Console Output

Skipping 8,283 KB.. Full Log
PASS: lldb-api :: lang/cpp/constructors/TestCppConstructors.py (859 of 1971)
PASS: lldb-api :: commands/watchpoints/watchpoint_events/TestWatchpointEvents.py (860 of 1971)
PASS: lldb-shell :: Breakpoint/debug_rnglist_basic.test (861 of 1971)
PASS: lldb-api :: commands/expression/import-std-module/forward_list-dbg-info-content/TestDbgInfoContentForwardListFromStdModule.py (862 of 1971)
PASS: lldb-api :: lang/cpp/call-function/TestCallCPPFunction.py (863 of 1971)
UNSUPPORTED: lldb-api :: functionalities/data-formatter/data-formatter-stl/libstdcpp/iterator/TestDataFormatterStdIterator.py (864 of 1971)
PASS: lldb-api :: commands/expression/fixits/TestFixIts.py (865 of 1971)
PASS: lldb-unit :: UnwindAssembly/x86/./UnwindAssemblyx86Tests/Testx86AssemblyInspectionEngine.TestPopR12 (866 of 1971)
PASS: lldb-api :: functionalities/breakpoint/scripted_bkpt/TestScriptedResolver.py (867 of 1971)
PASS: lldb-unit :: Process/minidump/./LLDBMinidumpTests/MinidumpParserTest.GetMemoryRegionInfo (868 of 1971)
PASS: lldb-unit :: Utility/./UtilityTests/StreamTest.PutRawBytesToMixedEndian (869 of 1971)
PASS: lldb-api :: functionalities/testid/TestTestId.py (870 of 1971)
PASS: lldb-shell :: ObjectFile/ELF/section-types-edgecases.yaml (871 of 1971)
PASS: lldb-unit :: Utility/./UtilityTests/UUIDTest.RelationalOperators (872 of 1971)
PASS: lldb-unit :: Utility/./UtilityTests/ArgsTest.ReplaceArgumentAtIndexLonger (873 of 1971)
PASS: lldb-api :: lang/cpp/incomplete-types/TestCppIncompleteTypes.py (874 of 1971)
PASS: lldb-unit :: Process/gdb-remote/./ProcessGdbRemoteTests/GDBRemoteCommunicationClientTest.SyncThreadState (875 of 1971)
PASS: lldb-unit :: Utility/./UtilityTests/SubsystemRAIITest.NormalSubsystem (876 of 1971)
PASS: lldb-unit :: UnwindAssembly/x86/./UnwindAssemblyx86Tests/Testx86AssemblyInspectionEngine.TestCALLNextInsn (877 of 1971)
PASS: lldb-api :: functionalities/tail_call_frames/thread_step_out_message/TestArtificialFrameStepOutMessage.py (878 of 1971)
PASS: lldb-unit :: Utility/./UtilityTests/StreamTest.Indent (879 of 1971)
PASS: lldb-unit :: ScriptInterpreter/Python/./ScriptInterpreterPythonTests/PythonDataObjectsTest.TestPythonInteger (880 of 1971)
PASS: lldb-api :: functionalities/thread/concurrent_events/TestConcurrentSignalNWatchNBreak.py (881 of 1971)
PASS: lldb-api :: functionalities/data-formatter/dump_dynamic/TestDumpDynamic.py (882 of 1971)
PASS: lldb-unit :: Utility/./UtilityTests/StringListTest.LongestCommonPrefixDuplicateElement (883 of 1971)
PASS: lldb-api :: commands/expression/unwind_expression/TestUnwindExpression.py (884 of 1971)
PASS: lldb-api :: lang/objc/objc-property/TestObjCProperty.py (885 of 1971)
UNSUPPORTED: lldb-api :: iohandler/unicode/TestUnicode.py (886 of 1971)
PASS: lldb-unit :: Process/gdb-remote/./ProcessGdbRemoteTests/GDBRemoteCommunicationServerTest.SendErrorResponse_ErrorList (887 of 1971)
PASS: lldb-unit :: debugserver/./debugserverTests/RNBSocket.LoopBackConnectIPv6 (888 of 1971)
UNSUPPORTED: lldb-shell :: SymbolFile/PDB/class-layout.test (889 of 1971)
PASS: lldb-unit :: ObjectFile/Breakpad/./ObjectFileBreakpadTests/ModuleRecord.parse (890 of 1971)
PASS: lldb-unit :: Language/Highlighting/./HighlighterTests/HighlighterTest.ClangCommas (891 of 1971)
PASS: lldb-shell :: ObjectFile/MachO/symtab.yaml (892 of 1971)
PASS: lldb-api :: commands/watchpoints/watchpoint_on_vectors/TestValueOfVectorVariable.py (893 of 1971)
PASS: lldb-api :: sample_test/TestSampleTest.py (894 of 1971)
PASS: lldb-unit :: Core/./LLDBCoreTests/StreamCallbackTest.Callback (895 of 1971)
PASS: lldb-api :: lang/cpp/class_types/TestClassTypes.py (896 of 1971)
PASS: lldb-unit :: Utility/./UtilityTests/ScalarTest.Division (897 of 1971)
PASS: lldb-api :: terminal/TestSTTYBeforeAndAfter.py (898 of 1971)
PASS: lldb-unit :: Utility/./UtilityTests/StringListTest.SplitIntoLines (899 of 1971)
PASS: lldb-api :: functionalities/thread/concurrent_events/TestConcurrentSignalDelayWatch.py (900 of 1971)
PASS: lldb-api :: functionalities/data-formatter/setvaluefromcstring/TestSetValueFromCString.py (901 of 1971)
PASS: lldb-api :: functionalities/gdb_remote_client/TestJLink6Armv7RegisterDefinition.py (902 of 1971)
PASS: lldb-unit :: Expression/./ExpressionTests/DiagnosticManagerTest.AddDiagnostic (903 of 1971)
UNSUPPORTED: lldb-api :: tools/lldb-server/platform-process-connect/TestPlatformProcessConnect.py (904 of 1971)
PASS: lldb-unit :: Utility/./UtilityTests/ArgsTest.ReplaceArgumentAtIndexOutOfRange (905 of 1971)
PASS: lldb-unit :: Utility/./UtilityTests/SerializationRountripTest.SerializeDeserializeCStringArrayNullptr (906 of 1971)
PASS: lldb-api :: functionalities/thread/concurrent_events/TestConcurrentTwoWatchpointsOneSignal.py (907 of 1971)
PASS: lldb-api :: lang/cpp/static_methods/TestCPPStaticMethods.py (908 of 1971)
PASS: lldb-api :: functionalities/breakpoint/cpp/TestCPPBreakpointLocations.py (909 of 1971)
UNSUPPORTED: lldb-shell :: ExecControl/StopHook/stop-hook-threads.test (910 of 1971)
PASS: lldb-unit :: Symbol/./SymbolTests/TestTypeSystemClang.TestFunctionTemplateConstruction (911 of 1971)
PASS: lldb-api :: functionalities/data-formatter/data-formatter-objc/TestDataFormatterObjNSException.py (912 of 1971)
PASS: lldb-unit :: Utility/./UtilityTests/StreamTest.PutHex16ByteOrderLittle (913 of 1971)
PASS: lldb-unit :: UnwindAssembly/x86/./UnwindAssemblyx86Tests/Testx86AssemblyInspectionEngine.TestPopEBP (914 of 1971)
PASS: lldb-unit :: Core/./LLDBCoreTests/RichManglingContextTest.IPDRealloc (915 of 1971)
PASS: lldb-unit :: Utility/./UtilityTests/RangeTest.Equal (916 of 1971)
PASS: lldb-api :: functionalities/thread/concurrent_events/TestConcurrentWatchpointDelayWatchpointOneBreakpoint.py (917 of 1971)
PASS: lldb-api :: functionalities/breakpoint/address_breakpoints/TestAddressBreakpoints.py (918 of 1971)
PASS: lldb-unit :: ObjectFile/PECOFF/./ObjectFilePECOFFTests/PECallFrameInfoTest.Frame_reg_eh (919 of 1971)
PASS: lldb-api :: functionalities/thread/backtrace_all/TestBacktraceAll.py (920 of 1971)
PASS: lldb-api :: functionalities/data-formatter/parray/TestPrintArray.py (921 of 1971)
UNSUPPORTED: lldb-shell :: SymbolFile/NativePDB/typedefs.cpp (922 of 1971)
PASS: lldb-unit :: Utility/./UtilityTests/FileSpecTest.Match (923 of 1971)
PASS: lldb-unit :: Host/./HostTests/NativeProcessProtocolTest.SetBreakpoint (924 of 1971)
PASS: lldb-unit :: SymbolFile/DWARF/./SymbolFileDWARFTests/SymbolFileDWARFTests.TestAbbrevValidAttrNullForm (925 of 1971)
PASS: lldb-unit :: Utility/./UtilityTests/ListenerTest.GetEventWait (926 of 1971)
PASS: lldb-api :: python_api/watchpoint/TestWatchpointIgnoreCount.py (927 of 1971)
PASS: lldb-api :: commands/command/script/import/TestImport.py (928 of 1971)
PASS: lldb-unit :: Symbol/./SymbolTests/SymbolsTest.TerminateLocateExecutableSymbolFileForUnknownExecutableAndUnknownSymbolFile (929 of 1971)
PASS: lldb-unit :: Host/./HostTests/NativeProcessProtocolTest.SetBreakpointFailWrite (930 of 1971)
PASS: lldb-api :: lang/c/blocks/TestBlocks.py (931 of 1971)
PASS: lldb-unit :: Host/./HostTests/MainLoopTest.ReadObject (932 of 1971)
PASS: lldb-api :: functionalities/data-formatter/data-formatter-ptr-to-array/TestPtrToArrayFormatting.py (933 of 1971)
PASS: lldb-unit :: Utility/./UtilityTests/StringListTest.AppendListCStringArray (934 of 1971)
PASS: lldb-api :: commands/expression/import-std-module/basic/TestImportStdModule.py (935 of 1971)
PASS: lldb-api :: lang/cpp/nested-class-other-compilation-unit/TestNestedClassWithParentInAnotherCU.py (936 of 1971)
PASS: lldb-unit :: Utility/./UtilityTests/StreamTeeTest.DefaultConstructor (937 of 1971)
PASS: lldb-api :: commands/expression/import-std-module/shared_ptr/TestSharedPtrFromStdModule.py (938 of 1971)
PASS: lldb-api :: lang/objc/objc-runtime-ivars/TestRuntimeIvars.py (939 of 1971)
PASS: lldb-shell :: SymbolFile/DWARF/debug_ranges_and_rnglists.test (940 of 1971)
PASS: lldb-api :: python_api/sbdata/TestSBData.py (941 of 1971)
PASS: lldb-api :: commands/frame/diagnose/bad-reference/TestBadReference.py (942 of 1971)
PASS: lldb-unit :: SymbolFile/DWARF/./SymbolFileDWARFTests/SymbolFileDWARFTests.TestAbbrevMissingTerminator (943 of 1971)
PASS: lldb-shell :: Settings/TestFrameFormatMangling.test (944 of 1971)
PASS: lldb-shell :: ObjectFile/PECOFF/basic-info-arm64.yaml (945 of 1971)
PASS: lldb-unit :: Utility/./UtilityTests/StreamTest.PutHex16ByteOrderBig (946 of 1971)
PASS: lldb-api :: functionalities/breakpoint/step_over_breakpoint/TestStepOverBreakpoint.py (947 of 1971)
PASS: lldb-unit :: SymbolFile/NativePDB/./SymbolFileNativePDBTests/PDBFPOProgramToDWARFExpressionTests.InvalidOpBinary (948 of 1971)
PASS: lldb-api :: tools/lldb-server/TestGdbRemoteAttach.py (949 of 1971)
PASS: lldb-unit :: Host/./HostTests/FileSystemTest.MakeAbsolute (950 of 1971)
UNSUPPORTED: lldb-shell :: ScriptInterpreter/Lua/bindings.test (951 of 1971)
PASS: lldb-unit :: ScriptInterpreter/Python/./ScriptInterpreterPythonTests/PythonDataObjectsTest.TestDictionaryResolutionWithDot (952 of 1971)
PASS: lldb-unit :: UnwindAssembly/x86/./UnwindAssemblyx86Tests/Testx86AssemblyInspectionEngine.TestPushR15 (953 of 1971)
PASS: lldb-api :: commands/expression/ignore-artificial-constructors/TestIgnoreArtificialConstructors.py (954 of 1971)
UNSUPPORTED: lldb-shell :: Unwind/eh-frame-small-fde.test (955 of 1971)
PASS: lldb-unit :: Host/./HostTests/SocketTest.DomainGetConnectURI (956 of 1971)
PASS: lldb-api :: types/TestShortTypeExpr.py (957 of 1971)
PASS: lldb-shell :: SymbolFile/DWARF/debug_rnglists.s (958 of 1971)
PASS: lldb-api :: lang/cpp/bool/TestCPPBool.py (959 of 1971)
PASS: lldb-api :: functionalities/data-formatter/data-formatter-disabling/TestDataFormatterDisabling.py (960 of 1971)
PASS: lldb-unit :: ScriptInterpreter/Python/./ScriptInterpreterPythonTests/PythonDataObjectsTest.TestModuleNameResolutionNoDot (961 of 1971)
PASS: lldb-api :: commands/source/info/TestSourceInfo.py (962 of 1971)
PASS: lldb-unit :: Host/./HostTests/HostInfoTest.GetAugmentedArchSpec (963 of 1971)
PASS: lldb-unit :: ScriptInterpreter/Python/./ScriptInterpreterPythonTests/PythonDataObjectsTest.TestPythonFile (964 of 1971)
PASS: lldb-unit :: Utility/./UtilityTests/GeneratorTest.Get (965 of 1971)
PASS: lldb-api :: functionalities/gdb_remote_client/TestPlatformClient.py (966 of 1971)
PASS: lldb-api :: commands/expression/ir-interpreter/TestIRInterpreter.py (967 of 1971)
PASS: lldb-unit :: Utility/./UtilityTests/SerializationRountripTest.SerializeDeserializePodPointers (968 of 1971)
PASS: lldb-api :: commands/apropos/with-process/TestAproposWithProcess.py (969 of 1971)
PASS: lldb-shell :: SymbolFile/DWARF/debug_rnglists-dwo.s (970 of 1971)
PASS: lldb-unit :: Symbol/./SymbolTests/DWARFCallFrameInfoTest.Basic_dwarf3 (971 of 1971)
PASS: lldb-unit :: ScriptInterpreter/Python/./ScriptInterpreterPythonTests/PythonDataObjectsTest.TestPythonTupleInitializerList (972 of 1971)
PASS: lldb-unit :: Language/Highlighting/./HighlighterTests/HighlighterTest.ClangCursorPos (973 of 1971)
PASS: lldb-api :: functionalities/thread/concurrent_events/TestConcurrentWatchpointWithDelayWatchpointThreads.py (974 of 1971)
PASS: lldb-api :: commands/watchpoints/watchpoint_commands/TestWatchpointCommands.py (975 of 1971)
PASS: lldb-unit :: Utility/./UtilityTests/BinaryStreamTest.PutSLEB128TwoBytes (976 of 1971)
PASS: lldb-api :: lang/cpp/class_static/TestStaticVariables.py (977 of 1971)
PASS: lldb-unit :: Expression/./ExpressionTests/CppModuleConfigurationTest.Sysroot (978 of 1971)
PASS: lldb-unit :: Utility/./UtilityTests/StreamTest.AddressSuffix (979 of 1971)
PASS: lldb-shell :: ObjectFile/ELF/section-addresses.yaml (980 of 1971)
PASS: lldb-shell :: SymbolFile/DWARF/apple-index-is-used.cpp (981 of 1971)
PASS: lldb-api :: commands/expression/import-std-module/queue/TestQueueFromStdModule.py (982 of 1971)
PASS: lldb-api :: functionalities/breakpoint/breakpoint_hit_count/TestBreakpointHitCount.py (983 of 1971)
PASS: lldb-unit :: Utility/./UtilityTests/RangeDataVector.FindEntryIndexesThatContain_Overlap (984 of 1971)
PASS: lldb-api :: commands/expression/dont_allow_jit/TestAllowJIT.py (985 of 1971)
PASS: lldb-api :: commands/expression/formatters/TestFormatters.py (986 of 1971)
PASS: lldb-api :: commands/expression/rdar44436068/Test128BitsInteger.py (987 of 1971)
PASS: lldb-api :: functionalities/inline-stepping/TestInlineStepping.py (988 of 1971)
PASS: lldb-api :: functionalities/value_md5_crash/TestValueMD5Crash.py (989 of 1971)
PASS: lldb-unit :: Target/./TargetTests/MemoryRegionInfoTest.Formatv (990 of 1971)
UNSUPPORTED: lldb-shell :: ScriptInterpreter/Lua/independent_state.test (991 of 1971)
PASS: lldb-unit :: Utility/./UtilityTests/FileSpecTest.OperatorBool (992 of 1971)
PASS: lldb-api :: functionalities/data-formatter/data-formatter-objc/TestDataFormatterObjCNSDate.py (993 of 1971)
PASS: lldb-unit :: UnwindAssembly/x86/./UnwindAssemblyx86Tests/Testx86AssemblyInspectionEngine.TestStackRealignMSVC_i386 (994 of 1971)
PASS: lldb-shell :: ObjectFile/ELF/build-id-case.yaml (995 of 1971)
PASS: lldb-api :: functionalities/thread/concurrent_events/TestConcurrentTwoWatchpointThreads.py (996 of 1971)
PASS: lldb-api :: functionalities/gdb_remote_client/TestNoGPacketSupported.py (997 of 1971)
PASS: lldb-api :: lang/c/function_types/TestFunctionTypes.py (998 of 1971)
PASS: lldb-api :: tools/lldb-server/TestGdbRemote_vCont.py (999 of 1971)
PASS: lldb-shell :: Minidump/dump-all.test (1000 of 1971)
PASS: lldb-api :: lang/cpp/stl/TestStdCXXDisassembly.py (1001 of 1971)
PASS: lldb-api :: lang/c/stepping/TestThreadStepping.py (1002 of 1971)
PASS: lldb-shell :: SymbolFile/DWARF/compilercontext.ll (1003 of 1971)
PASS: lldb-unit :: Utility/./UtilityTests/ArchSpecTest.YAML (1004 of 1971)
UNSUPPORTED: lldb-api :: functionalities/data-formatter/data-formatter-stl/libstdcpp/unique_ptr/TestDataFormatterStdUniquePtr.py (1005 of 1971)
PASS: lldb-unit :: Utility/./UtilityTests/FileSpecTest.IsRelative (1006 of 1971)
UNSUPPORTED: lldb-api :: functionalities/thread/concurrent_events/TestConcurrentManySignals.py (1007 of 1971)
UNSUPPORTED: lldb-api :: tools/lldb-server/TestGdbRemoteAuxvSupport.py (1008 of 1971)
PASS: lldb-api :: python_api/lldbutil/process/TestPrintStackTraces.py (1009 of 1971)
PASS: lldb-api :: commands/frame/language/TestGuessLanguage.py (1010 of 1971)
PASS: lldb-api :: lang/cpp/modules-import/TestCXXModulesImport.py (1011 of 1971)
PASS: lldb-shell :: ObjectFile/Breakpad/uuid-matching-mac.test (1012 of 1971)
PASS: lldb-api :: functionalities/gdb_remote_client/TestRestartBug.py (1013 of 1971)
UNSUPPORTED: lldb-api :: macosx/macabi/TestMacABImacOSFramework.py (1014 of 1971)
PASS: lldb-api :: functionalities/memory/read/TestMemoryRead.py (1015 of 1971)
PASS: lldb-api :: functionalities/postmortem/elf-core/TestLinuxCore.py (1016 of 1971)
PASS: lldb-unit :: Utility/./UtilityTests/StreamTest.ChangingByteOrder (1017 of 1971)
UNSUPPORTED: lldb-shell :: SymbolFile/dissassemble-entry-point.s (1018 of 1971)
PASS: lldb-api :: python_api/watchpoint/TestSetWatchpoint.py (1019 of 1971)
PASS: lldb-unit :: Utility/./UtilityTests/StringLexerTest.HasAtLeast (1020 of 1971)
PASS: lldb-unit :: Utility/./UtilityTests/BinaryStreamTest.PutULEB128NineBytes (1021 of 1971)
PASS: lldb-api :: functionalities/data-formatter/nssetsynth/TestNSSetSynthetic.py (1022 of 1971)
PASS: lldb-shell :: ObjectFile/ELF/duplicate-section.yaml (1023 of 1971)
PASS: lldb-api :: functionalities/data-formatter/synthupdate/TestSyntheticFilterRecompute.py (1024 of 1971)
PASS: lldb-api :: functionalities/dynamic_value_child_count/TestDynamicValueChildCount.py (1025 of 1971)
PASS: lldb-unit :: Utility/./UtilityTests/StringExtractorTest.DecodeHexU8_InvalidHex2 (1026 of 1971)
PASS: lldb-shell :: SymbolFile/DWARF/find-qualified-variable.cpp (1027 of 1971)
PASS: lldb-unit :: Utility/./UtilityTests/ConstStringTest.FromMidOfBufferStringRef (1028 of 1971)
PASS: lldb-api :: commands/expression/two-files/TestObjCTypeQueryFromOtherCompileUnit.py (1029 of 1971)
PASS: lldb-unit :: Interpreter/./InterpreterTests/OptionArgParserTest.toScriptLanguage (1030 of 1971)
PASS: lldb-unit :: ScriptInterpreter/Python/./ScriptInterpreterPythonTests/PythonDataObjectsTest.TestPythonCallableCheck (1031 of 1971)
PASS: lldb-unit :: Utility/./UtilityTests/StringListTest.SetSize (1032 of 1971)
PASS: lldb-api :: python_api/file_handle/TestFileHandle.py (1033 of 1971)
PASS: lldb-unit :: Utility/./UtilityTests/StringExtractorTest.GetHexU8_Underflow2 (1034 of 1971)
PASS: lldb-unit :: Utility/./UtilityTests/UriParserTest.LongPath (1035 of 1971)
PASS: lldb-unit :: Utility/./UtilityTests/StreamTest.PutBytesAsRawHex8ToBigEndian (1036 of 1971)
PASS: lldb-api :: functionalities/breakpoint/consecutive_breakpoints/TestConsecutiveBreakpoints.py (1037 of 1971)
PASS: lldb-api :: functionalities/lazy-loading/TestLazyLoading.py (1038 of 1971)
PASS: lldb-unit :: Utility/./UtilityTests/StringExtractorTest.GetHexBytes (1039 of 1971)
PASS: lldb-unit :: Utility/./UtilityTests/StringListTest.LongestCommonPrefixEmpty (1040 of 1971)
PASS: lldb-unit :: Process/minidump/./LLDBMinidumpTests/MinidumpParserTest.GetLinuxProcStatus (1041 of 1971)
PASS: lldb-unit :: Utility/./UtilityTests/ReproducerTest.SetCapture (1042 of 1971)
PASS: lldb-api :: lang/objc/objc-ivar-protocols/TestIvarProtocols.py (1043 of 1971)
PASS: lldb-api :: functionalities/thread/concurrent_events/TestConcurrentWatchBreakDelay.py (1044 of 1971)
PASS: lldb-unit :: Host/./HostTests/TaskPoolTest.RunTasks (1045 of 1971)
PASS: lldb-unit :: Interpreter/./InterpreterTests/OptionArgParserTest.toBoolean (1046 of 1971)
PASS: lldb-shell :: ObjectFile/ELF/many-sections.s (1047 of 1971)
PASS: lldb-api :: lang/cpp/signed_types/TestSignedTypes.py (1048 of 1971)
PASS: lldb-api :: functionalities/thread/concurrent_events/TestConcurrentCrashWithWatchpointBreakpointSignal.py (1049 of 1971)
PASS: lldb-unit :: Utility/./UtilityTests/LogTest.Register (1050 of 1971)
PASS: lldb-unit :: Utility/./UtilityTests/StatusTest.Formatv (1051 of 1971)
PASS: lldb-unit :: Utility/./UtilityTests/FileSpecTest.EqualSeparator (1052 of 1971)
UNSUPPORTED: lldb-api :: lang/cpp/static_members/TestCPPStaticMembers.py (1053 of 1971)
PASS: lldb-unit :: UnwindAssembly/x86/./UnwindAssemblyx86Tests/Testx86AssemblyInspectionEngine.TestSimple32bitFrameFunction (1054 of 1971)
PASS: lldb-api :: functionalities/plugins/command_plugin/TestPluginCommands.py (1055 of 1971)
PASS: lldb-unit :: Process/minidump/./LLDBMinidumpTests/MinidumpParserTest.GetMemoryRegionInfoFromMemory64List (1056 of 1971)
PASS: lldb-api :: tools/lldb-vscode/breakpoint/TestVSCode_setBreakpoints.py (1057 of 1971)
PASS: lldb-api :: functionalities/data-formatter/data-formatter-stl/libcxx/bitset/TestDataFormatterLibcxxBitset.py (1058 of 1971)
PASS: lldb-unit :: Utility/./UtilityTests/BinaryStreamTest.PutULEB128TwoBytes (1059 of 1971)
PASS: lldb-unit :: Target/./TargetTests/StackFrameRecognizerTest.NullModuleRegex (1060 of 1971)
UNSUPPORTED: lldb-api :: benchmarks/frame_variable/TestFrameVariableResponse.py (1061 of 1971)
PASS: lldb-unit :: Utility/./UtilityTests/StreamTest.QuotedCString (1062 of 1971)
PASS: lldb-api :: lang/cpp/breakpoint_in_member_func_w_non_primitive_params/TestBreakpointInMemberFuncWNonPrimitiveParams.py (1063 of 1971)
PASS: lldb-unit :: Host/./HostTests/NativeProcessProtocolTest.ReadCStringFromMemory_CrossPageBoundary (1064 of 1971)
PASS: lldb-shell :: SymbolFile/DWARF/find-method-local-struct.cpp (1065 of 1971)
PASS: lldb-unit :: Utility/./UtilityTests/StringExtractorTest.GetHexU8_Underflow2_NoEof (1066 of 1971)
PASS: lldb-api :: tools/lldb-vscode/attach/TestVSCode_attach.py (1067 of 1971)
UNSUPPORTED: lldb-shell :: SymbolFile/PDB/variables.test (1068 of 1971)
PASS: lldb-api :: python_api/process/io/TestProcessIO.py (1069 of 1971)
PASS: lldb-unit :: Language/Highlighting/./HighlighterTests/HighlighterTest.ClangTrailingBackslashBeforeNewline (1070 of 1971)
PASS: lldb-shell :: BuildScript/script-args.test (1071 of 1971)
PASS: lldb-api :: macosx/version_zero/TestGetVersionZeroVersion.py (1072 of 1971)
PASS: lldb-api :: lang/cpp/nsimport/TestCppNsImport.py (1073 of 1971)
PASS: lldb-api :: functionalities/breakpoint/breakpoint_command/TestBreakpointCommand.py (1074 of 1971)
PASS: lldb-unit :: Utility/./UtilityTests/VMRange.ContainsAddr (1075 of 1971)
PASS: lldb-unit :: Process/gdb-remote/./ProcessGdbRemoteTests/GDBRemoteClientBaseTest.SendContinueDelegateInterface (1076 of 1971)
PASS: lldb-api :: functionalities/thread/concurrent_events/TestConcurrentTwoWatchpointsOneDelayBreakpoint.py (1077 of 1971)
PASS: lldb-unit :: Expression/./ExpressionTests/ClangExpressionDeclMapTest.TestUnknownIdentifierLookup (1078 of 1971)
PASS: lldb-shell :: SymbolFile/DWARF/find-function-regex.cpp (1079 of 1971)
UNSUPPORTED: lldb-api :: tools/lldb-server/thread-name/TestGdbRemoteThreadName.py (1080 of 1971)
PASS: lldb-unit :: ScriptInterpreter/Python/./ScriptInterpreterPythonTests/PythonDataObjectsTest.TestOwnedReferences (1081 of 1971)
PASS: lldb-unit :: Utility/./UtilityTests/Flags.AllClear (1082 of 1971)
PASS: lldb-api :: functionalities/float-display/TestFloatDisplay.py (1083 of 1971)
PASS: lldb-unit :: Expression/./ExpressionTests/ClangHostTest.ComputeClangResourceDirectory (1084 of 1971)
PASS: lldb-unit :: Platform/./LLDBPlatformTests/PlatformDarwinTest.GetSDKNameForType (1085 of 1971)
PASS: lldb-unit :: Utility/./UtilityTests/StringListTest.ForRange (1086 of 1971)
PASS: lldb-api :: commands/expression/deleting-implicit-copy-constructor/TestDeletingImplicitCopyConstructor.py (1087 of 1971)
UNSUPPORTED: lldb-api :: commands/watchpoints/variable_out_of_scope/TestWatchedVarHitWhenInScope.py (1088 of 1971)
PASS: lldb-api :: functionalities/data-formatter/synthcapping/TestSyntheticCapping.py (1089 of 1971)
PASS: lldb-shell :: Breakpoint/single-file-split-dwarf.test (1090 of 1971)
PASS: lldb-unit :: UnwindAssembly/x86/./UnwindAssemblyx86Tests/Testx86AssemblyInspectionEngine.TestPopR13 (1091 of 1971)
UNSUPPORTED: lldb-shell :: ScriptInterpreter/Lua/command_script_import.test (1092 of 1971)
PASS: lldb-shell :: ObjectFile/ELF/section-overlap.yaml (1093 of 1971)
PASS: lldb-api :: commands/reproducer/invalid-args/TestInvalidArgsReproducer.py (1094 of 1971)
PASS: lldb-unit :: Language/CPlusPlus/./LanguageCPlusPlusTests/CPlusPlusLanguage.CPlusPlusNameParser (1095 of 1971)
PASS: lldb-api :: types/TestLongTypesExpr.py (1096 of 1971)
PASS: lldb-unit :: Interpreter/./InterpreterTests/CompletionTest.DirCompletionAbsolute (1097 of 1971)
PASS: lldb-api :: python_api/get-value-32bit-int/TestGetValue32BitInt.py (1098 of 1971)
PASS: lldb-shell :: SymbolFile/DWARF/debug_loc-aslr.s (1099 of 1971)
PASS: lldb-api :: lang/c/strings/TestCStrings.py (1100 of 1971)
PASS: lldb-unit :: Utility/./UtilityTests/Flags.AnySet (1101 of 1971)
PASS: lldb-unit :: Expression/./ExpressionTests/CppModuleConfigurationTest.Xcode (1102 of 1971)
PASS: lldb-api :: lang/c/global_variables/TestGlobalVariables.py (1103 of 1971)
PASS: lldb-unit :: ScriptInterpreter/Python/./ScriptInterpreterPythonTests/PythonDataObjectsTest.TestPythonIntegerToStr (1104 of 1971)
PASS: lldb-api :: lang/cpp/extern_c/TestExternCSymbols.py (1105 of 1971)
PASS: lldb-api :: functionalities/target-new-solib-notifications/TestModuleLoadedNotifys.py (1106 of 1971)
PASS: lldb-unit :: Utility/./UtilityTests/ScalarTest.CastOperations (1107 of 1971)
PASS: lldb-api :: tools/lldb-server/TestGdbRemoteExpeditedRegisters.py (1108 of 1971)
PASS: lldb-api :: python_api/watchpoint/condition/TestWatchpointConditionAPI.py (1109 of 1971)
PASS: lldb-api :: functionalities/thread/step_out/TestThreadStepOut.py (1110 of 1971)
PASS: lldb-shell :: SymbolFile/DWARF/clang-ast-from-dwarf-unamed-and-anon-structs.cpp (1111 of 1971)
PASS: lldb-shell :: ObjectFile/ELF/basic-info.yaml (1112 of 1971)
PASS: lldb-api :: lang/c/struct_types/TestStructTypes.py (1113 of 1971)
UNSUPPORTED: lldb-api :: commands/expression/completion-crash-invalid-iterator/TestInvalidIteratorCompletionCrash.py (1114 of 1971)
PASS: lldb-unit :: Utility/./UtilityTests/StreamTest.AddressRange (1115 of 1971)
PASS: lldb-shell :: SymbolFile/NativePDB/s_constant.cpp (1116 of 1971)
PASS: lldb-unit :: Process/gdb-remote/./ProcessGdbRemoteTests/GDBRemoteCommunicationClientTest.GetModulesInfo (1117 of 1971)
PASS: lldb-api :: tools/lldb-vscode/variables/TestVSCode_variables.py (1118 of 1971)
PASS: lldb-unit :: Utility/./UtilityTests/VMRange.Clear (1119 of 1971)
PASS: lldb-api :: python_api/sbvalue_persist/TestSBValuePersist.py (1120 of 1971)
PASS: lldb-api :: lang/objc/objc_direct-methods/TestObjCDirectMethods.py (1121 of 1971)
PASS: lldb-unit :: Utility/./UtilityTests/BinaryStreamTest.PutULEB128One (1122 of 1971)
UNSUPPORTED: lldb-api :: functionalities/process_save_core/TestProcessSaveCore.py (1123 of 1971)
PASS: lldb-unit :: Host/./HostTests/MainLoopTest.UnmonitoredSignal (1124 of 1971)
PASS: lldb-unit :: Platform/./LLDBPlatformTests/PlatformDarwinTest.FindXcodeContentsDirectoryInPath (1125 of 1971)
PASS: lldb-unit :: SymbolFile/DWARF/./SymbolFileDWARFTests/SymbolFileDWARFTests.TestAbbrevOrder1Start5 (1126 of 1971)
PASS: lldb-unit :: Utility/./UtilityTests/OptionsWithRawTest.ArgsButNoDelimiter (1127 of 1971)
PASS: lldb-unit :: SymbolFile/DWARF/./SymbolFileDWARFTests/SymbolFileDWARFTests.TestAbilitiesForDWARF (1128 of 1971)
PASS: lldb-unit :: Utility/./UtilityTests/UriParserTest.MinimalPort (1129 of 1971)
PASS: lldb-unit :: Utility/./UtilityTests/FileSpecTest.EqualDotsWindows (1130 of 1971)
PASS: lldb-unit :: ScriptInterpreter/Python/./ScriptInterpreterPythonTests/PythonDataObjectsTest.TestGlobalNameResolutionNoDot (1131 of 1971)
PASS: lldb-unit :: Utility/./UtilityTests/StreamTeeTest.GetStreamAtIndexOutOfBounds (1132 of 1971)
PASS: lldb-api :: functionalities/data-formatter/cstring-utf8-summary/TestCstringUnicode.py (1133 of 1971)
PASS: lldb-api :: lang/cpp/member-and-local-vars-with-same-name/TestMembersAndLocalsWithSameName.py (1134 of 1971)
PASS: lldb-api :: commands/disassemble/basic/TestFrameDisassemble.py (1135 of 1971)
PASS: lldb-shell :: Breakpoint/debug_rnglist_offset_pair.test (1136 of 1971)
PASS: lldb-shell :: SymbolFile/DWARF/dir-separator-posix.s (1137 of 1971)
PASS: lldb-shell :: SymbolFile/DWARF/clang-ast-from-dwarf-objc-property.m (1138 of 1971)
PASS: lldb-unit :: Utility/./UtilityTests/DataExtractorTest.GetCStrUnterminated (1139 of 1971)
PASS: lldb-unit :: UnwindAssembly/x86/./UnwindAssemblyx86Tests/Testx86AssemblyInspectionEngine.Test32bitFramelessSmallStackFrame (1140 of 1971)
PASS: lldb-api :: lang/objc/foundation/TestRuntimeTypes.py (1141 of 1971)
PASS: lldb-unit :: Utility/./UtilityTests/FileSpecTest.GuessPathStyle (1142 of 1971)
PASS: lldb-api :: commands/quit/TestQuit.py (1143 of 1971)
PASS: lldb-unit :: Utility/./UtilityTests/NameMatchesTest.EndsWith (1144 of 1971)
PASS: lldb-api :: functionalities/thread/concurrent_events/TestConcurrentBreakpointsDelayedBreakpointOneWatchpoint.py (1145 of 1971)
PASS: lldb-api :: lang/cpp/bitfields/TestCppBitfields.py (1146 of 1971)
PASS: lldb-api :: commands/expression/import-std-module/no-std-module/TestMissingStdModule.py (1147 of 1971)
PASS: lldb-unit :: Utility/./UtilityTests/StreamTeeTest.GetStreamAtIndexOutOfBoundsEmpty (1148 of 1971)
PASS: lldb-api :: lang/objc/global_ptrs/TestGlobalObjects.py (1149 of 1971)
PASS: lldb-unit :: Utility/./UtilityTests/BinaryStreamTest.PutSLEB128EightBytes (1150 of 1971)
PASS: lldb-shell :: SymbolFile/DWARF/debug-line-basic.s (1151 of 1971)
PASS: lldb-shell :: Minidump/disassemble-no-module.yaml (1152 of 1971)
PASS: lldb-api :: functionalities/process_crash_info/TestProcessCrashInfo.py (1153 of 1971)
PASS: lldb-unit :: UnwindAssembly/x86/./UnwindAssemblyx86Tests/Testx86AssemblyInspectionEngine.TestStackRealign32BitDisp_x86_64 (1154 of 1971)
PASS: lldb-api :: functionalities/thread/concurrent_events/TestConcurrentBreakpointDelayBreakpointOneSignal.py (1155 of 1971)
PASS: lldb-api :: functionalities/data-formatter/data-formatter-objc/TestDataFormatterObjCKVO.py (1156 of 1971)
PASS: lldb-api :: tools/lldb-vscode/step/TestVSCode_step.py (1157 of 1971)
PASS: lldb-unit :: UnwindAssembly/x86/./UnwindAssemblyx86Tests/Testx86AssemblyInspectionEngine.TestPushEBP (1158 of 1971)
PASS: lldb-unit :: Language/Highlighting/./HighlighterTests/HighlighterTest.ClangSquareBrackets (1159 of 1971)
PASS: lldb-shell :: SymbolFile/DWARF/debug_loc_and_loclists.s (1160 of 1971)
PASS: lldb-unit :: Utility/./UtilityTests/AnsiTerminal.KnownPrefix (1161 of 1971)
PASS: lldb-api :: functionalities/type_completion/TestTypeCompletion.py (1162 of 1971)
PASS: lldb-api :: functionalities/data-formatter/type_summary_list_arg/TestTypeSummaryListArg.py (1163 of 1971)
PASS: lldb-api :: commands/frame/diagnose/dereference-this/TestDiagnoseDereferenceThis.py (1164 of 1971)
PASS: lldb-unit :: Expression/./ExpressionTests/CppModuleConfigurationTest.AmbiguousCLib (1165 of 1971)
PASS: lldb-api :: functionalities/thread/jump/TestThreadJump.py (1166 of 1971)
PASS: lldb-unit :: Language/Highlighting/./HighlighterTests/HighlighterTest.ClangTrailingBackslashWithWhitespace (1167 of 1971)
PASS: lldb-api :: python_api/function_symbol/TestSymbolAPI.py (1168 of 1971)
PASS: lldb-unit :: ScriptInterpreter/Python/./ScriptInterpreterPythonTests/PythonDataObjectsTest.TestExceptions (1169 of 1971)
PASS: lldb-unit :: Symbol/./SymbolTests/TestTypeSystemClang.TemplateArguments (1170 of 1971)
PASS: lldb-unit :: Process/gdb-remote/./ProcessGdbRemoteTests/GDBRemoteCommunicationClientTest.SendGetDataPacket (1171 of 1971)
UNSUPPORTED: lldb-api :: functionalities/thread/break_after_join/TestBreakAfterJoin.py (1172 of 1971)
PASS: lldb-unit :: Utility/./UtilityTests/RecordReplayTest.InstrumentedFoo (1173 of 1971)
PASS: lldb-api :: api/check_public_api_headers/TestPublicAPIHeaders.py (1174 of 1971)
PASS: lldb-unit :: Utility/./UtilityTests/StringListTest.GetMaxStringLengthDecreasingSize (1175 of 1971)
PASS: lldb-unit :: Utility/./UtilityTests/StringListTest.JoinSingle (1176 of 1971)
PASS: lldb-api :: functionalities/thread/concurrent_events/TestConcurrentCrashWithSignal.py (1177 of 1971)
PASS: lldb-api :: tools/lldb-server/TestGdbRemoteSingleStep.py (1178 of 1971)
PASS: lldb-api :: commands/expression/dollar-in-variable/TestDollarInVariable.py (1179 of 1971)
PASS: lldb-unit :: ScriptInterpreter/Python/./ScriptInterpreterPythonTests/PythonDataObjectsTest.TestPythonByteArray (1180 of 1971)
PASS: lldb-unit :: Utility/./UtilityTests/VASprintfTest.BufferResize (1181 of 1971)
PASS: lldb-unit :: Utility/./UtilityTests/StringExtractorTest.GetHexU8_InvalidHex (1182 of 1971)
PASS: lldb-unit :: Utility/./UtilityTests/FileSpecTest.Equal (1183 of 1971)
PASS: lldb-unit :: Utility/./UtilityTests/ArgsTest.StringListConstructor (1184 of 1971)
PASS: lldb-unit :: Utility/./UtilityTests/UriParserTest.BracketedHostnameWithColon (1185 of 1971)
UNSUPPORTED: lldb-api :: android/platform/TestDefaultCacheLineSize.py (1186 of 1971)
PASS: lldb-unit :: Symbol/./SymbolTests/PostfixExpression.ToDWARF (1187 of 1971)
PASS: lldb-api :: functionalities/data-formatter/frameformat_smallstruct/TestFrameFormatSmallStruct.py (1188 of 1971)
PASS: lldb-api :: lang/c/conflicting-symbol/TestConflictingSymbol.py (1189 of 1971)
PASS: lldb-api :: tools/lldb-server/TestGdbRemoteExitCode.py (1190 of 1971)
PASS: lldb-unit :: Utility/./UtilityTests/Flags.Test (1191 of 1971)
PASS: lldb-api :: functionalities/source-map/TestTargetSourceMap.py (1192 of 1971)
PASS: lldb-api :: functionalities/target_var/TestTargetVar.py (1193 of 1971)
PASS: lldb-api :: lang/objc/modules/TestObjCModules.py (1194 of 1971)
PASS: lldb-unit :: Host/./HostTests/Host.GetEnvironment (1195 of 1971)
PASS: lldb-unit :: Symbol/./SymbolTests/TestClangASTImporter.CopyTypeTagDecl (1196 of 1971)
PASS: lldb-api :: tools/lldb-vscode/breakpoint/TestVSCode_setFunctionBreakpoints.py (1197 of 1971)
PASS: lldb-unit :: Utility/./UtilityTests/ArgsTest.GetQuotedCommandString (1198 of 1971)
PASS: lldb-api :: functionalities/postmortem/minidump-new/TestMiniDumpNew.py (1199 of 1971)
PASS: lldb-unit :: Utility/./UtilityTests/AnsiTerminal.Twice (1200 of 1971)
PASS: lldb-unit :: Utility/./UtilityTests/RecordReplayTest.InstrumentedBarPtr (1201 of 1971)
PASS: lldb-shell :: SymbolFile/NativePDB/globals-fundamental.cpp (1202 of 1971)
PASS: lldb-unit :: Utility/./UtilityTests/ProcessInstanceInfo.Yaml (1203 of 1971)
PASS: lldb-api :: functionalities/data-formatter/pyobjsynthprovider/TestPyObjSynthProvider.py (1204 of 1971)
PASS: lldb-shell :: Commands/command-script-import.test (1205 of 1971)
PASS: lldb-unit :: Process/gdb-remote/./ProcessGdbRemoteTests/GDBRemoteCommunicationClientTest.SendStopTracePacket (1206 of 1971)
PASS: lldb-api :: functionalities/data-formatter/data-formatter-stl/libcxx/vbool/TestDataFormatterLibcxxVBool.py (1207 of 1971)
PASS: lldb-unit :: Utility/./UtilityTests/ConstStringTest.YAML (1208 of 1971)
PASS: lldb-api :: commands/expression/timeout/TestCallWithTimeout.py (1209 of 1971)
PASS: lldb-unit :: Utility/./UtilityTests/BroadcasterTest.BroadcastEvent (1210 of 1971)
PASS: lldb-unit :: Symbol/./SymbolTests/TestTypeSystemClang.TestGetTypeClassNested (1211 of 1971)
PASS: lldb-api :: lang/objc/foundation/TestObjCMethods.py (1212 of 1971)
PASS: lldb-api :: functionalities/gdb_remote_client/TestGDBRemoteLoad.py (1213 of 1971)
PASS: lldb-unit :: Utility/./UtilityTests/VASprintfTest.EncodingError (1214 of 1971)
PASS: lldb-api :: lang/objc/conflicting-definition/TestConflictingDefinition.py (1215 of 1971)
PASS: lldb-api :: python_api/value/linked_list/TestValueAPILinkedList.py (1216 of 1971)
PASS: lldb-api :: lang/objc/objc++/TestObjCXX.py (1217 of 1971)
PASS: lldb-unit :: Utility/./UtilityTests/CompletionRequest.FakeLastArg (1218 of 1971)
PASS: lldb-api :: lang/cpp/unsigned_types/TestUnsignedTypes.py (1219 of 1971)
PASS: lldb-unit :: Process/gdb-remote/./ProcessGdbRemoteTests/GDBRemoteCommunicationClientTest.GetModulesInfoInvalidResponse (1220 of 1971)
UNSUPPORTED: lldb-api :: functionalities/data-formatter/data-formatter-stl/libstdcpp/string/TestDataFormatterStdString.py (1221 of 1971)
UNSUPPORTED: lldb-api :: functionalities/tty/TestTerminal.py (1222 of 1971)
PASS: lldb-shell :: ObjectFile/MachO/lc_build_version.yaml (1223 of 1971)
PASS: lldb-unit :: Utility/./UtilityTests/StreamTest.ShiftOperatorChars (1224 of 1971)
PASS: lldb-shell :: Reproducer/TestRelativePath.test (1225 of 1971)
PASS: lldb-unit :: Symbol/./SymbolTests/TestClangASTImporter.MetadataPropagationIndirectImport (1226 of 1971)
PASS: lldb-unit :: Process/minidump/./LLDBMinidumpTests/MinidumpParserTest.MinidumpDuplicateModuleMinAddress (1227 of 1971)
UNSUPPORTED: lldb-shell :: SymbolFile/PDB/func-symbols.test (1228 of 1971)
PASS: lldb-api :: lang/objc/modules-app-update/TestClangModulesAppUpdate.py (1229 of 1971)
PASS: lldb-unit :: Language/Highlighting/./HighlighterTests/HighlighterTest.ClangScalarLiterals (1230 of 1971)
PASS: lldb-api :: python_api/class_members/TestSBTypeClassMembers.py (1231 of 1971)
PASS: lldb-api :: commands/expression/vector_of_enums/TestVectorOfEnums.py (1232 of 1971)
PASS: lldb-unit :: Utility/./UtilityTests/OptionsWithRawTest.EmptyArgsOnlySuffix (1233 of 1971)
UNSUPPORTED: lldb-shell :: ScriptInterpreter/Lua/lua.test (1234 of 1971)
UNSUPPORTED: lldb-shell :: Register/arm-fp-read.test (1235 of 1971)
PASS: lldb-api :: lang/objc/foundation/TestObjCMethodsNSArray.py (1236 of 1971)
PASS: lldb-unit :: Utility/./UtilityTests/ArgsTest.ReplaceArgumentAtIndexEqual (1237 of 1971)
PASS: lldb-unit :: Process/gdb-remote/./ProcessGdbRemoteTests/GDBRemoteCommunicationClientTest.WriteRegisterNoSuffix (1238 of 1971)
UNSUPPORTED: lldb-shell :: SymbolFile/PDB/udt-layout.test (1239 of 1971)
PASS: lldb-unit :: Utility/./UtilityTests/VMRange.ContainsRange (1240 of 1971)
PASS: lldb-api :: functionalities/postmortem/minidump-new/TestMiniDumpUUID.py (1241 of 1971)
PASS: lldb-unit :: Expression/./ExpressionTests/CppModuleConfigurationTest.IgnoreLibStdCpp (1242 of 1971)
PASS: lldb-unit :: ObjectFile/PECOFF/./ObjectFilePECOFFTests/PECallFrameInfoTest.Basic_eh (1243 of 1971)
PASS: lldb-unit :: Utility/./UtilityTests/StreamTest.PutSLEB128 (1244 of 1971)
PASS: lldb-api :: lang/cpp/type_lookup/TestCppTypeLookup.py (1245 of 1971)
PASS: lldb-api :: functionalities/postmortem/minidump/TestMiniDump.py (1246 of 1971)
UNSUPPORTED: lldb-api :: functionalities/data-formatter/data-formatter-stl/libstdcpp/tuple/TestDataFormatterStdTuple.py (1247 of 1971)
PASS: lldb-unit :: Utility/./UtilityTests/ScalarTest.Equality (1248 of 1971)
PASS: lldb-shell :: SymbolFile/DWARF/debug-types-dwarf5.s (1249 of 1971)
UNSUPPORTED: lldb-shell :: Minidump/Windows/arm-fp-unwind.test (1250 of 1971)
PASS: lldb-api :: functionalities/breakpoint/global_constructor/TestBreakpointInGlobalConstructor.py (1251 of 1971)
PASS: lldb-api :: commands/expression/context-object/TestContextObject.py (1252 of 1971)
PASS: lldb-unit :: Utility/./UtilityTests/StringListTest.ShiftCString (1253 of 1971)
PASS: lldb-unit :: Utility/./UtilityTests/DataExtractorTest.GetBitfield (1254 of 1971)
PASS: lldb-unit :: Utility/./UtilityTests/Flags.AnyClear (1255 of 1971)
PASS: lldb-shell :: SymbolFile/NativePDB/globals-bss.cpp (1256 of 1971)
PASS: lldb-unit :: UnwindAssembly/x86/./UnwindAssemblyx86Tests/Testx86AssemblyInspectionEngine.TestDisassemblyMidFunctionEpilogues (1257 of 1971)
PASS: lldb-unit :: Core/./LLDBCoreTests/RichManglingContextTest.FromCxxMethodName (1258 of 1971)
PASS: lldb-unit :: Utility/./UtilityTests/RegularExpression.Match (1259 of 1971)
PASS: lldb-unit :: Utility/./UtilityTests/Flags.GetBitSize (1260 of 1971)
PASS: lldb-api :: commands/expression/regression-access-function-template-in-record/TestRegressionAccessFunctionTemplateInRecord.py (1261 of 1971)
PASS: lldb-api :: lang/objc/single-entry-dictionary/TestObjCSingleEntryDictionary.py (1262 of 1971)
UNSUPPORTED: lldb-api :: linux/add-symbols/TestTargetSymbolsAddCommand.py (1263 of 1971)
PASS: lldb-api :: functionalities/memory-region/TestMemoryRegion.py (1264 of 1971)
PASS: lldb-api :: python_api/signals/TestSignalsAPI.py (1265 of 1971)
PASS: lldb-api :: commands/process/attach/TestProcessAttach.py (1266 of 1971)
UNSUPPORTED: lldb-api :: lang/objc/objc-dynamic-value/TestObjCDynamicValue.py (1267 of 1971)
PASS: lldb-unit :: Symbol/./SymbolTests/TestTypeSystemClang.TestDeletingImplicitCopyCstrDueToMoveCStr (1268 of 1971)
PASS: lldb-api :: lang/objc/blocks/TestObjCIvarsInBlocks.py (1269 of 1971)
PASS: lldb-unit :: Utility/./UtilityTests/CompletionRequest.Constructor (1270 of 1971)
PASS: lldb-api :: lang/objc/radar-9691614/TestObjCMethodReturningBOOL.py (1271 of 1971)
PASS: lldb-unit :: SymbolFile/DWARF/./SymbolFileDWARFTests/SymbolFileDWARFTests.TestAbbrevOutOfOrder (1272 of 1971)
PASS: lldb-shell :: SymbolFile/Breakpad/stack-cfi-parsing.test (1273 of 1971)
PASS: lldb-api :: functionalities/data-formatter/data-formatter-stl/libcxx/unique_ptr/TestDataFormatterLibcxxUniquePtr.py (1274 of 1971)
PASS: lldb-shell :: Reproducer/Functionalities/TestDataFormatter.test (1275 of 1971)
UNSUPPORTED: lldb-api :: functionalities/darwin_log/filter/exact_match/subsystem/TestDarwinLogFilterMatchSubsystem.py (1276 of 1971)
PASS: lldb-shell :: SymbolFile/DWARF/find-basic-function.cpp (1277 of 1971)
PASS: lldb-unit :: Utility/./UtilityTests/RangeTest.Union (1278 of 1971)
PASS: lldb-unit :: Utility/./UtilityTests/ArgsTest.TestTrailingBackslash (1279 of 1971)
PASS: lldb-shell :: Breakpoint/case-sensitive.test (1280 of 1971)
PASS: lldb-shell :: SymbolFile/DWARF/dwarf5_locations.s (1281 of 1971)
PASS: lldb-api :: lang/objc/real-definition/TestRealDefinition.py (1282 of 1971)
PASS: lldb-api :: lang/cpp/virtual-overload/TestVirtualOverload.py (1283 of 1971)
PASS: lldb-unit :: Utility/./UtilityTests/LogChannelEnabledTest.LLDB_LOG_ERROR (1284 of 1971)
PASS: lldb-unit :: Utility/./UtilityTests/RangeTest.LessThan (1285 of 1971)
UNSUPPORTED: lldb-api :: linux/mix-dwo-and-regular-objects/TestMixedDwarfBinary.py (1286 of 1971)
PASS: lldb-api :: lang/objc/objc-static-method-stripped/TestObjCStaticMethodStripped.py (1287 of 1971)
PASS: lldb-unit :: Utility/./UtilityTests/ProcessInfoTest.Constructor (1288 of 1971)
PASS: lldb-api :: commands/watchpoints/watchpoint_commands/command/TestWatchpointCommandLLDB.py (1289 of 1971)
PASS: lldb-shell :: Reproducer/TestDiscard.test (1290 of 1971)
UNSUPPORTED: lldb-api :: functionalities/breakpoint/breakpoint_callback_command_source/TestBreakpointCallbackCommandSource.py (1291 of 1971)
PASS: lldb-unit :: Language/Highlighting/./HighlighterTests/HighlighterTest.ClangPreserveNewLine (1292 of 1971)
PASS: lldb-shell :: ScriptInterpreter/Python/scripted_breakpoint.test (1293 of 1971)
PASS: lldb-api :: commands/expression/radar_9673664/TestExprHelpExamples.py (1294 of 1971)
PASS: lldb-api :: lang/objc/foundation/TestObjCMethods2.py (1295 of 1971)
PASS: lldb-unit :: Utility/./UtilityTests/VMRange.Reset (1296 of 1971)
UNSUPPORTED: lldb-api :: lang/c/typedef/Testtypedef.py (1297 of 1971)
PASS: lldb-unit :: Utility/./UtilityTests/StringLexerTest.Peek (1298 of 1971)
PASS: lldb-api :: python_api/symbol-context/TestSymbolContext.py (1299 of 1971)
PASS: lldb-unit :: Host/./HostTests/NativeProcessProtocolTest.SetBreakpointFailRead (1300 of 1971)
PASS: lldb-api :: commands/expression/function_template_specialization_temp_args/TestFunctionTemplateSpecializationTempArgs.py (1301 of 1971)
PASS: lldb-api :: commands/expression/import-std-module/list-dbg-info-content/TestDbgInfoContentListFromStdModule.py (1302 of 1971)
PASS: lldb-unit :: Process/gdb-remote/./ProcessGdbRemoteTests/GDBRemoteCommunicationTest.ReadPacket_checksum (1303 of 1971)
PASS: lldb-api :: commands/expression/top-level/TestTopLevelExprs.py (1304 of 1971)
PASS: lldb-unit :: Language/CPlusPlus/./LanguageCPlusPlusTests/CPlusPlusLanguage.MethodNameParsing (1305 of 1971)
PASS: lldb-shell :: ObjectFile/ELF/PT_LOAD.yaml (1306 of 1971)
PASS: lldb-unit :: Utility/./UtilityTests/OptionsWithRawTest.WhitespaceInput (1307 of 1971)
PASS: lldb-api :: functionalities/multiword-commands/TestMultiWordCommands.py (1308 of 1971)
PASS: lldb-unit :: Host/./HostTests/SocketAddressTest.GetAddressInfo (1309 of 1971)
PASS: lldb-api :: lang/objcxx/hide-runtime-values/TestObjCXXHideRuntimeValues.py (1310 of 1971)
UNSUPPORTED: lldb-api :: functionalities/darwin_log/filter/exact_match/category/TestDarwinLogFilterMatchCategory.py (1311 of 1971)
PASS: lldb-unit :: Language/CPlusPlus/./LanguageCPlusPlusTests/CPlusPlusLanguage.FindAlternateFunctionManglings (1312 of 1971)
PASS: lldb-api :: functionalities/return-value/TestReturnValue.py (1313 of 1971)
PASS: lldb-unit :: Process/gdb-remote/./ProcessGdbRemoteTests/GDBRemoteCommunicationClientTest.ReadRegister (1314 of 1971)
PASS: lldb-api :: types/TestFloatTypes.py (1315 of 1971)
PASS: lldb-api :: commands/expression/cast_int_to_anonymous_enum/TestCastIntToAnonymousEnum.py (1316 of 1971)
PASS: lldb-unit :: Utility/./UtilityTests/ArgsTest.TestSingleArg (1317 of 1971)
PASS: lldb-api :: functionalities/thread/concurrent_events/TestConcurrentCrashWithWatchpoint.py (1318 of 1971)
PASS: lldb-api :: lang/cpp/trivial_abi/TestTrivialABI.py (1319 of 1971)
PASS: lldb-api :: lang/objc/modules-incomplete/TestIncompleteModules.py (1320 of 1971)
PASS: lldb-unit :: Utility/./UtilityTests/StringListTest.RemoveBlankLines (1321 of 1971)
PASS: lldb-shell :: SymbolFile/DWARF/debug_loclists-dwo.s (1322 of 1971)
UNSUPPORTED: lldb-shell :: Register/x86-64-gp-write.test (1323 of 1971)
PASS: lldb-api :: commands/frame/var/TestFrameVar.py (1324 of 1971)
PASS: lldb-unit :: Utility/./UtilityTests/StreamTest.PutHex32ByteOrderLittle (1325 of 1971)
PASS: lldb-api :: functionalities/data-formatter/data-formatter-objc/nsindexpath/TestDataFormatterNSIndexPath.py (1326 of 1971)
PASS: lldb-unit :: SymbolFile/NativePDB/./SymbolFileNativePDBTests/PDBFPOProgramToDWARFExpressionTests.InvalidAssignmentSingle (1327 of 1971)
PASS: lldb-api :: macosx/order/TestOrderFile.py (1328 of 1971)
PASS: lldb-unit :: Utility/./UtilityTests/AnsiTerminal.AtStart (1329 of 1971)
PASS: lldb-api :: python_api/watchpoint/watchlocation/TestTargetWatchAddress.py (1330 of 1971)
PASS: lldb-api :: commands/frame/diagnose/virtual-method-call/TestDiagnoseDereferenceVirtualMethodCall.py (1331 of 1971)
PASS: lldb-shell :: Settings/TestModuleCacheSanity.test (1332 of 1971)
PASS: lldb-shell :: Unwind/thread-step-out-ret-addr-check.test (1333 of 1971)
UNSUPPORTED: lldb-shell :: SymbolFile/PDB/compilands.test (1334 of 1971)
PASS: lldb-api :: functionalities/data-formatter/data-formatter-stl/libcxx/optional/TestDataFormatterLibcxxOptional.py (1335 of 1971)
PASS: lldb-api :: commands/settings/quoting/TestQuoting.py (1336 of 1971)
PASS: lldb-unit :: Expression/./ExpressionTests/DWARFExpression.DW_OP_piece (1337 of 1971)
PASS: lldb-unit :: Host/./HostTests/SocketTest.DecodeHostAndPort (1338 of 1971)
PASS: lldb-api :: lang/c/set_values/TestSetValues.py (1339 of 1971)
PASS: lldb-api :: tools/lldb-server/commandline/TestStubSetSID.py (1340 of 1971)
PASS: lldb-api :: tools/lldb-server/TestAppleSimulatorOSType.py (1341 of 1971)
PASS: lldb-api :: python_api/lldbutil/iter/TestLLDBIterator.py (1342 of 1971)
UNSUPPORTED: lldb-shell :: Register/arm-gp-read.test (1343 of 1971)
PASS: lldb-api :: lang/cpp/dynamic-value-same-basename/TestDynamicValueSameBase.py (1344 of 1971)
UNSUPPORTED: lldb-api :: commands/expression/multiline-navigation/TestMultilineNavigation.py (1345 of 1971)
PASS: lldb-api :: python_api/sblaunchinfo/TestSBLaunchInfo.py (1346 of 1971)
PASS: lldb-unit :: Utility/./UtilityTests/StringListTest.GetMaxStringLengthMixed (1347 of 1971)
PASS: lldb-unit :: Utility/./UtilityTests/StreamTest.PutRawBytesToBigEndian (1348 of 1971)
PASS: lldb-shell :: ObjectFile/wasm/basic.yaml (1349 of 1971)
PASS: lldb-unit :: Utility/./UtilityTests/StringExtractorTest.GetHexBytesAvail_FullString (1350 of 1971)
PASS: lldb-unit :: Utility/./UtilityTests/ArgsTest.DoubleQuotedItem (1351 of 1971)
PASS: lldb-shell :: SymbolFile/DWARF/debug_ranges-missing-section.s (1352 of 1971)
PASS: lldb-unit :: Host/./HostTests/NativeProcessProtocolTest.ReadCStringFromMemory (1353 of 1971)
PASS: lldb-unit :: ScriptInterpreter/Python/./ScriptInterpreterPythonTests/PythonDataObjectsTest.TestObjectAttributes (1354 of 1971)
PASS: lldb-api :: commands/process/launch/TestProcessLaunch.py (1355 of 1971)
PASS: lldb-api :: functionalities/breakpoint/move_nearest/TestMoveNearest.py (1356 of 1971)
PASS: lldb-unit :: Expression/./ExpressionTests/CppModuleConfigurationTest.LinuxLocalLibCpp (1357 of 1971)
PASS: lldb-unit :: Process/minidump/./LLDBMinidumpTests/MinidumpParserTest.GetMemoryRegionInfoFromMemoryList (1358 of 1971)
PASS: lldb-api :: api/listeners/TestListener.py (1359 of 1971)
PASS: lldb-unit :: Utility/./UtilityTests/NameMatchesTest.RegularExpression (1360 of 1971)
PASS: lldb-unit :: Utility/./UtilityTests/OptionsWithRawTest.EmptySuffix (1361 of 1971)
UNSUPPORTED: lldb-shell :: ObjectFile/ELF/minidebuginfo-no-lzma.yaml (1362 of 1971)
PASS: lldb-unit :: Symbol/./SymbolTests/TestTypeSystemClang.TestGetEnumIntegerTypeBasicTypes (1363 of 1971)
PASS: lldb-api :: functionalities/inferior-crashing/recursive-inferior/TestRecursiveInferior.py (1364 of 1971)
PASS: lldb-api :: functionalities/thread/concurrent_events/TestConcurrentTwoBreakpointsOneWatchpoint.py (1365 of 1971)
PASS: lldb-api :: functionalities/data-formatter/data-formatter-stl/libstdcpp/unique_ptr/invalid/TestDataFormatterInvalidStdUniquePtr.py (1366 of 1971)
PASS: lldb-shell :: SymbolFile/DWARF/dwp.s (1367 of 1971)
PASS: lldb-unit :: SymbolFile/DWARF/./SymbolFileDWARFTests/DWARFASTParserClangTests.EnsureAllDIEsInDeclContextHaveBeenParsedParsesOnlyMatchingEntries (1368 of 1971)
PASS: lldb-api :: functionalities/var_path/TestVarPath.py (1369 of 1971)
PASS: lldb-unit :: Utility/./UtilityTests/BroadcasterTest.EventTypeHasListeners (1370 of 1971)
PASS: lldb-api :: functionalities/postmortem/mach-core/TestMachCore.py (1371 of 1971)
PASS: lldb-shell :: Commands/command-regex-delete.test (1372 of 1971)
PASS: lldb-api :: python_api/module_section/TestModuleAndSection.py (1373 of 1971)
PASS: lldb-api :: commands/frame/diagnose/complicated-expression/TestComplicatedExpression.py (1374 of 1971)
PASS: lldb-api :: python_api/watchpoint/TestWatchpointIter.py (1375 of 1971)
PASS: lldb-unit :: Utility/./UtilityTests/StringListTest.CopyList (1376 of 1971)
PASS: lldb-api :: lang/c/vla/TestVLA.py (1377 of 1971)
PASS: lldb-unit :: Utility/./UtilityTests/StreamTeeTest.Flush (1378 of 1971)
UNSUPPORTED: lldb-shell :: Expr/TestIRMemoryMapWindows.test (1379 of 1971)
PASS: lldb-api :: commands/watchpoints/multiple_threads/TestWatchpointMultipleThreads.py (1380 of 1971)
PASS: lldb-api :: functionalities/thread/backtrace_limit/TestBacktraceLimit.py (1381 of 1971)
PASS: lldb-unit :: Utility/./UtilityTests/BinaryStreamTest.PutSLEB128MaxValue (1382 of 1971)
PASS: lldb-shell :: SymbolFile/NativePDB/bitfields.cpp (1383 of 1971)
PASS: lldb-unit :: debugserver/./debugserverTests/RNBSocket.LoopBackConnectIPv4 (1384 of 1971)
PASS: lldb-api :: functionalities/data-formatter/data-formatter-python-synth/TestDataFormatterPythonSynth.py (1385 of 1971)
PASS: lldb-api :: commands/target/create-deps/TestTargetCreateDeps.py (1386 of 1971)
PASS: lldb-api :: python_api/sbtype_typeclass/TestSBTypeTypeClass.py (1387 of 1971)
PASS: lldb-unit :: Utility/./UtilityTests/StreamTest.PutHex8 (1388 of 1971)
PASS: lldb-unit :: Utility/./UtilityTests/LogChannelTest.EnableOptions (1389 of 1971)
PASS: lldb-api :: tools/lldb-vscode/launch/TestVSCode_launch.py (1390 of 1971)
PASS: lldb-api :: commands/expression/entry-bp/TestExprEntryBP.py (1391 of 1971)
PASS: lldb-api :: functionalities/data-formatter/compactvectors/TestCompactVectors.py (1392 of 1971)
PASS: lldb-unit :: Utility/./UtilityTests/SerializationRountripTest.SerializeDeserializeCString (1393 of 1971)
PASS: lldb-unit :: Utility/./UtilityTests/UriParserTest.SchemeHostSeparator3 (1394 of 1971)
PASS: lldb-api :: commands/expression/persistent_types/TestPersistentTypes.py (1395 of 1971)
PASS: lldb-api :: macosx/profile_vrs_detach/TestDetachVrsProfile.py (1396 of 1971)
PASS: lldb-unit :: Expression/./ExpressionTests/DiagnosticManagerTest.GetStringNoDiags (1397 of 1971)
PASS: lldb-unit :: Process/minidump/./LLDBMinidumpTests/MinidumpParserTest.GetMiscInfoWindows (1398 of 1971)
PASS: lldb-unit :: Host/./HostTests/FileSystemTest.GetPermissions (1399 of 1971)
PASS: lldb-shell :: SymbolFile/DWARF/split-dwarf-inlining.cpp (1400 of 1971)
PASS: lldb-api :: lang/cpp/const_this/TestConstThis.py (1401 of 1971)
PASS: lldb-shell :: ObjectFile/PECOFF/symbol.yaml (1402 of 1971)
PASS: lldb-unit :: Utility/./UtilityTests/ArgsTest.ReplaceArgumentAtIndexFarOutOfRange (1403 of 1971)
PASS: lldb-api :: lang/cpp/accelerator-table/TestCPPAccelerator.py (1404 of 1971)
PASS: lldb-unit :: Utility/./UtilityTests/StreamTest.PutHex64ByteOrderBig (1405 of 1971)
PASS: lldb-unit :: Utility/./UtilityTests/TimerTest.CategoryTimesNested (1406 of 1971)
UNSUPPORTED: lldb-api :: functionalities/darwin_log/filter/exact_match/message/TestDarwinLogFilterMatchMessage.py (1407 of 1971)
UNSUPPORTED: lldb-shell :: BuildScript/toolchain-msvc.test (1408 of 1971)
UNSUPPORTED: lldb-api :: functionalities/ubsan/user-expression/TestUbsanUserExpression.py (1409 of 1971)
UNSUPPORTED: lldb-api :: functionalities/darwin_log/filter/regex/message/TestDarwinLogFilterRegexMessage.py (1410 of 1971)
PASS: lldb-api :: functionalities/data-formatter/data-formatter-stl/libcxx/unordered/TestDataFormatterUnordered.py (1411 of 1971)
PASS: lldb-unit :: Utility/./UtilityTests/RangeDataVector.FindEntryThatContains (1412 of 1971)
PASS: lldb-api :: functionalities/inferior-crashing/TestInferiorCrashingStep.py (1413 of 1971)
PASS: lldb-unit :: ScriptInterpreter/Python/./ScriptInterpreterPythonTests/PythonDataObjectsTest.TestPythonTupleToStructuredList (1414 of 1971)
PASS: lldb-shell :: Settings/TestStopCommandSourceOnError.test (1415 of 1971)
PASS: lldb-unit :: Utility/./UtilityTests/CompletionRequest.TestCompletionOwnership (1416 of 1971)
PASS: lldb-unit :: Utility/./UtilityTests/OptionsWithRawTest.TerminatedQuote (1417 of 1971)
PASS: lldb-shell :: SymbolFile/Breakpad/line-table-mixed-path-styles.test (1418 of 1971)
PASS: lldb-api :: functionalities/thread/concurrent_events/TestConcurrentBreakpointOneDelayBreakpointThreads.py (1419 of 1971)
PASS: lldb-unit :: Host/./HostTests/NativeProcessProtocolTest.ReadCStringFromMemory_MaxSize (1420 of 1971)
PASS: lldb-unit :: Language/Highlighting/./HighlighterTests/HighlighterTest.ClangUnterminatedString (1421 of 1971)
PASS: lldb-shell :: BuildScript/toolchain-clang.test (1422 of 1971)
PASS: lldb-unit :: Process/minidump/./LLDBMinidumpTests/MinidumpParserTest.GetMemoryRegionInfoLinuxMaps (1423 of 1971)
PASS: lldb-api :: lang/cpp/inlines/TestInlines.py (1424 of 1971)
PASS: lldb-unit :: Utility/./UtilityTests/DeserializerTest.HasData (1425 of 1971)
PASS: lldb-api :: functionalities/conditional_break/TestConditionalBreak.py (1426 of 1971)
PASS: lldb-unit :: Utility/./UtilityTests/FileSpecTest.AppendPathComponent (1427 of 1971)
PASS: lldb-unit :: Utility/./UtilityTests/ProcessInstanceInfo.DumpTable (1428 of 1971)
PASS: lldb-api :: functionalities/abbreviation/TestCommonShortSpellings.py (1429 of 1971)
PASS: lldb-unit :: Utility/./UtilityTests/StringListTest.ShiftMove (1430 of 1971)
PASS: lldb-unit :: UnwindAssembly/x86/./UnwindAssemblyx86Tests/Testx86AssemblyInspectionEngine.TestPushEAX (1431 of 1971)
PASS: lldb-unit :: Platform/./LLDBPlatformTests/PlatformDarwinTest.FindComponentInPath (1432 of 1971)
PASS: lldb-unit :: Target/./TargetTests/PathMappingListTest.AbsoluteTests (1433 of 1971)
PASS: lldb-api :: lang/c/shared_lib/TestSharedLib.py (1434 of 1971)
PASS: lldb-shell :: ScriptInterpreter/Python/crashlog.test (1435 of 1971)
PASS: lldb-api :: functionalities/thread/concurrent_events/TestConcurrentTwoBreakpointsOneSignal.py (1436 of 1971)
PASS: lldb-api :: types/TestIntegerTypeExpr.py (1437 of 1971)
PASS: lldb-unit :: Utility/./UtilityTests/StringListTest.JoinThree (1438 of 1971)
PASS: lldb-unit :: Host/./HostTests/SocketTest.TCPListen0GetPort (1439 of 1971)
PASS: lldb-api :: lang/objc/exceptions/TestObjCExceptions.py (1440 of 1971)
PASS: lldb-unit :: Host/./HostTests/TaskPoolTest.AddTask (1441 of 1971)
UNSUPPORTED: lldb-shell :: Breakpoint/case-insensitive.test (1442 of 1971)
PASS: lldb-unit :: Language/CPlusPlus/./LanguageCPlusPlusTests/CPlusPlusLanguage.ExtractContextAndIdentifier (1443 of 1971)
PASS: lldb-api :: commands/expression/completion-crash-incomplete-record/TestCompletionCrashIncompleteRecord.py (1444 of 1971)
PASS: lldb-unit :: Utility/./UtilityTests/StreamTest.PutStringAsRawHex8 (1445 of 1971)
PASS: lldb-shell :: SymbolFile/DWARF/anon_class_w_and_wo_export_symbols.ll (1446 of 1971)
PASS: lldb-unit :: Utility/./UtilityTests/OptionsWithRawTest.SingleWhitespaceInput (1447 of 1971)
PASS: lldb-api :: macosx/nslog/TestDarwinNSLogOutput.py (1448 of 1971)
PASS: lldb-unit :: Interpreter/./InterpreterTests/CompletionTest.DirCompletionUsername (1449 of 1971)
PASS: lldb-unit :: Utility/./UtilityTests/StringListTest.CopyListSingle (1450 of 1971)
PASS: lldb-unit :: ObjectFile/ELF/./ObjectFileELFTests/ObjectFileELFTest.GetSymtab_NoSymEntryPointArmThumbAddressClass (1451 of 1971)
PASS: lldb-api :: commands/expression/class_template_specialization_empty_pack/TestClassTemplateSpecializationParametersHandling.py (1452 of 1971)
UNSUPPORTED: lldb-shell :: SymbolFile/NativePDB/stack_unwinding01.cpp (1453 of 1971)
PASS: lldb-api :: sanity/TestModuleCacheSanity.py (1454 of 1971)
PASS: lldb-unit :: Utility/./UtilityTests/BinaryStreamTest.PutULEB128ThreeBytes (1455 of 1971)
PASS: lldb-unit :: Utility/./UtilityTests/EnvironmentTest.EnvpConstruction (1456 of 1971)
PASS: lldb-api :: lang/c/anonymous/TestAnonymous.py (1457 of 1971)
PASS: lldb-unit :: Interpreter/./InterpreterTests/OptionArgParserTest.toChar (1458 of 1971)
PASS: lldb-unit :: ScriptInterpreter/Python/./ScriptInterpreterPythonTests/PythonDataObjectsTest.TestBorrowedReferences (1459 of 1971)
PASS: lldb-unit :: Process/minidump/./LLDBMinidumpTests/MinidumpParserTest.GetThreadContext_x86_64 (1460 of 1971)
PASS: lldb-shell :: Minidump/no-process-id.yaml (1461 of 1971)
PASS: lldb-shell :: ObjectFile/ELF/compressed-sections.yaml (1462 of 1971)
UNSUPPORTED: lldb-shell :: SymbolFile/PDB/expressions.test (1463 of 1971)
PASS: lldb-unit :: Utility/./UtilityTests/AnsiTerminal.AtEnd (1464 of 1971)
PASS: lldb-unit :: Utility/./UtilityTests/OptionsWithRawTest.SingleWordSuffix (1465 of 1971)
PASS: lldb-shell :: ObjectFile/Breakpad/discontiguous-sections.test (1466 of 1971)
PASS: lldb-api :: lang/c/inlines/TestRedefinitionsInInlines.py (1467 of 1971)
PASS: lldb-shell :: ObjectFile/PECOFF/sections-names.yaml (1468 of 1971)
PASS: lldb-shell :: SymbolFile/DWARF/debug-types-line-tables.s (1469 of 1971)
PASS: lldb-unit :: ScriptInterpreter/Python/./ScriptInterpreterPythonTests/PythonDataObjectsTest.TestInstanceNameResolutionNoDot (1470 of 1971)
PASS: lldb-unit :: Process/gdb-remote/./ProcessGdbRemoteTests/GDBRemoteCommunicationClientTest.TestPacketSpeedJSON (1471 of 1971)
PASS: lldb-shell :: ObjectFile/ELF/section-types.yaml (1472 of 1971)
PASS: lldb-api :: api/command-return-object/TestSBCommandReturnObject.py (1473 of 1971)
PASS: lldb-api :: commands/process/launch-with-shellexpand/TestLaunchWithShellExpand.py (1474 of 1971)
PASS: lldb-unit :: Language/Highlighting/./HighlighterTests/HighlighterTest.ClangOperators (1475 of 1971)
PASS: lldb-api :: functionalities/data-formatter/data-formatter-stl/libcxx/string/TestDataFormatterLibcxxString.py (1476 of 1971)
PASS: lldb-unit :: Utility/./UtilityTests/ArchSpecTest.MergeFrom (1477 of 1971)
PASS: lldb-unit :: SymbolFile/NativePDB/./SymbolFileNativePDBTests/PDBFPOProgramToDWARFExpressionTests.MultipleIndependentAssignments (1478 of 1971)
PASS: lldb-api :: functionalities/data-formatter/data-formatter-objc/TestDataFormatterObjCNSError.py (1479 of 1971)
PASS: lldb-api :: lang/objc/print-obj/TestPrintObj.py (1480 of 1971)
PASS: lldb-api :: functionalities/data-formatter/data-formatter-stl/libcxx/variant/TestDataFormatterLibcxxVariant.py (1481 of 1971)
PASS: lldb-shell :: Driver/TestRepl.test (1482 of 1971)
PASS: lldb-unit :: Utility/./UtilityTests/StringExtractorTest.InitMisc (1483 of 1971)
PASS: lldb-api :: tools/lldb-server/inferior-crash/TestGdbRemoteSegFault.py (1484 of 1971)
PASS: lldb-shell :: Reproducer/Functionalities/TestStepping.test (1485 of 1971)
PASS: lldb-unit :: Utility/./UtilityTests/StringListTest.AppendList (1486 of 1971)
PASS: lldb-unit :: Utility/./UtilityTests/RegisterValueTest.GetSet8 (1487 of 1971)
PASS: lldb-unit :: ObjectFile/PECOFF/./ObjectFilePECOFFTests/PECallFrameInfoTest.Chained_eh (1488 of 1971)
PASS: lldb-api :: functionalities/thread/concurrent_events/TestConcurrentCrashWithBreak.py (1489 of 1971)
PASS: lldb-unit :: UnwindAssembly/x86/./UnwindAssemblyx86Tests/Testx86AssemblyInspectionEngine.TestPushR12 (1490 of 1971)
PASS: lldb-unit :: Process/gdb-remote/./ProcessGdbRemoteTests/GDBRemoteCommunicationClientTest.SaveRestoreRegistersNoSuffix (1491 of 1971)
UNSUPPORTED: lldb-api :: linux/sepdebugsymlink/TestTargetSymbolsSepDebugSymlink.py (1492 of 1971)
PASS: lldb-api :: functionalities/gdb_remote_client/TestqOffsets.py (1493 of 1971)
PASS: lldb-api :: python_api/frame/get-variables/TestGetVariables.py (1494 of 1971)
PASS: lldb-unit :: Utility/./UtilityTests/BinaryStreamTest.PutULEB128MaxValue (1495 of 1971)
PASS: lldb-api :: commands/frame/diagnose/dereference-function-return/TestDiagnoseDereferenceFunctionReturn.py (1496 of 1971)
PASS: lldb-api :: functionalities/data-formatter/data-formatter-script/TestDataFormatterScript.py (1497 of 1971)
PASS: lldb-unit :: Language/Highlighting/./HighlighterTests/HighlighterTest.ClangCursorPosBeforeOtherToken (1498 of 1971)
PASS: lldb-unit :: Language/Highlighting/./HighlighterTests/HighlighterTest.ClangPPDirectives (1499 of 1971)
PASS: lldb-shell :: ScriptInterpreter/None/none.test (1500 of 1971)
PASS: lldb-api :: lang/objc/objc-baseclass-sbtype/TestObjCBaseClassSBType.py (1501 of 1971)
UNSUPPORTED: lldb-shell :: ScriptInterpreter/Lua/watchpoint_callback.test (1502 of 1971)
PASS: lldb-unit :: Utility/./UtilityTests/Flags.IsClear (1503 of 1971)
PASS: lldb-unit :: Utility/./UtilityTests/CompletionRequest.TryCompleteCurrentArgGood (1504 of 1971)
PASS: lldb-api :: commands/frame/recognizer/TestFrameRecognizer.py (1505 of 1971)
PASS: lldb-unit :: Symbol/./SymbolTests/PostfixExpression.ParseFPOProgram (1506 of 1971)
PASS: lldb-unit :: Utility/./UtilityTests/StringExtractorTest.GetU64LittleEndian (1507 of 1971)
PASS: lldb-api :: lang/mixed/TestMixedLanguages.py (1508 of 1971)
PASS: lldb-unit :: Language/Highlighting/./HighlighterTests/HighlighterTest.ClangBraces (1509 of 1971)
PASS: lldb-unit :: Utility/./UtilityTests/StringListTest.SplitIntoLinesSingleTrailingCR (1510 of 1971)
PASS: lldb-unit :: Language/Highlighting/./HighlighterTests/HighlighterTest.ClangCursorPosInOtherToken (1511 of 1971)
PASS: lldb-api :: functionalities/data-formatter/data-formatter-caching/TestDataFormatterCaching.py (1512 of 1971)
PASS: lldb-unit :: Utility/./UtilityTests/ProcessInstanceInfo.DumpTable_invalidUID (1513 of 1971)
PASS: lldb-api :: functionalities/data-formatter/array_typedef/TestArrayTypedef.py (1514 of 1971)
PASS: lldb-unit :: Process/minidump/./LLDBMinidumpTests/MinidumpParserTest.GetLinuxProcStatus_no_stream (1515 of 1971)
PASS: lldb-shell :: Commands/command-backtrace.test (1516 of 1971)
PASS: lldb-api :: functionalities/thread/concurrent_events/TestConcurrentTwoBreakpointsOneDelaySignal.py (1517 of 1971)
PASS: lldb-shell :: ObjectFile/ELF/PT_LOAD-overlap-PT_INTERP.yaml (1518 of 1971)
UNSUPPORTED: lldb-api :: functionalities/tsan/basic/TestTsanBasic.py (1519 of 1971)
PASS: lldb-unit :: UnwindAssembly/x86/./UnwindAssemblyx86Tests/Testx86AssemblyInspectionEngine.TestDisassemblyJunkBytes (1520 of 1971)
PASS: lldb-unit :: Utility/./UtilityTests/Predicate.WaitForValueNotEqualTo (1521 of 1971)
PASS: lldb-unit :: Utility/./UtilityTests/StreamTeeTest.AppendStream (1522 of 1971)
UNSUPPORTED: lldb-api :: lang/objc/foundation/TestFoundationDisassembly.py (1523 of 1971)
PASS: lldb-unit :: debugserver/./debugserverTests/RNBSocket.LoopBackListenIPv6 (1524 of 1971)
PASS: lldb-shell :: Register/x86-64-ymm-read.test (1525 of 1971)
PASS: lldb-api :: functionalities/data-formatter/data-formatter-cpp/TestDataFormatterCpp.py (1526 of 1971)
PASS: lldb-unit :: UnwindAssembly/x86/./UnwindAssemblyx86Tests/Testx86AssemblyInspectionEngine.TestSimplex86_64Augmented (1527 of 1971)
PASS: lldb-api :: commands/expression/pr35310/TestExprsBug35310.py (1528 of 1971)
PASS: lldb-api :: python_api/frame/TestFrames.py (1529 of 1971)
PASS: lldb-api :: commands/expression/calculator_mode/TestCalculatorMode.py (1530 of 1971)
PASS: lldb-unit :: SymbolFile/NativePDB/./SymbolFileNativePDBTests/PDBFPOProgramToDWARFExpressionTests.DependencyChain (1531 of 1971)
PASS: lldb-unit :: UnwindAssembly/x86/./UnwindAssemblyx86Tests/Testx86AssemblyInspectionEngine.TestSubESP (1532 of 1971)
PASS: lldb-api :: lang/objc/self/TestObjCSelf.py (1533 of 1971)
PASS: lldb-unit :: Utility/./UtilityTests/RangeTest.DoesIntersect (1534 of 1971)
PASS: lldb-api :: lang/cpp/multiple-inheritance/TestCppMultipleInheritance.py (1535 of 1971)
PASS: lldb-api :: api/multithreaded/TestMultithreaded.py (1536 of 1971)
PASS: lldb-unit :: Utility/./UtilityTests/RangeDataVector.FindEntryIndexesThatContain (1537 of 1971)
PASS: lldb-api :: tools/lldb-server/TestGdbRemoteKill.py (1538 of 1971)
PASS: lldb-api :: functionalities/thread/concurrent_events/TestConcurrentManyCrash.py (1539 of 1971)
PASS: lldb-shell :: Commands/CommandScriptImmediateOutput/CommandScriptImmediateOutputConsole.test (1540 of 1971)
PASS: lldb-unit :: Language/Highlighting/./HighlighterTests/HighlighterTest.ClangEmptyInput (1541 of 1971)
PASS: lldb-api :: python_api/symbol-context/two-files/TestSymbolContextTwoFiles.py (1542 of 1971)
UNSUPPORTED: lldb-shell :: Register/x86-zmm-write.test (1543 of 1971)
PASS: lldb-shell :: SymbolFile/DWARF/dwo-type-in-main-file.s (1544 of 1971)
PASS: lldb-unit :: Utility/./UtilityTests/RecordReplayTest.InstrumentedBarRef (1545 of 1971)
PASS: lldb-unit :: Core/./LLDBCoreTests/UniqueCStringMap.NoDefaultConstructor (1546 of 1971)
PASS: lldb-unit :: Platform/./LLDBPlatformTests/PlatformDarwinTest.TestParseVersionBuildDir (1547 of 1971)
PASS: lldb-unit :: Process/minidump/./LLDBMinidumpTests/MinidumpParserTest.GetFilteredModuleList (1548 of 1971)
PASS: lldb-unit :: Utility/./UtilityTests/StringListTest.AppendListCStringArrayEmpty (1549 of 1971)
PASS: lldb-unit :: Utility/./UtilityTests/BinaryStreamTest.PutSLEB128ThreeBytes (1550 of 1971)
PASS: lldb-shell :: Breakpoint/split-dwarf5-debug-stroffsets.test (1551 of 1971)
PASS: lldb-unit :: ScriptInterpreter/Python/./ScriptInterpreterPythonTests/PythonDataObjectsTest.TestPythonBytes (1552 of 1971)
PASS: lldb-api :: lang/c/find_struct_type/TestFindStructTypes.py (1553 of 1971)
PASS: lldb-api :: lang/c/step_over_no_deadlock/TestStepOverDoesntBlock.py (1554 of 1971)
PASS: lldb-unit :: Symbol/./SymbolTests/TestClangASTImporter.DeportTypeTagDecl (1555 of 1971)
PASS: lldb-api :: functionalities/signal/raise/TestRaise.py (1556 of 1971)
PASS: lldb-unit :: Host/./HostTests/FileActionTest.Open (1557 of 1971)
PASS: lldb-unit :: Utility/./UtilityTests/AnsiTerminal.Unknown (1558 of 1971)
PASS: lldb-api :: python_api/findvalue_duplist/TestSBFrameFindValue.py (1559 of 1971)
PASS: lldb-unit :: UnwindAssembly/x86/./UnwindAssemblyx86Tests/Testx86AssemblyInspectionEngine.Test64bitFramelessSmallStackFrame (1560 of 1971)
PASS: lldb-api :: functionalities/breakpoint/auto_continue/TestBreakpointAutoContinue.py (1561 of 1971)
UNSUPPORTED: lldb-shell :: SymbolFile/PDB/pointers.test (1562 of 1971)
PASS: lldb-unit :: Utility/./UtilityTests/ScalarTest.GetValue (1563 of 1971)
UNSUPPORTED: lldb-api :: benchmarks/expression/TestExpressionCmd.py (1564 of 1971)
PASS: lldb-api :: lang/cpp/scope/TestCppScope.py (1565 of 1971)
PASS: lldb-unit :: ScriptInterpreter/Python/./ScriptInterpreterPythonTests/PythonDataObjectsTest.TestTypeNameResolutionNoDot (1566 of 1971)
PASS: lldb-unit :: Utility/./UtilityTests/StringListTest.JoinMultiCharSeparator (1567 of 1971)
PASS: lldb-api :: python_api/value_var_update/TestValueVarUpdate.py (1568 of 1971)
PASS: lldb-unit :: Process/gdb-remote/./ProcessGdbRemoteTests/GDBRemoteClientBaseTest.SendContinueDelegateStructuredDataReceipt (1569 of 1971)
PASS: lldb-api :: commands/platform/basic/TestPlatformPython.py (1570 of 1971)
PASS: lldb-api :: commands/watchpoints/watchpoint_size/TestWatchpointSizes.py (1571 of 1971)
PASS: lldb-shell :: Driver/TestConvenienceVariables.test (1572 of 1971)
PASS: lldb-api :: macosx/find-dsym/bundle-with-dot-in-filename/TestBundleWithDotInFilename.py (1573 of 1971)
PASS: lldb-api :: commands/expression/ir-interpreter-phi-nodes/TestIRInterpreterPHINodes.py (1574 of 1971)
PASS: lldb-unit :: SymbolFile/NativePDB/./SymbolFileNativePDBTests/PDBFPOProgramToDWARFExpressionTests.UnresolvedRegisterReference (1575 of 1971)
PASS: lldb-unit :: Expression/./ExpressionTests/ClangExpressionDeclMapTest.TestPersistentDeclLookup (1576 of 1971)
PASS: lldb-shell :: Settings/TestSettingsWrite.test (1577 of 1971)
PASS: lldb-api :: functionalities/data-formatter/data-formatter-synthval/TestDataFormatterSynthVal.py (1578 of 1971)
UNSUPPORTED: lldb-api :: tools/lldb-vscode/completions/TestVSCode_completions.py (1579 of 1971)
PASS: lldb-unit :: Utility/./UtilityTests/BinaryStreamTest.PutULEB128OneByte (1580 of 1971)
PASS: lldb-shell :: SymbolFile/DWARF/split-dwarf-multiple-cu.ll (1581 of 1971)
XFAIL: lldb-shell :: Register/x86-mm-xmm-write.test (1582 of 1971)
PASS: lldb-shell :: SymbolFile/Breakpad/line-table.test (1583 of 1971)
PASS: lldb-unit :: Utility/./UtilityTests/UriParserTest.SchemeHostSeparator4 (1584 of 1971)
PASS: lldb-api :: commands/expression/diagnostics/TestExprDiagnostics.py (1585 of 1971)
UNSUPPORTED: lldb-shell :: SymbolFile/PDB/type-quals.test (1586 of 1971)
PASS: lldb-shell :: Expr/TestMultilineExpr.test (1587 of 1971)
PASS: lldb-api :: functionalities/tail_call_frames/cross_object/TestCrossObjectTailCalls.py (1588 of 1971)
PASS: lldb-unit :: Utility/./UtilityTests/StringExtractorTest.DecodeHexU8_InvalidHex (1589 of 1971)
PASS: lldb-unit :: Utility/./UtilityTests/StringListTest.LongestCommonPrefixNoPrefix (1590 of 1971)
PASS: lldb-api :: functionalities/breakpoint/breakpoint_ids/TestBreakpointIDs.py (1591 of 1971)
PASS: lldb-unit :: Host/./HostTests/ProcessLaunchInfoTest.Constructor (1592 of 1971)
PASS: lldb-unit :: Utility/./UtilityTests/RegularExpression.CopyAssignment (1593 of 1971)
PASS: lldb-api :: commands/expression/import-std-module/sysroot/TestStdModuleSysroot.py (1594 of 1971)
PASS: lldb-api :: functionalities/inferior-changed/TestInferiorChanged.py (1595 of 1971)
PASS: lldb-unit :: Expression/./ExpressionTests/ClangHostTest.MacOSX (1596 of 1971)
PASS: lldb-api :: functionalities/breakpoint/breakpoint_language/TestBreakpointLanguage.py (1597 of 1971)
PASS: lldb-api :: lang/cpp/char8_t/TestCxxChar8_t.py (1598 of 1971)
PASS: lldb-unit :: Utility/./UtilityTests/ScalarTest.SetValueFromCString (1599 of 1971)
PASS: lldb-api :: commands/log/basic/TestLogging.py (1600 of 1971)
PASS: lldb-api :: tools/lldb-server/commandline/TestStubReverseConnect.py (1601 of 1971)
UNSUPPORTED: lldb-shell :: Register/x86-64-ymm16-read.test (1602 of 1971)
UNSUPPORTED: lldb-shell :: Register/x86-64-xmm16-read.test (1603 of 1971)
PASS: lldb-api :: lang/c/local_variables/TestLocalVariables.py (1604 of 1971)
PASS: lldb-api :: functionalities/unwind/sigtramp/TestSigtrampUnwind.py (1605 of 1971)
PASS: lldb-unit :: tools/lldb-server/tests/./LLDBServerTests/TestBase.DebugserverEnv (1606 of 1971)
PASS: lldb-unit :: Process/minidump/./LLDBMinidumpTests/MinidumpParserTest.GetPidWindows (1607 of 1971)
PASS: lldb-api :: functionalities/data-formatter/boolreference/TestFormattersBoolRefPtr.py (1608 of 1971)
PASS: lldb-unit :: Utility/./UtilityTests/StringExtractorTest.GetHexU8_Exact_NoEof (1609 of 1971)
PASS: lldb-shell :: Driver/TestFile.test (1610 of 1971)
UNSUPPORTED: lldb-api :: commands/expression/multiline-completion/TestMultilineCompletion.py (1611 of 1971)
PASS: lldb-shell :: Reproducer/TestVersionCheck.test (1612 of 1971)
PASS: lldb-api :: functionalities/thread/concurrent_events/TestConcurrentDelaySignalWatch.py (1613 of 1971)
PASS: lldb-unit :: Utility/./UtilityTests/FileSpecTest.FormatFileSpec (1614 of 1971)
PASS: lldb-unit :: Utility/./UtilityTests/StreamTest.ShiftOperatorPtr (1615 of 1971)
PASS: lldb-api :: functionalities/thread/thread_specific_break/TestThreadSpecificBreakpoint.py (1616 of 1971)
PASS: lldb-unit :: ObjectFile/Breakpad/./ObjectFileBreakpadTests/Record.classify (1617 of 1971)
PASS: lldb-shell :: Reproducer/TestCaptureEnvOverride.test (1618 of 1971)
PASS: lldb-unit :: tools/lldb-server/tests/./LLDBServerTests/TestBase.LaunchModePreservesEnvironment (1619 of 1971)
PASS: lldb-api :: lang/cpp/namespace/TestNamespace.py (1620 of 1971)
PASS: lldb-unit :: ScriptInterpreter/Python/./ScriptInterpreterPythonTests/PythonDataObjectsTest.TestPythonDictionaryValueEquality (1621 of 1971)
PASS: lldb-unit :: Utility/./UtilityTests/DataExtractorTest.GetCStrEmpty (1622 of 1971)
PASS: lldb-api :: commands/expression/namespace_local_var_same_name_cpp_and_c/TestNamespaceLocalVarSameNameCppAndC.py (1623 of 1971)
PASS: lldb-unit :: Utility/./UtilityTests/FileSpecTest.Yaml (1624 of 1971)
PASS: lldb-api :: functionalities/data-formatter/data-formatter-stl/libcxx/queue/TestDataFormatterLibcxxQueue.py (1625 of 1971)
PASS: lldb-api :: python_api/debugger/TestDebuggerAPI.py (1626 of 1971)
PASS: lldb-api :: python_api/process/read-mem-cstring/TestReadMemCString.py (1627 of 1971)
PASS: lldb-unit :: Utility/./UtilityTests/ArgsTest.BareSingleQuote (1628 of 1971)
PASS: lldb-api :: commands/expression/persistent_variables/TestPersistentVariables.py (1629 of 1971)
PASS: lldb-api :: tools/lldb-server/TestGdbRemoteRegisterState.py (1630 of 1971)
UNSUPPORTED: lldb-api :: tools/lldb-server/libraries-svr4/TestGdbRemoteLibrariesSvr4Support.py (1631 of 1971)
PASS: lldb-api :: lang/objc/rdar-10967107/TestRdar10967107.py (1632 of 1971)
PASS: lldb-unit :: Utility/./UtilityTests/LogTest.Unregister (1633 of 1971)
PASS: lldb-api :: functionalities/object-file/TestImageListMultiArchitecture.py (1634 of 1971)
PASS: lldb-api :: functionalities/multidebugger_commands/TestMultipleDebuggersCommands.py (1635 of 1971)
PASS: lldb-unit :: Process/gdb-remote/./ProcessGdbRemoteTests/GDBRemoteCommunicationClientTest.GetQOffsets (1636 of 1971)
PASS: lldb-unit :: Utility/./UtilityTests/ArchSpecTest.TripleComponentsWereSpecified (1637 of 1971)
UNSUPPORTED: lldb-shell :: ScriptInterpreter/Lua/breakpoint_callback.test (1638 of 1971)
PASS: lldb-api :: macosx/safe-to-func-call/TestSafeFuncCalls.py (1639 of 1971)
PASS: lldb-api :: commands/expression/scoped_enums/TestScopedEnumType.py (1640 of 1971)
PASS: lldb-unit :: Utility/./UtilityTests/VMRange.Ordering (1641 of 1971)
PASS: lldb-unit :: Utility/./UtilityTests/DataExtractorTest.GetMaxS64 (1642 of 1971)
PASS: lldb-shell :: Breakpoint/debug_addrx.test (1643 of 1971)
PASS: lldb-api :: commands/expression/issue_11588/Test11588.py (1644 of 1971)
PASS: lldb-api :: commands/expression/import-std-module/forward_list/TestForwardListFromStdModule.py (1645 of 1971)
PASS: lldb-api :: commands/frame/select/TestFrameSelect.py (1646 of 1971)
PASS: lldb-api :: driver/batch_mode/TestBatchMode.py (1647 of 1971)
PASS: lldb-unit :: UnwindAssembly/x86/./UnwindAssemblyx86Tests/Testx86AssemblyInspectionEngine.TestPopEBX (1648 of 1971)
PASS: lldb-unit :: Host/./HostTests/File.GetStreamFromDescriptor (1649 of 1971)
PASS: lldb-unit :: tools/lldb-server/tests/./LLDBServerTests/StandardStartupTest.TestStopReplyContainsThreadPcs (1650 of 1971)
PASS: lldb-shell :: SymbolFile/NativePDB/nested-types.cpp (1651 of 1971)
UNSUPPORTED: lldb-api :: functionalities/darwin_log/format/TestDarwinLogMessageFormat.py (1652 of 1971)
PASS: lldb-unit :: Utility/./UtilityTests/BinaryStreamTest.PutSLEB128Zero (1653 of 1971)
PASS: lldb-shell :: ObjectFile/MachO/subsections.yaml (1654 of 1971)
PASS: lldb-api :: commands/frame/var-scope/TestFrameVariableScope.py (1655 of 1971)
PASS: lldb-shell :: ObjectFile/ELF/avr-basic-info.yaml (1656 of 1971)
PASS: lldb-unit :: Process/gdb-remote/./ProcessGdbRemoteTests/GDBRemoteClientBaseTest.InterruptNoResponse (1657 of 1971)
PASS: lldb-api :: commands/process/attach-resume/TestAttachResume.py (1658 of 1971)
PASS: lldb-api :: functionalities/data-formatter/var-in-aggregate-misuse/TestVarInAggregateMisuse.py (1659 of 1971)
PASS: lldb-unit :: Utility/./UtilityTests/StringExtractorTest.DecodeHexU8_Exact (1660 of 1971)
PASS: lldb-api :: functionalities/breakpoint/address_breakpoints/TestBadAddressBreakpoints.py (1661 of 1971)
PASS: lldb-api :: functionalities/signal/TestSendSignal.py (1662 of 1971)
PASS: lldb-unit :: Utility/./UtilityTests/StringListTest.Join (1663 of 1971)
PASS: lldb-api :: python_api/target/TestTargetAPI.py (1664 of 1971)
UNSUPPORTED: lldb-api :: functionalities/darwin_log/filter/regex/activity-chain/TestDarwinLogFilterRegexActivityChain.py (1665 of 1971)
PASS: lldb-api :: lang/cpp/frame-var-anon-unions/TestFrameVariableAnonymousUnions.py (1666 of 1971)
PASS: lldb-unit :: UnwindAssembly/x86/./UnwindAssemblyx86Tests/Testx86AssemblyInspectionEngine.TestSimplei386ugmented (1667 of 1971)
PASS: lldb-shell :: ObjectFile/ELF/base-address.yaml (1668 of 1971)
PASS: lldb-unit :: Utility/./UtilityTests/StringExtractorTest.GetNameColonValueSuccess (1669 of 1971)
PASS: lldb-api :: lang/c/unions/TestUnionMembers.py (1670 of 1971)
PASS: lldb-api :: functionalities/thread/concurrent_events/TestConcurrentDelaySignalBreak.py (1671 of 1971)
PASS: lldb-api :: functionalities/thread/concurrent_events/TestConcurrentSignalBreak.py (1672 of 1971)
PASS: lldb-unit :: Utility/./UtilityTests/StringExtractorTest.GetU32LittleEndian (1673 of 1971)
PASS: lldb-unit :: Signals/./SignalsTests/UnixSignalsTest.VersionChange (1674 of 1971)
PASS: lldb-unit :: Utility/./UtilityTests/StreamTest.AddressRangeSize (1675 of 1971)
PASS: lldb-shell :: SymbolFile/NativePDB/function-types-classes.cpp (1676 of 1971)
PASS: lldb-api :: macosx/thread-names/TestInterruptThreadNames.py (1677 of 1971)
PASS: lldb-shell :: ObjectFile/ELF/PT_LOAD-empty.yaml (1678 of 1971)
UNSUPPORTED: lldb-api :: commands/target/auto-install-main-executable/TestAutoInstallMainExecutable.py (1679 of 1971)
PASS: lldb-shell :: Minidump/fb-dump.test (1680 of 1971)
PASS: lldb-unit :: Host/./HostTests/FileSystemTest.OpenErrno (1681 of 1971)
PASS: lldb-unit :: Process/minidump/./LLDBMinidumpTests/MinidumpParserTest.GetArchitectureWindows (1682 of 1971)
PASS: lldb-shell :: ObjectFile/ELF/netbsd-core-amd64.test (1683 of 1971)
PASS: lldb-api :: functionalities/breakpoint/serialize/TestBreakpointSerialization.py (1684 of 1971)
PASS: lldb-unit :: Utility/./UtilityTests/UriParserTest.MinimalPath (1685 of 1971)
PASS: lldb-unit :: ScriptInterpreter/Python/./ScriptInterpreterPythonTests/PythonDataObjectsTest.TestPythonListToStructuredList (1686 of 1971)
PASS: lldb-unit :: Utility/./UtilityTests/Predicate.WaitForValueEqualTo (1687 of 1971)
PASS: lldb-shell :: Commands/command-disassemble.s (1688 of 1971)
PASS: lldb-shell :: SymbolFile/DWARF/debug_ranges.s (1689 of 1971)
PASS: lldb-api :: macosx/indirect_symbol/TestIndirectSymbols.py (1690 of 1971)
PASS: lldb-unit :: Expression/./ExpressionTests/DiagnosticManagerTest.PutString (1691 of 1971)
PASS: lldb-unit :: Utility/./UtilityTests/RangeDataVector.FindEntryThatContains_Overlap (1692 of 1971)
UNSUPPORTED: lldb-api :: commands/register/register/intel_xtended_registers/mpx_offset_intersection/TestMPXOffsetIntersection.py (1693 of 1971)
UNSUPPORTED: lldb-api :: functionalities/darwin_log/filter/exact_match/activity/TestDarwinLogFilterMatchActivity.py (1694 of 1971)
PASS: lldb-api :: macosx/find-app-in-bundle/TestFindAppInBundle.py (1695 of 1971)
PASS: lldb-api :: commands/expression/call-function/TestCallUserDefinedFunction.py (1696 of 1971)
XFAIL: lldb-shell :: Register/x86-mm-xmm-read.test (1697 of 1971)
PASS: lldb-api :: lang/objc/objc-checker/TestObjCCheckers.py (1698 of 1971)
PASS: lldb-api :: commands/expression/namespace_local_var_same_name_obj_c/TestNamespaceLocalVarSameNameObjC.py (1699 of 1971)
PASS: lldb-api :: functionalities/tail_call_frames/sbapi_support/TestTailCallFrameSBAPI.py (1700 of 1971)
PASS: lldb-api :: lang/c/bitfields/TestBitfields.py (1701 of 1971)
PASS: lldb-shell :: Reproducer/TestGDBRemoteRepro.test (1702 of 1971)
PASS: lldb-unit :: Process/gdb-remote/./ProcessGdbRemoteTests/GDBRemoteCommunicationClientTest.SendSignalsToIgnore (1703 of 1971)
PASS: lldb-unit :: Utility/./UtilityTests/BinaryStreamTest.PutSLEB128SixBytes (1704 of 1971)
PASS: lldb-api :: commands/expression/static-initializers/TestStaticInitializers.py (1705 of 1971)
UNSUPPORTED: lldb-shell :: SymbolFile/PDB/typedefs.test (1706 of 1971)
PASS: lldb-unit :: UnwindAssembly/x86/./UnwindAssemblyx86Tests/Testx86AssemblyInspectionEngine.TestReturnDetect (1707 of 1971)
PASS: lldb-shell :: Driver/TestCommands.test (1708 of 1971)
PASS: lldb-unit :: Utility/./UtilityTests/StreamTest.PutCStringWithStringRef (1709 of 1971)
PASS: lldb-unit :: Utility/./UtilityTests/CompletionRequest.TryCompleteCurrentArgMode (1710 of 1971)
PASS: lldb-api :: functionalities/data-formatter/data-formatter-proper-plurals/TestFormattersOneIsSingular.py (1711 of 1971)
PASS: lldb-unit :: Utility/./UtilityTests/ArgsTest.EscapeLLDBCommandArgument (1712 of 1971)
PASS: lldb-shell :: Breakpoint/split-dwarf-5-addrbase.test (1713 of 1971)
PASS: lldb-shell :: SymbolFile/DWARF/dwarf5-atomic.s (1714 of 1971)
UNSUPPORTED: lldb-api :: functionalities/exec/TestExec.py (1715 of 1971)
PASS: lldb-unit :: Utility/./UtilityTests/StringExtractorTest.GetHexBytes_OddPair2 (1716 of 1971)
PASS: lldb-shell :: ObjectFile/wasm/embedded-debug-sections.yaml (1717 of 1971)
PASS: lldb-api :: commands/breakpoint/command/list/TestBreakpointCommandList.py (1718 of 1971)
UNSUPPORTED: lldb-api :: functionalities/darwin_log/filter/regex/activity/TestDarwinLogFilterRegexActivity.py (1719 of 1971)
PASS: lldb-api :: functionalities/data-formatter/data-formatter-stl/libcxx/initializerlist/TestInitializerList.py (1720 of 1971)
PASS: lldb-api :: functionalities/thread/step_until/TestStepUntil.py (1721 of 1971)
PASS: lldb-api :: lang/cpp/virtual-functions/TestCppVirtualFunctions.py (1722 of 1971)
PASS: lldb-shell :: ObjectFile/Breakpad/sections-trailing-func.test (1723 of 1971)
PASS: lldb-api :: linux/builtin_trap/TestBuiltinTrap.py (1724 of 1971)
PASS: lldb-unit :: Utility/./UtilityTests/StreamTest.PutNHex8 (1725 of 1971)
PASS: lldb-unit :: Utility/./UtilityTests/BinaryStreamTest.PutULEB128SevenBytes (1726 of 1971)
PASS: lldb-api :: functionalities/thread/thread_exit/TestThreadExit.py (1727 of 1971)
PASS: lldb-shell :: Reproducer/TestPythonImport.test (1728 of 1971)
PASS: lldb-unit :: Utility/./UtilityTests/ArchSpecTest.OperatorBool (1729 of 1971)
PASS: lldb-unit :: UnwindAssembly/x86/./UnwindAssemblyx86Tests/Testx86AssemblyInspectionEngine.TestPushR14 (1730 of 1971)
PASS: lldb-unit :: Symbol/./SymbolTests/Type.GetTypeScopeAndBasename (1731 of 1971)
PASS: lldb-api :: functionalities/gdb_remote_client/TestNoWatchpointSupportInfo.py (1732 of 1971)
PASS: lldb-shell :: SymbolFile/DWARF/deterministic-build.cpp (1733 of 1971)
PASS: lldb-unit :: Process/minidump/./LLDBMinidumpTests/MinidumpParserTest.GetPidWow64 (1734 of 1971)
PASS: lldb-unit :: Utility/./UtilityTests/StringExtractorTest.GetNameColonValueNoColon (1735 of 1971)
PASS: lldb-shell :: SymbolFile/DWARF/dir-separator-no-comp-dir-relative-name.s (1736 of 1971)
PASS: lldb-api :: lang/c/register_variables/TestRegisterVariables.py (1737 of 1971)
PASS: lldb-unit :: Target/./TargetTests/PathMappingListTest.RemapRoot (1738 of 1971)
PASS: lldb-api :: functionalities/thread/concurrent_events/TestConcurrentSignalDelayBreak.py (1739 of 1971)
PASS: lldb-api :: commands/statistics/basic/TestStats.py (1740 of 1971)
XFAIL: lldb-shell :: SymbolFile/DWARF/find-type-in-function.cpp (1741 of 1971)
PASS: lldb-unit :: Utility/./UtilityTests/ArgsTest.TestQuotedTrailingBackslash (1742 of 1971)
PASS: lldb-shell :: ObjectFile/ELF/section-permissions.yaml (1743 of 1971)
PASS: lldb-api :: functionalities/inferior-assert/TestInferiorAssert.py (1744 of 1971)
PASS: lldb-unit :: ScriptInterpreter/Python/./ScriptInterpreterPythonTests/PythonDataObjectsTest.TestPythonTupleSize (1745 of 1971)
UNSUPPORTED: lldb-api :: functionalities/thread/state/TestThreadStates.py (1746 of 1971)
PASS: lldb-api :: functionalities/thread/concurrent_events/TestConcurrentTwoWatchpointsOneBreakpoint.py (1747 of 1971)
PASS: lldb-api :: macosx/universal/TestUniversal.py (1748 of 1971)
PASS: lldb-unit :: ScriptInterpreter/Python/./ScriptInterpreterPythonTests/PythonDataObjectsTest.TestPythonCallableInvoke (1749 of 1971)
PASS: lldb-unit :: Utility/./UtilityTests/AnsiTerminal.WhiteSpace (1750 of 1971)
PASS: lldb-unit :: Utility/./UtilityTests/StringListTest.CopyListEmpty (1751 of 1971)
PASS: lldb-unit :: Signals/./SignalsTests/UnixSignalsTest.Iteration (1752 of 1971)
PASS: lldb-api :: functionalities/thread/concurrent_events/TestConcurrentWatchBreak.py (1753 of 1971)
PASS: lldb-shell :: Breakpoint/jitbp_elf.test (1754 of 1971)
UNSUPPORTED: lldb-api :: tools/lldb-server/TestGdbRemote_vContThreads.py (1755 of 1971)
PASS: lldb-unit :: Expression/./ExpressionTests/CppModuleConfigurationTest.Linux (1756 of 1971)
UNSUPPORTED: lldb-api :: functionalities/asan/TestReportData.py (1757 of 1971)
PASS: lldb-unit :: Utility/./UtilityTests/ArgsTest.TestSingleQuotedArgWithSpace (1758 of 1971)
PASS: lldb-shell :: SymbolFile/DWARF/debug-types-missing-signature.test (1759 of 1971)
PASS: lldb-api :: functionalities/data-formatter/data-formatter-objc/TestDataFormatterObjCExpr.py (1760 of 1971)
PASS: lldb-api :: lang/cpp/gmodules/TestWithModuleDebugging.py (1761 of 1971)
PASS: lldb-api :: functionalities/data-formatter/data-formatter-named-summaries/TestDataFormatterNamedSummaries.py (1762 of 1971)
PASS: lldb-api :: commands/version/TestVersion.py (1763 of 1971)
PASS: lldb-unit :: Symbol/./SymbolTests/TestTypeSystemClang.TestGetBasicTypeFromName (1764 of 1971)
PASS: lldb-unit :: Process/minidump/./LLDBMinidumpTests/MinidumpParserTest.FindMemoryRangeWithFullMemoryMinidump (1765 of 1971)
PASS: lldb-unit :: ObjectFile/Breakpad/./ObjectFileBreakpadTests/StackWinRecord.parse (1766 of 1971)
PASS: lldb-unit :: Host/./HostTests/FileSystemTest.GetByteSize (1767 of 1971)
PASS: lldb-api :: functionalities/memory/cache/TestMemoryCache.py (1768 of 1971)
PASS: lldb-unit :: Utility/./UtilityTests/StringExtractorTest.GetHexBytesAvail_OddPair (1769 of 1971)
UNSUPPORTED: lldb-api :: lang/cpp/function-template-parameter-pack/TestFunctionTemplateParameterPack.py (1770 of 1971)
FAIL: lldb-api :: python_api/thread/TestThreadAPI.py (1771 of 1971)
******************** TEST 'lldb-api :: python_api/thread/TestThreadAPI.py' FAILED ********************
Script:
--
/usr/local/bin/python /Users/buildslave/jenkins/workspace/lldb-cmake-sanitized/llvm-project/lldb/test/API/dotest.py --arch x86_64 -s /Users/buildslave/jenkins/workspace/lldb-cmake-sanitized/lldb-build/lldb-test-traces -S nm -u CXXFLAGS -u CFLAGS --codesign-identity lldb_codesign --server /Users/buildslave/jenkins/workspace/lldb-cmake-sanitized/lldb-build/./bin/debugserver --arch x86_64 --build-dir /Users/buildslave/jenkins/workspace/lldb-cmake-sanitized/lldb-build/lldb-test-build.noindex -s=/Users/buildslave/jenkins/workspace/lldb-cmake-sanitized/test/logs -t --env TERM=vt100 --env LLVM_LIBS_DIR=/Users/buildslave/jenkins/workspace/lldb-cmake-sanitized/lldb-build/./lib --inferior-env ASAN_OPTIONS=detect_stack_use_after_return=1 --inferior-env DYLD_INSERT_LIBRARIES=/Users/buildslave/jenkins/workspace/lldb-cmake-sanitized/host-compiler/lib/clang/11.0.0/lib/darwin/libclang_rt.asan_osx_dynamic.dylib --build-dir /Users/buildslave/jenkins/workspace/lldb-cmake-sanitized/lldb-build/lldb-test-build.noindex --lldb-module-cache-dir /Users/buildslave/jenkins/workspace/lldb-cmake-sanitized/lldb-build/lldb-test-build.noindex/module-cache-lldb/lldb-api --clang-module-cache-dir /Users/buildslave/jenkins/workspace/lldb-cmake-sanitized/lldb-build/lldb-test-build.noindex/module-cache-clang/lldb-api --executable /Users/buildslave/jenkins/workspace/lldb-cmake-sanitized/lldb-build/./bin/lldb --compiler /Users/buildslave/jenkins/workspace/lldb-cmake-sanitized/lldb-build/./bin/clang --dsymutil /Users/buildslave/jenkins/workspace/lldb-cmake-sanitized/lldb-build/./bin/dsymutil --filecheck /Users/buildslave/jenkins/workspace/lldb-cmake-sanitized/lldb-build/./bin/FileCheck --lldb-libs-dir /Users/buildslave/jenkins/workspace/lldb-cmake-sanitized/lldb-build/./lib /Users/buildslave/jenkins/workspace/lldb-cmake-sanitized/llvm-project/lldb/test/API/python_api/thread -p TestThreadAPI.py
--
Exit Code: 1

Hide Details

Command Output (stdout): -- lldb version 11.0.99 clang revision 8f1651ccead149fbd2e6fe692fb8a7f787a222bd llvm revision 8f1651ccead149fbd2e6fe692fb8a7f787a222bd LLDB library dir: /Users/buildslave/jenkins/workspace/lldb-cmake-sanitized/lldb-build/bin LLDB import library dir: /Users/buildslave/jenkins/workspace/lldb-cmake-sanitized/lldb-build/./lib libstdcxx tests will not be run because: Don't know how to build with libstdcxx on macosx Skipping following debug info categories: ['dwo'] start addr: 0x100624e66 end addr: 0x100624e70 start addr: 0x10585ce66 end addr: 0x10585ce70 start addr: 0x10ee58e66 end addr: 0x10ee58e70

Hide Details

-- Command Output (stderr): --

Hide Details

Session logs for test failures/errors/unexpected successes will go into directory '/Users/buildslave/jenkins/workspace/lldb-cmake-sanitized/test/logs' Command invoked: /Users/buildslave/jenkins/workspace/lldb-cmake-sanitized/llvm-project/lldb/test/API/dotest.py --arch x86_64 -s /Users/buildslave/jenkins/workspace/lldb-cmake-sanitized/lldb-build/lldb-test-traces -S nm -u CXXFLAGS -u CFLAGS --codesign-identity lldb_codesign --server /Users/buildslave/jenkins/workspace/lldb-cmake-sanitized/lldb-build/./bin/debugserver --arch x86_64 --build-dir /Users/buildslave/jenkins/workspace/lldb-cmake-sanitized/lldb-build/lldb-test-build.noindex -s=/Users/buildslave/jenkins/workspace/lldb-cmake-sanitized/test/logs -t --env TERM=vt100 --env LLVM_LIBS_DIR=/Users/buildslave/jenkins/workspace/lldb-cmake-sanitized/lldb-build/./lib --inferior-env ASAN_OPTIONS=detect_stack_use_after_return=1 --inferior-env DYLD_INSERT_LIBRARIES=/Users/buildslave/jenkins/workspace/lldb-cmake-sanitized/host-compiler/lib/clang/11.0.0/lib/darwin/libclang_rt.asan_osx_dynamic.dylib --build-dir /Users/buildslave/jenkins/workspace/lldb-cmake-sanitized/lldb-build/lldb-test-build.noindex --lldb-module-cache-dir /Users/buildslave/jenkins/workspace/lldb-cmake-sanitized/lldb-build/lldb-test-build.noindex/module-cache-lldb/lldb-api --clang-module-cache-dir /Users/buildslave/jenkins/workspace/lldb-cmake-sanitized/lldb-build/lldb-test-build.noindex/module-cache-clang/lldb-api --executable /Users/buildslave/jenkins/workspace/lldb-cmake-sanitized/lldb-build/./bin/lldb --compiler /Users/buildslave/jenkins/workspace/lldb-cmake-sanitized/lldb-build/./bin/clang --dsymutil /Users/buildslave/jenkins/workspace/lldb-cmake-sanitized/lldb-build/./bin/dsymutil --filecheck /Users/buildslave/jenkins/workspace/lldb-cmake-sanitized/lldb-build/./bin/FileCheck --lldb-libs-dir /Users/buildslave/jenkins/workspace/lldb-cmake-sanitized/lldb-build/./lib /Users/buildslave/jenkins/workspace/lldb-cmake-sanitized/llvm-project/lldb/test/API/python_api/thread -p TestThreadAPI.py Change dir to: /Users/buildslave/jenkins/workspace/lldb-cmake-sanitized/llvm-project/lldb/test/API/python_api/thread runCmd: settings clear -all output:

Hide Details

runCmd: settings set symbols.enable-external-lookup false output:

Hide Details

runCmd: settings set target.auto-apply-fixits false output:

Hide Details

runCmd: settings set plugin.process.gdb-remote.packet-timeout 60 output:

Hide Details

runCmd: settings set symbols.clang-modules-cache-path "/Users/buildslave/jenkins/workspace/lldb-cmake-sanitized/lldb-build/lldb-test-build.noindex/module-cache-lldb/lldb-api" output:

Hide Details

runCmd: settings set use-color false output:

Hide Details

runCmd: setting set target.prefer-dynamic-value no-dynamic-values output:

Hide Details

runCmd: settings set target.env-vars ASAN_OPTIONS=detect_stack_use_after_return=1 DYLD_INSERT_LIBRARIES=/Users/buildslave/jenkins/workspace/lldb-cmake-sanitized/host-compiler/lib/clang/11.0.0/lib/darwin/libclang_rt.asan_osx_dynamic.dylib output:

Hide Details

runCmd: breakpoint list output: Current breakpoints: 1: file = 'main.cpp', line = 17, exact_match = 0, locations = 1 1.1: where = a.out`main + 115 at main.cpp:17:5, address = a.out[0x0000000100000f53], unresolved, hit count = 0

Hide Details

Hide Details

Hide Details

runCmd: process status output: Process 79366 stopped * thread #1, queue = 'com.apple.main-thread', stop reason = breakpoint 1.1 frame #0: 0x0000000104cbef53 a.out`main(argc=1, argv=0x00007ffeeaf414c8) at main.cpp:17:5 14 15 printf("after the loop: my_char='%c'\n", my_char); // 'my_char' should print out as 'x'. 16 -> 17 return 0; // Set break point at this line and check variable 'my_char'. ^ 18 }

Hide Details

Hide Details

<bound method SBProcess.Kill of <lldb.SBProcess; proxy of <Swig Object of type 'lldb::SBProcess *' at 0x1141e9ab0> >>: success

Hide Details

PASS: LLDB (/Users/buildslave/jenkins/workspace/lldb-cmake-sanitized/lldb-build/bin/clang-11-x86_64) :: test_get_process_dsym (TestThreadAPI.ThreadAPITestCase) runCmd: settings clear -all output:

Hide Details

runCmd: settings set symbols.enable-external-lookup false output:

Hide Details

runCmd: settings set target.auto-apply-fixits false output:

Hide Details

runCmd: settings set plugin.process.gdb-remote.packet-timeout 60 output:

Hide Details

runCmd: settings set symbols.clang-modules-cache-path "/Users/buildslave/jenkins/workspace/lldb-cmake-sanitized/lldb-build/lldb-test-build.noindex/module-cache-lldb/lldb-api" output:

Hide Details

runCmd: settings set use-color false output:

Hide Details

runCmd: setting set target.prefer-dynamic-value no-dynamic-values output:

Hide Details

runCmd: settings set target.env-vars ASAN_OPTIONS=detect_stack_use_after_return=1 DYLD_INSERT_LIBRARIES=/Users/buildslave/jenkins/workspace/lldb-cmake-sanitized/host-compiler/lib/clang/11.0.0/lib/darwin/libclang_rt.asan_osx_dynamic.dylib output:

Hide Details

runCmd: breakpoint list output: Current breakpoints: 1: file = 'main.cpp', line = 17, exact_match = 0, locations = 1 1.1: where = a.out`main + 115 at main.cpp:17:5, address = a.out[0x0000000100000f53], unresolved, hit count = 0

Hide Details

Hide Details

Hide Details

runCmd: process status output: Process 79457 stopped * thread #1, queue = 'com.apple.main-thread', stop reason = breakpoint 1.1 frame #0: 0x000000010818af53 a.out`main(argc=1, argv=0x00007ffee7a75498) at main.cpp:17:5 14 15 printf("after the loop: my_char='%c'\n", my_char); // 'my_char' should print out as 'x'. 16 -> 17 return 0; // Set break point at this line and check variable 'my_char'. ^ 18 }

Hide Details

Hide Details

<bound method SBProcess.Kill of <lldb.SBProcess; proxy of <Swig Object of type 'lldb::SBProcess *' at 0x11354f990> >>: success

Hide Details

PASS: LLDB (/Users/buildslave/jenkins/workspace/lldb-cmake-sanitized/lldb-build/bin/clang-11-x86_64) :: test_get_process_dwarf (TestThreadAPI.ThreadAPITestCase) UNSUPPORTED: LLDB (/Users/buildslave/jenkins/workspace/lldb-cmake-sanitized/lldb-build/bin/clang-11-x86_64) :: test_get_process_dwo (TestThreadAPI.ThreadAPITestCase) (test case does not fall in any category of interest for this run) runCmd: settings clear -all output:

Hide Details

runCmd: settings set symbols.enable-external-lookup false output:

Hide Details

runCmd: settings set target.auto-apply-fixits false output:

Hide Details

runCmd: settings set plugin.process.gdb-remote.packet-timeout 60 output:

Hide Details

runCmd: settings set symbols.clang-modules-cache-path "/Users/buildslave/jenkins/workspace/lldb-cmake-sanitized/lldb-build/lldb-test-build.noindex/module-cache-lldb/lldb-api" output:

Hide Details

runCmd: settings set use-color false output:

Hide Details

runCmd: setting set target.prefer-dynamic-value no-dynamic-values output:

Hide Details

runCmd: settings set target.env-vars ASAN_OPTIONS=detect_stack_use_after_return=1 DYLD_INSERT_LIBRARIES=/Users/buildslave/jenkins/workspace/lldb-cmake-sanitized/host-compiler/lib/clang/11.0.0/lib/darwin/libclang_rt.asan_osx_dynamic.dylib output:

Hide Details

runCmd: breakpoint list output: Current breakpoints: 1: file = 'main.cpp', line = 17, exact_match = 0, locations = 1 1.1: where = a.out`main + 115 at main.cpp:17:5, address = a.out[0x0000000100000f53], unresolved, hit count = 0

Hide Details

Hide Details

Hide Details

runCmd: process status output: Process 79521 stopped * thread #1, queue = 'com.apple.main-thread', stop reason = breakpoint 1.1 frame #0: 0x000000010cd1ef53 a.out`main(argc=1, argv=0x00007ffee2ee1498) at main.cpp:17:5 14 15 printf("after the loop: my_char='%c'\n", my_char); // 'my_char' should print out as 'x'. 16 -> 17 return 0; // Set break point at this line and check variable 'my_char'. ^ 18 }

Hide Details

Hide Details

<bound method SBProcess.Kill of <lldb.SBProcess; proxy of <Swig Object of type 'lldb::SBProcess *' at 0x1141e98d0> >>: success

Hide Details

PASS: LLDB (/Users/buildslave/jenkins/workspace/lldb-cmake-sanitized/lldb-build/bin/clang-11-x86_64) :: test_get_process_gmodules (TestThreadAPI.ThreadAPITestCase) runCmd: settings clear -all output:

Hide Details

runCmd: settings set symbols.enable-external-lookup false output:

Hide Details

runCmd: settings set target.auto-apply-fixits false output:

Hide Details

runCmd: settings set plugin.process.gdb-remote.packet-timeout 60 output:

Hide Details

runCmd: settings set symbols.clang-modules-cache-path "/Users/buildslave/jenkins/workspace/lldb-cmake-sanitized/lldb-build/lldb-test-build.noindex/module-cache-lldb/lldb-api" output:

Hide Details

runCmd: settings set use-color false output:

Hide Details

runCmd: setting set target.prefer-dynamic-value no-dynamic-values output:

Hide Details

runCmd: settings set target.env-vars ASAN_OPTIONS=detect_stack_use_after_return=1 DYLD_INSERT_LIBRARIES=/Users/buildslave/jenkins/workspace/lldb-cmake-sanitized/host-compiler/lib/clang/11.0.0/lib/darwin/libclang_rt.asan_osx_dynamic.dylib output:

Hide Details

<bound method SBProcess.Kill of <lldb.SBProcess; proxy of <Swig Object of type 'lldb::SBProcess *' at 0x11354f960> >>: success

Hide Details

PASS: LLDB (/Users/buildslave/jenkins/workspace/lldb-cmake-sanitized/lldb-build/bin/clang-11-x86_64) :: test_get_stop_description_dsym (TestThreadAPI.ThreadAPITestCase) runCmd: settings clear -all output:

Hide Details

runCmd: settings set symbols.enable-external-lookup false output:

Hide Details

runCmd: settings set target.auto-apply-fixits false output:

Hide Details

runCmd: settings set plugin.process.gdb-remote.packet-timeout 60 output:

Hide Details

runCmd: settings set symbols.clang-modules-cache-path "/Users/buildslave/jenkins/workspace/lldb-cmake-sanitized/lldb-build/lldb-test-build.noindex/module-cache-lldb/lldb-api" output:

Hide Details

runCmd: settings set use-color false output:

Hide Details

runCmd: setting set target.prefer-dynamic-value no-dynamic-values output:

Hide Details

runCmd: settings set target.env-vars ASAN_OPTIONS=detect_stack_use_after_return=1 DYLD_INSERT_LIBRARIES=/Users/buildslave/jenkins/workspace/lldb-cmake-sanitized/host-compiler/lib/clang/11.0.0/lib/darwin/libclang_rt.asan_osx_dynamic.dylib output:

Hide Details

<bound method SBProcess.Kill of <lldb.SBProcess; proxy of <Swig Object of type 'lldb::SBProcess *' at 0x113c342d0> >>: success

Hide Details

PASS: LLDB (/Users/buildslave/jenkins/workspace/lldb-cmake-sanitized/lldb-build/bin/clang-11-x86_64) :: test_get_stop_description_dwarf (TestThreadAPI.ThreadAPITestCase) UNSUPPORTED: LLDB (/Users/buildslave/jenkins/workspace/lldb-cmake-sanitized/lldb-build/bin/clang-11-x86_64) :: test_get_stop_description_dwo (TestThreadAPI.ThreadAPITestCase) (test case does not fall in any category of interest for this run) runCmd: settings clear -all output:

Hide Details

runCmd: settings set symbols.enable-external-lookup false output:

Hide Details

runCmd: settings set target.auto-apply-fixits false output:

Hide Details

runCmd: settings set plugin.process.gdb-remote.packet-timeout 60 output:

Hide Details

runCmd: settings set symbols.clang-modules-cache-path "/Users/buildslave/jenkins/workspace/lldb-cmake-sanitized/lldb-build/lldb-test-build.noindex/module-cache-lldb/lldb-api" output:

Hide Details

runCmd: settings set use-color false output:

Hide Details

runCmd: setting set target.prefer-dynamic-value no-dynamic-values output:

Hide Details

runCmd: settings set target.env-vars ASAN_OPTIONS=detect_stack_use_after_return=1 DYLD_INSERT_LIBRARIES=/Users/buildslave/jenkins/workspace/lldb-cmake-sanitized/host-compiler/lib/clang/11.0.0/lib/darwin/libclang_rt.asan_osx_dynamic.dylib output:

Hide Details

<bound method SBProcess.Kill of <lldb.SBProcess; proxy of <Swig Object of type 'lldb::SBProcess *' at 0x11354f990> >>: success

Hide Details

PASS: LLDB (/Users/buildslave/jenkins/workspace/lldb-cmake-sanitized/lldb-build/bin/clang-11-x86_64) :: test_get_stop_description_gmodules (TestThreadAPI.ThreadAPITestCase) runCmd: settings clear -all output:

Hide Details

runCmd: settings set symbols.enable-external-lookup false output:

Hide Details

runCmd: settings set target.auto-apply-fixits false output:

Hide Details

runCmd: settings set plugin.process.gdb-remote.packet-timeout 60 output:

Hide Details

runCmd: settings set symbols.clang-modules-cache-path "/Users/buildslave/jenkins/workspace/lldb-cmake-sanitized/lldb-build/lldb-test-build.noindex/module-cache-lldb/lldb-api" output:

Hide Details

runCmd: settings set use-color false output:

Hide Details

runCmd: setting set target.prefer-dynamic-value no-dynamic-values output:

Hide Details

runCmd: settings set target.env-vars ASAN_OPTIONS=detect_stack_use_after_return=1 DYLD_INSERT_LIBRARIES=/Users/buildslave/jenkins/workspace/lldb-cmake-sanitized/host-compiler/lib/clang/11.0.0/lib/darwin/libclang_rt.asan_osx_dynamic.dylib output:

Hide Details

runCmd: breakpoint list output: Current breakpoints: 1: file = 'main2.cpp', line = 21, exact_match = 0, locations = 1 1.1: where = test_run_to_address_dsym`b(int) + 22 at main2.cpp:21:17, address = test_run_to_address_dsym[0x0000000100000e66], unresolved, hit count = 0

Hide Details

Hide Details

Hide Details

runCmd: thread backtrace output: * thread #1, queue = 'com.apple.main-thread', stop reason = breakpoint 1.1 * frame #0: 0x0000000100624e66 test_run_to_address_dsym`b(val=1) at main2.cpp:21:17 frame #1: 0x0000000100624e0d test_run_to_address_dsym`a(val=1) at main2.cpp:11:16 frame #2: 0x0000000100624ee0 test_run_to_address_dsym`main(argc=1, argv=0x00007ffeef5db470) at main2.cpp:36:14 frame #3: 0x00007fff67d6a085 libdyld.dylib`start + 1

Hide Details

Hide Details

runCmd: breakpoint list output: Current breakpoints: 1: file = 'main2.cpp', line = 21, exact_match = 0, locations = 1 Options: disabled 1.1: where = test_run_to_address_dsym`b(int) + 22 at main2.cpp:21:17, address = 0x0000000100624e66, unresolved, hit count = 1

Hide Details

Hide Details

Hide Details

runCmd: thread backtrace output: * thread #1, queue = 'com.apple.main-thread', stop reason = step over * frame #0: 0x0000000100624e9d test_run_to_address_dsym`b(val=1) at main2.cpp:26:12 frame #1: 0x0000000100624e0d test_run_to_address_dsym`a(val=1) at main2.cpp:11:16 frame #2: 0x0000000100624ee0 test_run_to_address_dsym`main(argc=1, argv=0x00007ffeef5db470) at main2.cpp:36:14 frame #3: 0x00007fff67d6a085 libdyld.dylib`start + 1

Hide Details

Hide Details

runCmd: process status output: Process 80002 stopped * thread #1, queue = 'com.apple.main-thread', stop reason = run to address: 0x0000000100624e66 frame #0: 0x0000000100624e66 test_run_to_address_dsym`b(val=2) at main2.cpp:21:17 18 int b(int val) 19 { 20 int rc = c(val); -> 21 void *ptr = malloc(1024); // thread step-out of malloc into function b. ^ 22 if (!ptr) 23 return -1; 24 else

Hide Details

Hide Details

<bound method SBProcess.Kill of <lldb.SBProcess; proxy of <Swig Object of type 'lldb::SBProcess *' at 0x113a35de0> >>: success

Hide Details

PASS: LLDB (/Users/buildslave/jenkins/workspace/lldb-cmake-sanitized/lldb-build/bin/clang-11-x86_64) :: test_run_to_address_dsym (TestThreadAPI.ThreadAPITestCase) runCmd: settings clear -all output:

Hide Details

runCmd: settings set symbols.enable-external-lookup false output:

Hide Details

runCmd: settings set target.auto-apply-fixits false output:

Hide Details

runCmd: settings set plugin.process.gdb-remote.packet-timeout 60 output:

Hide Details

runCmd: settings set symbols.clang-modules-cache-path "/Users/buildslave/jenkins/workspace/lldb-cmake-sanitized/lldb-build/lldb-test-build.noindex/module-cache-lldb/lldb-api" output:

Hide Details

runCmd: settings set use-color false output:

Hide Details

runCmd: setting set target.prefer-dynamic-value no-dynamic-values output:

Hide Details

runCmd: settings set target.env-vars ASAN_OPTIONS=detect_stack_use_after_return=1 DYLD_INSERT_LIBRARIES=/Users/buildslave/jenkins/workspace/lldb-cmake-sanitized/host-compiler/lib/clang/11.0.0/lib/darwin/libclang_rt.asan_osx_dynamic.dylib output:

Hide Details

runCmd: breakpoint list output: Current breakpoints: 1: file = 'main2.cpp', line = 21, exact_match = 0, locations = 1 1.1: where = test_run_to_address_dwarf`b(int) + 22 at main2.cpp:21:17, address = test_run_to_address_dwarf[0x0000000100000e66], unresolved, hit count = 0

Hide Details

Hide Details

Hide Details

runCmd: thread backtrace output: * thread #1, queue = 'com.apple.main-thread', stop reason = breakpoint 1.1 * frame #0: 0x000000010585ce66 test_run_to_address_dwarf`b(val=1) at main2.cpp:21:17 frame #1: 0x000000010585ce0d test_run_to_address_dwarf`a(val=1) at main2.cpp:11:16 frame #2: 0x000000010585cee0 test_run_to_address_dwarf`main(argc=1, argv=0x00007ffeea3a3470) at main2.cpp:36:14 frame #3: 0x00007fff67d6a085 libdyld.dylib`start + 1

Hide Details

Hide Details

runCmd: breakpoint list output: Current breakpoints: 1: file = 'main2.cpp', line = 21, exact_match = 0, locations = 1 Options: disabled 1.1: where = test_run_to_address_dwarf`b(int) + 22 at main2.cpp:21:17, address = 0x000000010585ce66, unresolved, hit count = 1

Hide Details

Hide Details

Hide Details

runCmd: thread backtrace output: * thread #1, queue = 'com.apple.main-thread', stop reason = step over * frame #0: 0x000000010585ce9d test_run_to_address_dwarf`b(val=1) at main2.cpp:26:12 frame #1: 0x000000010585ce0d test_run_to_address_dwarf`a(val=1) at main2.cpp:11:16 frame #2: 0x000000010585cee0 test_run_to_address_dwarf`main(argc=1, argv=0x00007ffeea3a3470) at main2.cpp:36:14 frame #3: 0x00007fff67d6a085 libdyld.dylib`start + 1

Hide Details

Hide Details

runCmd: process status output: Process 80172 stopped * thread #1, queue = 'com.apple.main-thread', stop reason = run to address: 0x000000010585ce66 frame #0: 0x000000010585ce66 test_run_to_address_dwarf`b(val=2) at main2.cpp:21:17 18 int b(int val) 19 { 20 int rc = c(val); -> 21 void *ptr = malloc(1024); // thread step-out of malloc into function b. ^ 22 if (!ptr) 23 return -1; 24 else

Hide Details

Hide Details

<bound method SBProcess.Kill of <lldb.SBProcess; proxy of <Swig Object of type 'lldb::SBProcess *' at 0x11354f960> >>: success

Hide Details

PASS: LLDB (/Users/buildslave/jenkins/workspace/lldb-cmake-sanitized/lldb-build/bin/clang-11-x86_64) :: test_run_to_address_dwarf (TestThreadAPI.ThreadAPITestCase) UNSUPPORTED: LLDB (/Users/buildslave/jenkins/workspace/lldb-cmake-sanitized/lldb-build/bin/clang-11-x86_64) :: test_run_to_address_dwo (TestThreadAPI.ThreadAPITestCase) (test case does not fall in any category of interest for this run) runCmd: settings clear -all output:

Hide Details

runCmd: settings set symbols.enable-external-lookup false output:

Hide Details

runCmd: settings set target.auto-apply-fixits false output:

Hide Details

runCmd: settings set plugin.process.gdb-remote.packet-timeout 60 output:

Hide Details

runCmd: settings set symbols.clang-modules-cache-path "/Users/buildslave/jenkins/workspace/lldb-cmake-sanitized/lldb-build/lldb-test-build.noindex/module-cache-lldb/lldb-api" output:

Hide Details

runCmd: settings set use-color false output:

Hide Details

runCmd: setting set target.prefer-dynamic-value no-dynamic-values output:

Hide Details

runCmd: settings set target.env-vars ASAN_OPTIONS=detect_stack_use_after_return=1 DYLD_INSERT_LIBRARIES=/Users/buildslave/jenkins/workspace/lldb-cmake-sanitized/host-compiler/lib/clang/11.0.0/lib/darwin/libclang_rt.asan_osx_dynamic.dylib output:

Hide Details

runCmd: breakpoint list output: Current breakpoints: 1: file = 'main2.cpp', line = 21, exact_match = 0, locations = 1 1.1: where = test_run_to_address_gmodules`b(int) + 22 at main2.cpp:21:17, address = test_run_to_address_gmodules[0x0000000100000e66], unresolved, hit count = 0

Hide Details

Hide Details

Hide Details

runCmd: thread backtrace output: * thread #1, queue = 'com.apple.main-thread', stop reason = breakpoint 1.1 * frame #0: 0x000000010ee58e66 test_run_to_address_gmodules`b(val=1) at main2.cpp:21:17 frame #1: 0x000000010ee58e0d test_run_to_address_gmodules`a(val=1) at main2.cpp:11:16 frame #2: 0x000000010ee58ee0 test_run_to_address_gmodules`main(argc=1, argv=0x00007ffee0da7460) at main2.cpp:36:14 frame #3: 0x00007fff67d6a085 libdyld.dylib`start + 1

Hide Details

Hide Details

runCmd: breakpoint list output: Current breakpoints: 1: file = 'main2.cpp', line = 21, exact_match = 0, locations = 1 Options: disabled 1.1: where = test_run_to_address_gmodules`b(int) + 22 at main2.cpp:21:17, address = 0x000000010ee58e66, unresolved, hit count = 1

Hide Details

Hide Details

Hide Details

runCmd: thread backtrace output: * thread #1, queue = 'com.apple.main-thread', stop reason = step over * frame #0: 0x000000010ee58e9d test_run_to_address_gmodules`b(val=1) at main2.cpp:26:12 frame #1: 0x000000010ee58e0d test_run_to_address_gmodules`a(val=1) at main2.cpp:11:16 frame #2: 0x000000010ee58ee0 test_run_to_address_gmodules`main(argc=1, argv=0x00007ffee0da7460) at main2.cpp:36:14 frame #3: 0x00007fff67d6a085 libdyld.dylib`start + 1

Hide Details

Hide Details

runCmd: process status output: Process 80240 stopped * thread #1, queue = 'com.apple.main-thread', stop reason = run to address: 0x000000010ee58e66 frame #0: 0x000000010ee58e66 test_run_to_address_gmodules`b(val=2) at main2.cpp:21:17 18 int b(int val) 19 { 20 int rc = c(val); -> 21 void *ptr = malloc(1024); // thread step-out of malloc into function b. ^ 22 if (!ptr) 23 return -1; 24 else

Hide Details

Hide Details

<bound method SBProcess.Kill of <lldb.SBProcess; proxy of <Swig Object of type 'lldb::SBProcess *' at 0x113c342d0> >>: success

Hide Details

PASS: LLDB (/Users/buildslave/jenkins/workspace/lldb-cmake-sanitized/lldb-build/bin/clang-11-x86_64) :: test_run_to_address_gmodules (TestThreadAPI.ThreadAPITestCase) runCmd: settings clear -all output:

Hide Details

runCmd: settings set symbols.enable-external-lookup false output:

Hide Details

runCmd: settings set target.auto-apply-fixits false output:

Hide Details

runCmd: settings set plugin.process.gdb-remote.packet-timeout 60 output:

Hide Details

runCmd: settings set symbols.clang-modules-cache-path "/Users/buildslave/jenkins/workspace/lldb-cmake-sanitized/lldb-build/lldb-test-build.noindex/module-cache-lldb/lldb-api" output:

Hide Details

runCmd: settings set use-color false output:

Hide Details

runCmd: setting set target.prefer-dynamic-value no-dynamic-values output:

Hide Details

runCmd: settings set target.env-vars ASAN_OPTIONS=detect_stack_use_after_return=1 DYLD_INSERT_LIBRARIES=/Users/buildslave/jenkins/workspace/lldb-cmake-sanitized/host-compiler/lib/clang/11.0.0/lib/darwin/libclang_rt.asan_osx_dynamic.dylib output:

Hide Details

FAIL: LLDB (/Users/buildslave/jenkins/workspace/lldb-cmake-sanitized/lldb-build/bin/clang-11-x86_64) :: test_step_out_of_malloc_into_function_b_dsym (TestThreadAPI.ThreadAPITestCase) <bound method SBProcess.Kill of <lldb.SBProcess; proxy of <Swig Object of type 'lldb::SBProcess *' at 0x11354f990> >>: success

Hide Details

runCmd: settings clear -all output:

Hide Details

runCmd: settings set symbols.enable-external-lookup false output:

Hide Details

runCmd: settings set target.auto-apply-fixits false output:

Hide Details

runCmd: settings set plugin.process.gdb-remote.packet-timeout 60 output:

Hide Details

runCmd: settings set symbols.clang-modules-cache-path "/Users/buildslave/jenkins/workspace/lldb-cmake-sanitized/lldb-build/lldb-test-build.noindex/module-cache-lldb/lldb-api" output:

Hide Details

runCmd: settings set use-color false output:

Hide Details

runCmd: setting set target.prefer-dynamic-value no-dynamic-values output:

Hide Details

runCmd: settings set target.env-vars ASAN_OPTIONS=detect_stack_use_after_return=1 DYLD_INSERT_LIBRARIES=/Users/buildslave/jenkins/workspace/lldb-cmake-sanitized/host-compiler/lib/clang/11.0.0/lib/darwin/libclang_rt.asan_osx_dynamic.dylib output:

Hide Details

FAIL: LLDB (/Users/buildslave/jenkins/workspace/lldb-cmake-sanitized/lldb-build/bin/clang-11-x86_64) :: test_step_out_of_malloc_into_function_b_dwarf (TestThreadAPI.ThreadAPITestCase) <bound method SBProcess.Kill of <lldb.SBProcess; proxy of <Swig Object of type 'lldb::SBProcess *' at 0x113a35de0> >>: success

Hide Details

UNSUPPORTED: LLDB (/Users/buildslave/jenkins/workspace/lldb-cmake-sanitized/lldb-build/bin/clang-11-x86_64) :: test_step_out_of_malloc_into_function_b_dwo (TestThreadAPI.ThreadAPITestCase) (test case does not fall in any category of interest for this run) runCmd: settings clear -all output:

Hide Details

runCmd: settings set symbols.enable-external-lookup false output:

Hide Details

runCmd: settings set target.auto-apply-fixits false output:

Hide Details

runCmd: settings set plugin.process.gdb-remote.packet-timeout 60 output:

Hide Details

runCmd: settings set symbols.clang-modules-cache-path "/Users/buildslave/jenkins/workspace/lldb-cmake-sanitized/lldb-build/lldb-test-build.noindex/module-cache-lldb/lldb-api" output:

Hide Details

runCmd: settings set use-color false output:

Hide Details

runCmd: setting set target.prefer-dynamic-value no-dynamic-values output:

Hide Details

runCmd: settings set target.env-vars ASAN_OPTIONS=detect_stack_use_after_return=1 DYLD_INSERT_LIBRARIES=/Users/buildslave/jenkins/workspace/lldb-cmake-sanitized/host-compiler/lib/clang/11.0.0/lib/darwin/libclang_rt.asan_osx_dynamic.dylib output:

Hide Details

FAIL: LLDB (/Users/buildslave/jenkins/workspace/lldb-cmake-sanitized/lldb-build/bin/clang-11-x86_64) :: test_step_out_of_malloc_into_function_b_gmodules (TestThreadAPI.ThreadAPITestCase) <bound method SBProcess.Kill of <lldb.SBProcess; proxy of <Swig Object of type 'lldb::SBProcess *' at 0x11354f990> >>: success

Hide Details

runCmd: settings clear -all output:

Hide Details

runCmd: settings set symbols.enable-external-lookup false output:

Hide Details

runCmd: settings set target.auto-apply-fixits false output:

Hide Details

runCmd: settings set plugin.process.gdb-remote.packet-timeout 60 output:

Hide Details

runCmd: settings set symbols.clang-modules-cache-path "/Users/buildslave/jenkins/workspace/lldb-cmake-sanitized/lldb-build/lldb-test-build.noindex/module-cache-lldb/lldb-api" output:

Hide Details

runCmd: settings set use-color false output:

Hide Details

runCmd: setting set target.prefer-dynamic-value no-dynamic-values output:

Hide Details

runCmd: settings set target.env-vars ASAN_OPTIONS=detect_stack_use_after_return=1 DYLD_INSERT_LIBRARIES=/Users/buildslave/jenkins/workspace/lldb-cmake-sanitized/host-compiler/lib/clang/11.0.0/lib/darwin/libclang_rt.asan_osx_dynamic.dylib output:

Hide Details

runCmd: breakpoint list output: Current breakpoints: 1: file = 'main2.cpp', line = 21, exact_match = 0, locations = 1 1.1: where = test_step_over_3_times_dsym`b(int) + 22 at main2.cpp:21:17, address = test_step_over_3_times_dsym[0x0000000100000e66], unresolved, hit count = 0

Hide Details

Hide Details

Hide Details

runCmd: thread backtrace output: * thread #1, queue = 'com.apple.main-thread', stop reason = breakpoint 1.1 * frame #0: 0x0000000103ccee66 test_step_over_3_times_dsym`b(val=1) at main2.cpp:21:17 frame #1: 0x0000000103ccee0d test_step_over_3_times_dsym`a(val=1) at main2.cpp:11:16 frame #2: 0x0000000103cceee0 test_step_over_3_times_dsym`main(argc=1, argv=0x00007ffeebf31468) at main2.cpp:36:14 frame #3: 0x00007fff67d6a085 libdyld.dylib`start + 1 frame #4: 0x00007fff67d6a085 libdyld.dylib`start + 1

Hide Details

Hide Details

runCmd: thread backtrace output: * thread #1, queue = 'com.apple.main-thread', stop reason = step over * frame #0: 0x0000000103ccee9d test_step_over_3_times_dsym`b(val=1) at main2.cpp:26:12 frame #1: 0x0000000103ccee0d test_step_over_3_times_dsym`a(val=1) at main2.cpp:11:16 frame #2: 0x0000000103cceee0 test_step_over_3_times_dsym`main(argc=1, argv=0x00007ffeebf31468) at main2.cpp:36:14 frame #3: 0x00007fff67d6a085 libdyld.dylib`start + 1 frame #4: 0x00007fff67d6a085 libdyld.dylib`start + 1

Hide Details

Hide Details

<bound method SBProcess.Kill of <lldb.SBProcess; proxy of <Swig Object of type 'lldb::SBProcess *' at 0x113a35de0> >>: success

Hide Details

PASS: LLDB (/Users/buildslave/jenkins/workspace/lldb-cmake-sanitized/lldb-build/bin/clang-11-x86_64) :: test_step_over_3_times_dsym (TestThreadAPI.ThreadAPITestCase) runCmd: settings clear -all output:

Hide Details

runCmd: settings set symbols.enable-external-lookup false output:

Hide Details

runCmd: settings set target.auto-apply-fixits false output:

Hide Details

runCmd: settings set plugin.process.gdb-remote.packet-timeout 60 output:

Hide Details

runCmd: settings set symbols.clang-modules-cache-path "/Users/buildslave/jenkins/workspace/lldb-cmake-sanitized/lldb-build/lldb-test-build.noindex/module-cache-lldb/lldb-api" output:

Hide Details

runCmd: settings set use-color false output:

Hide Details

runCmd: setting set target.prefer-dynamic-value no-dynamic-values output:

Hide Details

runCmd: settings set target.env-vars ASAN_OPTIONS=detect_stack_use_after_return=1 DYLD_INSERT_LIBRARIES=/Users/buildslave/jenkins/workspace/lldb-cmake-sanitized/host-compiler/lib/clang/11.0.0/lib/darwin/libclang_rt.asan_osx_dynamic.dylib output:

Hide Details

runCmd: breakpoint list output: Current breakpoints: 1: file = 'main2.cpp', line = 21, exact_match = 0, locations = 1 1.1: where = test_step_over_3_times_dwarf`b(int) + 22 at main2.cpp:21:17, address = test_step_over_3_times_dwarf[0x0000000100000e66], unresolved, hit count = 0

Hide Details

Hide Details

Hide Details

runCmd: thread backtrace output: * thread #1, queue = 'com.apple.main-thread', stop reason = breakpoint 1.1 * frame #0: 0x000000010cfbae66 test_step_over_3_times_dwarf`b(val=1) at main2.cpp:21:17 frame #1: 0x000000010cfbae0d test_step_over_3_times_dwarf`a(val=1) at main2.cpp:11:16 frame #2: 0x000000010cfbaee0 test_step_over_3_times_dwarf`main(argc=1, argv=0x00007ffee2c45460) at main2.cpp:36:14 frame #3: 0x00007fff67d6a085 libdyld.dylib`start + 1

Hide Details

Hide Details

runCmd: thread backtrace output: * thread #1, queue = 'com.apple.main-thread', stop reason = step over * frame #0: 0x000000010cfbae9d test_step_over_3_times_dwarf`b(val=1) at main2.cpp:26:12 frame #1: 0x000000010cfbae0d test_step_over_3_times_dwarf`a(val=1) at main2.cpp:11:16 frame #2: 0x000000010cfbaee0 test_step_over_3_times_dwarf`main(argc=1, argv=0x00007ffee2c45460) at main2.cpp:36:14 frame #3: 0x00007fff67d6a085 libdyld.dylib`start + 1

Hide Details

Hide Details

<bound method SBProcess.Kill of <lldb.SBProcess; proxy of <Swig Object of type 'lldb::SBProcess *' at 0x11354f990> >>: success

Hide Details

PASS: LLDB (/Users/buildslave/jenkins/workspace/lldb-cmake-sanitized/lldb-build/bin/clang-11-x86_64) :: test_step_over_3_times_dwarf (TestThreadAPI.ThreadAPITestCase) UNSUPPORTED: LLDB (/Users/buildslave/jenkins/workspace/lldb-cmake-sanitized/lldb-build/bin/clang-11-x86_64) :: test_step_over_3_times_dwo (TestThreadAPI.ThreadAPITestCase) (test case does not fall in any category of interest for this run) runCmd: settings clear -all output:

Hide Details

runCmd: settings set symbols.enable-external-lookup false output:

Hide Details

runCmd: settings set target.auto-apply-fixits false output:

Hide Details

runCmd: settings set plugin.process.gdb-remote.packet-timeout 60 output:

Hide Details

runCmd: settings set symbols.clang-modules-cache-path "/Users/buildslave/jenkins/workspace/lldb-cmake-sanitized/lldb-build/lldb-test-build.noindex/module-cache-lldb/lldb-api" output:

Hide Details

runCmd: settings set use-color false output:

Hide Details

runCmd: setting set target.prefer-dynamic-value no-dynamic-values output:

Hide Details

runCmd: settings set target.env-vars ASAN_OPTIONS=detect_stack_use_after_return=1 DYLD_INSERT_LIBRARIES=/Users/buildslave/jenkins/workspace/lldb-cmake-sanitized/host-compiler/lib/clang/11.0.0/lib/darwin/libclang_rt.asan_osx_dynamic.dylib output:

Hide Details

runCmd: breakpoint list output: Current breakpoints: 1: file = 'main2.cpp', line = 21, exact_match = 0, locations = 1 1.1: where = test_step_over_3_times_gmodules`b(int) + 22 at main2.cpp:21:17, address = test_step_over_3_times_gmodules[0x0000000100000e66], unresolved, hit count = 0

Hide Details

Hide Details

Hide Details

runCmd: thread backtrace output: * thread #1, queue = 'com.apple.main-thread', stop reason = breakpoint 1.1 * frame #0: 0x000000010cae8e66 test_step_over_3_times_gmodules`b(val=1) at main2.cpp:21:17 frame #1: 0x000000010cae8e0d test_step_over_3_times_gmodules`a(val=1) at main2.cpp:11:16 frame #2: 0x000000010cae8ee0 test_step_over_3_times_gmodules`main(argc=1, argv=0x00007ffee3117458) at main2.cpp:36:14 frame #3: 0x00007fff67d6a085 libdyld.dylib`start + 1 frame #4: 0x00007fff67d6a085 libdyld.dylib`start + 1

Hide Details

Hide Details

runCmd: thread backtrace output: * thread #1, queue = 'com.apple.main-thread', stop reason = step over * frame #0: 0x000000010cae8e9d test_step_over_3_times_gmodules`b(val=1) at main2.cpp:26:12 frame #1: 0x000000010cae8e0d test_step_over_3_times_gmodules`a(val=1) at main2.cpp:11:16 frame #2: 0x000000010cae8ee0 test_step_over_3_times_gmodules`main(argc=1, argv=0x00007ffee3117458) at main2.cpp:36:14 frame #3: 0x00007fff67d6a085 libdyld.dylib`start + 1 frame #4: 0x00007fff67d6a085 libdyld.dylib`start + 1

Hide Details

Hide Details

<bound method SBProcess.Kill of <lldb.SBProcess; proxy of <Swig Object of type 'lldb::SBProcess *' at 0x113c342d0> >>: success

Hide Details

PASS: LLDB (/Users/buildslave/jenkins/workspace/lldb-cmake-sanitized/lldb-build/bin/clang-11-x86_64) :: test_step_over_3_times_gmodules (TestThreadAPI.ThreadAPITestCase) Restore dir to: /Users/buildslave/jenkins/workspace/lldb-cmake-sanitized/lldb-build/tools/lldb/test ====================================================================== ERROR: test_step_out_of_malloc_into_function_b_dsym (TestThreadAPI.ThreadAPITestCase) Test Python SBThread.StepOut() API to step out of a malloc call where the call site is at function b(). ---------------------------------------------------------------------- Traceback (most recent call last): File "/Users/buildslave/jenkins/workspace/lldb-cmake-sanitized/llvm-project/lldb/packages/Python/lldbsuite/test/lldbtest.py", line 1751, in test_method return attrvalue(self) File "/Users/buildslave/jenkins/workspace/lldb-cmake-sanitized/llvm-project/lldb/packages/Python/lldbsuite/test/decorators.py", line 110, in wrapper func(*args, **kwargs) File "/Users/buildslave/jenkins/workspace/lldb-cmake-sanitized/llvm-project/lldb/packages/Python/lldbsuite/test/decorators.py", line 110, in wrapper func(*args, **kwargs) File "/Users/buildslave/jenkins/workspace/lldb-cmake-sanitized/llvm-project/lldb/packages/Python/lldbsuite/test/decorators.py", line 110, in wrapper func(*args, **kwargs) File "/Users/buildslave/jenkins/workspace/lldb-cmake-sanitized/llvm-project/lldb/test/API/python_api/thread/TestThreadAPI.py", line 50, in test_step_out_of_malloc_into_function_b self.step_out_of_malloc_into_function_b(self.exe_name) File "/Users/buildslave/jenkins/workspace/lldb-cmake-sanitized/llvm-project/lldb/test/API/python_api/thread/TestThreadAPI.py", line 157, in step_out_of_malloc_into_function_b thread.IsValid(), AttributeError: 'NoneType' object has no attribute 'IsValid' Config=x86_64-/Users/buildslave/jenkins/workspace/lldb-cmake-sanitized/lldb-build/bin/clang-11 ====================================================================== ERROR: test_step_out_of_malloc_into_function_b_dwarf (TestThreadAPI.ThreadAPITestCase) Test Python SBThread.StepOut() API to step out of a malloc call where the call site is at function b(). ---------------------------------------------------------------------- Traceback (most recent call last): File "/Users/buildslave/jenkins/workspace/lldb-cmake-sanitized/llvm-project/lldb/packages/Python/lldbsuite/test/lldbtest.py", line 1751, in test_method return attrvalue(self) File "/Users/buildslave/jenkins/workspace/lldb-cmake-sanitized/llvm-project/lldb/packages/Python/lldbsuite/test/decorators.py", line 110, in wrapper func(*args, **kwargs) File "/Users/buildslave/jenkins/workspace/lldb-cmake-sanitized/llvm-project/lldb/packages/Python/lldbsuite/test/decorators.py", line 110, in wrapper func(*args, **kwargs) File "/Users/buildslave/jenkins/workspace/lldb-cmake-sanitized/llvm-project/lldb/packages/Python/lldbsuite/test/decorators.py", line 110, in wrapper func(*args, **kwargs) File "/Users/buildslave/jenkins/workspace/lldb-cmake-sanitized/llvm-project/lldb/test/API/python_api/thread/TestThreadAPI.py", line 50, in test_step_out_of_malloc_into_function_b self.step_out_of_malloc_into_function_b(self.exe_name) File "/Users/buildslave/jenkins/workspace/lldb-cmake-sanitized/llvm-project/lldb/test/API/python_api/thread/TestThreadAPI.py", line 157, in step_out_of_malloc_into_function_b thread.IsValid(), AttributeError: 'NoneType' object has no attribute 'IsValid' Config=x86_64-/Users/buildslave/jenkins/workspace/lldb-cmake-sanitized/lldb-build/bin/clang-11 ====================================================================== ERROR: test_step_out_of_malloc_into_function_b_gmodules (TestThreadAPI.ThreadAPITestCase) Test Python SBThread.StepOut() API to step out of a malloc call where the call site is at function b(). ---------------------------------------------------------------------- Traceback (most recent call last): File "/Users/buildslave/jenkins/workspace/lldb-cmake-sanitized/llvm-project/lldb/packages/Python/lldbsuite/test/lldbtest.py", line 1751, in test_method return attrvalue(self) File "/Users/buildslave/jenkins/workspace/lldb-cmake-sanitized/llvm-project/lldb/packages/Python/lldbsuite/test/decorators.py", line 110, in wrapper func(*args, **kwargs) File "/Users/buildslave/jenkins/workspace/lldb-cmake-sanitized/llvm-project/lldb/packages/Python/lldbsuite/test/decorators.py", line 110, in wrapper func(*args, **kwargs) File "/Users/buildslave/jenkins/workspace/lldb-cmake-sanitized/llvm-project/lldb/packages/Python/lldbsuite/test/decorators.py", line 110, in wrapper func(*args, **kwargs) File "/Users/buildslave/jenkins/workspace/lldb-cmake-sanitized/llvm-project/lldb/test/API/python_api/thread/TestThreadAPI.py", line 50, in test_step_out_of_malloc_into_function_b self.step_out_of_malloc_into_function_b(self.exe_name) File "/Users/buildslave/jenkins/workspace/lldb-cmake-sanitized/llvm-project/lldb/test/API/python_api/thread/TestThreadAPI.py", line 157, in step_out_of_malloc_into_function_b thread.IsValid(), AttributeError: 'NoneType' object has no attribute 'IsValid' Config=x86_64-/Users/buildslave/jenkins/workspace/lldb-cmake-sanitized/lldb-build/bin/clang-11 ---------------------------------------------------------------------- Ran 20 tests in 40.177s

Hide Details

RESULT: FAILED (12 passes, 0 failures, 3 errors, 5 skipped, 0 expected failures, 0 unexpected successes)

Hide Details

--

Hide Details

******************** PASS: lldb-unit :: Utility/./UtilityTests/StreamTest.PutCString (1772 of 1971) PASS: lldb-api :: commands/command/invalid-args/TestInvalidArgsCommand.py (1773 of 1971) UNSUPPORTED: lldb-api :: functionalities/data-formatter/data-formatter-stl/libstdcpp/map/TestDataFormatterStdMap.py (1774 of 1971) PASS: lldb-api :: lang/c/tls_globals/TestTlsGlobals.py (1775 of 1971) PASS: lldb-api :: commands/expression/import-std-module/deque-basic/TestDequeFromStdModule.py (1776 of 1971) PASS: lldb-unit :: Utility/./UtilityTests/UriParserTest.SchemeHostSeparator (1777 of 1971) PASS: lldb-unit :: UnwindAssembly/x86/./UnwindAssemblyx86Tests/Testx86AssemblyInspectionEngine.TestPushRBX (1778 of 1971) PASS: lldb-unit :: Utility/./UtilityTests/ArchSpecTest.TestParseMachCPUDashSubtypeTripleSimple (1779 of 1971) UNSUPPORTED: lldb-api :: functionalities/data-formatter/data-formatter-stl/libstdcpp/list/TestDataFormatterStdList.py (1780 of 1971) PASS: lldb-shell :: Recognizer/assert.test (1781 of 1971) PASS: lldb-unit :: Core/./LLDBCoreTests/MangledTest.NameIndexes_FindFunctionSymbols (1782 of 1971) PASS: lldb-shell :: ObjectFile/ELF/minidebuginfo-corrupt-xz.yaml (1783 of 1971) PASS: lldb-shell :: SymbolFile/NativePDB/function-types-calling-conv.cpp (1784 of 1971) PASS: lldb-api :: commands/expression/completion-in-lambda-and-unnamed-class/TestCompletionInLambdaAndUnnamedClass.py (1785 of 1971) UNSUPPORTED: lldb-api :: arm/breakpoint-thumb-codesection/TestBreakpointThumbCodesection.py (1786 of 1971) PASS: lldb-unit :: Utility/./UtilityTests/RangeTest.ContainsRangeStartingFromZero (1787 of 1971) PASS: lldb-unit :: Host/./HostTests/SocketTest.DomainListenConnectAccept (1788 of 1971) PASS: lldb-api :: lang/objcxx/class-name-clash/TestNameClash.py (1789 of 1971) PASS: lldb-unit :: Utility/./UtilityTests/StreamTest.PutPtr (1790 of 1971) PASS: lldb-unit :: SymbolFile/NativePDB/./SymbolFileNativePDBTests/PDBFPOProgramToDWARFExpressionTests.UnsupportedRASearch (1791 of 1971) PASS: lldb-api :: lang/objc/objc-struct-argument/TestObjCStructArgument.py (1792 of 1971) PASS: lldb-api :: lang/objc/modules-auto-import/TestModulesAutoImport.py (1793 of 1971) PASS: lldb-unit :: Utility/./UtilityTests/StateTest.Formatv (1794 of 1971) PASS: lldb-api :: lang/objc/foundation/TestSymbolTable.py (1795 of 1971) PASS: lldb-api :: functionalities/deleted-executable/TestDeletedExecutable.py (1796 of 1971) PASS: lldb-api :: commands/watchpoints/step_over_watchpoint/TestStepOverWatchpoint.py (1797 of 1971) PASS: lldb-api :: functionalities/data-formatter/ptr_ref_typedef/TestPtrRef2Typedef.py (1798 of 1971) PASS: lldb-unit :: Utility/./UtilityTests/RangeTest.ContainsAddrInvalid (1799 of 1971) PASS: lldb-api :: functionalities/tail_call_frames/thread_step_out_or_return/TestSteppingOutWithArtificialFrames.py (1800 of 1971) PASS: lldb-shell :: Watchpoint/SetErrorCases.test (1801 of 1971) PASS: lldb-api :: lang/objc/rdar-11355592/TestRdar11355592.py (1802 of 1971) PASS: lldb-api :: tools/lldb-server/TestGdbRemote_qThreadStopInfo.py (1803 of 1971) PASS: lldb-api :: commands/target/dump-symtab-demangle/TestDumpSymtabDemangle.py (1804 of 1971) PASS: lldb-unit :: UnwindAssembly/x86/./UnwindAssemblyx86Tests/Testx86AssemblyInspectionEngine.TestPushRBPWithREX (1805 of 1971) PASS: lldb-unit :: Process/gdb-remote/./ProcessGdbRemoteTests/GDBRemoteCommunicationServerTest.SendErrorResponse_Status (1806 of 1971) PASS: lldb-api :: python_api/value/change_values/TestChangeValueAPI.py (1807 of 1971) PASS: lldb-unit :: Utility/./UtilityTests/StringListTest.InsertStringAtIndexMove (1808 of 1971) PASS: lldb-unit :: Utility/./UtilityTests/RangeTest.DefaultConstructor (1809 of 1971) PASS: lldb-shell :: ObjectFile/ELF/minidebuginfo-find-symbols.yaml (1810 of 1971) PASS: lldb-unit :: Utility/./UtilityTests/VMRange.IsValid (1811 of 1971) PASS: lldb-unit :: Utility/./UtilityTests/LogChannelTest.Disable (1812 of 1971) PASS: lldb-unit :: Language/Highlighting/./HighlighterTests/HighlighterTest.Keywords (1813 of 1971) PASS: lldb-unit :: Utility/./UtilityTests/CompletionRequest.DuplicateFiltering (1814 of 1971) PASS: lldb-unit :: Symbol/./SymbolTests/TestClangASTImporter.ImportInvalidType (1815 of 1971) PASS: lldb-api :: functionalities/data-formatter/varscript_formatting/TestDataFormatterVarScriptFormatting.py (1816 of 1971) PASS: lldb-unit :: Utility/./UtilityTests/ProcessInstanceInfo.Dump (1817 of 1971) PASS: lldb-shell :: Reproducer/TestFileRepro.test (1818 of 1971) PASS: lldb-unit :: ScriptInterpreter/Python/./ScriptInterpreterPythonTests/PythonDataObjectsTest.TestPythonDictionaryToStructuredDictionary (1819 of 1971) PASS: lldb-unit :: Host/./HostTests/Host.WaitStatusFormat (1820 of 1971) PASS: lldb-shell :: ObjectFile/PECOFF/basic-info.yaml (1821 of 1971) PASS: lldb-api :: python_api/formatters/TestFormattersSBAPI.py (1822 of 1971) PASS: lldb-unit :: Utility/./UtilityTests/RangeTest.ContainsRange (1823 of 1971) PASS: lldb-unit :: Target/./TargetTests/ModuleCacheTest.GetAndPutStrangeHostname (1824 of 1971) PASS: lldb-api :: functionalities/gdb_remote_client/TestGDBRemoteClient.py (1825 of 1971) PASS: lldb-api :: commands/watchpoints/hello_watchpoint/TestMyFirstWatchpoint.py (1826 of 1971) PASS: lldb-unit :: Utility/./UtilityTests/StreamTeeTest.Constructor1Stream (1827 of 1971) PASS: lldb-unit :: Utility/./UtilityTests/StringListTest.GetMaxStringLengthIncreasingSize (1828 of 1971) PASS: lldb-shell :: Process/TestEnvironment.test (1829 of 1971) PASS: lldb-unit :: Symbol/./SymbolTests/TestTypeSystemClang.TestGetEnumIntegerTypeInvalid (1830 of 1971) UNSUPPORTED: lldb-shell :: SymbolFile/PDB/function-level-linking.test (1831 of 1971) PASS: lldb-shell :: SymbolFile/DWARF/debug-types-address-ranges.s (1832 of 1971) PASS: lldb-unit :: Utility/./UtilityTests/RangeTest.ContainsAddr (1833 of 1971) PASS: lldb-unit :: Process/gdb-remote/./ProcessGdbRemoteTests/GDBRemoteClientBaseTest.SendContinueAndInterrupt (1834 of 1971) PASS: lldb-unit :: UnwindAssembly/x86/./UnwindAssemblyx86Tests/Testx86AssemblyInspectionEngine.TestPopRBP (1835 of 1971) UNSUPPORTED: lldb-api :: functionalities/darwin_log/filter/regex/category/TestDarwinLogFilterRegexCategory.py (1836 of 1971) PASS: lldb-unit :: Symbol/./SymbolTests/Type.CompilerContextPattern (1837 of 1971) PASS: lldb-unit :: Utility/./UtilityTests/FileSpecTest.CopyByAppendingPathComponent (1838 of 1971) PASS: lldb-api :: python_api/disassemble-raw-data/TestDisassembleRawData.py (1839 of 1971) PASS: lldb-unit :: Utility/./UtilityTests/Flags.AllSet (1840 of 1971) PASS: lldb-api :: commands/expression/invalid-args/TestInvalidArgsExpression.py (1841 of 1971) PASS: lldb-api :: functionalities/data-formatter/summary-string-onfail/Test-rdar-9974002.py (1842 of 1971) PASS: lldb-api :: lang/objc/foundation/TestConstStrings.py (1843 of 1971) PASS: lldb-api :: functionalities/step-avoids-no-debug/TestStepNoDebug.py (1844 of 1971) PASS: lldb-unit :: Utility/./UtilityTests/StringExtractorTest.GetNameColonValueContainsColon (1845 of 1971) PASS: lldb-api :: lang/cpp/operators/TestCppOperators.py (1846 of 1971) PASS: lldb-api :: functionalities/data-formatter/ostypeformatting/TestFormattersOsType.py (1847 of 1971) PASS: lldb-shell :: Commands/command-source.test (1848 of 1971) PASS: lldb-unit :: Expression/./ExpressionTests/DiagnosticManagerTest.FixedExpression (1849 of 1971) PASS: lldb-api :: functionalities/breakpoint/breakpoint_locations/TestBreakpointLocations.py (1850 of 1971) PASS: lldb-shell :: SymbolFile/DWARF/debug_line-relative_path.s (1851 of 1971) PASS: lldb-api :: lang/cpp/llvm-style/TestLLVMStyle.py (1852 of 1971) PASS: lldb-api :: tools/lldb-server/register-reading/TestGdbRemoteGPacket.py (1853 of 1971) PASS: lldb-api :: commands/expression/call-function/TestCallBuiltinFunction.py (1854 of 1971) PASS: lldb-shell :: Settings/TestEchoCommands.test (1855 of 1971) UNSUPPORTED: lldb-api :: benchmarks/libcxxlist/TestBenchmarkLibcxxList.py (1856 of 1971) PASS: lldb-shell :: ObjectFile/ELF/netbsd-exec-8.99.30-amd64.yaml (1857 of 1971) PASS: lldb-api :: functionalities/data-formatter/data-formatter-stl/libcxx/function/TestLibCxxFunction.py (1858 of 1971) PASS: lldb-unit :: Symbol/./SymbolTests/LineEntryTest.GetSameLineContiguousAddressRangeNoInlines (1859 of 1971) UNSUPPORTED: lldb-api :: api/multiple-debuggers/TestMultipleDebuggers.py (1860 of 1971) PASS: lldb-unit :: Utility/./UtilityTests/VMRange.SetEndAddress (1861 of 1971) PASS: lldb-unit :: ObjectFile/ELF/./ObjectFileELFTests/ObjectFileELFTest.SectionsResolveConsistently (1862 of 1971) PASS: lldb-shell :: SymbolFile/DWARF/inline-function-address.ll (1863 of 1971) PASS: lldb-shell :: Settings/TestFrameFormatColor.test (1864 of 1971) PASS: lldb-unit :: Utility/./UtilityTests/RangeDataVector.CustomSort (1865 of 1971) PASS: lldb-unit :: Symbol/./SymbolTests/DWARFCallFrameInfoTest.Basic_dwarf4 (1866 of 1971) PASS: lldb-unit :: Language/Highlighting/./HighlighterTests/HighlighterTest.FallbackHighlighter (1867 of 1971) UNSUPPORTED: lldb-shell :: SymbolFile/PDB/ast-restore.test (1868 of 1971) PASS: lldb-api :: commands/expression/import-std-module/conflicts/TestStdModuleWithConflicts.py (1869 of 1971) PASS: lldb-unit :: Utility/./UtilityTests/RegularExpression.Invalid (1870 of 1971) PASS: lldb-shell :: ObjectFile/ELF/PT_TLS-overlap-PT_LOAD.yaml (1871 of 1971) PASS: lldb-api :: commands/expression/test/TestExprs.py (1872 of 1971) PASS: lldb-api :: functionalities/tail_call_frames/cross_dso/TestCrossDSOTailCalls.py (1873 of 1971) PASS: lldb-api :: functionalities/tail_call_frames/ambiguous_tail_call_seq1/TestAmbiguousTailCallSeq1.py (1874 of 1971) PASS: lldb-unit :: Utility/./UtilityTests/StringListTest.LongestCommonPrefixSingleElement (1875 of 1971) PASS: lldb-shell :: Driver/LocalLLDBInit.test (1876 of 1971) PASS: lldb-unit :: Expression/./ExpressionTests/CppModuleConfigurationTest.MissingUsrInclude (1877 of 1971) PASS: lldb-api :: functionalities/thread/crash_during_step/TestCrashDuringStep.py (1878 of 1971) PASS: lldb-shell :: Driver/TestNoUseColor.test (1879 of 1971) PASS: lldb-shell :: Register/x86-64-read.test (1880 of 1971) PASS: lldb-unit :: Utility/./UtilityTests/StringListTest.InsertStringAtIndexOutOfBounds (1881 of 1971) UNSUPPORTED: lldb-shell :: Breakpoint/ppc64-localentry.test (1882 of 1971) PASS: lldb-shell :: Settings/TestSettingsSet.test (1883 of 1971) UNSUPPORTED: lldb-api :: functionalities/darwin_log/source/info/TestDarwinLogSourceInfo.py (1884 of 1971) PASS: lldb-unit :: UnwindAssembly/x86/./UnwindAssemblyx86Tests/Testx86AssemblyInspectionEngine.TestPushECX (1885 of 1971) PASS: lldb-shell :: SymbolFile/DWARF/gnu-style-compression.cpp (1886 of 1971) PASS: lldb-api :: commands/command/script_alias/TestCommandScriptAlias.py (1887 of 1971) PASS: lldb-api :: python_api/hello_world/TestHelloWorld.py (1888 of 1971) PASS: lldb-shell :: SymbolFile/NativePDB/break-by-function.cpp (1889 of 1971) PASS: lldb-unit :: Host/./HostTests/FileSystemTest.Exists (1890 of 1971) PASS: lldb-api :: python_api/objc_type/TestObjCType.py (1891 of 1971) PASS: lldb-unit :: ScriptInterpreter/Python/./ScriptInterpreterPythonTests/PythonDataObjectsTest.TestPythonTupleValues (1892 of 1971) PASS: lldb-api :: lang/cpp/breakpoint-commands/TestCPPBreakpointCommands.py (1893 of 1971) PASS: lldb-api :: commands/platform/process/list/TestProcessList.py (1894 of 1971) PASS: lldb-shell :: Expr/TestTypeOfDeclTypeExpr.test (1895 of 1971) PASS: lldb-api :: commands/expression/import-std-module/vector/TestVectorFromStdModule.py (1896 of 1971) PASS: lldb-api :: functionalities/load_using_paths/TestLoadUsingPaths.py (1897 of 1971) PASS: lldb-api :: functionalities/non-overlapping-index-variable-i/TestIndexVariable.py (1898 of 1971) PASS: lldb-unit :: Symbol/./SymbolTests/TestClangASTImporter.DeportDeclTagDecl (1899 of 1971) PASS: lldb-unit :: Symbol/./SymbolTests/TestTypeSystemClang.TestGetTypeClassDeclType (1900 of 1971) PASS: lldb-unit :: Utility/./UtilityTests/StreamTest.AddressRangeInvalidRange (1901 of 1971) PASS: lldb-api :: lang/cpp/stl/TestSTL.py (1902 of 1971) PASS: lldb-unit :: Symbol/./SymbolTests/TestClangASTImporter.RecordLayout (1903 of 1971) PASS: lldb-unit :: Expression/./ExpressionTests/DiagnosticManagerTest.GetStringBasic (1904 of 1971) PASS: lldb-shell :: Reproducer/TestDump.test (1905 of 1971) PASS: lldb-api :: tools/lldb-server/TestGdbRemoteHostInfo.py (1906 of 1971) PASS: lldb-api :: commands/disassemble/basic/TestDisassembleBreakpoint.py (1907 of 1971) PASS: lldb-unit :: SymbolFile/NativePDB/./SymbolFileNativePDBTests/PDBFPOProgramToDWARFExpressionTests.InvalidAssignmentMultiple (1908 of 1971) PASS: lldb-unit :: Host/./HostTests/NativeProcessProtocolTest.ReadMemoryWithoutTrap (1909 of 1971) PASS: lldb-shell :: ObjectFile/PECOFF/export-dllfunc.yaml (1910 of 1971) PASS: lldb-shell :: SymbolFile/DWARF/debug-types-dwo-cross-reference.cpp (1911 of 1971) PASS: lldb-shell :: Quit/TestQuitExitCode-30.test (1912 of 1971) PASS: lldb-api :: lang/c/step-target/TestStepTarget.py (1913 of 1971) PASS: lldb-unit :: SymbolFile/NativePDB/./SymbolFileNativePDBTests/PDBFPOProgramToDWARFExpressionTests.UnresolvedDependentCyclicRegisterAssignmentReference (1914 of 1971) PASS: lldb-unit :: Utility/./UtilityTests/ConstStringTest.CompareConstString (1915 of 1971) PASS: lldb-unit :: Utility/./UtilityTests/StringExtractorTest.GetHexU8_Underflow (1916 of 1971) PASS: lldb-shell :: Driver/TestCore.test (1917 of 1971) PASS: lldb-unit :: Utility/./UtilityTests/EnvironmentTest.EnvpConversion (1918 of 1971) PASS: lldb-api :: functionalities/gdb_remote_client/TestTargetXMLArch.py (1919 of 1971) PASS: lldb-unit :: Utility/./UtilityTests/StatusTest.ErrorConversion (1920 of 1971) PASS: lldb-api :: functionalities/data-formatter/data-formatter-categories/TestDataFormatterCategories.py (1921 of 1971) PASS: lldb-shell :: SymbolFile/DWARF/find-method.cpp (1922 of 1971) PASS: lldb-unit :: Utility/./UtilityTests/UriParserTest.MinimalPortPath (1923 of 1971) PASS: lldb-api :: lang/objc/objc-class-method/TestObjCClassMethod.py (1924 of 1971) PASS: lldb-api :: lang/cpp/unique-types/TestUniqueTypes.py (1925 of 1971) PASS: lldb-unit :: Utility/./UtilityTests/ScalarTest.APIntConstructor (1926 of 1971) PASS: lldb-unit :: Utility/./UtilityTests/BinaryStreamTest.PutULEB128FiveBytes (1927 of 1971) UNSUPPORTED: lldb-api :: functionalities/tsan/cpp_global_location/TestTsanCPPGlobalLocation.py (1928 of 1971) UNSUPPORTED: lldb-shell :: ScriptInterpreter/Lua/nested_sessions.test (1929 of 1971) PASS: lldb-unit :: Utility/./UtilityTests/VASprintfTest.NoBufferResize (1930 of 1971) PASS: lldb-api :: functionalities/data-formatter/data-formatter-stl/libcxx/atomic/TestLibCxxAtomic.py (1931 of 1971) PASS: lldb-unit :: Utility/./UtilityTests/UriParserTest.TypicalPortPath (1932 of 1971) PASS: lldb-unit :: Symbol/./SymbolTests/TestTypeSystemClang.TestNotDeletingUserCopyCstrDueToMoveCStr (1933 of 1971) PASS: lldb-api :: functionalities/rerun/TestRerun.py (1934 of 1971) PASS: lldb-unit :: Utility/./UtilityTests/SharedCluster.ClusterManager (1935 of 1971) PASS: lldb-shell :: Unwind/eh-frame-dwarf-unwind.test (1936 of 1971) PASS: lldb-api :: functionalities/data-formatter/poarray/TestPrintObjectArray.py (1937 of 1971) PASS: lldb-unit :: Process/minidump/./LLDBMinidumpTests/MinidumpParserTest.MinidumpModuleOrder (1938 of 1971) PASS: lldb-unit :: Editline/./EditlineTests/EditlineTestFixture.EditlineReceivesMultiLineText (1939 of 1971) PASS: lldb-api :: functionalities/data-formatter/format-propagation/TestFormatPropagation.py (1940 of 1971) PASS: lldb-api :: functionalities/paths/TestPaths.py (1941 of 1971) PASS: lldb-unit :: Utility/./UtilityTests/StreamTeeTest.SetStreamAtIndexOverwrite (1942 of 1971) PASS: lldb-api :: commands/expression/import-std-module/unique_ptr/TestUniquePtrFromStdModule.py (1943 of 1971) PASS: lldb-unit :: Core/./LLDBCoreTests/MangledTest.ResultForValidName (1944 of 1971) PASS: lldb-api :: python_api/breakpoint/TestBreakpointAPI.py (1945 of 1971) UNSUPPORTED: lldb-api :: functionalities/darwin_log/filter/exact_match/activity-chain/TestDarwinLogFilterMatchActivityChain.py (1946 of 1971) PASS: lldb-api :: lang/cpp/enum_types/TestCPP11EnumTypes.py (1947 of 1971) PASS: lldb-api :: functionalities/data-formatter/nsdictionarysynth/TestNSDictionarySynthetic.py (1948 of 1971) PASS: lldb-unit :: Utility/./UtilityTests/StructuredDataTest.ParseJSONFromFile (1949 of 1971) PASS: lldb-unit :: Utility/./UtilityTests/NameMatchesTest.Contains (1950 of 1971) PASS: lldb-api :: commands/command/history/TestCommandHistory.py (1951 of 1971) PASS: lldb-api :: commands/expression/import-std-module/unique_ptr-dbg-info-content/TestUniquePtrDbgInfoContent.py (1952 of 1971) PASS: lldb-unit :: Host/./HostTests/SocketTest.TCPGetConnectURI (1953 of 1971) PASS: lldb-api :: lang/c/stepping/TestStepAndBreakpoints.py (1954 of 1971) UNSUPPORTED: lldb-api :: functionalities/tsan/thread_leak/TestTsanThreadLeak.py (1955 of 1971) PASS: lldb-unit :: Process/gdb-remote/./ProcessGdbRemoteTests/GDBRemoteClientBaseTest.SendContinueAndInterrupt2PacketBug (1956 of 1971) PASS: lldb-api :: tools/lldb-server/TestLldbGdbServer.py (1957 of 1971) PASS: lldb-shell :: Quit/TestQuitExitCodeHex0.test (1958 of 1971) PASS: lldb-api :: functionalities/data-formatter/data-formatter-stl/libcxx/vector/TestDataFormatterLibcxxVector.py (1959 of 1971) PASS: lldb-unit :: Utility/./UtilityTests/StringExtractorTest.InitEmpty (1960 of 1971) PASS: lldb-shell :: SymbolFile/DWARF/DW_OP_piece-smaller-than-struct.s (1961 of 1971) PASS: lldb-unit :: Expression/./ExpressionTests/CppModuleConfigurationTest.AmbiguousLibCpp (1962 of 1971) PASS: lldb-unit :: Utility/./UtilityTests/RangeTest.SlideZero (1963 of 1971) PASS: lldb-unit :: Language/Highlighting/./HighlighterTests/HighlighterTest.ClangStringLiterals (1964 of 1971) PASS: lldb-unit :: Host/./HostTests/ConnectionFileDescriptorTest.TCPGetURIv4 (1965 of 1971) PASS: lldb-unit :: Utility/./UtilityTests/RangeTest.Clear (1966 of 1971) PASS: lldb-api :: commands/expression/options/TestExprOptions.py (1967 of 1971) PASS: lldb-api :: functionalities/data-formatter/data-formatter-stl/libcxx/forward_list/TestDataFormatterLibcxxForwardList.py (1968 of 1971) PASS: lldb-api :: functionalities/gdb_remote_client/TestIOSSimulator.py (1969 of 1971) PASS: lldb-api :: commands/expression/unicode-in-variable/TestUnicodeInVariable.py (1970 of 1971) PASS: lldb-api :: commands/expression/persist_objc_pointeetype/TestPersistObjCPointeeType.py (1971 of 1971)

Hide Details

Testing Time: 4366.94s ******************** Failing Tests (3): lldb-api :: lang/objc/ptr_refs/TestPtrRefsObjC.py lldb-api :: functionalities/ptr_refs/TestPtrRefs.py lldb-api :: python_api/thread/TestThreadAPI.py

Hide Details

Hide Details

Slowest Tests: -------------------------------------------------------------------------- 92.34s: lldb-api :: types/TestLongTypes.py 96.61s: lldb-api :: commands/settings/TestSettings.py 100.54s: lldb-api :: lang/objc/forward-decl/TestForwardDecl.py 101.63s: lldb-api :: types/TestCharType.py 111.34s: lldb-api :: lang/objc/objc-new-syntax/TestObjCNewSyntaxArray.py 113.04s: lldb-api :: lang/objc/objc-new-syntax/TestObjCNewSyntaxDictionary.py 113.29s: lldb-api :: lang/objc/foundation/TestObjCMethodsNSError.py 115.35s: lldb-api :: lang/objc/foundation/TestObjCMethodsString.py 120.57s: lldb-api :: tools/lldb-server/TestGdbRemote_qThreadStopInfo.py 132.77s: lldb-api :: types/TestLongTypesExpr.py 137.53s: lldb-api :: lang/objc/exceptions/TestObjCExceptions.py 140.67s: lldb-api :: lang/objc/real-definition/TestRealDefinition.py 152.68s: lldb-api :: lang/objc/objc-new-syntax/TestObjCNewSyntaxLiteral.py 163.35s: lldb-api :: lang/cpp/namespace/TestNamespaceLookup.py 215.38s: lldb-api :: lang/objc/foundation/TestObjCMethods.py 217.48s: lldb-api :: lang/objc/hidden-ivars/TestHiddenIvars.py 249.21s: lldb-api :: tools/lldb-server/TestGdbRemoteThreadsInStopReply.py 253.91s: lldb-api :: api/multithreaded/TestMultithreaded.py 273.77s: lldb-api :: lang/cpp/enum_types/TestCPP11EnumTypes.py 370.20s: lldb-api :: tools/lldb-server/TestLldbGdbServer.py

Hide Details

Tests Times: -------------------------------------------------------------------------- [ Range ] :: [ Percentage ] :: [ Count ] -------------------------------------------------------------------------- [ 0s, 20s) :: [********************************** ] :: [1719/1971] [ 20s, 40s) :: [** ] :: [ 122/1971] [ 40s, 60s) :: [* ] :: [ 78/1971] [ 60s, 80s) :: [ ] :: [ 27/1971] [ 80s,100s) :: [ ] :: [ 7/1971] [100s,120s) :: [ ] :: [ 6/1971] [120s,140s) :: [ ] :: [ 2/1971] [140s,160s) :: [ ] :: [ 3/1971] [160s,180s) :: [ ] :: [ 1/1971] [180s,200s) :: [ ] :: [ 0/1971] [200s,220s) :: [ ] :: [ 0/1971] [220s,240s) :: [ ] :: [ 2/1971] [240s,260s) :: [ ] :: [ 1/1971] [260s,280s) :: [ ] :: [ 1/1971] [280s,300s) :: [ ] :: [ 1/1971] [300s,320s) :: [ ] :: [ 0/1971] [320s,340s) :: [ ] :: [ 0/1971] [340s,360s) :: [ ] :: [ 0/1971] [360s,380s) :: [ ] :: [ 1/1971] Expected Passes : 1796 Expected Failures : 6 Unsupported Tests : 166 Unexpected Failures: 3 FAILED: tools/lldb/test/CMakeFiles/check-lldb-lit cd /Users/buildslave/jenkins/workspace/lldb-cmake-sanitized/lldb-build/tools/lldb/test && /usr/local/bin/python /Users/buildslave/jenkins/workspace/lldb-cmake-sanitized/lldb-build/./bin/llvm-lit -v --time-tests --shuffle --xunit-xml-output=/Users/buildslave/jenkins/workspace/lldb-cmake-sanitized/test/results.xml -v -j 4 --timeout 1200 /Users/buildslave/jenkins/workspace/lldb-cmake-sanitized/lldb-build/tools/lldb/test ninja: build stopped: subcommand failed. Command failed: Command '['/usr/bin/env', 'TERM=vt100', '/usr/local/bin/ninja', '-v', 'check-lldb']' returned non-zero exit status 1. Command: ['/usr/bin/env', 'TERM=vt100', '/usr/local/bin/ninja', '-v', 'check-lldb'] [Pipeline] } [Pipeline] // timeout [Pipeline] } [Pipeline] // stage [Pipeline] stage [Pipeline] { (Declarative: Post Actions) [Pipeline] scanForIssues [Clang (LLVM based)] Sleeping for 5 seconds due to JENKINS-32191... [Clang (LLVM based)] Parsing console log (workspace: '/Users/buildslave/jenkins/workspace/lldb-cmake-sanitized') [Clang (LLVM based)] Successfully parsed console log [Clang (LLVM based)] -> found 5 issues (skipped 0 duplicates) [Clang (LLVM based)] Post processing issues on 'green-dragon-23' with source code encoding 'UTF-8' [Clang (LLVM based)] Creating SCM blamer to obtain author and commit information for affected files [Clang (LLVM based)] Creating SCM miner to obtain statistics for affected repository files [Clang (LLVM based)] Resolving file names for all issues in source directory '/Users/buildslave/jenkins/workspace/lldb-cmake-sanitized' [Clang (LLVM based)] -> resolved paths in source directory (4 found, 0 not found) [Clang (LLVM based)] Resolving module names from module definitions (build.xml, pom.xml, or Manifest.mf files) [Clang (LLVM based)] -> resolved module names for 5 issues [Clang (LLVM based)] Resolving package names (or namespaces) by parsing the affected files [Clang (LLVM based)] -> resolved package names of 4 affected files [Clang (LLVM based)] No filter has been set, publishing all 5 issues [Clang (LLVM based)] Creating fingerprints for all affected code blocks to track issues over different builds [Clang (LLVM based)] -> created fingerprints for 5 issues (skipped 0 issues) [Clang (LLVM based)] Copying affected files to Jenkins' build folder '/Users/Shared/Jenkins/Home/jobs/lldb-cmake-sanitized/builds/1143/files-with-issues' [Clang (LLVM based)] -> 4 copied, 0 not in workspace, 0 not-found, 0 with I/O error [Pipeline] junit Recording test results [Pipeline] } [Pipeline] // stage [Pipeline] } [Pipeline] // withEnv [Pipeline] } [Pipeline] // node [Pipeline] End of Pipeline ERROR: script returned exit code 1 Finished: FAILURE