Console Output

Skipping 8,024 KB.. Full Log
PASS: lldb-api :: python_api/watchpoint/TestSetWatchpoint.py (560 of 2034)
UNSUPPORTED: lldb-api :: tools/lldb-server/thread-name/TestGdbRemoteThreadName.py (561 of 2034)
PASS: lldb-unit :: Symbol/./SymbolTests/TestTypeSystemClang.TestUnifyAccessSpecifiers (562 of 2034)
PASS: lldb-api :: functionalities/return-value/TestReturnValue.py (563 of 2034)
UNSUPPORTED: lldb-api :: functionalities/data-formatter/data-formatter-stl/libstdcpp/tuple/TestDataFormatterStdTuple.py (564 of 2034)
PASS: lldb-api :: functionalities/data-formatter/compactvectors/TestCompactVectors.py (565 of 2034)
PASS: lldb-api :: functionalities/thread/concurrent_events/TestConcurrentSignalBreak.py (566 of 2034)
PASS: lldb-api :: macosx/safe-to-func-call/TestSafeFuncCalls.py (567 of 2034)
PASS: lldb-unit :: Expression/./ExpressionTests/ClangHostTest.MacOSX (568 of 2034)
PASS: lldb-api :: commands/expression/import-std-module/no-std-module/TestMissingStdModule.py (569 of 2034)
PASS: lldb-api :: functionalities/gdb_remote_client/TestRestartBug.py (570 of 2034)
PASS: lldb-shell :: ScriptInterpreter/Python/scripted_breakpoint.test (571 of 2034)
PASS: lldb-api :: lang/cpp/type_lookup/TestCppTypeLookup.py (572 of 2034)
PASS: lldb-shell :: SymbolFile/DWARF/debug_loc.s (573 of 2034)
PASS: lldb-shell :: Register/x86-64-gp-read.test (574 of 2034)
PASS: lldb-unit :: Utility/./UtilityTests/BinaryStreamTest.PutSLEB128Zero (575 of 2034)
PASS: lldb-unit :: Utility/./UtilityTests/SerializationRountripTest.SerializeDeserializeCString (576 of 2034)
PASS: lldb-unit :: Utility/./UtilityTests/DataExtractorTest.GetCStrUnterminated (577 of 2034)
PASS: lldb-unit :: Language/CPlusPlus/./LanguageCPlusPlusTests/CPlusPlusLanguage.FindAlternateFunctionManglings (578 of 2034)
PASS: lldb-unit :: Utility/./UtilityTests/LogChannelTest.List (579 of 2034)
PASS: lldb-unit :: Target/./TargetTests/RemoteAwarePlatformTest.TestResolveExecutabelOnClientByPlatform (580 of 2034)
PASS: lldb-unit :: ScriptInterpreter/Python/./ScriptInterpreterPythonTests/PythonDataObjectsTest.TestModuleNameResolutionNoDot (581 of 2034)
PASS: lldb-api :: lang/c/offsetof/TestOffsetof.py (582 of 2034)
PASS: lldb-api :: macosx/find-dsym/deep-bundle/TestDeepBundle.py (583 of 2034)
PASS: lldb-api :: commands/expression/test/TestExprs2.py (584 of 2034)
PASS: lldb-unit :: Process/gdb-remote/./ProcessGdbRemoteTests/GDBRemoteCommunicationServerTest.SendErrorResponse_Status (585 of 2034)
UNSUPPORTED: lldb-api :: functionalities/tty/TestTerminal.py (586 of 2034)
PASS: lldb-unit :: Symbol/./SymbolTests/TestTypeSystemClang.TestGetEnumIntegerTypeBasicTypes (587 of 2034)
PASS: lldb-api :: functionalities/data-formatter/synthupdate/TestSyntheticFilterRecompute.py (588 of 2034)
PASS: lldb-unit :: Utility/./UtilityTests/StringListTest.AppendListCStringArrayEmpty (589 of 2034)
PASS: lldb-api :: lang/objc/variadic_methods/TestVariadicMethods.py (590 of 2034)
PASS: lldb-unit :: UnwindAssembly/x86/./UnwindAssemblyx86Tests/Testx86AssemblyInspectionEngine.TestPushR12 (591 of 2034)
PASS: lldb-api :: functionalities/dead-strip/TestDeadStrip.py (592 of 2034)
PASS: lldb-unit :: API/./APITests/SBCommandInterpreterTest.SingleWordCommand (593 of 2034)
UNSUPPORTED: lldb-shell :: Register/aarch64-fp-read.test (594 of 2034)
PASS: lldb-unit :: Utility/./UtilityTests/VMRange.CollectionContains (595 of 2034)
PASS: lldb-unit :: Utility/./UtilityTests/VASprintfTest.BufferResize (596 of 2034)
PASS: lldb-unit :: ScriptInterpreter/Python/./ScriptInterpreterPythonTests/PythonDataObjectsTest.TestPythonTupleInitializerList (597 of 2034)
PASS: lldb-shell :: ObjectFile/PECOFF/invalid-export-table.yaml (598 of 2034)
PASS: lldb-api :: lang/objc/objc-optimized/TestObjcOptimized.py (599 of 2034)
UNSUPPORTED: lldb-shell :: Register/x86-64-xmm16-write.test (600 of 2034)
PASS: lldb-shell :: SymbolFile/DWARF/deterministic-build.cpp (601 of 2034)
PASS: lldb-shell :: Unwind/eh-frame-dwarf-unwind.test (602 of 2034)
PASS: lldb-unit :: Utility/./UtilityTests/ConstStringTest.YAML (603 of 2034)
PASS: lldb-api :: functionalities/data-formatter/data-formatter-disabling/TestDataFormatterDisabling.py (604 of 2034)
PASS: lldb-unit :: Utility/./UtilityTests/RangeTest.Clear (605 of 2034)
PASS: lldb-shell :: Settings/TestEchoCommands.test (606 of 2034)
PASS: lldb-api :: functionalities/gdb_remote_client/TestqOffsets.py (607 of 2034)
PASS: lldb-unit :: Utility/./UtilityTests/ArgsTest.TestOverwriteArgs (608 of 2034)
PASS: lldb-unit :: Utility/./UtilityTests/VMRange.Reset (609 of 2034)
PASS: lldb-api :: functionalities/tail_call_frames/thread_step_out_or_return/TestSteppingOutWithArtificialFrames.py (610 of 2034)
PASS: lldb-api :: commands/expression/scoped_enums/TestScopedEnumType.py (611 of 2034)
PASS: lldb-shell :: SymbolFile/Breakpad/unwind-via-raSearch.test (612 of 2034)
PASS: lldb-api :: lang/cpp/class_static/TestStaticVariables.py (613 of 2034)
PASS: lldb-shell :: SymbolFile/NativePDB/function-types-classes.cpp (614 of 2034)
PASS: lldb-unit :: Utility/./UtilityTests/ConstStringTest.FromMidOfBufferStringRef (615 of 2034)
PASS: lldb-api :: types/TestShortType.py (616 of 2034)
UNSUPPORTED: lldb-api :: commands/watchpoints/variable_out_of_scope/TestWatchedVarHitWhenInScope.py (617 of 2034)
PASS: lldb-api :: types/TestFloatTypes.py (618 of 2034)
PASS: lldb-unit :: Language/Highlighting/./HighlighterTests/HighlighterTest.ClangTrailingBackslashBeforeNewline (619 of 2034)
PASS: lldb-api :: commands/expression/dollar-in-variable/TestDollarInVariable.py (620 of 2034)
PASS: lldb-unit :: Utility/./UtilityTests/StringExtractorTest.GetHexBytes_Underflow (621 of 2034)
PASS: lldb-shell :: Breakpoint/debug_addrx.test (622 of 2034)
PASS: lldb-unit :: UnwindAssembly/x86/./UnwindAssemblyx86Tests/Testx86AssemblyInspectionEngine.TestPushEDX (623 of 2034)
PASS: lldb-unit :: Utility/./UtilityTests/StringListTest.SplitIntoLinesSingleTrailingCR (624 of 2034)
PASS: lldb-api :: lang/cpp/stl/TestStdCXXDisassembly.py (625 of 2034)
PASS: lldb-shell :: Unwind/trap_frame_sym_ctx.test (626 of 2034)
UNSUPPORTED: lldb-api :: functionalities/gdb_remote_client/TestWasm.py (627 of 2034)
PASS: lldb-unit :: Utility/./UtilityTests/ConstStringTest.UpdateMangledCounterpart (628 of 2034)
PASS: lldb-shell :: SymbolFile/NativePDB/global-classes.cpp (629 of 2034)
PASS: lldb-unit :: Symbol/./SymbolTests/SymbolsTest.LocateExecutableSymbolFileForUnknownExecutableAndMissingSymbolFile (630 of 2034)
PASS: lldb-unit :: Utility/./UtilityTests/VMRange.Clear (631 of 2034)
PASS: lldb-api :: lang/c/local_variables/TestLocalVariables.py (632 of 2034)
PASS: lldb-shell :: ObjectFile/ELF/basic-info.yaml (633 of 2034)
PASS: lldb-api :: functionalities/data-formatter/data-formatter-stl/libcxx/optional/TestDataFormatterLibcxxOptional.py (634 of 2034)
PASS: lldb-unit :: Process/gdb-remote/./ProcessGdbRemoteTests/GDBRemoteCommunicationServerTest.SendErrorResponse_StringError (635 of 2034)
PASS: lldb-api :: tools/lldb-vscode/breakpoint-events/TestVSCode_breakpointEvents.py (636 of 2034)
PASS: lldb-api :: functionalities/value_md5_crash/TestValueMD5Crash.py (637 of 2034)
PASS: lldb-shell :: SymbolFile/Breakpad/symtab-macho.test (638 of 2034)
PASS: lldb-unit :: Process/gdb-remote/./ProcessGdbRemoteTests/GDBRemoteCommunicationClientTest.SendStartTracePacket (639 of 2034)
PASS: lldb-api :: lang/objcxx/objcxx-ivar-vector/TestIvarVector.py (640 of 2034)
PASS: lldb-unit :: Utility/./UtilityTests/RecordReplayTest.InstrumentedBar (641 of 2034)
PASS: lldb-unit :: Utility/./UtilityTests/StreamTest.PutMaxHex64ByteOrderBig (642 of 2034)
PASS: lldb-shell :: SymbolFile/DWARF/debug-types-basic.test (643 of 2034)
PASS: lldb-api :: functionalities/data-formatter/nsarraysynth/TestNSArraySynthetic.py (644 of 2034)
PASS: lldb-shell :: ObjectFile/ELF/section-overlap.yaml (645 of 2034)
PASS: lldb-shell :: Driver/TestTarget.test (646 of 2034)
UNSUPPORTED: lldb-shell :: Register/x86-64-ymm16-write.test (647 of 2034)
PASS: lldb-unit :: ScriptInterpreter/Python/./ScriptInterpreterPythonTests/PythonDataObjectsTest.TestExceptions (648 of 2034)
PASS: lldb-unit :: SymbolFile/NativePDB/./SymbolFileNativePDBTests/PDBFPOProgramToDWARFExpressionTests.UnresolvedRegisterAssignmentReference (649 of 2034)
PASS: lldb-unit :: Utility/./UtilityTests/RecordReplayTest.InstrumentedFooSameThis (650 of 2034)
UNSUPPORTED: lldb-shell :: ObjectFile/ELF/minidebuginfo-no-lzma.yaml (651 of 2034)
PASS: lldb-unit :: Language/Highlighting/./HighlighterTests/HighlighterTest.ClangCursorPosAfterOtherToken (652 of 2034)
PASS: lldb-api :: functionalities/data-formatter/data-formatter-stl/libcxx/map/TestDataFormatterLibccMap.py (653 of 2034)
PASS: lldb-api :: functionalities/history/TestHistoryRecall.py (654 of 2034)
PASS: lldb-api :: macosx/thread_suspend/TestInternalThreadSuspension.py (655 of 2034)
PASS: lldb-api :: lang/objc/modules-inline-functions/TestModulesInlineFunctions.py (656 of 2034)
PASS: lldb-unit :: ScriptInterpreter/Python/./ScriptInterpreterPythonTests/PythonDataObjectsTest.TestPythonIntegerToStr (657 of 2034)
PASS: lldb-api :: functionalities/thread/concurrent_events/TestConcurrentTwoBreakpointThreads.py (658 of 2034)
UNSUPPORTED: lldb-api :: functionalities/thread/state/TestThreadStates.py (659 of 2034)
UNSUPPORTED: lldb-shell :: ScriptInterpreter/Lua/lua.test (660 of 2034)
PASS: lldb-api :: commands/expression/completion-crash-incomplete-record/TestCompletionCrashIncompleteRecord.py (661 of 2034)
PASS: lldb-api :: sample_test/TestSampleInlineTest.py (662 of 2034)
PASS: lldb-unit :: Utility/./UtilityTests/StreamTest.PutHex16ByteOrderBig (663 of 2034)
UNSUPPORTED: lldb-api :: tools/lldb-server/TestGdbRemoteAuxvSupport.py (664 of 2034)
PASS: lldb-unit :: Utility/./UtilityTests/ArgsTest.EscapeLLDBCommandArgument (665 of 2034)
PASS: lldb-api :: commands/process/attach/attach_denied/TestAttachDenied.py (666 of 2034)
PASS: lldb-api :: lang/cpp/frame-var-anon-unions/TestFrameVariableAnonymousUnions.py (667 of 2034)
PASS: lldb-api :: functionalities/breakpoint/breakpoint_command/TestRegexpBreakCommand.py (668 of 2034)
PASS: lldb-unit :: Utility/./UtilityTests/XcodeSDKTest.SDKSupportsModules (669 of 2034)
PASS: lldb-unit :: Utility/./UtilityTests/OptionsWithRawTest.MultiWordSuffix (670 of 2034)
PASS: lldb-unit :: Utility/./UtilityTests/Flags.AllClear (671 of 2034)
PASS: lldb-api :: macosx/version_zero/TestGetVersionZeroVersion.py (672 of 2034)
PASS: lldb-shell :: SymbolFile/Breakpad/symtab.test (673 of 2034)
PASS: lldb-unit :: ScriptInterpreter/Python/./ScriptInterpreterPythonTests/PythonDataObjectsTest.TestResetting (674 of 2034)
PASS: lldb-api :: lang/objc/global_ptrs/TestGlobalObjects.py (675 of 2034)
PASS: lldb-unit :: ScriptInterpreter/Python/./ScriptInterpreterPythonTests/PythonDataObjectsTest.TestDictionaryResolutionWithDot (676 of 2034)
PASS: lldb-api :: functionalities/tail_call_frames/disambiguate_paths_to_common_sink/TestDisambiguatePathsToCommonSink.py (677 of 2034)
PASS: lldb-unit :: Host/./HostTests/ConnectionFileDescriptorTest.TCPGetURIv6 (678 of 2034)
PASS: lldb-unit :: Utility/./UtilityTests/StringListTest.InsertStringAtIndexStdString (679 of 2034)
PASS: lldb-unit :: Utility/./UtilityTests/FileSpecTest.GetPath (680 of 2034)
PASS: lldb-unit :: Expression/./ExpressionTests/DiagnosticManagerTest.GetStringBasic (681 of 2034)
PASS: lldb-api :: api/multiple-targets/TestMultipleTargets.py (682 of 2034)
PASS: lldb-api :: lang/objc/real-definition/TestRealDefinition.py (683 of 2034)
PASS: lldb-api :: lang/cpp/overloaded-functions/TestOverloadedFunctions.py (684 of 2034)
PASS: lldb-shell :: Reproducer/TestCrash.test (685 of 2034)
PASS: lldb-api :: macosx/find-app-in-bundle/TestFindAppInBundle.py (686 of 2034)
PASS: lldb-api :: functionalities/gdb_remote_client/TestWriteMemory.py (687 of 2034)
PASS: lldb-shell :: Watchpoint/SetErrorCases.test (688 of 2034)
PASS: lldb-api :: commands/expression/invalid-args/TestInvalidArgsExpression.py (689 of 2034)
PASS: lldb-api :: lang/objc/rdar-11355592/TestRdar11355592.py (690 of 2034)
PASS: lldb-unit :: Utility/./UtilityTests/ArchSpecTest.TestSetTriple (691 of 2034)
PASS: lldb-unit :: Utility/./UtilityTests/StreamTest.PutPtr (692 of 2034)
PASS: lldb-api :: commands/expression/namespace_local_var_same_name_obj_c/TestNamespaceLocalVarSameNameObjC.py (693 of 2034)
PASS: lldb-api :: lang/cpp/chained-calls/TestCppChainedCalls.py (694 of 2034)
PASS: lldb-unit :: Utility/./UtilityTests/StreamTest.Indent (695 of 2034)
PASS: lldb-api :: commands/expression/fixits/TestFixIts.py (696 of 2034)
PASS: lldb-unit :: Utility/./UtilityTests/ArgsTest.DoubleQuotedItem (697 of 2034)
PASS: lldb-unit :: Process/minidump/./LLDBMinidumpTests/MinidumpParserTest.GetMemoryRegionInfoLinuxMaps (698 of 2034)
PASS: lldb-unit :: Core/./LLDBCoreTests/StreamCallbackTest.Callback (699 of 2034)
PASS: lldb-api :: tools/lldb-server/TestGdbRemoteExpeditedRegisters.py (700 of 2034)
PASS: lldb-api :: functionalities/mtc/simple/TestMTCSimple.py (701 of 2034)
PASS: lldb-unit :: Process/minidump/./LLDBMinidumpTests/MinidumpParserTest.GetLinuxProcStatus_no_stream (702 of 2034)
PASS: lldb-unit :: Utility/./UtilityTests/StringListTest.JoinEmpty (703 of 2034)
PASS: lldb-api :: commands/frame/recognizer/TestFrameRecognizer.py (704 of 2034)
PASS: lldb-api :: functionalities/breakpoint/serialize/TestBreakpointSerialization.py (705 of 2034)
PASS: lldb-api :: functionalities/thread/concurrent_events/TestConcurrentSignalDelayBreak.py (706 of 2034)
PASS: lldb-shell :: SymbolFile/DWARF/debug_ranges.s (707 of 2034)
PASS: lldb-shell :: ObjectFile/PECOFF/basic-info-arm.yaml (708 of 2034)
PASS: lldb-api :: functionalities/type_lookup/TestTypeLookup.py (709 of 2034)
PASS: lldb-api :: lang/c/function_types/TestFunctionTypes.py (710 of 2034)
PASS: lldb-api :: python_api/file_handle/TestFileHandle.py (711 of 2034)
PASS: lldb-unit :: Language/Highlighting/./HighlighterTests/HighlighterTest.DefaultHighlighter (712 of 2034)
PASS: lldb-api :: functionalities/data-formatter/synthcapping/TestSyntheticCapping.py (713 of 2034)
FAIL: lldb-shell :: SymbolFile/DWARF/DW_TAG_variable-DW_AT_const_value.s (714 of 2034)
******************** TEST 'lldb-shell :: SymbolFile/DWARF/DW_TAG_variable-DW_AT_const_value.s' FAILED ********************
Script:
--
: 'RUN: at line 5';   /Users/buildslave/jenkins/workspace/lldb-cmake-sanitized/lldb-build/bin/llvm-mc -triple x86_64-unknown-linux-gnu /Users/buildslave/jenkins/workspace/lldb-cmake-sanitized/llvm-project/lldb/test/Shell/SymbolFile/DWARF/DW_TAG_variable-DW_AT_const_value.s -filetype=obj > /Users/buildslave/jenkins/workspace/lldb-cmake-sanitized/lldb-build/tools/lldb/test/SymbolFile/DWARF/Output/DW_TAG_variable-DW_AT_const_value.s.tmp.o
: 'RUN: at line 6';   /Users/buildslave/jenkins/workspace/lldb-cmake-sanitized/lldb-build/bin/lldb --no-lldbinit -S /Users/buildslave/jenkins/workspace/lldb-cmake-sanitized/lldb-build/tools/lldb/test/Shell/lit-lldb-init /Users/buildslave/jenkins/workspace/lldb-cmake-sanitized/lldb-build/tools/lldb/test/SymbolFile/DWARF/Output/DW_TAG_variable-DW_AT_const_value.s.tmp.o -o "p/x magic64" -o exit | /Users/buildslave/jenkins/workspace/lldb-cmake-sanitized/lldb-build/bin/FileCheck /Users/buildslave/jenkins/workspace/lldb-cmake-sanitized/llvm-project/lldb/test/Shell/SymbolFile/DWARF/DW_TAG_variable-DW_AT_const_value.s
--
Exit Code: 1

Hide Details

Command Output (stderr): -- /Users/buildslave/jenkins/workspace/lldb-cmake-sanitized/llvm-project/lldb/source/Utility/DataExtractor.cpp:934:17: runtime error: negation of -9223372036854775808 cannot be represented in type 'int64_t' (aka 'long long'); cast to an unsigned type to negate this value to itself SUMMARY: UndefinedBehaviorSanitizer: undefined-behavior /Users/buildslave/jenkins/workspace/lldb-cmake-sanitized/llvm-project/lldb/source/Utility/DataExtractor.cpp:934:17 in PLEASE submit a bug report to https://bugs.llvm.org/ and include the crash backtrace. Stack dump: 0. Program arguments: /Users/buildslave/jenkins/workspace/lldb-cmake-sanitized/lldb-build/bin/lldb --no-lldbinit -S /Users/buildslave/jenkins/workspace/lldb-cmake-sanitized/lldb-build/tools/lldb/test/Shell/lit-lldb-init /Users/buildslave/jenkins/workspace/lldb-cmake-sanitized/lldb-build/tools/lldb/test/SymbolFile/DWARF/Output/DW_TAG_variable-DW_AT_const_value.s.tmp.o -o p/x magic64 -o exit /Users/buildslave/jenkins/workspace/lldb-cmake-sanitized/llvm-project/lldb/test/Shell/SymbolFile/DWARF/DW_TAG_variable-DW_AT_const_value.s:8:10: error: CHECK: expected string not found in input # CHECK: (const long) $0 = 0xed9a924c00011151 ^ <stdin>:1:1: note: scanning from here (lldb) command source -s 0 '/Users/buildslave/jenkins/workspace/lldb-cmake-sanitized/lldb-build/tools/lldb/test/Shell/lit-lldb-init' ^ <stdin>:11:1: note: possible intended match here (lldb) p/x magic64 ^

Hide Details

--

Hide Details

******************** PASS: lldb-api :: python_api/value/change_values/TestChangeValueAPI.py (715 of 2034) PASS: lldb-api :: lang/objc/objc_direct-methods/TestObjCDirectMethods.py (716 of 2034) PASS: lldb-api :: commands/frame/diagnose/array/TestArray.py (717 of 2034) PASS: lldb-unit :: Utility/./UtilityTests/StringExtractorTest.DecodeHexU8_InvalidHex2 (718 of 2034) PASS: lldb-unit :: Utility/./UtilityTests/XcodeSDKTest.SDKSupportsSwift (719 of 2034) PASS: lldb-unit :: Process/minidump/./LLDBMinidumpTests/MinidumpParserTest.FindMemoryRangeWithFullMemoryMinidump (720 of 2034) PASS: lldb-api :: functionalities/data-formatter/type_summary_list_script/TestTypeSummaryListScript.py (721 of 2034) PASS: lldb-api :: python_api/watchpoint/watchlocation/TestTargetWatchAddress.py (722 of 2034) UNSUPPORTED: lldb-api :: lang/cpp/function-template-parameter-pack/TestFunctionTemplateParameterPack.py (723 of 2034) PASS: lldb-api :: lang/objc/self/TestObjCSelf.py (724 of 2034) PASS: lldb-shell :: ObjectFile/ELF/section-types.yaml (725 of 2034) PASS: lldb-unit :: Utility/./UtilityTests/RangeTest.SlideZero (726 of 2034) PASS: lldb-unit :: Process/minidump/./LLDBMinidumpTests/RegisterContextMinidump.ConvertMinidumpContext_x86_32 (727 of 2034) PASS: lldb-unit :: Symbol/./SymbolTests/TestClangASTImporter.ImportInvalidType (728 of 2034) PASS: lldb-api :: linux/builtin_trap/TestBuiltinTrap.py (729 of 2034) PASS: lldb-shell :: SymbolFile/DWARF/find-basic-namespace.cpp (730 of 2034) PASS: lldb-unit :: Utility/./UtilityTests/StreamTeeTest.Constructor2Streams (731 of 2034) PASS: lldb-api :: functionalities/breakpoint/breakpoint_options/TestBreakpointOptions.py (732 of 2034) PASS: lldb-api :: functionalities/data-formatter/cstring-utf8-summary/TestCstringUnicode.py (733 of 2034) PASS: lldb-unit :: Utility/./UtilityTests/DataExtractorTest.PeekData (734 of 2034) PASS: lldb-shell :: Minidump/disassemble-no-module.yaml (735 of 2034) PASS: lldb-unit :: Host/./HostTests/FileSystemTest.EmptyTest (736 of 2034) PASS: lldb-api :: commands/process/attach-resume/TestAttachResume.py (737 of 2034) PASS: lldb-unit :: Utility/./UtilityTests/UUIDTest.RelationalOperators (738 of 2034) PASS: lldb-unit :: UnwindAssembly/x86/./UnwindAssemblyx86Tests/Testx86AssemblyInspectionEngine.TestPopR15 (739 of 2034) PASS: lldb-unit :: DataFormatter/./LLDBFormatterTests/StringPrinterTests.SwiftUTF8 (740 of 2034) PASS: lldb-unit :: Utility/./UtilityTests/LogChannelEnabledTest.LogThread (741 of 2034) PASS: lldb-unit :: Expression/./ExpressionTests/DiagnosticManagerTest.FixedExpression (742 of 2034) PASS: lldb-unit :: UnwindAssembly/x86/./UnwindAssemblyx86Tests/Testx86AssemblyInspectionEngine.TestAddRSP (743 of 2034) PASS: lldb-unit :: Expression/./ExpressionTests/ClangHostTest.ComputeClangResourceDirectory (744 of 2034) PASS: lldb-api :: functionalities/archives/TestBSDArchives.py (745 of 2034) PASS: lldb-unit :: Expression/./ExpressionTests/DiagnosticManagerTest.AddDiagnostic (746 of 2034) PASS: lldb-api :: macosx/universal/TestUniversal.py (747 of 2034) PASS: lldb-unit :: Utility/./UtilityTests/UriParserTest.BracketedHostnameWithColon (748 of 2034) PASS: lldb-shell :: Settings/TestFrameFormatColor.test (749 of 2034) PASS: lldb-api :: commands/expression/import-std-module/forward_list-dbg-info-content/TestDbgInfoContentForwardListFromStdModule.py (750 of 2034) PASS: lldb-unit :: debugserver/./debugserverTests/RNBSocket.LoopBackConnectIPv4 (751 of 2034) PASS: lldb-api :: macosx/DBGSourcePathRemapping/TestDSYMSourcePathRemapping.py (752 of 2034) PASS: lldb-unit :: Utility/./UtilityTests/RangeDataVector.FindEntryIndexesThatContain (753 of 2034) PASS: lldb-unit :: Utility/./UtilityTests/OptionsWithRawTest.EmptyInput (754 of 2034) PASS: lldb-unit :: Utility/./UtilityTests/StringListTest.DefaultConstructor (755 of 2034) PASS: lldb-api :: commands/expression/import-std-module/deque-basic/TestDequeFromStdModule.py (756 of 2034) PASS: lldb-api :: lang/objcxx/hide-runtime-values/TestObjCXXHideRuntimeValues.py (757 of 2034) PASS: lldb-unit :: Utility/./UtilityTests/UriParserTest.SchemeHostSeparator2 (758 of 2034) PASS: lldb-shell :: Minidump/fb-dump.test (759 of 2034) PASS: lldb-unit :: Host/./HostTests/Host.WaitStatusFormat (760 of 2034) PASS: lldb-unit :: Platform/./LLDBPlatformTests/PlatformDarwinTest.FindComponentInPath (761 of 2034) UNSUPPORTED: lldb-api :: lang/cpp/static_members/TestCPPStaticMembers.py (762 of 2034) PASS: lldb-unit :: Utility/./UtilityTests/BinaryStreamTest.PutSLEB128ThreeBytes (763 of 2034) PASS: lldb-unit :: Utility/./UtilityTests/StringExtractorTest.GetNameColonValueNoColon (764 of 2034) PASS: lldb-unit :: Host/./HostTests/FileSystemTest.OpenErrno (765 of 2034) PASS: lldb-api :: commands/expression/namespace_local_var_same_name_cpp_and_c/TestNamespaceLocalVarSameNameCppAndC.py (766 of 2034) PASS: lldb-api :: commands/frame/select/TestFrameSelect.py (767 of 2034) UNSUPPORTED: lldb-shell :: Breakpoint/ppc64-localentry.test (768 of 2034) PASS: lldb-unit :: Utility/./UtilityTests/StructuredDataTest.StringDump (769 of 2034) PASS: lldb-api :: commands/command/delete/TestCommandDelete.py (770 of 2034) PASS: lldb-unit :: Host/./HostTests/SocketTest.TCPListen0GetPort (771 of 2034) PASS: lldb-api :: tools/lldb-vscode/console/TestVSCode_console.py (772 of 2034) PASS: lldb-shell :: Reproducer/TestDump.test (773 of 2034) PASS: lldb-unit :: Expression/./ExpressionTests/DWARFExpression.DW_OP_stack_value (774 of 2034) PASS: lldb-api :: functionalities/postmortem/minidump-new/TestMiniDumpNew.py (775 of 2034) UNSUPPORTED: lldb-api :: lang/cpp/printf/TestPrintf.py (776 of 2034) PASS: lldb-unit :: Target/./TargetTests/ExecutionContextTest.GetByteOrderTarget (777 of 2034) PASS: lldb-unit :: Utility/./UtilityTests/RangeTest.NotEqualInvalid (778 of 2034) PASS: lldb-unit :: Utility/./UtilityTests/StreamTeeTest.SetStreamAtIndexOutOfBounds (779 of 2034) PASS: lldb-unit :: Utility/./UtilityTests/ArgsTest.TestSingleArgWithQuotedSpace (780 of 2034) PASS: lldb-unit :: Utility/./UtilityTests/BinaryStreamTest.PutULEB128MaxValue (781 of 2034) PASS: lldb-unit :: Language/Highlighting/./HighlighterTests/HighlighterTest.DefaultHighlighterWithCursor (782 of 2034) PASS: lldb-unit :: Utility/./UtilityTests/UriParserTest.BracketedHostnamePort (783 of 2034) PASS: lldb-unit :: ScriptInterpreter/Python/./ScriptInterpreterPythonTests/PythonDataObjectsTest.TestGlobalNameResolutionNoDot (784 of 2034) PASS: lldb-api :: lang/objc/objc-dyn-sbtype/TestObjCDynamicSBType.py (785 of 2034) UNSUPPORTED: lldb-api :: functionalities/tsan/cpp_global_location/TestTsanCPPGlobalLocation.py (786 of 2034) PASS: lldb-unit :: Target/./TargetTests/MCBasedABI.MapRegisterName (787 of 2034) PASS: lldb-api :: commands/expression/expr-in-syscall/TestExpressionInSyscall.py (788 of 2034) PASS: lldb-unit :: Process/minidump/./LLDBMinidumpTests/MinidumpParserTest.MinidumpModuleOrder (789 of 2034) PASS: lldb-unit :: ScriptInterpreter/Python/./ScriptInterpreterPythonTests/PythonDataObjectsTest.TestExtractingUInt64ThroughStructuredData (790 of 2034) PASS: lldb-api :: api/listeners/TestListener.py (791 of 2034) PASS: lldb-unit :: Utility/./UtilityTests/StreamTest.PutRawBytesToLittleEndian (792 of 2034) PASS: lldb-api :: functionalities/tail_call_frames/cross_dso/TestCrossDSOTailCalls.py (793 of 2034) PASS: lldb-unit :: Process/gdb-remote/./ProcessGdbRemoteTests/GDBRemoteClientBaseTest.SendContinueDelegateStructuredDataReceipt (794 of 2034) PASS: lldb-unit :: Utility/./UtilityTests/UriParserTest.BadPort2 (795 of 2034) PASS: lldb-api :: python_api/value/linked_list/TestValueAPILinkedList.py (796 of 2034) UNSUPPORTED: lldb-api :: functionalities/asan/TestReportData.py (797 of 2034) PASS: lldb-unit :: Utility/./UtilityTests/RegularExpression.Valid (798 of 2034) PASS: lldb-shell :: ObjectFile/MachO/subsections.yaml (799 of 2034) PASS: lldb-unit :: Symbol/./SymbolTests/TestTypeSystemClang.TestGetTypeClassTypeOf (800 of 2034) PASS: lldb-api :: commands/target/stop-hooks/TestStopHooks.py (801 of 2034) PASS: lldb-api :: functionalities/data-formatter/data-formatter-enum-format/TestDataFormatterEnumFormat.py (802 of 2034) PASS: lldb-shell :: SymbolFile/NativePDB/ast-methods.cpp (803 of 2034) PASS: lldb-api :: lang/objc/foundation/TestConstStrings.py (804 of 2034) PASS: lldb-api :: functionalities/stats_api/TestStatisticsAPI.py (805 of 2034) PASS: lldb-api :: functionalities/thread_plan/TestThreadPlanCommands.py (806 of 2034) PASS: lldb-unit :: Utility/./UtilityTests/StringListTest.CopyListEmpty (807 of 2034) PASS: lldb-api :: types/TestLongTypesExpr.py (808 of 2034) PASS: lldb-unit :: UnwindAssembly/x86/./UnwindAssemblyx86Tests/Testx86AssemblyInspectionEngine.Test32BitOnlyInstruction (809 of 2034) PASS: lldb-api :: commands/breakpoint/command/list/TestBreakpointCommandList.py (810 of 2034) PASS: lldb-api :: lang/c/struct_types/TestStructTypes.py (811 of 2034) UNSUPPORTED: lldb-shell :: Breakpoint/case-insensitive.test (812 of 2034) PASS: lldb-api :: lang/objc/objc-ivar-offsets/TestObjCIvarOffsets.py (813 of 2034) PASS: lldb-unit :: Utility/./UtilityTests/StatusTest.ErrorConstructor (814 of 2034) PASS: lldb-shell :: Reproducer/TestDSYM.test (815 of 2034) PASS: lldb-unit :: Host/./HostTests/MainLoopTest.ReadObject (816 of 2034) PASS: lldb-api :: functionalities/data-formatter/parray/TestPrintArray.py (817 of 2034) PASS: lldb-api :: python_api/formatters/TestFormattersSBAPI.py (818 of 2034) PASS: lldb-unit :: Process/minidump/./LLDBMinidumpTests/MinidumpParserTest.GetThreadContext_x86_32_wow64 (819 of 2034) PASS: lldb-unit :: Utility/./UtilityTests/XcodeSDKTest.ParseTest (820 of 2034) PASS: lldb-api :: commands/expression/no-deadlock/TestExprDoesntBlock.py (821 of 2034) PASS: lldb-api :: functionalities/thread/backtrace_all/TestBacktraceAll.py (822 of 2034) PASS: lldb-shell :: Driver/TestPositionalArgs.test (823 of 2034) UNSUPPORTED: lldb-shell :: SymbolFile/NativePDB/ast-functions-msvc.cpp (824 of 2034) PASS: lldb-api :: lang/cpp/nested-class-other-compilation-unit/TestNestedClassWithParentInAnotherCU.py (825 of 2034) PASS: lldb-shell :: ObjectFile/Breakpad/discontiguous-sections.test (826 of 2034) PASS: lldb-unit :: SymbolFile/NativePDB/./SymbolFileNativePDBTests/PDBFPOProgramToDWARFExpressionTests.UnresolvedRegisterReference (827 of 2034) PASS: lldb-api :: lang/cpp/modules-import/TestCXXModulesImport.py (828 of 2034) PASS: lldb-unit :: Utility/./UtilityTests/StringExtractorTest.GetNameColonValueContainsColon (829 of 2034) PASS: lldb-unit :: Utility/./UtilityTests/StringExtractorTest.GetU32LittleEndian (830 of 2034) PASS: lldb-api :: lang/c/vla/TestVLA.py (831 of 2034) UNSUPPORTED: lldb-api :: tools/lldb-server/signal-filtering/TestGdbRemote_QPassSignals.py (832 of 2034) PASS: lldb-unit :: Core/./LLDBCoreTests/MangledTest.ResultForBlockInvocation (833 of 2034) PASS: lldb-unit :: debugserver/./debugserverTests/JSON.Parse (834 of 2034) PASS: lldb-api :: lang/objc/orderedset/TestOrderedSet.py (835 of 2034) PASS: lldb-unit :: Utility/./UtilityTests/OptionsWithRawTest.ArgsButNoLeadingDash (836 of 2034) UNSUPPORTED: lldb-api :: tools/intel-features/intel-pt/test/TestIntelPTSimpleBinary.py (837 of 2034) PASS: lldb-unit :: Process/minidump/./LLDBMinidumpTests/MinidumpParserTest.GetLinuxProcStatus (838 of 2034) PASS: lldb-unit :: Language/Highlighting/./HighlighterTests/HighlighterTest.Colons (839 of 2034) PASS: lldb-api :: lang/cpp/unique-types/TestUniqueTypes.py (840 of 2034) PASS: lldb-unit :: SymbolFile/NativePDB/./SymbolFileNativePDBTests/PDBFPOProgramToDWARFExpressionTests.InvalidOpBinary (841 of 2034) PASS: lldb-shell :: ObjectFile/ELF/duplicate-section.yaml (842 of 2034) PASS: lldb-shell :: Breakpoint/implicit_const_form_support.test (843 of 2034) XFAIL: lldb-shell :: SymbolFile/DWARF/find-type-in-function.cpp (844 of 2034) PASS: lldb-unit :: Process/gdb-remote/./ProcessGdbRemoteTests/GDBRemoteClientBaseTest.SendPacketAndReceiveResponseWithOutputSupport (845 of 2034) PASS: lldb-api :: functionalities/plugins/python_os_plugin/stepping_plugin_threads/TestOSPluginStepping.py (846 of 2034) XFAIL: lldb-shell :: Register/x86-mm-xmm-write.test (847 of 2034) PASS: lldb-api :: functionalities/breakpoint/breakpoint_command/TestBreakpointCommandsFromPython.py (848 of 2034) PASS: lldb-unit :: ScriptInterpreter/Python/./ScriptInterpreterPythonTests/PythonDataObjectsTest.TestPythonDictionaryToStructuredDictionary (849 of 2034) PASS: lldb-unit :: Target/./TargetTests/PathMappingListTest.RelativeTests (850 of 2034) PASS: lldb-unit :: Utility/./UtilityTests/FileSpecTest.FormatFileSpec (851 of 2034) PASS: lldb-unit :: Symbol/./SymbolTests/TestTypeSystemClang.TestGetEnumIntegerTypeInvalid (852 of 2034) PASS: lldb-api :: python_api/symbol-context/TestSymbolContext.py (853 of 2034) PASS: lldb-api :: lang/objc/objc-ivar-protocols/TestIvarProtocols.py (854 of 2034) UNSUPPORTED: lldb-shell :: SymbolFile/PDB/variables-locations.test (855 of 2034) PASS: lldb-unit :: Utility/./UtilityTests/StringListTest.AppendStringStdString (856 of 2034) PASS: lldb-api :: functionalities/data-formatter/data-formatter-objc/TestDataFormatterObjCNSContainer.py (857 of 2034) PASS: lldb-shell :: ExecControl/StopHook/stop-hook.test (858 of 2034) PASS: lldb-unit :: Utility/./UtilityTests/DataExtractorTest.GetCStrAtNullOffset (859 of 2034) UNSUPPORTED: lldb-api :: commands/register/register/intel_xtended_registers/TestMPXRegisters.py (860 of 2034) PASS: lldb-unit :: Utility/./UtilityTests/StringListTest.CopyList (861 of 2034) PASS: lldb-unit :: Utility/./UtilityTests/StreamTeeTest.SetStreamAtIndexOverwrite (862 of 2034) PASS: lldb-unit :: Utility/./UtilityTests/LogChannelTest.Enable (863 of 2034) PASS: lldb-shell :: SymbolFile/DWARF/DW_OP_piece-struct.s (864 of 2034) PASS: lldb-unit :: Utility/./UtilityTests/DataExtractorTest.GetULEB128_bit63 (865 of 2034) PASS: lldb-api :: commands/expression/rdar44436068/Test128BitsInteger.py (866 of 2034) PASS: lldb-unit :: Process/gdb-remote/./ProcessGdbRemoteTests/GDBRemoteCommunicationClientTest.GetModulesInfo_UUID20 (867 of 2034) PASS: lldb-unit :: Utility/./UtilityTests/ArgsTest.TestInsertArg (868 of 2034) PASS: lldb-unit :: ScriptInterpreter/Python/./ScriptInterpreterPythonTests/PythonDataObjectsTest.TestPythonIntegerToStructuredInteger (869 of 2034) PASS: lldb-shell :: Quit/TestQuitExitCode30.test (870 of 2034) PASS: lldb-api :: commands/add-dsym/uuid/TestAddDsymCommand.py (871 of 2034) PASS: lldb-shell :: ObjectFile/ELF/compressed-sections.yaml (872 of 2034) PASS: lldb-shell :: SymbolFile/NativePDB/function-types-builtins.cpp (873 of 2034) UNSUPPORTED: lldb-shell :: Register/x86-zmm-read.test (874 of 2034) PASS: lldb-api :: tools/lldb-vscode/launch/TestVSCode_launch.py (875 of 2034) PASS: lldb-shell :: SymbolFile/DWARF/inline-function-address.ll (876 of 2034) UNSUPPORTED: lldb-shell :: Register/x86-64-gp-write.test (877 of 2034) PASS: lldb-shell :: SymbolFile/DWARF/childless-compile-unit.s (878 of 2034) PASS: lldb-unit :: Symbol/./SymbolTests/TestTypeSystemClang.TestFunctionTemplateConstruction (879 of 2034) PASS: lldb-api :: lang/c/register_variables/TestRegisterVariables.py (880 of 2034) PASS: lldb-unit :: Utility/./UtilityTests/RegularExpression.Invalid (881 of 2034) PASS: lldb-unit :: Expression/./ExpressionTests/CppModuleConfigurationTest.MissingLibCpp (882 of 2034) PASS: lldb-api :: functionalities/backticks/TestBackticksWithoutATarget.py (883 of 2034) PASS: lldb-shell :: BuildScript/modes.test (884 of 2034) PASS: lldb-unit :: Utility/./UtilityTests/DataExtractorTest.GetCStrEmpty (885 of 2034) PASS: lldb-unit :: SymbolFile/NativePDB/./SymbolFileNativePDBTests/PDBFPOProgramToDWARFExpressionTests.DependencyChain (886 of 2034) PASS: lldb-unit :: Core/./LLDBCoreTests/SourceFileCache.FindSourceFileFound (887 of 2034) PASS: lldb-api :: lang/cpp/virtual-overload/TestVirtualOverload.py (888 of 2034) PASS: lldb-unit :: Utility/./UtilityTests/ProcessInstanceInfo.DumpTable (889 of 2034) PASS: lldb-api :: functionalities/thread/create_after_attach/TestCreateAfterAttach.py (890 of 2034) UNSUPPORTED: lldb-api :: functionalities/breakpoint/breakpoint_in_delayslot/TestAvoidBreakpointInDelaySlot.py (891 of 2034) PASS: lldb-unit :: Utility/./UtilityTests/BinaryStreamTest.PutULEB128ThreeBytes (892 of 2034) PASS: lldb-unit :: Language/Highlighting/./HighlighterTests/HighlighterTest.ClangTrailingBackslashWithWhitespace (893 of 2034) PASS: lldb-unit :: ScriptInterpreter/Python/./ScriptInterpreterPythonTests/PythonDataObjectsTest.TestPythonCallableCheck (894 of 2034) PASS: lldb-api :: functionalities/inferior-crashing/TestInferiorCrashingStep.py (895 of 2034) PASS: lldb-unit :: Utility/./UtilityTests/OptionsWithRawTest.EmptySuffixSingleWhitespace (896 of 2034) PASS: lldb-api :: lang/objc/objc-new-syntax/TestObjCNewSyntaxDictionary.py (897 of 2034) PASS: lldb-unit :: Utility/./UtilityTests/BinaryStreamTest.PutSLEB128MaxValue (898 of 2034) PASS: lldb-api :: commands/watchpoints/multiple_hits/TestMultipleHits.py (899 of 2034) UNSUPPORTED: lldb-api :: arm/breakpoint-it/TestBreakpointIt.py (900 of 2034) PASS: lldb-shell :: SymbolFile/DWARF/gnu-style-compression.cpp (901 of 2034) PASS: lldb-shell :: SymbolFile/DWARF/dwp.s (902 of 2034) PASS: lldb-api :: commands/process/launch/TestProcessLaunch.py (903 of 2034) PASS: lldb-shell :: BuildScript/compiler-full-path.test (904 of 2034) UNSUPPORTED: lldb-api :: functionalities/longjmp/TestLongjmp.py (905 of 2034) PASS: lldb-unit :: ObjectFile/Breakpad/./ObjectFileBreakpadTests/StackWinRecord.parse (906 of 2034) PASS: lldb-api :: functionalities/param_entry_vals/basic_entry_values/TestBasicEntryValues.py (907 of 2034) PASS: lldb-shell :: Commands/command-regex-unalias.test (908 of 2034) PASS: lldb-api :: commands/expression/argument_passing_restrictions/TestArgumentPassingRestrictions.py (909 of 2034) UNSUPPORTED: lldb-shell :: ObjectFile/ELF/minidebuginfo-set-and-hit-breakpoint.test (910 of 2034) PASS: lldb-api :: functionalities/data-formatter/data-formatter-advanced/TestDataFormatterAdv.py (911 of 2034) UNSUPPORTED: lldb-shell :: Register/x86-64-zmm-write.test (912 of 2034) PASS: lldb-unit :: Utility/./UtilityTests/ArgsTest.ReplaceArgumentAtIndexLonger (913 of 2034) PASS: lldb-shell :: Settings/TestFrameFormatMangling.test (914 of 2034) PASS: lldb-api :: lang/c/unions/TestUnionMembers.py (915 of 2034) PASS: lldb-unit :: Utility/./UtilityTests/ArchSpecTest.TestParseMachCPUDashSubtypeTripleSimple (916 of 2034) PASS: lldb-unit :: UnwindAssembly/x86/./UnwindAssemblyx86Tests/Testx86AssemblyInspectionEngine.TestPushRBX (917 of 2034) PASS: lldb-unit :: Language/Highlighting/./HighlighterTests/HighlighterTest.ClangCursorPosEndOfLine (918 of 2034) UNSUPPORTED: lldb-shell :: ScriptInterpreter/Lua/bindings.test (919 of 2034) PASS: lldb-api :: functionalities/thread/exit_during_step/TestExitDuringStep.py (920 of 2034) PASS: lldb-shell :: Settings/TestStopCommandSourceOnError.test (921 of 2034) PASS: lldb-api :: functionalities/thread/concurrent_events/TestConcurrentManyCrash.py (922 of 2034) PASS: lldb-api :: commands/expression/import-std-module/vector-bool/TestVectorBoolFromStdModule.py (923 of 2034) UNSUPPORTED: lldb-api :: functionalities/asan/TestMemoryHistory.py (924 of 2034) PASS: lldb-unit :: Utility/./UtilityTests/StringExtractorTest.DecodeHexU8_Underflow2 (925 of 2034) UNSUPPORTED: lldb-api :: functionalities/darwin_log/filter/exact_match/message/TestDarwinLogFilterMatchMessage.py (926 of 2034) PASS: lldb-unit :: Utility/./UtilityTests/StringExtractorTest.GetHexBytes_OddPair2 (927 of 2034) PASS: lldb-api :: driver/batch_mode/TestBatchMode.py (928 of 2034) PASS: lldb-unit :: Utility/./UtilityTests/OptionsWithRawTest.LeadingSpaceArgs (929 of 2034) PASS: lldb-api :: python_api/signals/TestSignalsAPI.py (930 of 2034) PASS: lldb-unit :: ScriptInterpreter/Python/./ScriptInterpreterPythonTests/PythonDataObjectsTest.TestPythonBytes (931 of 2034) PASS: lldb-shell :: SymbolFile/Breakpad/unwind-via-stack-win.test (932 of 2034) PASS: lldb-api :: functionalities/breakpoint/move_nearest/TestMoveNearest.py (933 of 2034) PASS: lldb-api :: lang/cpp/inlines/TestInlines.py (934 of 2034) PASS: lldb-api :: commands/watchpoints/step_over_watchpoint/TestStepOverWatchpoint.py (935 of 2034) PASS: lldb-unit :: Utility/./UtilityTests/ArgsTest.ReplaceArgumentAtIndexShort (936 of 2034) PASS: lldb-api :: lang/cpp/virtual-functions/TestCppVirtualFunctions.py (937 of 2034) UNSUPPORTED: lldb-api :: commands/gui/basic/TestGuiBasic.py (938 of 2034) PASS: lldb-shell :: Quit/TestQuitExitCodeHex0.test (939 of 2034) PASS: lldb-unit :: Process/minidump/./LLDBMinidumpTests/MinidumpParserTest.GetPid (940 of 2034) PASS: lldb-api :: functionalities/data-formatter/refpointer-recursion/TestDataFormatterRefPtrRecursion.py (941 of 2034) PASS: lldb-unit :: Language/CPlusPlus/./LanguageCPlusPlusTests/CPlusPlusLanguage.MethodNameParsing (942 of 2034) PASS: lldb-unit :: Process/gdb-remote/./ProcessGdbRemoteTests/GDBRemoteCommunicationClientTest.SaveRestoreRegistersNoSuffix (943 of 2034) PASS: lldb-api :: functionalities/recursion/TestValueObjectRecursion.py (944 of 2034) PASS: lldb-unit :: SymbolFile/DWARF/./SymbolFileDWARFTests/SymbolFileDWARFTests.TestAbbrevOrder1Start5 (945 of 2034) PASS: lldb-shell :: Breakpoint/split-dwarf5-debug-stroffsets.test (946 of 2034) PASS: lldb-unit :: Utility/./UtilityTests/CompletionRequest.Constructor (947 of 2034) PASS: lldb-api :: functionalities/postmortem/minidump/TestMiniDump.py (948 of 2034) PASS: lldb-unit :: Utility/./UtilityTests/CompletionRequest.DuplicateFilteringWithComments (949 of 2034) PASS: lldb-api :: functionalities/gdb_remote_client/TestNestedRegDefinitions.py (950 of 2034) PASS: lldb-unit :: Utility/./UtilityTests/StreamTest.AddressSuffix (951 of 2034) PASS: lldb-unit :: Utility/./UtilityTests/StringListTest.PopBack (952 of 2034) PASS: lldb-shell :: ObjectFile/ELF/build-id-case.yaml (953 of 2034) PASS: lldb-unit :: ObjectFile/PECOFF/./ObjectFilePECOFFTests/PECallFrameInfoTest.Basic_eh (954 of 2034) PASS: lldb-api :: functionalities/thread/thread_exit/TestThreadExit.py (955 of 2034) PASS: lldb-api :: lang/cpp/template-function/TestTemplateFunctions.py (956 of 2034) UNSUPPORTED: lldb-shell :: ScriptInterpreter/Lua/breakpoint_callback.test (957 of 2034) PASS: lldb-shell :: Driver/TestConvenienceVariables.test (958 of 2034) PASS: lldb-api :: tools/lldb-server/TestGdbRemoteExitCode.py (959 of 2034) PASS: lldb-api :: functionalities/gdb_remote_client/TestArmRegisterDefinition.py (960 of 2034) PASS: lldb-unit :: Host/./HostTests/FileSystemTest.MakeAbsolute (961 of 2034) PASS: lldb-unit :: SymbolFile/DWARF/./SymbolFileDWARFTests/SymbolFileDWARFTests.ParseArangesNonzeroSegmentSize (962 of 2034) PASS: lldb-api :: lang/objc/foundation/TestObjCMethodsNSError.py (963 of 2034) PASS: lldb-unit :: Platform/./LLDBPlatformTests/PlatformDarwinTest.FindXcodeContentsDirectoryInPath (964 of 2034) PASS: lldb-unit :: Utility/./UtilityTests/LogChannelEnabledTest.LLDB_LOG_ERROR (965 of 2034) PASS: lldb-unit :: Host/./HostTests/ProcessLaunchInfoTest.Constructor (966 of 2034) UNSUPPORTED: lldb-api :: api/multiple-debuggers/TestMultipleDebuggers.py (967 of 2034) PASS: lldb-unit :: Symbol/./SymbolTests/TestTypeSystemClang.TestBuiltinTypeForEncodingAndBitSize (968 of 2034) PASS: lldb-unit :: Utility/./UtilityTests/VMRange.Ordering (969 of 2034) PASS: lldb-unit :: Utility/./UtilityTests/ArgsTest.GetArgumentArrayRef (970 of 2034) PASS: lldb-unit :: Utility/./UtilityTests/SubsystemRAIITest.NormalSubsystem (971 of 2034) PASS: lldb-unit :: Utility/./UtilityTests/PassiveReplayTest.InstrumentedBarPtr (972 of 2034) PASS: lldb-shell :: Breakpoint/debug_rnglist_offset_pair.test (973 of 2034) UNSUPPORTED: lldb-shell :: SymbolFile/NativePDB/typedefs.cpp (974 of 2034) PASS: lldb-api :: lang/cpp/class-template-parameter-pack/TestClassTemplateParameterPack.py (975 of 2034) PASS: lldb-api :: commands/command/script/TestCommandScript.py (976 of 2034) PASS: lldb-unit :: Utility/./UtilityTests/OptionsWithRawTest.UnterminatedQuote (977 of 2034) PASS: lldb-unit :: Utility/./UtilityTests/StringListTest.JoinNonSpace (978 of 2034) PASS: lldb-unit :: DataFormatter/./LLDBFormatterTests/StringPrinterTests.CxxUTF8 (979 of 2034) PASS: lldb-unit :: Target/./TargetTests/ModuleCacheTest.GetAndPutStrangeHostname (980 of 2034) PASS: lldb-api :: functionalities/data-formatter/data-formatter-objc/TestDataFormatterObjCNSError.py (981 of 2034) PASS: lldb-api :: python_api/watchpoint/condition/TestWatchpointConditionAPI.py (982 of 2034) PASS: lldb-unit :: Utility/./UtilityTests/LogTest.LLDB_LOG_nullptr (983 of 2034) PASS: lldb-unit :: Symbol/./SymbolTests/TestTypeSystemClang.TestFunctionTemplateInRecordConstruction (984 of 2034) PASS: lldb-api :: functionalities/thread/concurrent_events/TestConcurrentSignalWatchBreak.py (985 of 2034) PASS: lldb-api :: functionalities/data-formatter/boolreference/TestFormattersBoolRefPtr.py (986 of 2034) PASS: lldb-api :: lang/objc/objc-checker/TestObjCCheckers.py (987 of 2034) PASS: lldb-api :: types/TestDoubleTypes.py (988 of 2034) PASS: lldb-shell :: SymbolFile/Breakpad/unwind-via-stack-cfi.test (989 of 2034) PASS: lldb-api :: lang/cpp/breakpoint_in_member_func_w_non_primitive_params/TestBreakpointInMemberFuncWNonPrimitiveParams.py (990 of 2034) PASS: lldb-unit :: Signals/./SignalsTests/UnixSignalsTest.Iteration (991 of 2034) PASS: lldb-unit :: Utility/./UtilityTests/StringListTest.LongestCommonPrefixNoPrefix (992 of 2034) PASS: lldb-api :: commands/expression/persistent_types/TestNestedPersistentTypes.py (993 of 2034) PASS: lldb-unit :: Utility/./UtilityTests/BinaryStreamTest.PutSLEB128OneByte (994 of 2034) PASS: lldb-api :: functionalities/memory-region/TestMemoryRegion.py (995 of 2034) PASS: lldb-api :: lang/objc/objc-struct-argument/TestObjCStructArgument.py (996 of 2034) PASS: lldb-shell :: ObjectFile/ELF/PT_LOAD-overlap-PT_INTERP.yaml (997 of 2034) PASS: lldb-unit :: Symbol/./SymbolTests/TestTypeSystemClang.TestGetTypeClassTypeOfExpr (998 of 2034) PASS: lldb-unit :: Utility/./UtilityTests/FileSpecTest.EqualDotsWindows (999 of 2034) PASS: lldb-shell :: SymbolFile/DWARF/DW_AT_low_pc-addrx.s (1000 of 2034) PASS: lldb-api :: commands/expression/import_builtin_fileid/TestImportBuiltinFileID.py (1001 of 2034) PASS: lldb-unit :: Utility/./UtilityTests/ListenerTest.GetEventImmediate (1002 of 2034) PASS: lldb-unit :: Process/gdb-remote/./ProcessGdbRemoteTests/GDBRemoteCommunicationServerTest.SendErrorResponse_ErrorNumber (1003 of 2034) UNSUPPORTED: lldb-api :: linux/thread/create_during_instruction_step/TestCreateDuringInstructionStep.py (1004 of 2034) PASS: lldb-unit :: Utility/./UtilityTests/BinaryStreamTest.PutULEB128FiveBytes (1005 of 2034) PASS: lldb-unit :: Editline/./EditlineTests/EditlineTestFixture.EditlineReceivesMultiLineText (1006 of 2034) PASS: lldb-api :: types/TestIntegerTypeExpr.py (1007 of 2034) PASS: lldb-api :: functionalities/breakpoint/dummy_target_breakpoints/TestBreakpointsWithNoTargets.py (1008 of 2034) PASS: lldb-api :: commands/expression/timeout/TestCallWithTimeout.py (1009 of 2034) PASS: lldb-unit :: Utility/./UtilityTests/RangeTest.LessThan (1010 of 2034) PASS: lldb-shell :: SymbolFile/DWARF/module-ownership.mm (1011 of 2034) PASS: lldb-unit :: ScriptInterpreter/Python/./ScriptInterpreterPythonTests/PythonDataObjectsTest.TestRun (1012 of 2034) PASS: lldb-api :: functionalities/data-formatter/data-formatter-objc/TestDataFormatterObjNSException.py (1013 of 2034) PASS: lldb-unit :: Utility/./UtilityTests/ProcessInstanceInfoList.Yaml (1014 of 2034) PASS: lldb-unit :: Utility/./UtilityTests/FileSpecTest.Equal (1015 of 2034) PASS: lldb-shell :: Reproducer/TestPythonImport.test (1016 of 2034) PASS: lldb-unit :: Utility/./UtilityTests/ScalarTest.Equality (1017 of 2034) PASS: lldb-api :: functionalities/inline-stepping/TestInlineStepping.py (1018 of 2034) PASS: lldb-api :: commands/expression/xvalue/TestXValuePrinting.py (1019 of 2034) PASS: lldb-unit :: ScriptInterpreter/Python/./ScriptInterpreterPythonTests/PythonDataObjectsTest.TestPythonBoolean (1020 of 2034) PASS: lldb-unit :: Interpreter/./InterpreterTests/CompletionTest.DirCompletionUsername (1021 of 2034) PASS: lldb-api :: functionalities/thread/concurrent_events/TestConcurrentCrashWithBreak.py (1022 of 2034) PASS: lldb-api :: commands/register/register/register_command/TestRegisters.py (1023 of 2034) PASS: lldb-api :: functionalities/tail_call_frames/ambiguous_tail_call_seq2/TestAmbiguousTailCallSeq2.py (1024 of 2034) PASS: lldb-api :: commands/expression/ignore-artificial-constructors/TestIgnoreArtificialConstructors.py (1025 of 2034) PASS: lldb-unit :: Symbol/./SymbolTests/LineEntryTest.GetSameLineContiguousAddressRangeOneInline (1026 of 2034) PASS: lldb-api :: lang/cpp/const_this/TestConstThis.py (1027 of 2034) PASS: lldb-shell :: Minidump/Windows/Sigsegv/sigsegv.test (1028 of 2034) PASS: lldb-unit :: DataFormatter/./LLDBFormatterTests/FormatManagerTests.CompatibleLangs (1029 of 2034) PASS: lldb-unit :: Utility/./UtilityTests/StateTest.Formatv (1030 of 2034) PASS: lldb-api :: lang/objc/foundation/TestObjectDescriptionAPI.py (1031 of 2034) PASS: lldb-api :: commands/target/create-no-such-arch/TestNoSuchArch.py (1032 of 2034) PASS: lldb-shell :: SymbolFile/DWARF/debug_ranges_and_rnglists.test (1033 of 2034) PASS: lldb-api :: lang/cpp/stl/TestSTL.py (1034 of 2034) PASS: lldb-shell :: SymbolFile/DWARF/debug-types-line-tables.s (1035 of 2034) UNSUPPORTED: lldb-api :: lang/objc/bitfield_ivars/TestBitfieldIvars.py (1036 of 2034) PASS: lldb-shell :: Commands/command-source.test (1037 of 2034) PASS: lldb-api :: functionalities/data-formatter/data-formatter-stl/libcxx/atomic/TestLibCxxAtomic.py (1038 of 2034) PASS: lldb-api :: functionalities/thread/backtrace_limit/TestBacktraceLimit.py (1039 of 2034) PASS: lldb-unit :: Platform/./LLDBPlatformTests/PlatformDarwinTest.TestParseVersionBuildDir (1040 of 2034) PASS: lldb-shell :: SymbolFile/DWARF/dwo-type-in-main-file.s (1041 of 2034) PASS: lldb-api :: lang/cpp/accelerator-table/TestCPPAccelerator.py (1042 of 2034) PASS: lldb-api :: tools/lldb-server/TestGdbRemoteKill.py (1043 of 2034) PASS: lldb-api :: lang/objc/unicode-string/TestUnicodeString.py (1044 of 2034) PASS: lldb-unit :: Utility/./UtilityTests/StringListTest.ShiftCString (1045 of 2034) PASS: lldb-unit :: Symbol/./SymbolTests/LineEntryTest.GetSameLineContiguousAddressRangeNestedInline (1046 of 2034) PASS: lldb-api :: commands/expression/import-std-module/deque-dbg-info-content/TestDbgInfoContentDequeFromStdModule.py (1047 of 2034) PASS: lldb-api :: functionalities/jitloader_gdb/TestJITLoaderGDB.py (1048 of 2034) PASS: lldb-shell :: ObjectFile/Breakpad/breakpad-identification.test (1049 of 2034) PASS: lldb-shell :: Settings/TestModuleCacheSanity.test (1050 of 2034) PASS: lldb-shell :: ObjectFile/ELF/minidebuginfo-corrupt-xz.yaml (1051 of 2034) PASS: lldb-unit :: Symbol/./SymbolTests/Type.CompilerContextPattern (1052 of 2034) PASS: lldb-api :: lang/c/shared_lib_stripped_symbols/TestSharedLibStrippedSymbols.py (1053 of 2034) PASS: lldb-unit :: Utility/./UtilityTests/RegularExpression.Match (1054 of 2034) PASS: lldb-api :: lang/cpp/lambdas/TestLambdas.py (1055 of 2034) PASS: lldb-unit :: Language/Highlighting/./HighlighterTests/HighlighterTest.HighlighterSelectionPath (1056 of 2034) PASS: lldb-unit :: Utility/./UtilityTests/XcodeSDKTest.MergeTest (1057 of 2034) PASS: lldb-api :: commands/log/basic/TestLogging.py (1058 of 2034) PASS: lldb-api :: commands/expression/radar_9531204/TestPrintfAfterUp.py (1059 of 2034) PASS: lldb-unit :: Host/./HostTests/FileSystemTest.GetByteSize (1060 of 2034) PASS: lldb-unit :: Utility/./UtilityTests/RangeTest.ContainsEndInclusive (1061 of 2034) UNSUPPORTED: lldb-shell :: Register/x86-64-xmm16-read.test (1062 of 2034) PASS: lldb-unit :: UnwindAssembly/x86/./UnwindAssemblyx86Tests/Testx86AssemblyInspectionEngine.TestPushESI (1063 of 2034) PASS: lldb-api :: commands/expression/import-std-module/vector/TestVectorFromStdModule.py (1064 of 2034) PASS: lldb-unit :: ScriptInterpreter/Python/./ScriptInterpreterPythonTests/PythonDataObjectsTest.TestPythonListValueEquality (1065 of 2034) UNSUPPORTED: lldb-shell :: SymbolFile/PDB/udt-layout.test (1066 of 2034) PASS: lldb-unit :: Utility/./UtilityTests/StreamTest.AddressPrefixAndSuffix (1067 of 2034) PASS: lldb-unit :: Utility/./UtilityTests/StringExtractorTest.GetU64BigEndian (1068 of 2034) PASS: lldb-unit :: Utility/./UtilityTests/EventTest.DumpEventDataBytes (1069 of 2034) PASS: lldb-unit :: Language/Highlighting/./HighlighterTests/HighlighterTest.ClangBraces (1070 of 2034) PASS: lldb-api :: commands/expression/inline-namespace/TestInlineNamespace.py (1071 of 2034) PASS: lldb-api :: functionalities/data-formatter/data-formatter-stl/libcxx/vector/TestDataFormatterLibcxxVector.py (1072 of 2034) PASS: lldb-unit :: Utility/./UtilityTests/StreamTeeTest.Constructor1Stream (1073 of 2034) UNSUPPORTED: lldb-api :: iohandler/resize/TestIOHandlerResize.py (1074 of 2034) PASS: lldb-api :: lang/cpp/operator-overload/TestOperatorOverload.py (1075 of 2034) PASS: lldb-unit :: ObjectFile/Breakpad/./ObjectFileBreakpadTests/PublicRecord.parse (1076 of 2034) PASS: lldb-api :: functionalities/load_unload/TestLoadUnload.py (1077 of 2034) PASS: lldb-unit :: UnwindAssembly/x86/./UnwindAssemblyx86Tests/Testx86AssemblyInspectionEngine.Test32bitFramelessBigStackFrame (1078 of 2034) PASS: lldb-unit :: Utility/./UtilityTests/BinaryStreamTest.PutSLEB128SixBytes (1079 of 2034) PASS: lldb-api :: lang/c/step-target/TestStepTarget.py (1080 of 2034) PASS: lldb-api :: functionalities/data-formatter/data-formatter-stl/libcxx/bitset/TestDataFormatterLibcxxBitset.py (1081 of 2034) PASS: lldb-api :: lang/cpp/exceptions/TestCPPExceptionBreakpoints.py (1082 of 2034) PASS: lldb-unit :: Editline/./EditlineTests/EditlineTestFixture.EditlineReceivesSingleLineText (1083 of 2034) PASS: lldb-unit :: Utility/./UtilityTests/StreamTest.AddressRange (1084 of 2034) PASS: lldb-unit :: Utility/./UtilityTests/ArgsTest.StringListConstructor (1085 of 2034) UNSUPPORTED: lldb-api :: terminal/TestEditline.py (1086 of 2034) PASS: lldb-unit :: Symbol/./SymbolTests/Type.GetTypeScopeAndBasename (1087 of 2034) PASS: lldb-shell :: Reproducer/Functionalities/TestStepping.test (1088 of 2034) PASS: lldb-api :: functionalities/thread/concurrent_events/TestConcurrentDelaySignalBreak.py (1089 of 2034) PASS: lldb-shell :: Register/x86-64-ymm-read.test (1090 of 2034) PASS: lldb-api :: functionalities/breakpoint/step_over_breakpoint/TestStepOverBreakpoint.py (1091 of 2034) PASS: lldb-shell :: Recognizer/assert.test (1092 of 2034) PASS: lldb-unit :: Utility/./UtilityTests/StreamTeeTest.Assignment (1093 of 2034) PASS: lldb-unit :: Utility/./UtilityTests/XcodeSDKTest.GetCanonicalNameAndConstruct (1094 of 2034) PASS: lldb-unit :: Host/./HostTests/File.GetStreamFromDescriptor (1095 of 2034) PASS: lldb-api :: macosx/queues/TestQueues.py (1096 of 2034) PASS: lldb-shell :: Minidump/memory-region-from-module.yaml (1097 of 2034) PASS: lldb-unit :: Host/./HostTests/SocketTest.TCPGetAddress (1098 of 2034) PASS: lldb-api :: python_api/module_section/TestModuleAndSection.py (1099 of 2034) PASS: lldb-unit :: Symbol/./SymbolTests/TestClangASTImporter.CanImportInvalidType (1100 of 2034) PASS: lldb-api :: python_api/lldbutil/iter/TestLLDBIterator.py (1101 of 2034) PASS: lldb-api :: python_api/sblaunchinfo/TestSBLaunchInfo.py (1102 of 2034) PASS: lldb-api :: functionalities/data-formatter/data-formatter-named-summaries/TestDataFormatterNamedSummaries.py (1103 of 2034) PASS: lldb-shell :: ObjectFile/Breakpad/sections.test (1104 of 2034) PASS: lldb-unit :: Utility/./UtilityTests/StreamTest.AddressPrefix (1105 of 2034) PASS: lldb-unit :: Expression/./ExpressionTests/CppModuleConfigurationTest.LibCppV2 (1106 of 2034) PASS: lldb-unit :: Utility/./UtilityTests/StringExtractorTest.InitMisc (1107 of 2034) UNSUPPORTED: lldb-shell :: SymbolFile/PDB/compilands.test (1108 of 2034) PASS: lldb-api :: lang/objc/modules-incomplete/TestIncompleteModules.py (1109 of 2034) PASS: lldb-api :: functionalities/signal/TestSendSignal.py (1110 of 2034) UNSUPPORTED: lldb-api :: benchmarks/continue/TestBenchmarkContinue.py (1111 of 2034) PASS: lldb-unit :: ObjectFile/ELF/./ObjectFileELFTests/ObjectFileELFTest.GetModuleSpecifications_EarlySectionHeaders (1112 of 2034) PASS: lldb-unit :: Utility/./UtilityTests/Flags.Reset (1113 of 2034) PASS: lldb-api :: functionalities/gdb_remote_client/TestGDBRemoteClient.py (1114 of 2034) PASS: lldb-api :: functionalities/thread/concurrent_events/TestConcurrentBreakpointsDelayedBreakpointOneWatchpoint.py (1115 of 2034) UNSUPPORTED: lldb-shell :: BuildScript/toolchain-msvc.test (1116 of 2034) PASS: lldb-api :: tools/lldb-server/commandline/TestStubReverseConnect.py (1117 of 2034) PASS: lldb-unit :: ScriptInterpreter/Python/./ScriptInterpreterPythonTests/PythonDataObjectsTest.TestPythonTupleInitializerList2 (1118 of 2034) PASS: lldb-unit :: Utility/./UtilityTests/RecordReplayTest.InstrumentedFoo (1119 of 2034) PASS: lldb-api :: lang/c/const_variables/TestConstVariables.py (1120 of 2034) PASS: lldb-api :: python_api/watchpoint/TestWatchpointIgnoreCount.py (1121 of 2034) PASS: lldb-shell :: Reproducer/TestFileRepro.test (1122 of 2034) PASS: lldb-unit :: Utility/./UtilityTests/SharedCluster.ClusterManager (1123 of 2034) PASS: lldb-unit :: UnwindAssembly/x86/./UnwindAssemblyx86Tests/Testx86AssemblyInspectionEngine.Test32bitFramelessSmallStackFrame (1124 of 2034) PASS: lldb-unit :: ScriptInterpreter/Python/./ScriptInterpreterPythonTests/PythonDataObjectsTest.TestPythonTupleToStructuredList (1125 of 2034) PASS: lldb-api :: lang/objc/objc-foundation-dictionary-empty/TestNSDictionary0.py (1126 of 2034) PASS: lldb-unit :: Symbol/./SymbolTests/PostfixExpression.ToDWARF (1127 of 2034) PASS: lldb-unit :: Utility/./UtilityTests/StreamTest.AddressRangeEmptyRange (1128 of 2034) PASS: lldb-unit :: Utility/./UtilityTests/RangeTest.ContainsEndInclusiveInvalid (1129 of 2034) PASS: lldb-api :: functionalities/data-formatter/data-formatter-objc/TestDataFormatterObjCNSURL.py (1130 of 2034) PASS: lldb-api :: functionalities/data-formatter/data-formatter-objc/TestDataFormatterObjCPlain.py (1131 of 2034) PASS: lldb-api :: python_api/watchpoint/watchlocation/TestSetWatchlocation.py (1132 of 2034) PASS: lldb-unit :: Utility/./UtilityTests/StringExtractorTest.GetHexBytesAvail_FullString (1133 of 2034) PASS: lldb-shell :: Commands/command-disassemble-process.yaml (1134 of 2034) PASS: lldb-api :: functionalities/data-formatter/data-formatter-stl/libcxx/function/TestLibCxxFunction.py (1135 of 2034) PASS: lldb-unit :: ScriptInterpreter/Python/./ScriptInterpreterPythonTests/PythonDataObjectsTest.TestPythonDictionaryValueEquality (1136 of 2034) UNSUPPORTED: lldb-shell :: Minidump/Windows/arm-fp-unwind.test (1137 of 2034) PASS: lldb-api :: functionalities/data-formatter/data-formatter-objc/TestDataFormatterObjCNSDate.py (1138 of 2034) PASS: lldb-unit :: Interpreter/./InterpreterTests/CompletionTest.FileCompletionAbsolute (1139 of 2034) PASS: lldb-api :: functionalities/data-formatter/data-formatter-objc/nsindexpath/TestDataFormatterNSIndexPath.py (1140 of 2034) PASS: lldb-unit :: Process/gdb-remote/./ProcessGdbRemoteTests/GDBRemoteCommunicationClientTest.ReadRegister (1141 of 2034) PASS: lldb-unit :: Utility/./UtilityTests/LogChannelEnabledTest.log_options (1142 of 2034) PASS: lldb-shell :: SymbolFile/DWARF/DW_AT_loclists_base.s (1143 of 2034) PASS: lldb-unit :: UnwindAssembly/x86/./UnwindAssemblyx86Tests/Testx86AssemblyInspectionEngine.TestPopEDI (1144 of 2034) PASS: lldb-shell :: SymbolFile/DWARF/dwp-separate-debug-file.cpp (1145 of 2034) PASS: lldb-api :: types/TestCharType.py (1146 of 2034) PASS: lldb-unit :: SymbolFile/DWARF/./SymbolFileDWARFTests/SymbolFileDWARFTests.TestAbbrevValidAttrNullForm (1147 of 2034) PASS: lldb-api :: lang/cpp/class_types/TestClassTypesDisassembly.py (1148 of 2034) PASS: lldb-shell :: SymbolFile/DWARF/find-method.cpp (1149 of 2034) PASS: lldb-unit :: Language/Highlighting/./HighlighterTests/HighlighterTest.ClangUnterminatedString (1150 of 2034) PASS: lldb-api :: lang/cpp/gmodules-templates/TestGModules.py (1151 of 2034) PASS: lldb-unit :: Utility/./UtilityTests/DataExtractorTest.UncommonAddressSize (1152 of 2034) PASS: lldb-api :: terminal/TestSTTYBeforeAndAfter.py (1153 of 2034) PASS: lldb-unit :: Utility/./UtilityTests/PassiveReplayTest.InstrumentedFooInvalid (1154 of 2034) PASS: lldb-unit :: Utility/./UtilityTests/CompletionRequest.TryCompleteCurrentArgBad (1155 of 2034) UNSUPPORTED: lldb-api :: functionalities/tsan/thread_numbers/TestTsanThreadNumbers.py (1156 of 2034) PASS: lldb-unit :: Symbol/./SymbolTests/TestTypeSystemClang.TestNotDeletingUserCopyCstrDueToMoveCStr (1157 of 2034) PASS: lldb-api :: lang/c/blocks/TestBlocks.py (1158 of 2034) PASS: lldb-api :: functionalities/breakpoint/breakpoint_command/TestBreakpointCommand.py (1159 of 2034) PASS: lldb-unit :: ObjectFile/Breakpad/./ObjectFileBreakpadTests/LineRecord.parse (1160 of 2034) PASS: lldb-unit :: UnwindAssembly/x86/./UnwindAssemblyx86Tests/Testx86AssemblyInspectionEngine.TestPushEBX (1161 of 2034) PASS: lldb-api :: commands/log/invalid-args/TestInvalidArgsLog.py (1162 of 2034) PASS: lldb-unit :: Utility/./UtilityTests/UUIDTest.SetFromStringRef (1163 of 2034) PASS: lldb-api :: functionalities/target-new-solib-notifications/TestModuleLoadedNotifys.py (1164 of 2034) PASS: lldb-shell :: Quit/TestQuitExitCodeNonInt.test (1165 of 2034) PASS: lldb-shell :: Quit/TestQuitExitCodeHexA.test (1166 of 2034) PASS: lldb-api :: lang/objc/objc-ivar-stripped/TestObjCIvarStripped.py (1167 of 2034) PASS: lldb-unit :: Utility/./UtilityTests/DataExtractorTest.GetMaxU64_unchecked (1168 of 2034) PASS: lldb-shell :: Driver/LocalLLDBInit.test (1169 of 2034) PASS: lldb-unit :: Utility/./UtilityTests/StringListTest.LongestCommonPrefixEmpty (1170 of 2034) PASS: lldb-unit :: Host/./HostTests/NativeProcessProtocolTest.ReadMemoryWithoutTrap (1171 of 2034) PASS: lldb-unit :: Utility/./UtilityTests/BinaryStreamTest.PutSLEB128NineBytes (1172 of 2034) PASS: lldb-unit :: Utility/./UtilityTests/VMRange.SetEndAddress (1173 of 2034) PASS: lldb-unit :: Process/gdb-remote/./ProcessGdbRemoteTests/GDBRemoteCommunicationClientTest.SyncThreadState (1174 of 2034) PASS: lldb-shell :: SymbolFile/DWARF/static_scope.s (1175 of 2034) PASS: lldb-unit :: Language/Highlighting/./HighlighterTests/HighlighterTest.ClangPPDirectives (1176 of 2034) PASS: lldb-api :: python_api/class_members/TestSBTypeClassMembers.py (1177 of 2034) PASS: lldb-shell :: SymbolFile/DWARF/debug-types-missing-signature.test (1178 of 2034) PASS: lldb-api :: functionalities/process_crash_info/TestProcessCrashInfo.py (1179 of 2034) PASS: lldb-api :: commands/expression/persistent_types/TestPersistentTypes.py (1180 of 2034) PASS: lldb-unit :: Utility/./UtilityTests/AnsiTerminal.Basic (1181 of 2034) PASS: lldb-unit :: debugserver/./debugserverTests/RNBSocket.AnyListen (1182 of 2034) PASS: lldb-api :: commands/watchpoints/watchpoint_commands/TestWatchpointCommands.py (1183 of 2034) PASS: lldb-shell :: ObjectFile/ELF/PT_LOAD-empty.yaml (1184 of 2034) UNSUPPORTED: lldb-api :: iohandler/unicode/TestUnicode.py (1185 of 2034) PASS: lldb-api :: api/multithreaded/TestMultithreaded.py (1186 of 2034) PASS: lldb-unit :: UnwindAssembly/x86/./UnwindAssemblyx86Tests/Testx86AssemblyInspectionEngine.TestPushR14 (1187 of 2034) UNSUPPORTED: lldb-api :: commands/expression/macros/TestMacros.py (1188 of 2034) PASS: lldb-unit :: Utility/./UtilityTests/ScalarTest.GetValue (1189 of 2034) UNSUPPORTED: lldb-api :: macosx/macabi/TestMacABImacOSFramework.py (1190 of 2034) PASS: lldb-unit :: Utility/./UtilityTests/StreamTest.PutHex8 (1191 of 2034) PASS: lldb-api :: functionalities/gdb_remote_client/TestPlatformClient.py (1192 of 2034) PASS: lldb-api :: macosx/dyld-trie-symbols/TestDyldTrieSymbols.py (1193 of 2034) PASS: lldb-unit :: Process/gdb-remote/./ProcessGdbRemoteTests/GDBRemoteCommunicationClientTest.GetModulesInfoInvalidResponse (1194 of 2034) PASS: lldb-unit :: Utility/./UtilityTests/StringListTest.AppendList (1195 of 2034) PASS: lldb-api :: python_api/value_var_update/TestValueVarUpdate.py (1196 of 2034) PASS: lldb-unit :: Utility/./UtilityTests/OptionsWithRawTest.QuotedSuffix (1197 of 2034) PASS: lldb-unit :: Utility/./UtilityTests/BinaryStreamTest.PutSLEB128FiveBytes (1198 of 2034) PASS: lldb-api :: lang/cpp/constructors/TestCppConstructors.py (1199 of 2034) PASS: lldb-unit :: Target/./TargetTests/MemoryRegionInfoTest.Formatv (1200 of 2034) PASS: lldb-api :: functionalities/data-formatter/data-formatter-stl/libcxx/string/TestDataFormatterLibcxxString.py (1201 of 2034) PASS: lldb-api :: lang/c/enum_types/TestEnumTypes.py (1202 of 2034) PASS: lldb-api :: types/TestLongTypes.py (1203 of 2034) PASS: lldb-unit :: Utility/./UtilityTests/ArgsTest.AppendArguments (1204 of 2034) PASS: lldb-shell :: SymbolFile/DWARF/find-basic-type.cpp (1205 of 2034) PASS: lldb-api :: python_api/sbstructureddata/TestStructuredDataAPI.py (1206 of 2034) PASS: lldb-api :: macosx/profile_vrs_detach/TestDetachVrsProfile.py (1207 of 2034) PASS: lldb-shell :: ObjectFile/MachO/lc_build_version_notools.yaml (1208 of 2034) UNSUPPORTED: lldb-api :: commands/expression/call-restarts/TestCallThatRestarts.py (1209 of 2034) PASS: lldb-unit :: SymbolFile/NativePDB/./SymbolFileNativePDBTests/PDBFPOProgramToDWARFExpressionTests.InvalidAssignmentSingle (1210 of 2034) PASS: lldb-unit :: Utility/./UtilityTests/ArgsTest.GetQuotedCommandString (1211 of 2034) PASS: lldb-shell :: Minidump/breakpad-symbols.test (1212 of 2034) PASS: lldb-unit :: ObjectFile/Breakpad/./ObjectFileBreakpadTests/FuncRecord.parse (1213 of 2034) PASS: lldb-shell :: SymbolFile/DWARF/find-basic-variable.cpp (1214 of 2034) PASS: lldb-shell :: SymbolFile/NativePDB/bitfields.cpp (1215 of 2034) PASS: lldb-unit :: Expression/./ExpressionTests/CppModuleConfigurationTest.AmbiguousLibCpp (1216 of 2034) PASS: lldb-unit :: Process/gdb-remote/./ProcessGdbRemoteTests/GDBRemoteCommunicationServerTest.SendErrorResponse_UnimplementedError (1217 of 2034) UNSUPPORTED: lldb-shell :: ScriptInterpreter/Lua/convenience_variables.test (1218 of 2034) PASS: lldb-api :: commands/expression/diagnostics/TestExprDiagnostics.py (1219 of 2034) PASS: lldb-api :: python_api/lldbutil/iter/TestRegistersIterator.py (1220 of 2034) PASS: lldb-unit :: Utility/./UtilityTests/StringExtractorTest.DecodeHexU8_Extra (1221 of 2034) PASS: lldb-shell :: ObjectFile/ELF/short-build-id.yaml (1222 of 2034) PASS: lldb-api :: functionalities/thread/concurrent_events/TestConcurrentWatchBreakDelay.py (1223 of 2034) PASS: lldb-unit :: Utility/./UtilityTests/StringListTest.JoinThree (1224 of 2034) PASS: lldb-api :: functionalities/set-data/TestSetData.py (1225 of 2034) UNSUPPORTED: lldb-shell :: Register/x86-64-ymm16-read.test (1226 of 2034) PASS: lldb-api :: functionalities/breakpoint/auto_continue/TestBreakpointAutoContinue.py (1227 of 2034) PASS: lldb-api :: functionalities/data-formatter/data-formatter-caching/TestDataFormatterCaching.py (1228 of 2034) PASS: lldb-api :: functionalities/breakpoint/breakpoint_by_line_and_column/TestBreakpointByLineAndColumn.py (1229 of 2034) PASS: lldb-unit :: Language/Highlighting/./HighlighterTests/HighlighterTest.ClangCursorPosBeforeOtherToken (1230 of 2034) PASS: lldb-unit :: Process/gdb-remote/./ProcessGdbRemoteTests/GDBRemoteClientBaseTest.SendContinueAndAsyncPacket (1231 of 2034) PASS: lldb-shell :: SymbolFile/DWARF/DW_TAG_basic_type_DW_ATE_UTF_nonC.ll (1232 of 2034) PASS: lldb-unit :: UnwindAssembly/x86/./UnwindAssemblyx86Tests/Testx86AssemblyInspectionEngine.TestPopRBP (1233 of 2034) PASS: lldb-unit :: Utility/./UtilityTests/NameMatchesTest.RegularExpression (1234 of 2034) PASS: lldb-api :: lang/mixed/TestMixedLanguages.py (1235 of 2034) PASS: lldb-unit :: UnwindAssembly/x86/./UnwindAssemblyx86Tests/Testx86AssemblyInspectionEngine.TestSpillRegToStackViaMOVi386 (1236 of 2034) PASS: lldb-shell :: Minidump/dump-all.test (1237 of 2034) PASS: lldb-unit :: Utility/./UtilityTests/StringListTest.LongestCommonPrefixDuplicateElement (1238 of 2034) PASS: lldb-api :: lang/cpp/llvm-style/TestLLVMStyle.py (1239 of 2034) UNSUPPORTED: lldb-api :: functionalities/darwin_log/filter/regex/category/TestDarwinLogFilterRegexCategory.py (1240 of 2034) PASS: lldb-api :: python_api/function_symbol/TestSymbolAPI.py (1241 of 2034) UNSUPPORTED: lldb-shell :: Register/x86-64-zmm-read.test (1242 of 2034) PASS: lldb-api :: functionalities/testid/TestTestId.py (1243 of 2034) PASS: lldb-unit :: Utility/./UtilityTests/StreamTest.QuotedCString (1244 of 2034) PASS: lldb-unit :: Utility/./UtilityTests/BroadcasterTest.EventTypeHasListeners (1245 of 2034) PASS: lldb-unit :: Utility/./UtilityTests/AnsiTerminal.AtStart (1246 of 2034) UNSUPPORTED: lldb-shell :: SymbolFile/target-symbols-add-unwind.test (1247 of 2034) PASS: lldb-unit :: Target/./TargetTests/ModuleCacheTest.GetAndPut (1248 of 2034) PASS: lldb-api :: functionalities/data-formatter/data-formatter-synth/TestDataFormatterSynth.py (1249 of 2034) UNSUPPORTED: lldb-api :: lang/c/typedef/Testtypedef.py (1250 of 2034) PASS: lldb-api :: functionalities/thread/concurrent_events/TestConcurrentTwoBreakpointsOneWatchpoint.py (1251 of 2034) PASS: lldb-api :: commands/frame/diagnose/virtual-method-call/TestDiagnoseDereferenceVirtualMethodCall.py (1252 of 2034) PASS: lldb-unit :: Utility/./UtilityTests/BinaryStreamTest.PutSLEB128One (1253 of 2034) XFAIL: lldb-shell :: Register/x86-64-ymm-write.test (1254 of 2034) PASS: lldb-api :: functionalities/multidebugger_commands/TestMultipleDebuggersCommands.py (1255 of 2034) PASS: lldb-api :: lang/cpp/covariant-return-types/TestCovariantReturnTypes.py (1256 of 2034) UNSUPPORTED: lldb-shell :: SymbolFile/Breakpad/stack-cfi-arm.yaml (1257 of 2034) PASS: lldb-unit :: Utility/./UtilityTests/StringExtractorTest.DecodeHexU8_Exact (1258 of 2034) PASS: lldb-api :: functionalities/data-formatter/data-formatter-stl/libstdcpp/unique_ptr/invalid/TestDataFormatterInvalidStdUniquePtr.py (1259 of 2034) PASS: lldb-api :: lang/cpp/gmodules/TestWithModuleDebugging.py (1260 of 2034) PASS: lldb-api :: functionalities/thread/concurrent_events/TestConcurrentTwoWatchpointsOneDelayBreakpoint.py (1261 of 2034) PASS: lldb-api :: api/command-return-object/TestSBCommandReturnObject.py (1262 of 2034) PASS: lldb-unit :: Symbol/./SymbolTests/TestTypeSystemClang.TestIsClangType (1263 of 2034) PASS: lldb-unit :: Utility/./UtilityTests/SerializationRountripTest.SerializeDeserializeCStringArrayNullptrElem (1264 of 2034) PASS: lldb-api :: functionalities/breakpoint/global_constructor/TestBreakpointInGlobalConstructor.py (1265 of 2034) FAIL: lldb-api :: commands/expression/deleting-implicit-copy-constructor/TestDeletingImplicitCopyConstructor.py (1266 of 2034) ******************** TEST 'lldb-api :: commands/expression/deleting-implicit-copy-constructor/TestDeletingImplicitCopyConstructor.py' FAILED ******************** Script: -- /Users/buildslave/jenkins/workspace/lldb-cmake-sanitized/lldb-build/lldb-test-build.noindex/copied-system-python /Users/buildslave/jenkins/workspace/lldb-cmake-sanitized/llvm-project/lldb/test/API/dotest.py --arch x86_64 -s /Users/buildslave/jenkins/workspace/lldb-cmake-sanitized/lldb-build/lldb-test-traces -S nm -u CXXFLAGS -u CFLAGS --codesign-identity lldb_codesign --server /Users/buildslave/jenkins/workspace/lldb-cmake-sanitized/lldb-build/./bin/debugserver --arch x86_64 --build-dir /Users/buildslave/jenkins/workspace/lldb-cmake-sanitized/lldb-build/lldb-test-build.noindex -s=/Users/buildslave/jenkins/workspace/lldb-cmake-sanitized/test/logs -t --env TERM=vt100 --env LLVM_LIBS_DIR=/Users/buildslave/jenkins/workspace/lldb-cmake-sanitized/lldb-build/./lib --inferior-env ASAN_OPTIONS=detect_stack_use_after_return=1 --inferior-env DYLD_INSERT_LIBRARIES=/Users/buildslave/jenkins/workspace/lldb-cmake-sanitized/host-compiler/lib/clang/11.0.0/lib/darwin/libclang_rt.asan_osx_dynamic.dylib --build-dir /Users/buildslave/jenkins/workspace/lldb-cmake-sanitized/lldb-build/lldb-test-build.noindex --lldb-module-cache-dir /Users/buildslave/jenkins/workspace/lldb-cmake-sanitized/lldb-build/lldb-test-build.noindex/module-cache-lldb/lldb-api --clang-module-cache-dir /Users/buildslave/jenkins/workspace/lldb-cmake-sanitized/lldb-build/lldb-test-build.noindex/module-cache-clang/lldb-api --executable /Users/buildslave/jenkins/workspace/lldb-cmake-sanitized/lldb-build/./bin/lldb --compiler /Users/buildslave/jenkins/workspace/lldb-cmake-sanitized/lldb-build/./bin/clang --dsymutil /Users/buildslave/jenkins/workspace/lldb-cmake-sanitized/lldb-build/./bin/dsymutil --filecheck /Users/buildslave/jenkins/workspace/lldb-cmake-sanitized/lldb-build/./bin/FileCheck --lldb-libs-dir /Users/buildslave/jenkins/workspace/lldb-cmake-sanitized/lldb-build/./lib /Users/buildslave/jenkins/workspace/lldb-cmake-sanitized/llvm-project/lldb/test/API/commands/expression/deleting-implicit-copy-constructor -p TestDeletingImplicitCopyConstructor.py -- Exit Code: -6

Hide Details

Command Output (stdout): -- lldb version 11.0.99 clang revision 80cb25cbd555f9634836b766c86aead435b60eaa llvm revision 80cb25cbd555f9634836b766c86aead435b60eaa

Hide Details

-- Command Output (stderr): -- Assertion failed: ((data().DefaultedCopyAssignmentIsDeleted || needsOverloadResolutionForCopyAssignment()) && "copy assignment should not be deleted"), function setImplicitCopyAssignmentIsDeleted, file /Users/buildslave/jenkins/workspace/lldb-cmake-sanitized/llvm-project/clang/include/clang/AST/DeclCXX.h, line 887.

Hide Details

--

Hide Details

******************** UNSUPPORTED: lldb-api :: benchmarks/expression/TestExpressionCmd.py (1267 of 2034) PASS: lldb-unit :: UnwindAssembly/x86/./UnwindAssemblyx86Tests/Testx86AssemblyInspectionEngine.TestPopR13 (1268 of 2034) PASS: lldb-api :: macosx/load-kext/TestLoadKext.py (1269 of 2034) PASS: lldb-unit :: Core/./LLDBCoreTests/RichManglingContextTest.FromCxxMethodName (1270 of 2034) PASS: lldb-api :: functionalities/data-formatter/data-formatter-proper-plurals/TestFormattersOneIsSingular.py (1271 of 2034) PASS: lldb-unit :: Host/./HostTests/FileSystemTest.FileAndDirectoryComponents (1272 of 2034) PASS: lldb-api :: lang/objc/foundation/TestRuntimeTypes.py (1273 of 2034) PASS: lldb-shell :: Commands/command-target-modules-dump-sections.yaml (1274 of 2034) PASS: lldb-unit :: Utility/./UtilityTests/StringListTest.GetMaxStringLengthDecreasingSize (1275 of 2034) PASS: lldb-api :: lang/cpp/enum_types/TestCPP11EnumTypes.py (1276 of 2034) PASS: lldb-shell :: ObjectFile/MachO/lc_version_min.yaml (1277 of 2034) PASS: lldb-unit :: Expression/./ExpressionTests/CppModuleConfigurationTest.UnknownLibCppFile (1278 of 2034) PASS: lldb-api :: functionalities/tail_call_frames/unambiguous_sequence/TestUnambiguousTailCalls.py (1279 of 2034) PASS: lldb-shell :: SymbolFile/DWARF/dwarf5-partial-index.cpp (1280 of 2034) PASS: lldb-shell :: Reproducer/TestReuseDirectory.test (1281 of 2034) PASS: lldb-api :: python_api/default-constructor/TestDefaultConstructorForAPIObjects.py (1282 of 2034) PASS: lldb-shell :: ObjectFile/ELF/PT_LOAD-overlap.yaml (1283 of 2034) PASS: lldb-api :: functionalities/thread/concurrent_events/TestConcurrentWatchpointWithDelayWatchpointThreads.py (1284 of 2034) PASS: lldb-api :: functionalities/data-formatter/data-formatter-cpp/TestDataFormatterCpp.py (1285 of 2034) PASS: lldb-unit :: Utility/./UtilityTests/StreamTest.AddressRangeInvalidRange (1286 of 2034) PASS: lldb-unit :: Utility/./UtilityTests/BinaryStreamTest.PutULEB128OneByte (1287 of 2034) PASS: lldb-api :: lang/cpp/namespace/TestNamespaceLookup.py (1288 of 2034) PASS: lldb-shell :: Breakpoint/case-sensitive.test (1289 of 2034) UNSUPPORTED: lldb-api :: functionalities/ptr_refs/TestPtrRefs.py (1290 of 2034) PASS: lldb-unit :: Utility/./UtilityTests/StringLexerTest.AdvanceIf (1291 of 2034) PASS: lldb-unit :: Symbol/./SymbolTests/TestClangASTImporter.MetadataPropagationIndirectImport (1292 of 2034) PASS: lldb-unit :: ScriptInterpreter/Python/./ScriptInterpreterPythonTests/PythonDataObjectsTest.TestPythonDictionaryManipulation (1293 of 2034) PASS: lldb-shell :: ScriptInterpreter/None/none.test (1294 of 2034) PASS: lldb-api :: functionalities/thread/concurrent_events/TestConcurrentBreakpointDelayBreakpointOneSignal.py (1295 of 2034) PASS: lldb-api :: lang/objc/foundation/TestObjCMethodsNSArray.py (1296 of 2034) PASS: lldb-api :: functionalities/data-formatter/summary-string-onfail/Test-rdar-9974002.py (1297 of 2034) PASS: lldb-unit :: Core/./LLDBCoreTests/MangledTest.ResultForValidName (1298 of 2034) PASS: lldb-unit :: Process/minidump/./LLDBMinidumpTests/MinidumpParserTest.GetFilteredModuleList (1299 of 2034) PASS: lldb-shell :: SymbolFile/DWARF/debug_line-relative_path.s (1300 of 2034) PASS: lldb-api :: functionalities/signal/raise/TestRaise.py (1301 of 2034) PASS: lldb-api :: commands/expression/import-std-module/weak_ptr-dbg-info-content/TestDbgInfoContentWeakPtrFromStdModule.py (1302 of 2034) PASS: lldb-shell :: SymbolFile/NativePDB/globals-bss.cpp (1303 of 2034) PASS: lldb-unit :: tools/lldb-server/tests/./LLDBServerTests/StandardStartupTest.TestStopReplyContainsThreadPcs (1304 of 2034) PASS: lldb-unit :: Utility/./UtilityTests/TildeExpressionResolver.ResolveFullPath (1305 of 2034) PASS: lldb-shell :: SymbolFile/NativePDB/tag-types.cpp (1306 of 2034) PASS: lldb-api :: tools/lldb-vscode/breakpoint/TestVSCode_setFunctionBreakpoints.py (1307 of 2034) PASS: lldb-api :: functionalities/data-formatter/data-formatter-stl/libcxx/set/TestDataFormatterLibcxxSet.py (1308 of 2034) PASS: lldb-unit :: Symbol/./SymbolTests/TestTypeSystemClang.TestGetBasicTypeFromEnum (1309 of 2034) PASS: lldb-unit :: UnwindAssembly/x86/./UnwindAssemblyx86Tests/Testx86AssemblyInspectionEngine.TestSpillRegToStackViaMOVx86_64 (1310 of 2034) PASS: lldb-unit :: Symbol/./SymbolTests/TestTypeSystemClang.TestDeletingImplicitCopyCstrDueToMoveCStr (1311 of 2034) PASS: lldb-shell :: SymbolFile/DWARF/dir-separator-posix.s (1312 of 2034) PASS: lldb-api :: lang/c/step_over_no_deadlock/TestStepOverDoesntBlock.py (1313 of 2034) PASS: lldb-unit :: UnwindAssembly/x86/./UnwindAssemblyx86Tests/Testx86AssemblyInspectionEngine.TestSimple64bitFrameFunction (1314 of 2034) PASS: lldb-unit :: Utility/./UtilityTests/UriParserTest.SchemeHostSeparator3 (1315 of 2034) PASS: lldb-shell :: Reproducer/TestWorkingDir.test (1316 of 2034) PASS: lldb-unit :: Language/Highlighting/./HighlighterTests/HighlighterTest.ClangIdentifiers (1317 of 2034) PASS: lldb-unit :: Process/gdb-remote/./ProcessGdbRemoteTests/GDBRemoteCommunicationClientTest.SendSignalsToIgnore (1318 of 2034) PASS: lldb-api :: lang/objc/modules-compile-error/TestModulesCompileError.py (1319 of 2034) PASS: lldb-unit :: ObjectFile/ELF/./ObjectFileELFTests/ObjectFileELFTest.GetSymtab_NoSymEntryPointArmThumbAddressClass (1320 of 2034) PASS: lldb-unit :: Utility/./UtilityTests/AnsiTerminal.Unknown (1321 of 2034) PASS: lldb-unit :: Utility/./UtilityTests/RangeTest.LessThanInvalid (1322 of 2034) PASS: lldb-api :: lang/objc/objc-new-syntax/TestObjCNewSyntaxArray.py (1323 of 2034) PASS: lldb-unit :: Utility/./UtilityTests/SerializationRountripTest.SerializeDeserializeCStringArray (1324 of 2034) PASS: lldb-unit :: Symbol/./SymbolTests/PostfixExpression.ParseFPOProgram (1325 of 2034) PASS: lldb-api :: functionalities/data-formatter/data-formatter-stl/libcxx/variant/TestDataFormatterLibcxxVariant.py (1326 of 2034) PASS: lldb-api :: commands/gui/invalid-args/TestInvalidArgsGui.py (1327 of 2034) PASS: lldb-unit :: Utility/./UtilityTests/VMRange.Comparison (1328 of 2034) PASS: lldb-api :: functionalities/plugins/python_os_plugin/TestPythonOSPlugin.py (1329 of 2034) PASS: lldb-unit :: Utility/./UtilityTests/IndexToObjectTest.ObjectForIndex (1330 of 2034) PASS: lldb-unit :: Core/./LLDBCoreTests/MangledTest.EmptyForInvalidName (1331 of 2034) PASS: lldb-api :: functionalities/breakpoint/breakpoint_conditions/TestBreakpointConditions.py (1332 of 2034) PASS: lldb-api :: commands/expression/import-std-module/sysroot/TestStdModuleSysroot.py (1333 of 2034) PASS: lldb-unit :: Symbol/./SymbolTests/DWARFCallFrameInfoTest.Basic_dwarf3 (1334 of 2034) PASS: lldb-api :: functionalities/data-formatter/poarray/TestPrintObjectArray.py (1335 of 2034) PASS: lldb-api :: functionalities/deleted-executable/TestDeletedExecutable.py (1336 of 2034) PASS: lldb-unit :: Utility/./UtilityTests/SubsystemRAIITest.SubsystemWithErrorSuccess (1337 of 2034) PASS: lldb-api :: functionalities/data-formatter/data-formatter-skip-summary/TestDataFormatterSkipSummary.py (1338 of 2034) PASS: lldb-api :: tools/lldb-server/commandline/TestStubSetSID.py (1339 of 2034) PASS: lldb-unit :: Utility/./UtilityTests/ArgsTest.ReplaceArgumentAtIndexEqual (1340 of 2034) PASS: lldb-api :: functionalities/type_completion/TestTypeCompletion.py (1341 of 2034) PASS: lldb-unit :: Utility/./UtilityTests/ConstStringTest.NullAndEmptyStates (1342 of 2034) PASS: lldb-unit :: UnwindAssembly/x86/./UnwindAssemblyx86Tests/Testx86AssemblyInspectionEngine.TestDisassemblyMidFunctionEpilogues (1343 of 2034) PASS: lldb-unit :: Expression/./ExpressionTests/DWARFExpression.DW_OP_piece (1344 of 2034) PASS: lldb-unit :: UnwindAssembly/x86/./UnwindAssemblyx86Tests/Testx86AssemblyInspectionEngine.TestSimplei386ugmented (1345 of 2034) PASS: lldb-api :: functionalities/step-avoids-no-debug/TestStepNoDebug.py (1346 of 2034) UNSUPPORTED: lldb-shell :: Unwind/unwind-plan-dwarf-dump.test (1347 of 2034) PASS: lldb-unit :: Utility/./UtilityTests/StreamTest.PutNHex8 (1348 of 2034) PASS: lldb-api :: lang/objc/modules-hash-mismatch/TestClangModulesHashMismatch.py (1349 of 2034) PASS: lldb-api :: functionalities/thread/concurrent_events/TestConcurrentTwoWatchpointThreads.py (1350 of 2034) PASS: lldb-api :: functionalities/memory/cache/TestMemoryCache.py (1351 of 2034) UNSUPPORTED: lldb-shell :: Reproducer/TestLuaImport.test (1352 of 2034) PASS: lldb-api :: functionalities/unwind/zeroth_frame/TestZerothFrame.py (1353 of 2034) PASS: lldb-api :: commands/expression/import-std-module/unique_ptr-dbg-info-content/TestUniquePtrDbgInfoContent.py (1354 of 2034) UNSUPPORTED: lldb-api :: functionalities/darwin_log/source/info/TestDarwinLogSourceInfo.py (1355 of 2034) PASS: lldb-unit :: Utility/./UtilityTests/StringListTest.RemoveBlankLines (1356 of 2034) PASS: lldb-api :: functionalities/unwind/noreturn/TestNoreturnUnwind.py (1357 of 2034) PASS: lldb-unit :: Utility/./UtilityTests/StreamTeeTest.GetStreamAtIndexOutOfBoundsEmpty (1358 of 2034) PASS: lldb-unit :: Utility/./UtilityTests/ListenerTest.GetEventWait (1359 of 2034) PASS: lldb-api :: lang/cpp/operators/TestCppOperators.py (1360 of 2034) PASS: lldb-unit :: Process/gdb-remote/./ProcessGdbRemoteTests/GDBRemoteCommunicationClientTest.TestPacketSpeedJSON (1361 of 2034) UNSUPPORTED: lldb-shell :: SymbolFile/PDB/typedefs.test (1362 of 2034) PASS: lldb-api :: lang/objc/objc-super/TestObjCSuper.py (1363 of 2034) PASS: lldb-unit :: DataFormatter/./LLDBFormatterTests/StringPrinterTests.CxxASCII (1364 of 2034) PASS: lldb-shell :: Reproducer/Modules/TestModuleCXX.test (1365 of 2034) PASS: lldb-api :: functionalities/data-formatter/typedef_array/TestTypedefArray.py (1366 of 2034) PASS: lldb-unit :: Host/./HostTests/MainLoopTest.DetectsEOF (1367 of 2034) UNSUPPORTED: lldb-api :: functionalities/data-formatter/data-formatter-stl/libstdcpp/smart_ptr/TestDataFormatterStdSmartPtr.py (1368 of 2034) PASS: lldb-api :: commands/expression/char/TestExprsChar.py (1369 of 2034) PASS: lldb-unit :: Utility/./UtilityTests/RangeTest.Equal (1370 of 2034) PASS: lldb-unit :: Utility/./UtilityTests/RangeTest.ContainsAddr (1371 of 2034) PASS: lldb-api :: lang/cpp/bool/TestCPPBool.py (1372 of 2034) PASS: lldb-unit :: Expression/./ExpressionTests/CppModuleConfigurationTest.AmbiguousCLib (1373 of 2034) PASS: lldb-unit :: Utility/./UtilityTests/OptionsWithRawTest.EmptySuffix (1374 of 2034) PASS: lldb-api :: commands/help/TestHelp.py (1375 of 2034) PASS: lldb-api :: lang/objc/foundation/TestObjCMethods2.py (1376 of 2034) PASS: lldb-api :: lang/c/local_types/TestUseClosestType.py (1377 of 2034) PASS: lldb-shell :: SymbolFile/NativePDB/ast-functions.cpp (1378 of 2034) PASS: lldb-unit :: Utility/./UtilityTests/StreamTest.PutHex32ByteOrderBig (1379 of 2034) PASS: lldb-unit :: Utility/./UtilityTests/FileSpecTest.RemoveLastPathComponent (1380 of 2034) PASS: lldb-unit :: Utility/./UtilityTests/UriParserTest.MinimalPort (1381 of 2034) UNSUPPORTED: lldb-api :: benchmarks/frame_variable/TestFrameVariableResponse.py (1382 of 2034) UNSUPPORTED: lldb-api :: functionalities/darwin_log/filter/regex/activity-chain/TestDarwinLogFilterRegexActivityChain.py (1383 of 2034) PASS: lldb-unit :: Utility/./UtilityTests/SerializationRountripTest.SerializeDeserializePodPointers (1384 of 2034) PASS: lldb-api :: lang/cpp/this/TestCPPThis.py (1385 of 2034) PASS: lldb-unit :: Utility/./UtilityTests/StringListTest.AppendStringMove (1386 of 2034) PASS: lldb-unit :: Utility/./UtilityTests/RangeTest.Copy (1387 of 2034) PASS: lldb-unit :: Symbol/./SymbolTests/TestClangASTImporter.MetadataPropagationAfterCopying (1388 of 2034) PASS: lldb-unit :: Utility/./UtilityTests/StatusTest.Formatv (1389 of 2034) PASS: lldb-api :: commands/expression/unwind_expression/TestUnwindExpression.py (1390 of 2034) PASS: lldb-api :: functionalities/inferior-crashing/recursive-inferior/TestRecursiveInferior.py (1391 of 2034) UNSUPPORTED: lldb-shell :: SymbolFile/PDB/func-symbols.test (1392 of 2034) PASS: lldb-api :: commands/command/script/import/rdar-12586188/TestRdar12586188.py (1393 of 2034) PASS: lldb-unit :: Signals/./SignalsTests/UnixSignalsTest.GetInfo (1394 of 2034) PASS: lldb-unit :: Utility/./UtilityTests/SubsystemRAIITest.SubsystemWithErrorFailure (1395 of 2034) PASS: lldb-unit :: Utility/./UtilityTests/Predicate.WaitForValueNotEqualTo (1396 of 2034) PASS: lldb-unit :: SymbolFile/NativePDB/./SymbolFileNativePDBTests/PDBFPOProgramToDWARFExpressionTests.UnknownOp (1397 of 2034) PASS: lldb-unit :: Utility/./UtilityTests/ArgsTest.TestQuotedTrailingBackslash (1398 of 2034) PASS: lldb-unit :: ScriptInterpreter/Python/./ScriptInterpreterPythonTests/PythonDataObjectsTest.TestGlobalNameResolutionWithDot (1399 of 2034) PASS: lldb-api :: tools/lldb-server/TestGdbRemote_qThreadStopInfo.py (1400 of 2034) PASS: lldb-unit :: ScriptInterpreter/Python/./ScriptInterpreterPythonTests/PythonDataObjectsTest.TestPythonCallableInvoke (1401 of 2034) PASS: lldb-unit :: Utility/./UtilityTests/ArgsTest.TestSingleArg (1402 of 2034) PASS: lldb-api :: functionalities/optimized_code/TestNoASanExceptionAfterEvalOP_piece.py (1403 of 2034) PASS: lldb-api :: python_api/interpreter/TestCommandInterpreterAPI.py (1404 of 2034) PASS: lldb-shell :: SymbolFile/NativePDB/source-list.cpp (1405 of 2034) PASS: lldb-api :: functionalities/thread/concurrent_events/TestConcurrentCrashWithSignal.py (1406 of 2034) PASS: lldb-unit :: Utility/./UtilityTests/DataExtractorTest.GetCStrAtEnd (1407 of 2034) PASS: lldb-api :: lang/cpp/dynamic-value-same-basename/TestDynamicValueSameBase.py (1408 of 2034) UNSUPPORTED: lldb-shell :: SymbolFile/NativePDB/stack_unwinding01.cpp (1409 of 2034) PASS: lldb-shell :: SymbolFile/DWARF/find-variable-dwo.cpp (1410 of 2034) PASS: lldb-unit :: Utility/./UtilityTests/StringExtractorTest.GetU64LittleEndian (1411 of 2034) PASS: lldb-unit :: Utility/./UtilityTests/NameMatchesTest.Equals (1412 of 2034) PASS: lldb-api :: functionalities/data-formatter/data-formatter-stl/libcxx/iterator/TestDataFormatterLibccIterator.py (1413 of 2034) PASS: lldb-shell :: Register/x86-64-read.test (1414 of 2034) PASS: lldb-api :: functionalities/thread/step_until/TestStepUntil.py (1415 of 2034) PASS: lldb-api :: lang/objc/forward-decl/TestForwardDecl.py (1416 of 2034) PASS: lldb-api :: commands/expression/import-std-module/list-dbg-info-content/TestDbgInfoContentListFromStdModule.py (1417 of 2034) PASS: lldb-unit :: Utility/./UtilityTests/BinaryStreamTest.PutULEB128SixBytes (1418 of 2034) PASS: lldb-unit :: ObjectFile/ELF/./ObjectFileELFTests/ObjectFileELFTest.GetSymtab_NoSymEntryPointArmAddressClass (1419 of 2034) PASS: lldb-unit :: tools/lldb-server/tests/./LLDBServerTests/TestBase.DebugserverEnv (1420 of 2034) PASS: lldb-unit :: Utility/./UtilityTests/TimeoutTest.Format (1421 of 2034) PASS: lldb-unit :: Utility/./UtilityTests/ArchSpecTest.TripleComponentsWereSpecified (1422 of 2034) PASS: lldb-unit :: SymbolFile/NativePDB/./SymbolFileNativePDBTests/PDBFPOProgramToDWARFExpressionTests.InvalidAssignmentMultiple (1423 of 2034) PASS: lldb-api :: functionalities/breakpoint/scripted_bkpt/TestScriptedResolver.py (1424 of 2034) PASS: lldb-shell :: SymbolFile/Breakpad/line-table-mixed-path-styles.test (1425 of 2034) PASS: lldb-api :: functionalities/breakpoint/cpp_exception/TestCPPExceptionBreakpoint.py (1426 of 2034) PASS: lldb-unit :: Utility/./UtilityTests/RangeTest.ContainsRange (1427 of 2034) PASS: lldb-api :: functionalities/thread/concurrent_events/TestConcurrentBreakpointOneDelayBreakpointThreads.py (1428 of 2034) PASS: lldb-api :: functionalities/gdb_remote_client/TestStopPCs.py (1429 of 2034) PASS: lldb-api :: functionalities/breakpoint/breakpoint_set_restart/TestBreakpointSetRestart.py (1430 of 2034) PASS: lldb-unit :: ScriptInterpreter/Python/./ScriptInterpreterPythonTests/PythonDataObjectsTest.TestInstanceNameResolutionNoDot (1431 of 2034) PASS: lldb-unit :: Utility/./UtilityTests/TimerTest.CategoryTimes (1432 of 2034) PASS: lldb-api :: functionalities/postmortem/minidump-new/TestMiniDumpUUID.py (1433 of 2034) PASS: lldb-api :: python_api/get-value-32bit-int/TestGetValue32BitInt.py (1434 of 2034) PASS: lldb-shell :: SymbolFile/Breakpad/line-table-discontinuous-file-ids.test (1435 of 2034) PASS: lldb-unit :: Utility/./UtilityTests/TimerTest.CategoryTimes2 (1436 of 2034) PASS: lldb-api :: functionalities/data-formatter/data-formatter-stl/libcxx/initializerlist/TestInitializerList.py (1437 of 2034) PASS: lldb-unit :: Utility/./UtilityTests/StringListTest.LongestCommonPrefixSingleElement (1438 of 2034) PASS: lldb-api :: lang/objc/objc-class-method/TestObjCClassMethod.py (1439 of 2034) PASS: lldb-unit :: Utility/./UtilityTests/StringExtractorTest.GetHexBytes (1440 of 2034) PASS: lldb-unit :: Utility/./UtilityTests/RangeTest.EqualInvalid (1441 of 2034) PASS: lldb-api :: commands/expression/ir-interpreter-phi-nodes/TestIRInterpreterPHINodes.py (1442 of 2034) PASS: lldb-shell :: SymbolFile/NativePDB/disassembly.cpp (1443 of 2034) UNSUPPORTED: lldb-api :: functionalities/darwin_log/basic/TestDarwinLogBasic.py (1444 of 2034) PASS: lldb-unit :: Utility/./UtilityTests/VMRange.ContainsAddr (1445 of 2034) PASS: lldb-unit :: Utility/./UtilityTests/StringExtractorTest.GetHexU8_InvalidHex_NoEof (1446 of 2034) PASS: lldb-api :: functionalities/inferior-crashing/recursive-inferior/TestRecursiveInferiorStep.py (1447 of 2034) PASS: lldb-api :: functionalities/thread/exit_during_expression/TestExitDuringExpression.py (1448 of 2034) PASS: lldb-shell :: SymbolFile/DWARF/array-sizes.s (1449 of 2034) PASS: lldb-api :: commands/expression/ir-interpreter/TestIRInterpreter.py (1450 of 2034) PASS: lldb-unit :: Utility/./UtilityTests/SerializationRountripTest.SerializeDeserializeObjectReference (1451 of 2034) PASS: lldb-api :: tools/lldb-server/TestGdbRemoteSingleStep.py (1452 of 2034) UNSUPPORTED: lldb-api :: android/platform/TestDefaultCacheLineSize.py (1453 of 2034) PASS: lldb-unit :: Utility/./UtilityTests/ArchSpecTest.TestParseMachCPUDashSubtypeTripleExtra (1454 of 2034) PASS: lldb-api :: functionalities/data-formatter/data-formatter-script/TestDataFormatterScript.py (1455 of 2034) PASS: lldb-api :: lang/objc/exceptions/TestObjCExceptions.py (1456 of 2034) PASS: lldb-unit :: Utility/./UtilityTests/UriParserTest.SchemeHostSeparator (1457 of 2034) PASS: lldb-unit :: Utility/./UtilityTests/UriParserTest.BracketedHostnameWithPortIPv6 (1458 of 2034) PASS: lldb-unit :: Utility/./UtilityTests/StringListTest.InsertStringAtIndexOutOfBounds (1459 of 2034) PASS: lldb-api :: functionalities/breakpoint/source_regexp/TestSourceRegexBreakpoints.py (1460 of 2034) PASS: lldb-unit :: Signals/./SignalsTests/UnixSignalsTest.VersionChange (1461 of 2034) PASS: lldb-api :: functionalities/thread/step_out/TestThreadStepOut.py (1462 of 2034) PASS: lldb-api :: lang/cpp/namespace_definitions/TestNamespaceDefinitions.py (1463 of 2034) PASS: lldb-api :: lang/cpp/class_types/TestClassTypes.py (1464 of 2034) PASS: lldb-api :: commands/expression/completion-in-lambda-and-unnamed-class/TestCompletionInLambdaAndUnnamedClass.py (1465 of 2034) PASS: lldb-shell :: SymbolFile/DWARF/debug_ranges-missing-section.s (1466 of 2034) PASS: lldb-unit :: Utility/./UtilityTests/StringListTest.SplitIntoLinesEmpty (1467 of 2034) PASS: lldb-api :: python_api/objc_type/TestObjCType.py (1468 of 2034) PASS: lldb-unit :: Utility/./UtilityTests/RegularExpression.Empty (1469 of 2034) PASS: lldb-unit :: Expression/./ExpressionTests/CppModuleConfigurationTest.Sysroot (1470 of 2034) PASS: lldb-api :: commands/frame/diagnose/dereference-function-return/TestDiagnoseDereferenceFunctionReturn.py (1471 of 2034) FAIL: lldb-unit :: Utility/./UtilityTests/DataExtractorTest.GetSLEB128_bit63 (1472 of 2034) ******************** TEST 'lldb-unit :: Utility/./UtilityTests/DataExtractorTest.GetSLEB128_bit63' FAILED ******************** Note: Google Test filter = DataExtractorTest.GetSLEB128_bit63 [==========] Running 1 test from 1 test case. [----------] Global test environment set-up. [----------] 1 test from DataExtractorTest [ RUN ] DataExtractorTest.GetSLEB128_bit63 /Users/buildslave/jenkins/workspace/lldb-cmake-sanitized/llvm-project/lldb/source/Utility/DataExtractor.cpp:934:17: runtime error: negation of -9223372036854775808 cannot be represented in type 'int64_t' (aka 'long long'); cast to an unsigned type to negate this value to itself SUMMARY: UndefinedBehaviorSanitizer: undefined-behavior /Users/buildslave/jenkins/workspace/lldb-cmake-sanitized/llvm-project/lldb/source/Utility/DataExtractor.cpp:934:17 in

Hide Details

******************** PASS: lldb-unit :: Language/Highlighting/./HighlighterTests/HighlighterTest.ClangEmptyInput (1473 of 2034) PASS: lldb-api :: sample_test/TestSampleTest.py (1474 of 2034) PASS: lldb-unit :: Utility/./UtilityTests/StringExtractorTest.GetHexU8_Underflow_NoEof (1475 of 2034) UNSUPPORTED: lldb-shell :: Register/arm-gp-read.test (1476 of 2034) PASS: lldb-unit :: Interpreter/./InterpreterTests/CompletionTest.DirCompletionAbsolute (1477 of 2034) PASS: lldb-shell :: ObjectFile/PECOFF/section-types.yaml (1478 of 2034) PASS: lldb-api :: lang/cpp/signed_types/TestSignedTypes.py (1479 of 2034) PASS: lldb-unit :: Utility/./UtilityTests/RegularExpression.CopyAssignment (1480 of 2034) PASS: lldb-unit :: UnwindAssembly/x86/./UnwindAssemblyx86Tests/Testx86AssemblyInspectionEngine.TestPopEBX (1481 of 2034) PASS: lldb-unit :: Utility/./UtilityTests/SerializationRountripTest.SerializeDeserializeCStringArrayNullptr (1482 of 2034) PASS: lldb-unit :: Utility/./UtilityTests/StringListTest.AppendStringCString (1483 of 2034) PASS: lldb-unit :: UnwindAssembly/x86/./UnwindAssemblyx86Tests/Testx86AssemblyInspectionEngine.TestSubRSP (1484 of 2034) PASS: lldb-unit :: Utility/./UtilityTests/RangeDataVector.CustomSort (1485 of 2034) PASS: lldb-unit :: Utility/./UtilityTests/BinaryStreamTest.PutULEB128NineBytes (1486 of 2034) PASS: lldb-unit :: Utility/./UtilityTests/UriParserTest.TypicalPortPathIPv4 (1487 of 2034) PASS: lldb-api :: python_api/process/read-mem-cstring/TestReadMemCString.py (1488 of 2034) PASS: lldb-api :: api/log/TestAPILog.py (1489 of 2034) PASS: lldb-api :: functionalities/thread/num_threads/TestNumThreads.py (1490 of 2034) PASS: lldb-unit :: Utility/./UtilityTests/Flags.AnySet (1491 of 2034) PASS: lldb-api :: macosx/thread-names/TestInterruptThreadNames.py (1492 of 2034) PASS: lldb-shell :: ObjectFile/ELF/minidebuginfo-find-symbols.yaml (1493 of 2034) PASS: lldb-unit :: Utility/./UtilityTests/Flags.Clear (1494 of 2034) PASS: lldb-shell :: Reproducer/Functionalities/TestDataFormatter.test (1495 of 2034) PASS: lldb-api :: functionalities/tail_call_frames/inlining_and_tail_calls/TestInliningAndTailCalls.py (1496 of 2034) PASS: lldb-api :: tools/lldb-server/TestAppleSimulatorOSType.py (1497 of 2034) PASS: lldb-api :: commands/process/attach/TestProcessAttach.py (1498 of 2034) PASS: lldb-api :: functionalities/target_var/TestTargetVar.py (1499 of 2034) PASS: lldb-unit :: Utility/./UtilityTests/StreamTest.PutULEB128 (1500 of 2034) PASS: lldb-unit :: Utility/./UtilityTests/StreamTeeTest.Flush (1501 of 2034) PASS: lldb-shell :: Commands/command-backtrace.test (1502 of 2034) PASS: lldb-api :: python_api/disassemble-raw-data/TestDisassembleRawData.py (1503 of 2034) UNSUPPORTED: lldb-api :: python_api/disassemble-raw-data/TestDisassemble_VST1_64.py (1504 of 2034) PASS: lldb-api :: functionalities/data-formatter/data-formatter-globals/TestDataFormatterGlobals.py (1505 of 2034) PASS: lldb-shell :: Settings/TestDisableColor.test (1506 of 2034) PASS: lldb-api :: lang/objc/modules-cache/TestClangModulesCache.py (1507 of 2034) PASS: lldb-unit :: Utility/./UtilityTests/ProcessInfoTest.Constructor (1508 of 2034) PASS: lldb-unit :: Utility/./UtilityTests/CompletionRequest.FakeLastArg (1509 of 2034) PASS: lldb-api :: functionalities/tail_call_frames/ambiguous_tail_call_seq1/TestAmbiguousTailCallSeq1.py (1510 of 2034) PASS: lldb-api :: macosx/order/TestOrderFile.py (1511 of 2034) UNSUPPORTED: lldb-api :: commands/watchpoints/multi_watchpoint_slots/TestWatchpointMultipleSlots.py (1512 of 2034) PASS: lldb-api :: functionalities/data-formatter/data-formatter-objc/TestDataFormatterObjCNSBundle.py (1513 of 2034) PASS: lldb-api :: functionalities/data-formatter/data-formatter-stl/libcxx/unordered/TestDataFormatterUnordered.py (1514 of 2034) PASS: lldb-shell :: Minidump/Windows/find-module.test (1515 of 2034) PASS: lldb-api :: lang/cpp/limit-debug-info/TestWithLimitDebugInfo.py (1516 of 2034) UNSUPPORTED: lldb-shell :: SymbolFile/PDB/function-nested-block.test (1517 of 2034) PASS: lldb-unit :: Utility/./UtilityTests/FileSpecTest.EqualDotsPosixRoot (1518 of 2034) PASS: lldb-unit :: Utility/./UtilityTests/ArgsTest.TestQuotedUnknownEscape (1519 of 2034) PASS: lldb-api :: functionalities/non-overlapping-index-variable-i/TestIndexVariable.py (1520 of 2034) PASS: lldb-api :: functionalities/pointer_num_children/TestPointerNumChildren.py (1521 of 2034) PASS: lldb-unit :: ScriptInterpreter/Python/./ScriptInterpreterPythonTests/PythonDataObjectsTest.TestOwnedReferences (1522 of 2034) PASS: lldb-unit :: Utility/./UtilityTests/ArgsTest.Yaml (1523 of 2034) UNSUPPORTED: lldb-api :: commands/expression/multiline-navigation/TestMultilineNavigation.py (1524 of 2034) PASS: lldb-unit :: Utility/./UtilityTests/CompletionRequest.TestCompletionOwnership (1525 of 2034) PASS: lldb-shell :: SymbolFile/DWARF/inline-function-address-shared.test (1526 of 2034) PASS: lldb-api :: functionalities/show_location/TestShowLocationDwarf5.py (1527 of 2034) PASS: lldb-unit :: Host/./HostTests/NativeProcessProtocolTest.SetBreakpointFailRead (1528 of 2034) PASS: lldb-unit :: Host/./HostTests/SocketTest.DomainGetConnectURI (1529 of 2034) UNSUPPORTED: lldb-shell :: SymbolFile/PDB/vbases.test (1530 of 2034) PASS: lldb-api :: lang/objc/modules-update/TestClangModulesUpdate.py (1531 of 2034) PASS: lldb-api :: functionalities/avoids-fd-leak/TestFdLeak.py (1532 of 2034) PASS: lldb-api :: functionalities/conditional_break/TestConditionalBreak.py (1533 of 2034) PASS: lldb-api :: lang/c/modules/TestCModules.py (1534 of 2034) PASS: lldb-unit :: Breakpoint/./LLDBBreakpointTests/BreakpointIDTest.StringIsBreakpointName (1535 of 2034) PASS: lldb-unit :: Language/Highlighting/./HighlighterTests/HighlighterTest.ClangPreserveNewLine (1536 of 2034) PASS: lldb-unit :: Utility/./UtilityTests/UriParserTest.BadPort (1537 of 2034) PASS: lldb-api :: commands/frame/var/TestFrameVar.py (1538 of 2034) PASS: lldb-api :: tools/lldb-server/TestGdbRemoteProcessInfo.py (1539 of 2034) PASS: lldb-unit :: SymbolFile/NativePDB/./SymbolFileNativePDBTests/PDBFPOProgramToDWARFExpressionTests.UnresolvedDependentCyclicRegisterAssignmentReference (1540 of 2034) PASS: lldb-api :: functionalities/unwind/sigtramp/TestSigtrampUnwind.py (1541 of 2034) PASS: lldb-api :: lang/cpp/function-qualifiers/TestCppFunctionQualifiers.py (1542 of 2034) PASS: lldb-unit :: Language/Highlighting/./HighlighterTests/HighlighterTest.ClangSquareBrackets (1543 of 2034) PASS: lldb-api :: commands/expression/unicode-in-variable/TestUnicodeInVariable.py (1544 of 2034) PASS: lldb-unit :: UnwindAssembly/x86/./UnwindAssemblyx86Tests/Testx86AssemblyInspectionEngine.TestDisassemblyJunkBytes (1545 of 2034) PASS: lldb-api :: functionalities/thread/concurrent_events/TestConcurrentDelayedCrashWithBreakpointWatchpoint.py (1546 of 2034) UNSUPPORTED: lldb-shell :: ScriptInterpreter/Lua/watchpoint_callback.test (1547 of 2034) PASS: lldb-api :: functionalities/thread/concurrent_events/TestConcurrentTwoWatchpointsOneSignal.py (1548 of 2034) PASS: lldb-api :: functionalities/thread/concurrent_events/TestConcurrentSignalWatch.py (1549 of 2034) PASS: lldb-unit :: Utility/./UtilityTests/StringListTest.InsertStringAtIndexMove (1550 of 2034) PASS: lldb-unit :: Process/gdb-remote/./ProcessGdbRemoteTests/GDBRemoteCommunicationClientTest.GetMemoryRegionInfoInvalidResponse (1551 of 2034) PASS: lldb-unit :: Host/./HostTests/ConnectionFileDescriptorTest.TCPGetURIv4 (1552 of 2034) PASS: lldb-unit :: Utility/./UtilityTests/StringLexerTest.NextIf (1553 of 2034) PASS: lldb-api :: tools/lldb-server/TestGdbRemoteThreadsInStopReply.py (1554 of 2034) PASS: lldb-api :: functionalities/data-formatter/hexcaps/TestDataFormatterHexCaps.py (1555 of 2034) PASS: lldb-unit :: Utility/./UtilityTests/StringListTest.SplitIntoLines (1556 of 2034) PASS: lldb-unit :: Utility/./UtilityTests/ProcessInstanceInfo.DumpTable_invalidUID (1557 of 2034) PASS: lldb-api :: lang/cpp/function_refs/TestFunctionRefs.py (1558 of 2034) PASS: lldb-unit :: Utility/./UtilityTests/RegisterValueTest.GetSet8 (1559 of 2034) PASS: lldb-shell :: SymbolFile/DWARF/debug_rnglists-dwo.s (1560 of 2034) PASS: lldb-unit :: Expression/./ExpressionTests/ClangExpressionDeclMapTest.TestPersistentDeclLookup (1561 of 2034) PASS: lldb-shell :: ObjectFile/ELF/section-permissions.yaml (1562 of 2034) PASS: lldb-api :: functionalities/gdb_remote_client/TestTargetXMLArch.py (1563 of 2034) PASS: lldb-api :: functionalities/unwind/noreturn/module-end/TestNoReturnModuleEnd.py (1564 of 2034) PASS: lldb-api :: commands/expression/vector_of_enums/TestVectorOfEnums.py (1565 of 2034) PASS: lldb-api :: tools/lldb-server/TestGdbRemoteHostInfo.py (1566 of 2034) PASS: lldb-api :: functionalities/thread/concurrent_events/TestConcurrentSignalNWatchNBreak.py (1567 of 2034) PASS: lldb-unit :: SymbolFile/DWARF/./SymbolFileDWARFTests/SymbolFileDWARFTests.TestAbbrevNullAttrValidForm (1568 of 2034) PASS: lldb-api :: lang/objc/hidden-ivars/TestHiddenIvars.py (1569 of 2034) PASS: lldb-api :: lang/objc/objc-runtime-ivars/TestRuntimeIvars.py (1570 of 2034) PASS: lldb-unit :: Utility/./UtilityTests/FileSpecTest.GuessPathStyle (1571 of 2034) PASS: lldb-api :: functionalities/paths/TestPaths.py (1572 of 2034) PASS: lldb-unit :: Utility/./UtilityTests/StreamTeeTest.Write (1573 of 2034) PASS: lldb-unit :: ObjectFile/PECOFF/./ObjectFilePECOFFTests/PECallFrameInfoTest.Frame_reg_eh (1574 of 2034) PASS: lldb-unit :: UnwindAssembly/x86/./UnwindAssemblyx86Tests/Testx86AssemblyInspectionEngine.TestPushR13 (1575 of 2034) PASS: lldb-api :: lang/cpp/nsimport/TestCppNsImport.py (1576 of 2034) PASS: lldb-unit :: Process/minidump/./LLDBMinidumpTests/MinidumpParserTest.GetArchitectureWindows (1577 of 2034) PASS: lldb-shell :: Settings/TestSettingsWrite.test (1578 of 2034) PASS: lldb-api :: functionalities/data-formatter/data-formatter-objc/TestDataFormatterObjCCF.py (1579 of 2034) PASS: lldb-unit :: Utility/./UtilityTests/StringListTest.ShiftMove (1580 of 2034) PASS: lldb-unit :: Utility/./UtilityTests/ReproducerTest.SetCapture (1581 of 2034) PASS: lldb-unit :: Utility/./UtilityTests/GeneratorTest.GetOrCreate (1582 of 2034) PASS: lldb-api :: functionalities/object-file/TestImageListMultiArchitecture.py (1583 of 2034) PASS: lldb-shell :: SymbolFile/DWARF/find-variable-file.cpp (1584 of 2034) PASS: lldb-unit :: Expression/./ExpressionTests/DiagnosticManagerTest.AppendMessageAttachToLastDiag (1585 of 2034) PASS: lldb-unit :: Symbol/./SymbolTests/TestTypeSystemClang.AddMethodToObjCObjectType (1586 of 2034) PASS: lldb-api :: commands/expression/call-function/TestCallBuiltinFunction.py (1587 of 2034) PASS: lldb-api :: functionalities/process_group/TestChangeProcessGroup.py (1588 of 2034) PASS: lldb-api :: functionalities/data-formatter/vector-types/TestVectorTypesFormatting.py (1589 of 2034) PASS: lldb-shell :: ObjectFile/PECOFF/basic-info-arm64.yaml (1590 of 2034) PASS: lldb-shell :: Settings/TestSettingsSet.test (1591 of 2034) PASS: lldb-unit :: Utility/./UtilityTests/ArgsTest.TestMultipleArgs (1592 of 2034) PASS: lldb-api :: functionalities/data-formatter/stringprinter/TestStringPrinter.py (1593 of 2034) PASS: lldb-unit :: Process/gdb-remote/./ProcessGdbRemoteTests/GDBRemoteClientBaseTest.SendContinueAndInterrupt2PacketBug (1594 of 2034) PASS: lldb-api :: commands/expression/context-object-objc/TestContextObjectObjc.py (1595 of 2034) PASS: lldb-unit :: Utility/./UtilityTests/BinaryStreamTest.PutULEB128FourBytes (1596 of 2034) PASS: lldb-unit :: Symbol/./SymbolTests/PostfixExpression.ParseOneExpression (1597 of 2034) PASS: lldb-api :: functionalities/inferior-changed/TestInferiorChanged.py (1598 of 2034) PASS: lldb-unit :: Expression/./ExpressionTests/CppModuleConfigurationTest.MissingUsrInclude (1599 of 2034) PASS: lldb-api :: lang/cpp/unsigned_types/TestUnsignedTypes.py (1600 of 2034) PASS: lldb-unit :: Utility/./UtilityTests/StructuredDataTest.ParseJSONFromFile (1601 of 2034) PASS: lldb-api :: python_api/symbol-context/two-files/TestSymbolContextTwoFiles.py (1602 of 2034) PASS: lldb-unit :: Host/./HostTests/File.GetWaitableHandleFileno (1603 of 2034) PASS: lldb-api :: commands/target/basic/TestTargetCommand.py (1604 of 2034) PASS: lldb-api :: lang/objc/objc-struct-return/TestObjCStructReturn.py (1605 of 2034) PASS: lldb-shell :: Quit/TestQuitExitCodeImplicit0.test (1606 of 2034) PASS: lldb-unit :: Utility/./UtilityTests/OptionsWithRawTest.SingleWordSuffix (1607 of 2034) PASS: lldb-api :: macosx/save_crashlog/TestSaveCrashlog.py (1608 of 2034) PASS: lldb-unit :: Utility/./UtilityTests/StatusTest.ErrorCodeConstructor (1609 of 2034) PASS: lldb-shell :: Commands/command-script-import.test (1610 of 2034) PASS: lldb-unit :: Core/./LLDBCoreTests/RichManglingContextTest.IPDRealloc (1611 of 2034) UNSUPPORTED: lldb-shell :: SymbolFile/PDB/enums-layout.test (1612 of 2034) PASS: lldb-unit :: Utility/./UtilityTests/TimeoutTest.Construction (1613 of 2034) PASS: lldb-api :: lang/objc/objc-static-method-stripped/TestObjCStaticMethodStripped.py (1614 of 2034) PASS: lldb-unit :: Utility/./UtilityTests/ArchSpecTest.MergeFromMachOUnknown (1615 of 2034) PASS: lldb-shell :: SymbolFile/DWARF/debug_loc_and_loclists.s (1616 of 2034) PASS: lldb-unit :: Utility/./UtilityTests/RangeTest.Union (1617 of 2034) PASS: lldb-unit :: Symbol/./SymbolTests/TestTypeSystemClang.TestRecordHasFields (1618 of 2034) PASS: lldb-shell :: SymbolFile/DWARF/find-inline-method.s (1619 of 2034) PASS: lldb-api :: commands/platform/basic/TestPlatformCommand.py (1620 of 2034) PASS: lldb-unit :: Host/./HostTests/HostInfoTest.GetAugmentedArchSpec (1621 of 2034) UNSUPPORTED: lldb-api :: lang/objc/rdar-12408181/TestRdar12408181.py (1622 of 2034) PASS: lldb-shell :: SymbolFile/DWARF/find-method-local-struct.cpp (1623 of 2034) PASS: lldb-unit :: Utility/./UtilityTests/StringLexerTest.PutBack (1624 of 2034) UNSUPPORTED: lldb-api :: commands/register/register/intel_xtended_registers/mpx_offset_intersection/TestMPXOffsetIntersection.py (1625 of 2034) PASS: lldb-unit :: Language/Highlighting/./HighlighterTests/HighlighterTest.ClangStringLiterals (1626 of 2034) PASS: lldb-unit :: Utility/./UtilityTests/FileSpecTest.Match (1627 of 2034) PASS: lldb-unit :: Expression/./ExpressionTests/CppModuleConfigurationTest.UnrelatedLibrary (1628 of 2034) PASS: lldb-api :: commands/quit/TestQuit.py (1629 of 2034) PASS: lldb-unit :: Utility/./UtilityTests/StringListTest.ShiftStdString (1630 of 2034) PASS: lldb-unit :: Utility/./UtilityTests/UUIDTest.StringConverion (1631 of 2034) PASS: lldb-shell :: Reproducer/TestDiscard.test (1632 of 2034) PASS: lldb-api :: python_api/lldbutil/process/TestPrintStackTraces.py (1633 of 2034) PASS: lldb-api :: lang/cpp/std-function-step-into-callable/TestStdFunctionStepIntoCallable.py (1634 of 2034) UNSUPPORTED: lldb-shell :: Unwind/eh-frame-small-fde.test (1635 of 2034) PASS: lldb-api :: functionalities/fat_archives/TestFatArchives.py (1636 of 2034) PASS: lldb-api :: commands/breakpoint/set/func-regex/TestBreakpointRegexError.py (1637 of 2034) PASS: lldb-unit :: ScriptInterpreter/Python/./ScriptInterpreterPythonTests/PythonDataObjectsTest.TestObjectAttributes (1638 of 2034) PASS: lldb-unit :: debugserver/./debugserverTests/RNBSocket.LoopBackConnectIPv6 (1639 of 2034) UNSUPPORTED: lldb-api :: functionalities/thread/multi_break/TestMultipleBreakpoints.py (1640 of 2034) PASS: lldb-unit :: Process/gdb-remote/./ProcessGdbRemoteTests/GDBRemoteCommunicationClientTest.GetQOffsets (1641 of 2034) PASS: lldb-api :: macosx/nslog/TestDarwinNSLogOutput.py (1642 of 2034) PASS: lldb-api :: tools/lldb-server/inferior-crash/TestGdbRemoteSegFault.py (1643 of 2034) UNSUPPORTED: lldb-api :: linux/add-symbols/TestTargetSymbolsAddCommand.py (1644 of 2034) PASS: lldb-api :: commands/expression/call-throws/TestCallThatThrows.py (1645 of 2034) PASS: lldb-unit :: UnwindAssembly/x86/./UnwindAssemblyx86Tests/Testx86AssemblyInspectionEngine.TestPushImm (1646 of 2034) UNSUPPORTED: lldb-shell :: Register/x86-gp-write.test (1647 of 2034) PASS: lldb-unit :: ScriptInterpreter/Python/./ScriptInterpreterPythonTests/PythonDataObjectsTest.TestCallable (1648 of 2034) PASS: lldb-api :: python_api/sbdata/TestSBData.py (1649 of 2034) PASS: lldb-unit :: Utility/./UtilityTests/StreamTeeTest.AppendStream (1650 of 2034) PASS: lldb-unit :: Utility/./UtilityTests/ProcessInstanceInfoMatch.Name (1651 of 2034) PASS: lldb-api :: macosx/indirect_symbol/TestIndirectSymbols.py (1652 of 2034) PASS: lldb-unit :: Utility/./UtilityTests/StreamTest.PutMaxHex64ByteOrderLittle (1653 of 2034) PASS: lldb-unit :: SymbolFile/NativePDB/./SymbolFileNativePDBTests/PDBFPOProgramToDWARFExpressionTests.MultipleDependentAssignments (1654 of 2034) PASS: lldb-unit :: UnwindAssembly/x86/./UnwindAssemblyx86Tests/Testx86AssemblyInspectionEngine.TestReturnDetect (1655 of 2034) PASS: lldb-api :: lang/cpp/unicode-literals/TestUnicodeLiterals.py (1656 of 2034) PASS: lldb-api :: tools/lldb-server/TestLldbGdbServer.py (1657 of 2034) PASS: lldb-shell :: Breakpoint/split-dwarf-5-addrbase.test (1658 of 2034) UNSUPPORTED: lldb-shell :: ScriptInterpreter/Lua/persistent_state.test (1659 of 2034) PASS: lldb-api :: python_api/watchpoint/TestWatchpointIter.py (1660 of 2034) PASS: lldb-api :: python_api/sbvalue_const_addrof/TestSBValueConstAddrOf.py (1661 of 2034) PASS: lldb-unit :: Utility/./UtilityTests/ScalarTest.Division (1662 of 2034) PASS: lldb-unit :: Utility/./UtilityTests/RangeTest.ClearWithStarAddress (1663 of 2034) UNSUPPORTED: lldb-api :: functionalities/data-formatter/data-formatter-stl/libstdcpp/string/TestDataFormatterStdString.py (1664 of 2034) PASS: lldb-unit :: Utility/./UtilityTests/ConstStringTest.CompareConstString (1665 of 2034) PASS: lldb-shell :: Expr/TestMultilineExpr.test (1666 of 2034) PASS: lldb-api :: functionalities/inferior-crashing/TestInferiorCrashing.py (1667 of 2034) PASS: lldb-unit :: UnwindAssembly/x86/./UnwindAssemblyx86Tests/Testx86AssemblyInspectionEngine.TestAddESP (1668 of 2034) PASS: lldb-unit :: Utility/./UtilityTests/ScalarTest.CastOperations (1669 of 2034) PASS: lldb-shell :: ObjectFile/ELF/PT_TLS-overlap-PT_LOAD.yaml (1670 of 2034) UNSUPPORTED: lldb-api :: functionalities/darwin_log/filter/exact_match/subsystem/TestDarwinLogFilterMatchSubsystem.py (1671 of 2034) UNSUPPORTED: lldb-api :: functionalities/exec/TestExec.py (1672 of 2034) PASS: lldb-shell :: SymbolFile/DWARF/debug-names-compressed.cpp (1673 of 2034) PASS: lldb-unit :: Symbol/./SymbolTests/TestTypeSystemClang.TestGetBasicTypeFromName (1674 of 2034) PASS: lldb-unit :: ScriptInterpreter/Python/./ScriptInterpreterPythonTests/PythonDataObjectsTest.TestPythonFile (1675 of 2034) PASS: lldb-api :: lang/cpp/diamond/TestDiamond.py (1676 of 2034) PASS: lldb-unit :: SymbolFile/DWARF/./SymbolFileDWARFTests/SymbolFileDWARFTests.TestAbilitiesForDWARF (1677 of 2034) UNSUPPORTED: lldb-api :: benchmarks/turnaround/TestCompileRunToBreakpointTurnaround.py (1678 of 2034) PASS: lldb-unit :: Utility/./UtilityTests/ArchSpecTest.OperatorBool (1679 of 2034) PASS: lldb-api :: python_api/sbplatform/TestSBPlatform.py (1680 of 2034) PASS: lldb-unit :: Utility/./UtilityTests/StringExtractorTest.GetHexU8_Extra_NoEof (1681 of 2034) PASS: lldb-shell :: BuildScript/script-args.test (1682 of 2034) PASS: lldb-api :: functionalities/data-formatter/ostypeformatting/TestFormattersOsType.py (1683 of 2034) UNSUPPORTED: lldb-api :: functionalities/darwin_log/filter/exact_match/activity-chain/TestDarwinLogFilterMatchActivityChain.py (1684 of 2034) PASS: lldb-api :: lang/objc/radar-9691614/TestObjCMethodReturningBOOL.py (1685 of 2034) PASS: lldb-api :: commands/expression/top-level/TestTopLevelExprs.py (1686 of 2034) UNSUPPORTED: lldb-shell :: ScriptInterpreter/Lua/nested_sessions.test (1687 of 2034) PASS: lldb-shell :: ObjectFile/ELF/avr-basic-info.yaml (1688 of 2034) PASS: lldb-unit :: Utility/./UtilityTests/OptionsWithRawTest.WhitespaceInput (1689 of 2034) PASS: lldb-shell :: SymbolFile/DWARF/compilercontext.ll (1690 of 2034) PASS: lldb-api :: functionalities/data-formatter/user-format-vs-summary/TestUserFormatVsSummary.py (1691 of 2034) PASS: lldb-unit :: Host/./HostTests/MainLoopTest.TerminatesImmediately (1692 of 2034) PASS: lldb-shell :: Process/Optimization.test (1693 of 2034) PASS: lldb-shell :: SymbolFile/NativePDB/break-by-line.cpp (1694 of 2034) PASS: lldb-api :: lang/objc/modules-auto-import/TestModulesAutoImport.py (1695 of 2034) PASS: lldb-shell :: ObjectFile/ELF/PT_LOAD-overlap-section.yaml (1696 of 2034) UNSUPPORTED: lldb-api :: functionalities/tsan/basic/TestTsanBasic.py (1697 of 2034) PASS: lldb-unit :: Utility/./UtilityTests/UriParserTest.LongPath (1698 of 2034) PASS: lldb-unit :: Host/./HostTests/HostInfoTest.GetXcodeSDK (1699 of 2034) PASS: lldb-api :: commands/expression/completion/TestExprCompletion.py (1700 of 2034) PASS: lldb-api :: lang/c/unicode/TestUnicodeSymbols.py (1701 of 2034) PASS: lldb-api :: lang/cpp/char8_t/TestCxxChar8_t.py (1702 of 2034) PASS: lldb-unit :: SymbolFile/NativePDB/./SymbolFileNativePDBTests/PDBFPOProgramToDWARFExpressionTests.MultipleIndependentAssignments (1703 of 2034) PASS: lldb-api :: lang/objc/rdar-10967107/TestRdar10967107.py (1704 of 2034) PASS: lldb-unit :: Utility/./UtilityTests/StreamTest.PutStringAsRawHex8 (1705 of 2034) PASS: lldb-api :: source-manager/TestSourceManager.py (1706 of 2034) PASS: lldb-api :: functionalities/data-formatter/data-formatter-stl/libcxx/multimap/TestDataFormatterLibccMultiMap.py (1707 of 2034) PASS: lldb-unit :: Utility/./UtilityTests/StringExtractorTest.GetHexBytesAvail_Partial (1708 of 2034) PASS: lldb-unit :: Host/./HostTests/NativeProcessProtocolTest.SetBreakpointFailWrite (1709 of 2034) PASS: lldb-shell :: ScriptInterpreter/Python/crashlog.test (1710 of 2034) PASS: lldb-unit :: Utility/./UtilityTests/RangeTest.Constructor (1711 of 2034) PASS: lldb-unit :: Utility/./UtilityTests/NameMatchesTest.Ignore (1712 of 2034) UNSUPPORTED: lldb-api :: commands/expression/completion-crash-invalid-iterator/TestInvalidIteratorCompletionCrash.py (1713 of 2034) PASS: lldb-unit :: Host/./HostTests/HostInfoTest.GetHostname (1714 of 2034) PASS: lldb-shell :: Reproducer/TestVersionCheck.test (1715 of 2034) PASS: lldb-unit :: Utility/./UtilityTests/RangeDataVector.FindEntryIndexesThatContain_Overlap (1716 of 2034) UNSUPPORTED: lldb-api :: benchmarks/libcxxmap/TestBenchmarkLibcxxMap.py (1717 of 2034) PASS: lldb-shell :: Reproducer/TestMultipleTargets.test (1718 of 2034) PASS: lldb-unit :: Utility/./UtilityTests/StreamTest.AddressEmptyPrefix (1719 of 2034) PASS: lldb-api :: lang/objcxx/cxx-bridged-po/TestObjCXXBridgedPO.py (1720 of 2034) PASS: lldb-api :: functionalities/data-formatter/pyobjsynthprovider/TestPyObjSynthProvider.py (1721 of 2034) PASS: lldb-api :: commands/frame/diagnose/dereference-argument/TestDiagnoseDereferenceArgument.py (1722 of 2034) PASS: lldb-unit :: Utility/./UtilityTests/BinaryStreamTest.PutSLEB128SevenBytes (1723 of 2034) PASS: lldb-api :: functionalities/postmortem/elf-core/gcore/TestGCore.py (1724 of 2034) PASS: lldb-api :: functionalities/postmortem/elf-core/thread_crash/TestLinuxCoreThreads.py (1725 of 2034) PASS: lldb-api :: lang/objc/modules-app-update/TestClangModulesAppUpdate.py (1726 of 2034) PASS: lldb-unit :: Utility/./UtilityTests/StringListTest.Join (1727 of 2034) PASS: lldb-api :: functionalities/thread/crash_during_step/TestCrashDuringStep.py (1728 of 2034) PASS: lldb-api :: functionalities/breakpoint/breakpoint_locations/TestBreakpointLocations.py (1729 of 2034) PASS: lldb-unit :: Utility/./UtilityTests/StringExtractorTest.GetU32BigEndian (1730 of 2034) PASS: lldb-api :: commands/expression/result_numbering/TestResultNumbering.py (1731 of 2034) PASS: lldb-unit :: Utility/./UtilityTests/SerializationRountripTest.SerializeDeserializePodReferences (1732 of 2034) PASS: lldb-shell :: Reproducer/TestGDBRemoteRepro.test (1733 of 2034) PASS: lldb-shell :: Settings/TestLineMarkerColor.test (1734 of 2034) PASS: lldb-unit :: Utility/./UtilityTests/ArgsTest.TestArgv (1735 of 2034) PASS: lldb-unit :: Process/gdb-remote/./ProcessGdbRemoteTests/GDBRemoteClientBaseTest.SendContinueAndLateInterrupt (1736 of 2034) PASS: lldb-api :: functionalities/breakpoint/require_hw_breakpoints/TestRequireHWBreakpoints.py (1737 of 2034) PASS: lldb-api :: commands/watchpoints/watchpoint_count/TestWatchpointCount.py (1738 of 2034) PASS: lldb-shell :: Process/UnsupportedLanguage.test (1739 of 2034) PASS: lldb-unit :: Utility/./UtilityTests/StringExtractorTest.GetHexU8_Exact (1740 of 2034) PASS: lldb-api :: lang/cpp/char1632_t/TestChar1632T.py (1741 of 2034) PASS: lldb-unit :: Process/gdb-remote/./ProcessGdbRemoteTests/GDBRemoteCommunicationClientTest.GetMemoryRegionInfo (1742 of 2034) PASS: lldb-shell :: SymbolFile/NativePDB/ast-types.cpp (1743 of 2034) PASS: lldb-api :: functionalities/data-formatter/data-formatter-objc/TestDataFormatterObjCNSData.py (1744 of 2034) PASS: lldb-api :: commands/statistics/basic/TestStats.py (1745 of 2034) PASS: lldb-unit :: Host/./HostTests/SocketTest.TCPGetConnectURI (1746 of 2034) PASS: lldb-unit :: Utility/./UtilityTests/StreamTest.PutHex64ByteOrderBig (1747 of 2034) PASS: lldb-api :: macosx/add-dsym/TestAddDsymMidExecutionCommand.py (1748 of 2034) PASS: lldb-unit :: Utility/./UtilityTests/FileSpecTest.EqualDotsPosix (1749 of 2034) PASS: lldb-api :: lang/objc/objc-property/TestObjCProperty.py (1750 of 2034) PASS: lldb-unit :: Utility/./UtilityTests/StringExtractorTest.DecodeHexU8_Underflow (1751 of 2034) PASS: lldb-api :: commands/expression/cast_int_to_anonymous_enum/TestCastIntToAnonymousEnum.py (1752 of 2034) PASS: lldb-unit :: Utility/./UtilityTests/AnsiTerminal.Empty (1753 of 2034) PASS: lldb-unit :: Utility/./UtilityTests/StreamTest.PutHex16ByteOrderLittle (1754 of 2034) PASS: lldb-unit :: ObjectFile/Breakpad/./ObjectFileBreakpadTests/ModuleRecord.parse (1755 of 2034) PASS: lldb-unit :: Utility/./UtilityTests/ScalarTest.ComparisonFloat (1756 of 2034) XFAIL: lldb-shell :: Register/x86-64-write.test (1757 of 2034) PASS: lldb-api :: tools/lldb-vscode/coreFile/TestVSCode_coreFile.py (1758 of 2034) PASS: lldb-unit :: Utility/./UtilityTests/StreamTest.PutHex64ByteOrderLittle (1759 of 2034) PASS: lldb-unit :: Utility/./UtilityTests/StreamTest.PutRawBytesToMixedEndian (1760 of 2034) PASS: lldb-api :: functionalities/data-formatter/data-formatter-stl/libcxx/unique_ptr/TestDataFormatterLibcxxUniquePtr.py (1761 of 2034) PASS: lldb-unit :: Expression/./ExpressionTests/DiagnosticManagerTest.HasFixits (1762 of 2034) PASS: lldb-unit :: Expression/./ExpressionTests/DiagnosticManagerTest.AppendMessageNoDiag (1763 of 2034) PASS: lldb-unit :: Utility/./UtilityTests/Flags.IsClear (1764 of 2034) PASS: lldb-api :: commands/expression/import-std-module/forward_list/TestForwardListFromStdModule.py (1765 of 2034) PASS: lldb-api :: functionalities/data-formatter/data-formatter-python-synth/TestDataFormatterPythonSynth.py (1766 of 2034) PASS: lldb-api :: commands/platform/basic/TestPlatformPython.py (1767 of 2034) PASS: lldb-unit :: Utility/./UtilityTests/ConstStringTest.format_provider (1768 of 2034) PASS: lldb-api :: lang/c/stepping/TestThreadStepping.py (1769 of 2034) PASS: lldb-api :: commands/expression/call-function/TestCallUserDefinedFunction.py (1770 of 2034) PASS: lldb-unit :: Utility/./UtilityTests/ProcessInstanceInfo.Yaml (1771 of 2034) PASS: lldb-unit :: Utility/./UtilityTests/DataExtractorTest.GetCStr (1772 of 2034) PASS: lldb-unit :: SymbolFile/NativePDB/./SymbolFileNativePDBTests/PDBFPOProgramToDWARFExpressionTests.UnsupportedRASearch (1773 of 2034) PASS: lldb-shell :: Unwind/thread-step-out-ret-addr-check.test (1774 of 2034) PASS: lldb-api :: lang/cpp/call-function/TestCallCPPFunction.py (1775 of 2034) PASS: lldb-api :: commands/watchpoints/multiple_threads/TestWatchpointMultipleThreads.py (1776 of 2034) PASS: lldb-api :: python_api/section/TestSectionAPI.py (1777 of 2034) PASS: lldb-unit :: Utility/./UtilityTests/StringExtractorTest.GetNameColonValueNoSemicolon (1778 of 2034) PASS: lldb-unit :: Core/./LLDBCoreTests/CommunicationTest.SynchronizeWhileClosing (1779 of 2034) PASS: lldb-shell :: ObjectFile/wasm/unified-debug-sections.yaml (1780 of 2034) PASS: lldb-shell :: SymbolFile/DWARF/debug-types-address-ranges.s (1781 of 2034) PASS: lldb-unit :: Process/gdb-remote/./ProcessGdbRemoteTests/GDBRemoteCommunicationTest.ReadPacket_checksum (1782 of 2034) PASS: lldb-unit :: Utility/./UtilityTests/StreamTeeTest.CopyConstructor (1783 of 2034) PASS: lldb-unit :: Process/gdb-remote/./ProcessGdbRemoteTests/GDBRemoteCommunicationClientTest.WriteRegisterNoSuffix (1784 of 2034) PASS: lldb-unit :: Utility/./UtilityTests/StringListTest.ForRange (1785 of 2034) PASS: lldb-api :: lang/cpp/rvalue-references/TestRvalueReferences.py (1786 of 2034) PASS: lldb-unit :: Utility/./UtilityTests/RecordReplayTest.InstrumentedBarRef (1787 of 2034) PASS: lldb-api :: commands/watchpoints/watchpoint_commands/command/TestWatchpointCommandLLDB.py (1788 of 2034) PASS: lldb-api :: functionalities/thread/concurrent_events/TestConcurrentDelaySignalWatch.py (1789 of 2034) UNSUPPORTED: lldb-api :: functionalities/ubsan/basic/TestUbsanBasic.py (1790 of 2034) PASS: lldb-unit :: Utility/./UtilityTests/CompletionRequest.TryCompleteCurrentArgGood (1791 of 2034) PASS: lldb-shell :: ObjectFile/ELF/netbsd-exec-8.99.30-amd64.yaml (1792 of 2034) PASS: lldb-shell :: SymbolFile/DWARF/find-function-regex.cpp (1793 of 2034) PASS: lldb-shell :: SymbolFile/DWARF/debug_loc-aslr.s (1794 of 2034) PASS: lldb-unit :: Process/gdb-remote/./ProcessGdbRemoteTests/GDBRemoteClientBaseTest.SendContinueAndInterrupt (1795 of 2034) PASS: lldb-unit :: Utility/./UtilityTests/StringListTest.JoinSingle (1796 of 2034) PASS: lldb-shell :: ObjectFile/ELF/many-sections.s (1797 of 2034) PASS: lldb-unit :: Symbol/./SymbolTests/DWARFCallFrameInfoTest.Basic_eh (1798 of 2034) PASS: lldb-shell :: Breakpoint/single-file-split-dwarf.test (1799 of 2034) PASS: lldb-api :: python_api/value/empty_class/TestValueAPIEmptyClass.py (1800 of 2034) PASS: lldb-shell :: Settings/TestFrameFormatNoColor.test (1801 of 2034) PASS: lldb-unit :: ObjectFile/ELF/./ObjectFileELFTests/ObjectFileELFTest.SectionsResolveConsistently (1802 of 2034) PASS: lldb-api :: lang/c/find_struct_type/TestFindStructTypes.py (1803 of 2034) PASS: lldb-api :: functionalities/data-formatter/ptr_ref_typedef/TestPtrRef2Typedef.py (1804 of 2034) PASS: lldb-api :: functionalities/tail_call_frames/disambiguate_call_site/TestDisambiguateCallSite.py (1805 of 2034) PASS: lldb-api :: lang/c/shared_lib/TestSharedLib.py (1806 of 2034) PASS: lldb-unit :: Utility/./UtilityTests/VASprintfTest.EncodingError (1807 of 2034) PASS: lldb-api :: commands/expression/import-std-module/vector-of-vectors/TestVectorOfVectorsFromStdModule.py (1808 of 2034) UNSUPPORTED: lldb-api :: functionalities/darwin_log/filter/exact_match/activity/TestDarwinLogFilterMatchActivity.py (1809 of 2034) PASS: lldb-api :: functionalities/float-display/TestFloatDisplay.py (1810 of 2034) PASS: lldb-api :: commands/expression/two-files/TestObjCTypeQueryFromOtherCompileUnit.py (1811 of 2034) PASS: lldb-unit :: Host/./HostTests/SocketTest.UDPGetConnectURI (1812 of 2034) UNSUPPORTED: lldb-api :: benchmarks/libcxxlist/TestBenchmarkLibcxxList.py (1813 of 2034) PASS: lldb-api :: functionalities/var_path/TestVarPath.py (1814 of 2034) PASS: lldb-api :: lang/objc/direct-dispatch-step/TestObjCDirectDispatchStepping.py (1815 of 2034) PASS: lldb-api :: commands/expression/import-std-module/conflicts/TestStdModuleWithConflicts.py (1816 of 2034) PASS: lldb-unit :: Utility/./UtilityTests/StringLexerTest.Next (1817 of 2034) PASS: lldb-shell :: SymbolFile/Breakpad/unwind-via-stack-win-no-memory-info.yaml (1818 of 2034) PASS: lldb-unit :: Process/minidump/./LLDBMinidumpTests/MinidumpParserTest.GetMiscInfoWindows (1819 of 2034) PASS: lldb-api :: tools/lldb-server/TestGdbRemoteAttach.py (1820 of 2034) PASS: lldb-api :: commands/expression/anonymous-struct/TestCallUserAnonTypedef.py (1821 of 2034) PASS: lldb-unit :: Host/./HostTests/NativeProcessProtocolTest.ReadCStringFromMemory_MaxSize (1822 of 2034) UNSUPPORTED: lldb-shell :: SymbolFile/DWARF/debug-types-expressions.test (1823 of 2034) PASS: lldb-unit :: Utility/./UtilityTests/UriParserTest.PortOverflow (1824 of 2034) PASS: lldb-shell :: Driver/TestCore.test (1825 of 2034) UNSUPPORTED: lldb-api :: functionalities/signal/handle-segv/TestHandleSegv.py (1826 of 2034) UNSUPPORTED: lldb-api :: functionalities/darwin_log/filter/exact_match/category/TestDarwinLogFilterMatchCategory.py (1827 of 2034) PASS: lldb-unit :: Host/./HostTests/Host.GetEnvironment (1828 of 2034) PASS: lldb-api :: commands/expression/codegen-crash-typedefdecl-not-in_declcontext/TestCodegenCrashTypedefDeclNotInDeclContext.py (1829 of 2034) UNSUPPORTED: lldb-shell :: SymbolFile/PDB/class-layout.test (1830 of 2034) PASS: lldb-unit :: Utility/./UtilityTests/RangeTest.DoesIntersect (1831 of 2034) PASS: lldb-unit :: Utility/./UtilityTests/FileSpecTest.FileAndDirectoryComponents (1832 of 2034) PASS: lldb-api :: commands/expression/persistent_variables/TestPersistentVariables.py (1833 of 2034) PASS: lldb-unit :: Utility/./UtilityTests/StringLexerTest.Peek (1834 of 2034) PASS: lldb-api :: functionalities/data-formatter/data-formatter-ptr-to-array/TestPtrToArrayFormatting.py (1835 of 2034) UNSUPPORTED: lldb-shell :: SymbolFile/PDB/expressions.test (1836 of 2034) PASS: lldb-unit :: Host/./HostTests/FileSystemTest.GetPermissions (1837 of 2034) PASS: lldb-unit :: Target/./TargetTests/PathMappingListTest.AbsoluteTests (1838 of 2034) PASS: lldb-unit :: Utility/./UtilityTests/BinaryStreamTest.PutULEB128Zero (1839 of 2034) PASS: lldb-api :: macosx/function-starts/TestFunctionStarts.py (1840 of 2034) PASS: lldb-api :: functionalities/breakpoint/breakpoint_hit_count/TestBreakpointHitCount.py (1841 of 2034) UNSUPPORTED: lldb-api :: functionalities/data-formatter/data-formatter-stl/libstdcpp/list/TestDataFormatterStdList.py (1842 of 2034) PASS: lldb-api :: commands/command/source/TestCommandSource.py (1843 of 2034) PASS: lldb-api :: python_api/frame/get-variables/TestGetVariables.py (1844 of 2034) PASS: lldb-api :: commands/watchpoints/watchpoint_set_command/TestWatchLocationWithWatchSet.py (1845 of 2034) PASS: lldb-unit :: Utility/./UtilityTests/AnsiTerminal.Incomplete (1846 of 2034) PASS: lldb-shell :: SymbolFile/DWARF/debug_aranges-empty-section.s (1847 of 2034) PASS: lldb-api :: commands/command/nested_alias/TestNestedAlias.py (1848 of 2034) PASS: lldb-api :: commands/expression/weak_symbols/TestWeakSymbols.py (1849 of 2034) PASS: lldb-unit :: Utility/./UtilityTests/UserIDResolver.GetUserName (1850 of 2034) PASS: lldb-unit :: Utility/./UtilityTests/StreamTest.PutHex32ByteOrderLittle (1851 of 2034) PASS: lldb-shell :: SymbolFile/DWARF/parallel-indexing-stress.s (1852 of 2034) UNSUPPORTED: lldb-api :: functionalities/breakpoint/breakpoint_callback_command_source/TestBreakpointCallbackCommandSource.py (1853 of 2034) PASS: lldb-unit :: Utility/./UtilityTests/StringExtractorTest.GetHexBytesAvail (1854 of 2034) PASS: lldb-unit :: Process/minidump/./LLDBMinidumpTests/MinidumpParserTest.MinidumpDuplicateModuleMinAddress (1855 of 2034) PASS: lldb-unit :: Utility/./UtilityTests/ScalarTest.Scalar_512 (1856 of 2034) PASS: lldb-unit :: Utility/./UtilityTests/StringExtractorTest.GetHexBytes_FullString (1857 of 2034) PASS: lldb-unit :: Utility/./UtilityTests/StringLexerTest.GetUnlexed (1858 of 2034) PASS: lldb-unit :: Utility/./UtilityTests/StringListTest.GetMaxStringLengthEmpty (1859 of 2034) PASS: lldb-unit :: Process/minidump/./LLDBMinidumpTests/MinidumpParserTest.GetMemoryRegionInfo (1860 of 2034) PASS: lldb-unit :: Utility/./UtilityTests/SerializationRountripTest.SerializeDeserializeObjectPointer (1861 of 2034) PASS: lldb-api :: types/TestShortTypeExpr.py (1862 of 2034) PASS: lldb-unit :: Symbol/./SymbolTests/TestTypeSystemClang.TestConvertAccessTypeToAccessSpecifier (1863 of 2034) PASS: lldb-api :: tools/lldb-vscode/stackTrace/TestVSCode_stackTrace.py (1864 of 2034) UNSUPPORTED: lldb-api :: commands/expression/multiline-completion/TestMultilineCompletion.py (1865 of 2034) PASS: lldb-api :: functionalities/thread/concurrent_events/TestConcurrentManyWatchpoints.py (1866 of 2034) PASS: lldb-unit :: Utility/./UtilityTests/StringListTest.ForRangeEmpty (1867 of 2034) UNSUPPORTED: lldb-api :: lang/objc/objc-dynamic-value/TestObjCDynamicValue.py (1868 of 2034) UNSUPPORTED: lldb-api :: functionalities/ubsan/user-expression/TestUbsanUserExpression.py (1869 of 2034) PASS: lldb-unit :: UnwindAssembly/x86/./UnwindAssemblyx86Tests/Testx86AssemblyInspectionEngine.TestPushEAX (1870 of 2034) PASS: lldb-api :: tools/lldb-server/TestGdbRemote_vCont.py (1871 of 2034) PASS: lldb-unit :: Utility/./UtilityTests/StreamTest.PutCString (1872 of 2034) PASS: lldb-unit :: Utility/./UtilityTests/UriParserTest.Minimal (1873 of 2034) PASS: lldb-unit :: Process/minidump/./LLDBMinidumpTests/MinidumpParserTest.GetPidWow64 (1874 of 2034) PASS: lldb-unit :: Process/minidump/./LLDBMinidumpTests/MinidumpParserTest.GetExceptionStream (1875 of 2034) PASS: lldb-api :: functionalities/load_using_paths/TestLoadUsingPaths.py (1876 of 2034) PASS: lldb-shell :: Breakpoint/debug_rnglistx_rlex.test (1877 of 2034) PASS: lldb-api :: functionalities/data-formatter/data-formatter-objc/TestDataFormatterObjCExpr.py (1878 of 2034) PASS: lldb-api :: functionalities/plugins/command_plugin/TestPluginCommands.py (1879 of 2034) PASS: lldb-api :: commands/expression/import-std-module/empty-module/TestEmptyStdModule.py (1880 of 2034) PASS: lldb-unit :: Utility/./UtilityTests/ArgsTest.ReplaceArgumentAtIndexFarOutOfRange (1881 of 2034) PASS: lldb-api :: commands/expression/import-std-module/vector-dbg-info-content/TestDbgInfoContentVectorFromStdModule.py (1882 of 2034) PASS: lldb-api :: lang/cpp/auto/TestCPPAuto.py (1883 of 2034) PASS: lldb-unit :: Core/./LLDBCoreTests/UniqueCStringMap.NoDefaultConstructor (1884 of 2034) UNSUPPORTED: lldb-api :: functionalities/darwin_log/source/debug/TestDarwinLogSourceDebug.py (1885 of 2034) PASS: lldb-shell :: Quit/TestQuitExitCodeTooManyArgs.test (1886 of 2034) PASS: lldb-api :: commands/expression/entry-bp/TestExprEntryBP.py (1887 of 2034) PASS: lldb-api :: macosx/duplicate-archive-members/TestDuplicateMembers.py (1888 of 2034) PASS: lldb-api :: lang/cpp/wchar_t/TestCxxWCharT.py (1889 of 2034) PASS: lldb-api :: commands/expression/import-std-module/list/TestListFromStdModule.py (1890 of 2034) UNSUPPORTED: lldb-shell :: Register/x86-zmm-write.test (1891 of 2034) PASS: lldb-api :: lang/cpp/trivial_abi/TestTrivialABI.py (1892 of 2034) UNSUPPORTED: lldb-shell :: SymbolFile/dissassemble-entry-point.s (1893 of 2034) PASS: lldb-unit :: Utility/./UtilityTests/RecordReplayTest.InstrumentedBarPtr (1894 of 2034) PASS: lldb-api :: lang/c/conflicting-symbol/TestConflictingSymbol.py (1895 of 2034) PASS: lldb-unit :: tools/lldb-server/tests/./LLDBServerTests/TestBase.LaunchModePreservesEnvironment (1896 of 2034) UNSUPPORTED: lldb-shell :: SymbolFile/PDB/type-quals.test (1897 of 2034) PASS: lldb-api :: python_api/findvalue_duplist/TestSBFrameFindValue.py (1898 of 2034) PASS: lldb-api :: functionalities/breakpoint/hardware_breakpoints/hardware_breakpoint_on_multiple_threads/TestHWBreakMultiThread.py (1899 of 2034) PASS: lldb-api :: commands/frame/diagnose/inheritance/TestDiagnoseInheritance.py (1900 of 2034) PASS: lldb-shell :: SymbolFile/NativePDB/function-types-calling-conv.cpp (1901 of 2034) PASS: lldb-shell :: SymbolFile/DWARF/debug-types-signature-loop.s (1902 of 2034) PASS: lldb-unit :: Utility/./UtilityTests/NameMatchesTest.EndsWith (1903 of 2034) PASS: lldb-api :: tools/lldb-server/TestGdbRemoteRegisterState.py (1904 of 2034) PASS: lldb-unit :: Process/minidump/./LLDBMinidumpTests/MinidumpParserTest.FindMemoryRange (1905 of 2034) PASS: lldb-api :: python_api/type/TestTypeList.py (1906 of 2034) PASS: lldb-unit :: Utility/./UtilityTests/StreamTest.SetIndentLevel (1907 of 2034) PASS: lldb-unit :: UnwindAssembly/x86/./UnwindAssemblyx86Tests/Testx86AssemblyInspectionEngine.Testi386IgnoredRegisters (1908 of 2034) PASS: lldb-api :: lang/c/inlines/TestRedefinitionsInInlines.py (1909 of 2034) PASS: lldb-api :: python_api/thread/TestThreadAPI.py (1910 of 2034) PASS: lldb-api :: commands/expression/call-function/TestCallStopAndContinue.py (1911 of 2034) PASS: lldb-unit :: UnwindAssembly/x86/./UnwindAssemblyx86Tests/Testx86AssemblyInspectionEngine.TestMovRSPtoRBP (1912 of 2034) PASS: lldb-api :: functionalities/thread/concurrent_events/TestConcurrentManyBreakpoints.py (1913 of 2034) UNSUPPORTED: lldb-api :: lang/objc/ptr_refs/TestPtrRefsObjC.py (1914 of 2034) PASS: lldb-api :: python_api/process/TestProcessAPI.py (1915 of 2034) PASS: lldb-unit :: SymbolFile/DWARF/./SymbolFileDWARFTests/SymbolFileDWARFTests.TestAbbrevOutOfOrder (1916 of 2034) PASS: lldb-api :: lang/cpp/offsetof/TestOffsetofCpp.py (1917 of 2034) PASS: lldb-unit :: Utility/./UtilityTests/Predicate.WaitForValueEqualTo (1918 of 2034) PASS: lldb-api :: lang/cpp/thread_local/TestThreadLocal.py (1919 of 2034) PASS: lldb-shell :: Reproducer/TestSynchronous.test (1920 of 2034) PASS: lldb-api :: commands/process/launch-with-shellexpand/TestLaunchWithShellExpand.py (1921 of 2034) PASS: lldb-shell :: SymbolFile/DWARF/debug-types-dwarf5.s (1922 of 2034) PASS: lldb-unit :: Utility/./UtilityTests/StringListTest.GetMaxStringLengthMixed (1923 of 2034) PASS: lldb-shell :: ObjectFile/ELF/aarch64-relocations.yaml (1924 of 2034) PASS: lldb-shell :: ObjectFile/PECOFF/symbol.yaml (1925 of 2034) PASS: lldb-api :: sanity/TestModuleCacheSanity.py (1926 of 2034) PASS: lldb-shell :: Driver/TestFile.test (1927 of 2034) PASS: lldb-api :: python_api/lldbutil/TestSwigVersion.py (1928 of 2034) PASS: lldb-shell :: Breakpoint/jitbp_elf.test (1929 of 2034) UNSUPPORTED: lldb-api :: functionalities/process_save_core/TestProcessSaveCore.py (1930 of 2034) PASS: lldb-unit :: Utility/./UtilityTests/CompletionRequest.TryCompleteCurrentArgMode (1931 of 2034) PASS: lldb-unit :: Utility/./UtilityTests/UriParserTest.BracketedHostnameWithPortIPv4 (1932 of 2034) PASS: lldb-api :: commands/version/TestVersion.py (1933 of 2034) PASS: lldb-unit :: Symbol/./SymbolTests/TestTypeSystemClang.TestGetTypeClassNested (1934 of 2034) PASS: lldb-unit :: Utility/./UtilityTests/StringListTest.LongestCommonPrefix (1935 of 2034) PASS: lldb-unit :: Utility/./UtilityTests/OptionsWithRawTest.EmptyArgsOnlySuffix (1936 of 2034) PASS: lldb-unit :: Process/gdb-remote/./ProcessGdbRemoteTests/GDBRemoteCommunicationServerTest.SendErrorResponse_ErrorList (1937 of 2034) PASS: lldb-api :: python_api/name_lookup/TestNameLookup.py (1938 of 2034) PASS: lldb-shell :: BuildScript/toolchain-clang.test (1939 of 2034) PASS: lldb-api :: commands/expression/radar_8638051/Test8638051.py (1940 of 2034) PASS: lldb-api :: lang/cpp/member-and-local-vars-with-same-name/TestMembersAndLocalsWithSameName.py (1941 of 2034) PASS: lldb-unit :: Host/./HostTests/MainLoopTest.Signal (1942 of 2034) PASS: lldb-shell :: SymbolFile/DWARF/debug_loclists-dwo.s (1943 of 2034) PASS: lldb-unit :: Process/minidump/./LLDBMinidumpTests/MinidumpParserTest.GetArchitecture (1944 of 2034) PASS: lldb-unit :: Utility/./UtilityTests/RangeTest.DoesAdjoinOrIntersect (1945 of 2034) PASS: lldb-unit :: Utility/./UtilityTests/StringListTest.InsertStringAtIndexEnd (1946 of 2034) PASS: lldb-unit :: Utility/./UtilityTests/PassiveReplayTest.InstrumentedFoo (1947 of 2034) PASS: lldb-unit :: Core/./LLDBCoreTests/RichManglingContextTest.Basic (1948 of 2034) PASS: lldb-unit :: ScriptInterpreter/Python/./ScriptInterpreterPythonTests/PythonDataObjectsTest.TestTypeNameResolutionNoDot (1949 of 2034) PASS: lldb-unit :: Language/Highlighting/./HighlighterTests/HighlighterTest.ClangCommas (1950 of 2034) PASS: lldb-unit :: Utility/./UtilityTests/TimerTest.CategoryTimesNested (1951 of 2034) PASS: lldb-api :: commands/expression/rdar42038760/TestScalarURem.py (1952 of 2034) PASS: lldb-unit :: UnwindAssembly/x86/./UnwindAssemblyx86Tests/Testx86AssemblyInspectionEngine.TestSpArithx86_64Augmented (1953 of 2034) PASS: lldb-unit :: Utility/./UtilityTests/VMRange.ContainsRange (1954 of 2034) PASS: lldb-unit :: Expression/./ExpressionTests/DiagnosticManagerTest.PutString (1955 of 2034) PASS: lldb-shell :: ObjectFile/PECOFF/sections-names.yaml (1956 of 2034) PASS: lldb-shell :: Commands/CommandScriptImmediateOutput/CommandScriptImmediateOutputFile.test (1957 of 2034) PASS: lldb-shell :: Minidump/memory-region.yaml (1958 of 2034) PASS: lldb-unit :: ScriptInterpreter/Python/./ScriptInterpreterPythonTests/PythonDataObjectsTest.TestPythonListManipulation (1959 of 2034) PASS: lldb-shell :: ObjectFile/ELF/PT_LOAD.yaml (1960 of 2034) PASS: lldb-api :: commands/expression/import-std-module/weak_ptr/TestWeakPtrFromStdModule.py (1961 of 2034) UNSUPPORTED: lldb-api :: functionalities/thread/create_during_step/TestCreateDuringStep.py (1962 of 2034) PASS: lldb-api :: functionalities/data-formatter/data-formatter-objc/cmtime/TestDataFormatterCMTime.py (1963 of 2034) PASS: lldb-api :: python_api/target/TestTargetAPI.py (1964 of 2034) PASS: lldb-api :: lang/cpp/namespace_conflicts/TestNamespaceConflicts.py (1965 of 2034) PASS: lldb-api :: macosx/find-dsym/bundle-with-dot-in-filename/TestBundleWithDotInFilename.py (1966 of 2034) PASS: lldb-api :: functionalities/wrong_commands/TestWrongCommands.py (1967 of 2034) PASS: lldb-api :: commands/expression/import_base_class_when_class_has_derived_member/TestImportBaseClassWhenClassHasDerivedMember.py (1968 of 2034) PASS: lldb-api :: functionalities/breakpoint/address_breakpoints/TestBadAddressBreakpoints.py (1969 of 2034) PASS: lldb-unit :: Process/minidump/./LLDBMinidumpTests/MinidumpParserTest.GetMemory (1970 of 2034) UNSUPPORTED: lldb-api :: functionalities/data-formatter/data-formatter-stl/libstdcpp/vbool/TestDataFormatterStdVBool.py (1971 of 2034) PASS: lldb-shell :: Expr/TestTypeOfDeclTypeExpr.test (1972 of 2034) PASS: lldb-api :: functionalities/breakpoint/inlined_breakpoints/TestInlinedBreakpoints.py (1973 of 2034) PASS: lldb-unit :: Language/Highlighting/./HighlighterTests/HighlighterTest.ClangScalarLiterals (1974 of 2034) PASS: lldb-shell :: ScriptInterpreter/Python/sb_address_exception.test (1975 of 2034) PASS: lldb-api :: commands/command/history/TestCommandHistory.py (1976 of 2034) PASS: lldb-unit :: Utility/./UtilityTests/XcodeSDKTest.GetSDKTypeForTriple (1977 of 2034) PASS: lldb-unit :: Expression/./ExpressionTests/DiagnosticManagerTest.GetStringSeverityLabels (1978 of 2034) PASS: lldb-shell :: SymbolFile/DWARF/debug-types-dwo-cross-reference.cpp (1979 of 2034) PASS: lldb-api :: commands/watchpoints/watchpoint_disable/TestWatchpointDisable.py (1980 of 2034) PASS: lldb-unit :: UnwindAssembly/x86/./UnwindAssemblyx86Tests/Testx86AssemblyInspectionEngine.TestPushEDI (1981 of 2034) PASS: lldb-api :: python_api/process/io/TestProcessIO.py (1982 of 2034) XFAIL: lldb-shell :: Unwind/prefer-debug-over-eh-frame.test (1983 of 2034) PASS: lldb-api :: functionalities/data-formatter/data-formatter-categories/TestDataFormatterCategories.py (1984 of 2034) PASS: lldb-unit :: Utility/./UtilityTests/LogChannelEnabledTest.LogVerboseThread (1985 of 2034) PASS: lldb-unit :: Expression/./ExpressionTests/DiagnosticManagerTest.GetStringNoDiags (1986 of 2034) PASS: lldb-unit :: ObjectFile/PECOFF/./ObjectFilePECOFFTests/PECallFrameInfoTest.Chained_eh (1987 of 2034) PASS: lldb-unit :: Utility/./UtilityTests/PassiveReplayTest.InstrumentedBar (1988 of 2034) PASS: lldb-unit :: Utility/./UtilityTests/FileSpecTest.PrependPathComponent (1989 of 2034) PASS: lldb-unit :: ScriptInterpreter/Python/./ScriptInterpreterPythonTests/PythonDataObjectsTest.TestPythonInteger (1990 of 2034) PASS: lldb-unit :: Language/Highlighting/./HighlighterTests/HighlighterTest.ClangTrailingBackslashMissingNewLine (1991 of 2034) PASS: lldb-unit :: Utility/./UtilityTests/FileSpecTest.EqualSeparator (1992 of 2034) PASS: lldb-unit :: Language/Highlighting/./HighlighterTests/HighlighterTest.ClangCursorPosInOtherToken (1993 of 2034) PASS: lldb-api :: lang/cpp/template/TestTemplateArgs.py (1994 of 2034) PASS: lldb-unit :: ScriptInterpreter/Python/./ScriptInterpreterPythonTests/PythonDataObjectsTest.TestPythonTupleSize (1995 of 2034) PASS: lldb-api :: commands/watchpoints/watchpoint_commands/condition/TestWatchpointConditionCmd.py (1996 of 2034) PASS: lldb-unit :: ObjectFile/Breakpad/./ObjectFileBreakpadTests/StackCFIRecord.parse (1997 of 2034) PASS: lldb-api :: python_api/hello_world/TestHelloWorld.py (1998 of 2034) PASS: lldb-unit :: SymbolFile/DWARF/./SymbolFileDWARFTests/DWARFASTParserClangTests.EnsureAllDIEsInDeclContextHaveBeenParsedParsesOnlyMatchingEntries (1999 of 2034) PASS: lldb-unit :: SymbolFile/NativePDB/./SymbolFileNativePDBTests/PDBFPOProgramToDWARFExpressionTests.InvalidOpUnary (2000 of 2034) PASS: lldb-api :: commands/apropos/basic/TestApropos.py (2001 of 2034) PASS: lldb-shell :: SymbolFile/DWARF/debug_rnglists.s (2002 of 2034) PASS: lldb-shell :: ObjectFile/Breakpad/uuid-matching-mac.test (2003 of 2034) PASS: lldb-api :: functionalities/signal/handle-abrt/TestHandleAbort.py (2004 of 2034) PASS: lldb-unit :: Utility/./UtilityTests/DataExtractorTest.GetBitfield (2005 of 2034) PASS: lldb-api :: lang/objc/foundation/TestObjCMethodsString.py (2006 of 2034) PASS: lldb-api :: functionalities/data-formatter/data-formatter-objc/TestDataFormatterObjCKVO.py (2007 of 2034) PASS: lldb-api :: functionalities/inferior-assert/TestInferiorAssert.py (2008 of 2034) PASS: lldb-unit :: Utility/./UtilityTests/StreamTest.ShiftOperatorStrings (2009 of 2034) PASS: lldb-unit :: Process/gdb-remote/./ProcessGdbRemoteTests/GDBRemoteCommunicationClientTest.SendGetMetaDataPacket (2010 of 2034) PASS: lldb-unit :: Utility/./UtilityTests/OptionsWithRawTest.SingleWhitespaceInput (2011 of 2034) UNSUPPORTED: lldb-api :: commands/register/register/intel_xtended_registers/mpx_bound_violation/TestBoundViolation.py (2012 of 2034) PASS: lldb-api :: lang/cpp/global_variables/TestCPPGlobalVariables.py (2013 of 2034) PASS: lldb-api :: commands/expression/import-std-module/unique_ptr/TestUniquePtrFromStdModule.py (2014 of 2034) PASS: lldb-shell :: SymbolFile/DWARF/dir-separator-no-comp-dir-relative-name.s (2015 of 2034) PASS: lldb-api :: functionalities/data-formatter/data-formatter-stl/libcxx/vbool/TestDataFormatterLibcxxVBool.py (2016 of 2034) PASS: lldb-unit :: SymbolFile/DWARF/./SymbolFileDWARFTests/XcodeSDKModuleTests.TestModuleGetXcodeSDK (2017 of 2034) PASS: lldb-api :: types/TestFloatTypesExpr.py (2018 of 2034) PASS: lldb-api :: commands/expression/import-std-module/basic/TestImportStdModule.py (2019 of 2034) UNSUPPORTED: lldb-api :: functionalities/unwind/ehframe/TestEhFrameUnwind.py (2020 of 2034) PASS: lldb-unit :: UnwindAssembly/x86/./UnwindAssemblyx86Tests/Testx86AssemblyInspectionEngine.TestPushECX (2021 of 2034) PASS: lldb-unit :: Process/minidump/./LLDBMinidumpTests/MinidumpParserTest.GetMiscInfo_no_stream (2022 of 2034) PASS: lldb-api :: functionalities/postmortem/wow64_minidump/TestWow64MiniDump.py (2023 of 2034) PASS: lldb-api :: functionalities/breakpoint/breakpoint_ids/TestBreakpointIDs.py (2024 of 2034) PASS: lldb-api :: functionalities/data-formatter/setvaluefromcstring/TestSetValueFromCString.py (2025 of 2034) PASS: lldb-api :: commands/expression/calculator_mode/TestCalculatorMode.py (2026 of 2034) PASS: lldb-api :: lang/cpp/scope/TestCppScope.py (2027 of 2034) PASS: lldb-unit :: Symbol/./SymbolTests/TestClangASTImporter.DeportTypeTagDecl (2028 of 2034) PASS: lldb-unit :: Utility/./UtilityTests/StreamTest.PutBytesAsRawHex8ToMixedEndian (2029 of 2034) PASS: lldb-api :: types/TestRecursiveTypes.py (2030 of 2034) PASS: lldb-unit :: UnwindAssembly/x86/./UnwindAssemblyx86Tests/Testx86AssemblyInspectionEngine.TestPushRBP (2031 of 2034) PASS: lldb-api :: python_api/sbenvironment/TestSBEnvironment.py (2032 of 2034) PASS: lldb-api :: functionalities/data-formatter/data-formatter-stl/libcxx/multiset/TestDataFormatterLibcxxMultiSet.py (2033 of 2034) PASS: lldb-api :: lang/cpp/multiple-inheritance/TestCppMultipleInheritance.py (2034 of 2034) Slowest Tests: -------------------------------------------------------------------------- 350.15s: lldb-api :: tools/lldb-server/TestLldbGdbServer.py 266.57s: lldb-api :: lang/cpp/enum_types/TestCPP11EnumTypes.py 253.32s: lldb-api :: api/multithreaded/TestMultithreaded.py 245.25s: lldb-api :: tools/lldb-server/TestGdbRemoteThreadsInStopReply.py 217.78s: lldb-api :: lang/objc/foundation/TestObjCMethods.py 208.74s: lldb-api :: lang/objc/hidden-ivars/TestHiddenIvars.py 183.04s: lldb-api :: lang/objc/objc-new-syntax/TestObjCNewSyntaxLiteral.py 154.28s: lldb-api :: lang/objc/exceptions/TestObjCExceptions.py 152.50s: lldb-api :: lang/cpp/namespace/TestNamespaceLookup.py 139.30s: lldb-api :: lang/objc/real-definition/TestRealDefinition.py 120.78s: lldb-api :: types/TestLongTypesExpr.py 119.48s: lldb-api :: lang/objc/objc-new-syntax/TestObjCNewSyntaxDictionary.py 118.91s: lldb-api :: tools/lldb-server/TestGdbRemote_qThreadStopInfo.py 118.29s: lldb-api :: lang/objc/objc-new-syntax/TestObjCNewSyntaxArray.py 115.75s: lldb-api :: lang/objc/foundation/TestObjCMethodsNSError.py 115.13s: lldb-api :: lang/objc/foundation/TestObjCMethodsString.py 103.35s: lldb-api :: python_api/lldbutil/iter/TestLLDBIterator.py 101.61s: lldb-api :: lang/objcxx/class-name-clash/TestNameClash.py 95.17s: lldb-api :: commands/expression/import-std-module/stack/TestStackFromStdModule.py 91.66s: lldb-api :: functionalities/gdb_remote_client/TestWasm.py

Hide Details

Tests Times: -------------------------------------------------------------------------- [ Range ] :: [ Percentage ] :: [ Count ] -------------------------------------------------------------------------- [340s,360s) :: [ ] :: [ 1/2034] [320s,340s) :: [ ] :: [ 0/2034] [300s,320s) :: [ ] :: [ 0/2034] [280s,300s) :: [ ] :: [ 0/2034] [260s,280s) :: [ ] :: [ 2/2034] [240s,260s) :: [ ] :: [ 1/2034] [220s,240s) :: [ ] :: [ 1/2034] [200s,220s) :: [ ] :: [ 1/2034] [180s,200s) :: [ ] :: [ 1/2034] [160s,180s) :: [ ] :: [ 0/2034] [140s,160s) :: [ ] :: [ 3/2034] [120s,140s) :: [ ] :: [ 4/2034] [100s,120s) :: [ ] :: [ 4/2034] [ 80s,100s) :: [ ] :: [ 8/2034] [ 60s, 80s) :: [ ] :: [ 20/2034] [ 40s, 60s) :: [* ] :: [ 91/2034] [ 20s, 40s) :: [** ] :: [ 115/2034] [ 0s, 20s) :: [*********************************** ] :: [1782/2034] -------------------------------------------------------------------------- ******************** Failing Tests (3): lldb-shell :: SymbolFile/DWARF/DW_TAG_variable-DW_AT_const_value.s lldb-api :: commands/expression/deleting-implicit-copy-constructor/TestDeletingImplicitCopyConstructor.py lldb-unit :: Utility/./UtilityTests/DataExtractorTest.GetSLEB128_bit63

Hide Details

Hide Details

Testing Time: 4348.34s Unsupported Tests : 171 Expected Passes : 1854 Expected Failures : 6 Unexpected Failures: 3 FAILED: tools/lldb/test/CMakeFiles/check-lldb-lit cd /Users/buildslave/jenkins/workspace/lldb-cmake-sanitized/lldb-build/tools/lldb/test && /usr/local/Frameworks/Python.framework/Versions/3.7/bin/python3.7 /Users/buildslave/jenkins/workspace/lldb-cmake-sanitized/lldb-build/./bin/llvm-lit -v --time-tests --shuffle --xunit-xml-output=/Users/buildslave/jenkins/workspace/lldb-cmake-sanitized/test/results.xml -v -j 4 --timeout 1200 /Users/buildslave/jenkins/workspace/lldb-cmake-sanitized/lldb-build/tools/lldb/test ninja: build stopped: subcommand failed. Command failed: Command '['/usr/bin/env', 'TERM=vt100', '/usr/local/bin/ninja', '-v', 'check-lldb']' returned non-zero exit status 1. Command: ['/usr/bin/env', 'TERM=vt100', '/usr/local/bin/ninja', '-v', 'check-lldb'] [Pipeline] } [Pipeline] // timeout [Pipeline] } [Pipeline] // stage [Pipeline] stage [Pipeline] { (Declarative: Post Actions) [Pipeline] scanForIssues [Clang (LLVM based)] Sleeping for 5 seconds due to JENKINS-32191... [Clang (LLVM based)] Parsing console log (workspace: '/Users/buildslave/jenkins/workspace/lldb-cmake-sanitized') [Clang (LLVM based)] Successfully parsed console log [Clang (LLVM based)] -> found 4 issues (skipped 1 duplicate) [Clang (LLVM based)] Post processing issues on 'green-dragon-23' with source code encoding 'UTF-8' [Clang (LLVM based)] Creating SCM blamer to obtain author and commit information for affected files [Clang (LLVM based)] Creating SCM miner to obtain statistics for affected repository files [Clang (LLVM based)] Resolving file names for all issues in source directory '/Users/buildslave/jenkins/workspace/lldb-cmake-sanitized' [Clang (LLVM based)] -> resolved paths in source directory (3 found, 0 not found) [Clang (LLVM based)] Resolving module names from module definitions (build.xml, pom.xml, or Manifest.mf files) [Clang (LLVM based)] -> resolved module names for 4 issues [Clang (LLVM based)] Resolving package names (or namespaces) by parsing the affected files [Clang (LLVM based)] -> resolved package names of 3 affected files [Clang (LLVM based)] No filter has been set, publishing all 4 issues [Clang (LLVM based)] Creating fingerprints for all affected code blocks to track issues over different builds [Clang (LLVM based)] -> created fingerprints for 4 issues (skipped 0 issues) [Clang (LLVM based)] Copying affected files to Jenkins' build folder '/Users/Shared/Jenkins/Home/jobs/lldb-cmake-sanitized/builds/1511/files-with-issues' [Clang (LLVM based)] -> 3 copied, 0 not in workspace, 0 not-found, 0 with I/O error [Pipeline] junit Recording test results [Pipeline] } [Pipeline] // stage [Pipeline] } [Pipeline] // withEnv [Pipeline] } [Pipeline] // node [Pipeline] End of Pipeline ERROR: script returned exit code 1 Finished: FAILURE