Console Output

Skipping 9,405 KB.. Full Log
PASS: lldb-api :: lang/objc/modules-hash-mismatch/TestClangModulesHashMismatch.py (1454 of 2331)
PASS: lldb-unit :: Core/./LLDBCoreTests/SourceFileCache.FindSourceFileFound (1455 of 2331)
PASS: lldb-unit :: Utility/./UtilityTests/OptionsWithRawTest.EmptyInput (1456 of 2331)
XFAIL: lldb-shell :: Expr/nodefaultlib.cpp (1457 of 2331)
PASS: lldb-shell :: Quit/TestQuitExitCodeTooManyArgs.test (1458 of 2331)
UNSUPPORTED: lldb-api :: functionalities/tty/TestTerminal.py (1459 of 2331)
PASS: lldb-api :: functionalities/breakpoint/breakpoint_options/TestBreakpointOptions.py (1460 of 2331)
PASS: lldb-api :: commands/watchpoints/watchpoint_commands/command/TestWatchpointCommandLLDB.py (1461 of 2331)
PASS: lldb-unit :: Utility/./UtilityTests/StringListTest.JoinNonSpace (1462 of 2331)
PASS: lldb-unit :: SymbolFile/DWARF/./SymbolFileDWARFTests/SymbolFileDWARFTests.TestAbbrevOrder1Start1 (1463 of 2331)
PASS: lldb-unit :: Utility/./UtilityTests/ScalarTest.Getters (1464 of 2331)
PASS: lldb-shell :: Quit/TestQuitExitCodeImplicit0.test (1465 of 2331)
PASS: lldb-api :: macosx/builtin-debugtrap/TestBuiltinDebugTrap.py (1466 of 2331)
PASS: lldb-unit :: Utility/./UtilityTests/ScalarTest.ExtractBitfield (1467 of 2331)
PASS: lldb-unit :: Expression/./ExpressionTests/CppModuleConfigurationTest.UnknownLibCppFile (1468 of 2331)
PASS: lldb-shell :: Reproducer/TestDebugSymbols.test (1469 of 2331)
UNSUPPORTED: lldb-api :: functionalities/process_save_core/TestProcessSaveCore.py (1470 of 2331)
PASS: lldb-unit :: Utility/./UtilityTests/DataExtractorTest.GetFloatUnaligned (1471 of 2331)
PASS: lldb-api :: lang/cpp/exceptions/TestCPPExceptionBreakpoints.py (1472 of 2331)
PASS: lldb-unit :: Utility/./UtilityTests/RangeDataVector.CustomSort (1473 of 2331)
PASS: lldb-unit :: Symbol/./SymbolTests/LineEntryTest.GetSameLineContiguousAddressRangeNestedInline (1474 of 2331)
UNSUPPORTED: lldb-api :: commands/watchpoints/variable_out_of_scope/TestWatchedVarHitWhenInScope.py (1475 of 2331)
PASS: lldb-api :: commands/expression/invalid-args/TestInvalidArgsExpression.py (1476 of 2331)
PASS: lldb-unit :: Host/./HostTests/PipeTest.OpenAsReader (1477 of 2331)
PASS: lldb-unit :: Utility/./UtilityTests/ArchSpecTest.TestParseMachCPUDashSubtypeTripleSimple (1478 of 2331)
PASS: lldb-unit :: Utility/./UtilityTests/OptionsWithRawTest.QuotedSuffix (1479 of 2331)
UNSUPPORTED: lldb-api :: macosx/posix_spawn/TestLaunchProcessPosixSpawn.py (1480 of 2331)
PASS: lldb-api :: lang/objc/objc-class-method/TestObjCClassMethod.py (1481 of 2331)
PASS: lldb-shell :: ScriptInterpreter/Python/eof.test (1482 of 2331)
PASS: lldb-unit :: Host/./HostTests/HostInfoTest.GetHostname (1483 of 2331)
PASS: lldb-api :: types/TestIntegerTypeExpr.py (1484 of 2331)
PASS: lldb-api :: functionalities/breakpoint/address_breakpoints/TestAddressBreakpoints.py (1485 of 2331)
PASS: lldb-unit :: Utility/./UtilityTests/BinaryStreamTest.PutULEB128One (1486 of 2331)
PASS: lldb-unit :: Core/./LLDBCoreTests/DumpDataExtractorTest.ItemByteSizeErrors (1487 of 2331)
PASS: lldb-unit :: Utility/./UtilityTests/UriParserTest.BadPort (1488 of 2331)
PASS: lldb-api :: lang/c/blocks/TestBlocks.py (1489 of 2331)
PASS: lldb-unit :: UnwindAssembly/x86/./UnwindAssemblyx86Tests/Testx86AssemblyInspectionEngine.TestPushEDI (1490 of 2331)
PASS: lldb-api :: functionalities/data-formatter/data-formatter-stl/libcxx/multiset/TestDataFormatterLibcxxMultiSet.py (1491 of 2331)
PASS: lldb-shell :: SymbolFile/NativePDB/ast-functions.cpp (1492 of 2331)
PASS: lldb-unit :: Symbol/./SymbolTests/TestTypeSystemClang.TestDisplayName (1493 of 2331)
PASS: lldb-api :: tools/lldb-server/memory-allocation/TestGdbRemoteMemoryAllocation.py (1494 of 2331)
UNSUPPORTED: lldb-shell :: ScriptInterpreter/Lua/independent_state.test (1495 of 2331)
PASS: lldb-unit :: Utility/./UtilityTests/ScalarTest.Division (1496 of 2331)
PASS: lldb-unit :: Utility/./UtilityTests/StringListTest.AppendList (1497 of 2331)
PASS: lldb-shell :: SymbolFile/DWARF/x86/DW_AT_location-DW_AT_const_value.s (1498 of 2331)
PASS: lldb-unit :: Utility/./UtilityTests/ArchSpecTest.MergeFromMachOUnknown (1499 of 2331)
UNSUPPORTED: lldb-api :: functionalities/breakpoint/breakpoint_callback_command_source/TestBreakpointCallbackCommandSource.py (1500 of 2331)
PASS: lldb-unit :: UnwindAssembly/x86/./UnwindAssemblyx86Tests/Testx86AssemblyInspectionEngine.TestPushR14 (1501 of 2331)
PASS: lldb-unit :: Utility/./UtilityTests/StreamTeeTest.GetStreamAtIndexOutOfBounds (1502 of 2331)
PASS: lldb-unit :: Core/./LLDBCoreTests/FormatEntity.LookupAllEntriesInTree (1503 of 2331)
PASS: lldb-api :: lang/objc/objc-static-method/TestObjCStaticMethod.py (1504 of 2331)
PASS: lldb-api :: functionalities/object-file/TestImageListMultiArchitecture.py (1505 of 2331)
PASS: lldb-unit :: tools/lldb-server/tests/./LLDBServerTests/StandardStartupTest.TestStopReplyContainsThreadPcs (1506 of 2331)
PASS: lldb-unit :: Language/Highlighting/./HighlighterTests/HighlighterTest.ClangCursorPosEndOfLine (1507 of 2331)
PASS: lldb-shell :: Minidump/no-process-id.yaml (1508 of 2331)
PASS: lldb-shell :: Settings/TestDisassemblyFormat.test (1509 of 2331)
PASS: lldb-unit :: Utility/./UtilityTests/StringExtractorTest.GetHexBytes_Partial (1510 of 2331)
PASS: lldb-api :: functionalities/gdb_remote_client/TestqOffsets.py (1511 of 2331)
PASS: lldb-api :: functionalities/data-formatter/builtin-formats/TestBuiltinFormats.py (1512 of 2331)
PASS: lldb-unit :: Symbol/./SymbolTests/DWARFCallFrameInfoTest.Basic_dwarf3 (1513 of 2331)
PASS: lldb-api :: lang/objc/single-entry-dictionary/TestObjCSingleEntryDictionary.py (1514 of 2331)
PASS: lldb-unit :: Process/./ProcessEventDataTests/ProcessEventDataTest.ShouldStop (1515 of 2331)
PASS: lldb-unit :: Utility/./UtilityTests/UriParserTest.Empty (1516 of 2331)
PASS: lldb-unit :: Utility/./UtilityTests/StringListTest.CopyListSingle (1517 of 2331)
PASS: lldb-shell :: Register/Core/x86-32-linux-fp.test (1518 of 2331)
PASS: lldb-api :: functionalities/data-formatter/language_category_updates/TestDataFormatterLanguageCategoryUpdates.py (1519 of 2331)
PASS: lldb-unit :: Utility/./UtilityTests/StringListTest.JoinSingle (1520 of 2331)
UNSUPPORTED: lldb-api :: tools/lldb-server/TestGdbRemoteAuxvSupport.py (1521 of 2331)
PASS: lldb-unit :: Interpreter/./InterpreterTests/OptionValueString.DeepCopy (1522 of 2331)
PASS: lldb-unit :: ObjectFile/Breakpad/./ObjectFileBreakpadTests/ModuleRecord.parse (1523 of 2331)
PASS: lldb-unit :: Utility/./UtilityTests/BinaryStreamTest.PutSLEB128Zero (1524 of 2331)
PASS: lldb-api :: functionalities/gdb_remote_client/TestProcessConnect.py (1525 of 2331)
PASS: lldb-api :: functionalities/thread/step_out/TestThreadStepOut.py (1526 of 2331)
PASS: lldb-unit :: Process/minidump/./LLDBMinidumpTests/MinidumpParserTest.GetLinuxProcStatus_no_stream (1527 of 2331)
PASS: lldb-api :: functionalities/data-formatter/data-formatter-stl/libcxx/map/TestDataFormatterLibccMap.py (1528 of 2331)
PASS: lldb-unit :: Expression/./ExpressionTests/CppModuleConfigurationTest.MissingLibCpp (1529 of 2331)
PASS: lldb-unit :: Symbol/./SymbolTests/TestTypeSystemClang.TestGetTypeClassNested (1530 of 2331)
PASS: lldb-api :: lang/cpp/pointer_to_member_type_depending_on_parent_size/TestPointerToMemberTypeDependingOnParentSize.py (1531 of 2331)
PASS: lldb-shell :: Settings/TestDisableColor.test (1532 of 2331)
PASS: lldb-api :: functionalities/data-formatter/ptr_ref_typedef/TestPtrRef2Typedef.py (1533 of 2331)
PASS: lldb-unit :: Utility/./UtilityTests/ArgsTest.TestSingleArgWithQuotedSpace (1534 of 2331)
PASS: lldb-unit :: Utility/./UtilityTests/UriParserTest.BracketedHostnameWithPortIPv4 (1535 of 2331)
PASS: lldb-api :: lang/cpp/inlines/TestInlines.py (1536 of 2331)
PASS: lldb-unit :: Host/./HostTests/SocketTests/SocketTest.DomainGetConnectURI/ipv4 (1537 of 2331)
PASS: lldb-unit :: Utility/./UtilityTests/DataExtractorTest.GetCStrUnterminated (1538 of 2331)
UNSUPPORTED: lldb-api :: lang/c/typedef/Testtypedef.py (1539 of 2331)
UNSUPPORTED: lldb-api :: iohandler/unicode/TestUnicode.py (1540 of 2331)
PASS: lldb-unit :: UnwindAssembly/x86/./UnwindAssemblyx86Tests/Testx86AssemblyInspectionEngine.TestPushEDX (1541 of 2331)
PASS: lldb-api :: commands/expression/rdar44436068/Test128BitsInteger.py (1542 of 2331)
PASS: lldb-unit :: UnwindAssembly/x86/./UnwindAssemblyx86Tests/Testx86AssemblyInspectionEngine.Test32BitOnlyInstruction (1543 of 2331)
PASS: lldb-unit :: Process/gdb-remote/./ProcessGdbRemoteTests/GDBRemoteCommunicationServerTest.SendErrorResponse_Status (1544 of 2331)
PASS: lldb-unit :: SymbolFile/DWARF/./SymbolFileDWARFTests/SymbolFileDWARFTests.TestAbilitiesForDWARF (1545 of 2331)
PASS: lldb-api :: lang/cpp/signed_types/TestSignedTypes.py (1546 of 2331)
PASS: lldb-unit :: ScriptInterpreter/Python/./ScriptInterpreterPythonTests/PythonDataObjectsTest.TestPythonListValueEquality (1547 of 2331)
PASS: lldb-unit :: UnwindAssembly/x86/./UnwindAssemblyx86Tests/Testx86AssemblyInspectionEngine.TestPush0 (1548 of 2331)
UNSUPPORTED: lldb-api :: commands/watchpoints/hello_watchlocation/TestWatchLocation.py (1549 of 2331)
PASS: lldb-api :: functionalities/breakpoint/step_over_breakpoint/TestStepOverBreakpoint.py (1550 of 2331)
PASS: lldb-api :: lang/objc/objc-struct-argument/TestObjCStructArgument.py (1551 of 2331)
PASS: lldb-unit :: Utility/./UtilityTests/SubsystemRAIITest.SubsystemWithErrorSuccess (1552 of 2331)
PASS: lldb-api :: functionalities/unwind/zeroth_frame/TestZerothFrame.py (1553 of 2331)
PASS: lldb-unit :: Utility/./UtilityTests/StringListTest.AppendStringStdString (1554 of 2331)
UNSUPPORTED: lldb-api :: functionalities/thread/state/TestThreadStates.py (1555 of 2331)
PASS: lldb-shell :: Unwind/trap_frame_sym_ctx.test (1556 of 2331)
PASS: lldb-unit :: Utility/./UtilityTests/FileSpecTest.OperatorBool (1557 of 2331)
UNSUPPORTED: lldb-shell :: Subprocess/clone-follow-parent-wp.test (1558 of 2331)
PASS: lldb-unit :: Host/./HostTests/FileSystemTest.EmptyTest (1559 of 2331)
PASS: lldb-shell :: Unwind/thread-step-out-ret-addr-check.test (1560 of 2331)
PASS: lldb-api :: lang/objc/modules-cache/TestClangModulesCache.py (1561 of 2331)
PASS: lldb-api :: commands/expression/expr-in-syscall/TestExpressionInSyscall.py (1562 of 2331)
PASS: lldb-unit :: API/./APITests/SBCommandInterpreterTest.SingleWordCommand (1563 of 2331)
PASS: lldb-unit :: UnwindAssembly/x86/./UnwindAssemblyx86Tests/Testx86AssemblyInspectionEngine.TestPopR15 (1564 of 2331)
PASS: lldb-api :: lang/objc/real-definition/TestRealDefinition.py (1565 of 2331)
PASS: lldb-api :: commands/expression/xvalue/TestXValuePrinting.py (1566 of 2331)
PASS: lldb-unit :: Utility/./UtilityTests/UriParserTest.PortOverflow (1567 of 2331)
PASS: lldb-shell :: Reproducer/TestRelativePath.test (1568 of 2331)
PASS: lldb-shell :: SymbolFile/NativePDB/break-by-line.cpp (1569 of 2331)
PASS: lldb-api :: functionalities/inferior-crashing/recursive-inferior/TestRecursiveInferiorStep.py (1570 of 2331)
PASS: lldb-unit :: Utility/./UtilityTests/ArgsTest.GetShellSafeArgument (1571 of 2331)
PASS: lldb-shell :: SymbolFile/DWARF/x86/find-basic-namespace.cpp (1572 of 2331)
UNSUPPORTED: lldb-shell :: ScriptInterpreter/Lua/io.test (1573 of 2331)
PASS: lldb-unit :: Utility/./UtilityTests/OptionsWithRawTest.WhitespaceSuffix (1574 of 2331)
PASS: lldb-unit :: Utility/./UtilityTests/ConstStringTest.NullAndEmptyStates (1575 of 2331)
PASS: lldb-unit :: Utility/./UtilityTests/ReproducerTest.SetCapture (1576 of 2331)
PASS: lldb-unit :: Utility/./UtilityTests/RangeTest.Slide (1577 of 2331)
PASS: lldb-shell :: Commands/command-script-import.test (1578 of 2331)
PASS: lldb-api :: sanity/TestModuleCacheSanity.py (1579 of 2331)
PASS: lldb-api :: functionalities/gdb_remote_client/TestWriteMemory.py (1580 of 2331)
FAIL: lldb-api :: commands/expression/import-std-module/weak_ptr/TestWeakPtrFromStdModule.py (1581 of 2331)
******************** TEST 'lldb-api :: commands/expression/import-std-module/weak_ptr/TestWeakPtrFromStdModule.py' FAILED ********************
Script:
--
/Users/buildslave/jenkins/workspace/lldb-cmake-sanitized/lldb-build/lldb-test-build.noindex/copied-python /Users/buildslave/jenkins/workspace/lldb-cmake-sanitized/llvm-project/lldb/test/API/dotest.py -u CXXFLAGS -u CFLAGS --codesign-identity lldb_codesign --arch x86_64 --build-dir /Users/buildslave/jenkins/workspace/lldb-cmake-sanitized/lldb-build/lldb-test-build.noindex -t --env TERM=vt100 --env LLVM_LIBS_DIR=/Users/buildslave/jenkins/workspace/lldb-cmake-sanitized/lldb-build/./lib --inferior-env ASAN_OPTIONS=detect_stack_use_after_return=1 --inferior-env DYLD_INSERT_LIBRARIES=/Users/buildslave/jenkins/workspace/lldb-cmake-sanitized/host-compiler/lib/clang/13.0.99/lib/darwin/libclang_rt.asan_osx_dynamic.dylib --arch x86_64 --build-dir /Users/buildslave/jenkins/workspace/lldb-cmake-sanitized/lldb-build/lldb-test-build.noindex --lldb-module-cache-dir /Users/buildslave/jenkins/workspace/lldb-cmake-sanitized/lldb-build/lldb-test-build.noindex/module-cache-lldb/lldb-api --clang-module-cache-dir /Users/buildslave/jenkins/workspace/lldb-cmake-sanitized/lldb-build/lldb-test-build.noindex/module-cache-clang/lldb-api --executable /Users/buildslave/jenkins/workspace/lldb-cmake-sanitized/lldb-build/./bin/lldb --compiler /Users/buildslave/jenkins/workspace/lldb-cmake-sanitized/lldb-build/./bin/clang --dsymutil /Users/buildslave/jenkins/workspace/lldb-cmake-sanitized/lldb-build/./bin/dsymutil --llvm-tools-dir /Users/buildslave/jenkins/workspace/lldb-cmake-sanitized/lldb-build/./bin --lldb-libs-dir /Users/buildslave/jenkins/workspace/lldb-cmake-sanitized/lldb-build/./lib /Users/buildslave/jenkins/workspace/lldb-cmake-sanitized/llvm-project/lldb/test/API/commands/expression/import-std-module/weak_ptr -p TestWeakPtrFromStdModule.py
--
Exit Code: 1

Hide Details

Command Output (stdout): -- lldb version 13.0.99 (http://labmaster3.local/git/llvm-project.git revision cdd1adfb7d5d5048a7fdedc441e75db019fbb0b5) clang revision cdd1adfb7d5d5048a7fdedc441e75db019fbb0b5 llvm revision cdd1adfb7d5d5048a7fdedc441e75db019fbb0b5 Skipping the following test categories: ['darwin-log', 'libstdcxx', 'dwo', 'llgs', 'fork']

Hide Details

-- Command Output (stderr): -- Change dir to: /Users/buildslave/jenkins/workspace/lldb-cmake-sanitized/llvm-project/lldb/test/API/commands/expression/import-std-module/weak_ptr runCmd: settings clear -all output:

Hide Details

runCmd: settings set symbols.enable-external-lookup false output:

Hide Details

runCmd: settings set target.inherit-tcc true output:

Hide Details

runCmd: settings set target.detach-on-error false output:

Hide Details

runCmd: settings set target.auto-apply-fixits false output:

Hide Details

runCmd: settings set plugin.process.gdb-remote.packet-timeout 60 output:

Hide Details

runCmd: settings set symbols.clang-modules-cache-path "/Users/buildslave/jenkins/workspace/lldb-cmake-sanitized/lldb-build/lldb-test-build.noindex/module-cache-lldb/lldb-api" output:

Hide Details

runCmd: settings set use-color false output:

Hide Details

runCmd: setting set target.prefer-dynamic-value no-dynamic-values output:

Hide Details

runCmd: settings set target.env-vars ASAN_OPTIONS=detect_stack_use_after_return=1 DYLD_INSERT_LIBRARIES=/Users/buildslave/jenkins/workspace/lldb-cmake-sanitized/host-compiler/lib/clang/13.0.99/lib/darwin/libclang_rt.asan_osx_dynamic.dylib output:

Hide Details

runCmd: settings set target.env-vars ASAN_OPTIONS=detect_stack_use_after_return=1 DYLD_INSERT_LIBRARIES=/Users/buildslave/jenkins/workspace/lldb-cmake-sanitized/host-compiler/lib/clang/13.0.99/lib/darwin/libclang_rt.asan_osx_dynamic.dylib output:

Hide Details

runCmd: settings set target.import-std-module true output:

Hide Details

runCmd: expr w.reset() output:

Hide Details

Ran command: "expr w.reset()"

Hide Details

Got output:

Hide Details

Hide Details

<bound method SBProcess.Kill of <lldb.SBProcess; proxy of <Swig Object of type 'lldb::SBProcess *' at 0x10f0f2b40> >>: success

Hide Details

PASS: LLDB (/Users/buildslave/jenkins/workspace/lldb-cmake-sanitized/lldb-build/bin/clang-x86_64) :: test_dsym (TestWeakPtrFromStdModule.TestSharedPtr) runCmd: settings clear -all output:

Hide Details

runCmd: settings set symbols.enable-external-lookup false output:

Hide Details

runCmd: settings set target.inherit-tcc true output:

Hide Details

runCmd: settings set target.detach-on-error false output:

Hide Details

runCmd: settings set target.auto-apply-fixits false output:

Hide Details

runCmd: settings set plugin.process.gdb-remote.packet-timeout 60 output:

Hide Details

runCmd: settings set symbols.clang-modules-cache-path "/Users/buildslave/jenkins/workspace/lldb-cmake-sanitized/lldb-build/lldb-test-build.noindex/module-cache-lldb/lldb-api" output:

Hide Details

runCmd: settings set use-color false output:

Hide Details

runCmd: setting set target.prefer-dynamic-value no-dynamic-values output:

Hide Details

runCmd: settings set target.env-vars ASAN_OPTIONS=detect_stack_use_after_return=1 DYLD_INSERT_LIBRARIES=/Users/buildslave/jenkins/workspace/lldb-cmake-sanitized/host-compiler/lib/clang/13.0.99/lib/darwin/libclang_rt.asan_osx_dynamic.dylib output:

Hide Details

runCmd: settings set target.env-vars ASAN_OPTIONS=detect_stack_use_after_return=1 DYLD_INSERT_LIBRARIES=/Users/buildslave/jenkins/workspace/lldb-cmake-sanitized/host-compiler/lib/clang/13.0.99/lib/darwin/libclang_rt.asan_osx_dynamic.dylib output:

Hide Details

runCmd: settings set target.import-std-module true output:

Hide Details

runCmd: expr w.reset() output:

Hide Details

Ran command: "expr w.reset()"

Hide Details

Got output:

Hide Details

Hide Details

<bound method SBProcess.Kill of <lldb.SBProcess; proxy of <Swig Object of type 'lldb::SBProcess *' at 0x10e384cf0> >>: success

Hide Details

PASS: LLDB (/Users/buildslave/jenkins/workspace/lldb-cmake-sanitized/lldb-build/bin/clang-x86_64) :: test_dwarf (TestWeakPtrFromStdModule.TestSharedPtr) UNSUPPORTED: LLDB (/Users/buildslave/jenkins/workspace/lldb-cmake-sanitized/lldb-build/bin/clang-x86_64) :: test_dwo (TestWeakPtrFromStdModule.TestSharedPtr) (test case does not fall in any category of interest for this run) runCmd: settings clear -all output:

Hide Details

runCmd: settings set symbols.enable-external-lookup false output:

Hide Details

runCmd: settings set target.inherit-tcc true output:

Hide Details

runCmd: settings set target.detach-on-error false output:

Hide Details

runCmd: settings set target.auto-apply-fixits false output:

Hide Details

runCmd: settings set plugin.process.gdb-remote.packet-timeout 60 output:

Hide Details

runCmd: settings set symbols.clang-modules-cache-path "/Users/buildslave/jenkins/workspace/lldb-cmake-sanitized/lldb-build/lldb-test-build.noindex/module-cache-lldb/lldb-api" output:

Hide Details

runCmd: settings set use-color false output:

Hide Details

runCmd: setting set target.prefer-dynamic-value no-dynamic-values output:

Hide Details

runCmd: settings set target.env-vars ASAN_OPTIONS=detect_stack_use_after_return=1 DYLD_INSERT_LIBRARIES=/Users/buildslave/jenkins/workspace/lldb-cmake-sanitized/host-compiler/lib/clang/13.0.99/lib/darwin/libclang_rt.asan_osx_dynamic.dylib output:

Hide Details

FAIL: LLDB (/Users/buildslave/jenkins/workspace/lldb-cmake-sanitized/lldb-build/bin/clang-x86_64) :: test_gmodules (TestWeakPtrFromStdModule.TestSharedPtr) Restore dir to: /Users/buildslave/jenkins/workspace/lldb-cmake-sanitized/lldb-build/tools/lldb/test ====================================================================== ERROR: test_gmodules (TestWeakPtrFromStdModule.TestSharedPtr) ---------------------------------------------------------------------- Error when building test subject.

Hide Details

Build Command: make VPATH=/Users/buildslave/jenkins/workspace/lldb-cmake-sanitized/llvm-project/lldb/test/API/commands/expression/import-std-module/weak_ptr -C /Users/buildslave/jenkins/workspace/lldb-cmake-sanitized/lldb-build/lldb-test-build.noindex/commands/expression/import-std-module/weak_ptr/TestWeakPtrFromStdModule.test_gmodules -I /Users/buildslave/jenkins/workspace/lldb-cmake-sanitized/llvm-project/lldb/test/API/commands/expression/import-std-module/weak_ptr -I /Users/buildslave/jenkins/workspace/lldb-cmake-sanitized/llvm-project/lldb/packages/Python/lldbsuite/test/make -f /Users/buildslave/jenkins/workspace/lldb-cmake-sanitized/llvm-project/lldb/test/API/commands/expression/import-std-module/weak_ptr/Makefile MAKE_DSYM=NO MAKE_GMODULES=YES ARCH=x86_64 CC="/Users/buildslave/jenkins/workspace/lldb-cmake-sanitized/lldb-build/bin/clang" DSYMUTIL="/Users/buildslave/jenkins/workspace/lldb-cmake-sanitized/lldb-build/./bin/dsymutil" CLANG_MODULE_CACHE_DIR=/Users/buildslave/jenkins/workspace/lldb-cmake-sanitized/lldb-build/lldb-test-build.noindex/module-cache-clang/lldb-api

Hide Details

Build Command Output: /Users/buildslave/jenkins/workspace/lldb-cmake-sanitized/lldb-build/bin/clang -fmodules -gmodules -fmodules-cache-path=/Users/buildslave/jenkins/workspace/lldb-cmake-sanitized/lldb-build/lldb-test-build.noindex/module-cache-clang/lldb-api -gmodules -fcxx-modules -std=c++11 -g -O0 -fno-builtin -isysroot "/Applications/Xcode.app/Contents/Developer/Platforms/MacOSX.platform/Developer/SDKs/MacOSX10.15.sdk" -arch x86_64 -I/Users/buildslave/jenkins/workspace/lldb-cmake-sanitized/llvm-project/lldb/packages/Python/lldbsuite/test/make/../../../../../include -I/Users/buildslave/jenkins/workspace/lldb-cmake-sanitized/llvm-project/lldb/test/API/commands/expression/import-std-module/weak_ptr -I/Users/buildslave/jenkins/workspace/lldb-cmake-sanitized/llvm-project/lldb/packages/Python/lldbsuite/test/make -include /Users/buildslave/jenkins/workspace/lldb-cmake-sanitized/llvm-project/lldb/packages/Python/lldbsuite/test/make/test_common.h -fno-limit-debug-info -fmodules -gmodules -fmodules-cache-path=/Users/buildslave/jenkins/workspace/lldb-cmake-sanitized/lldb-build/lldb-test-build.noindex/module-cache-clang/lldb-api -gmodules -fcxx-modules -DLLDB_USING_LIBCPP -stdlib=libc++ --driver-mode=g++ -MT main.o -MD -MP -MF main.d -c -o main.o /Users/buildslave/jenkins/workspace/lldb-cmake-sanitized/llvm-project/lldb/test/API/commands/expression/import-std-module/weak_ptr/main.cpp In module 'std' imported from /Users/buildslave/jenkins/workspace/lldb-cmake-sanitized/llvm-project/lldb/test/API/commands/expression/import-std-module/weak_ptr/main.cpp:1: /Users/buildslave/jenkins/workspace/lldb-cmake-sanitized/lldb-build/bin/../include/c++/v1/__memory/allocator_traits.h:73:48: error: missing '#include "/Users/buildslave/jenkins/workspace/lldb-cmake-sanitized/lldb-build/bin/../include/c++/v1/__memory/pointer_traits.h"'; 'pointer_traits<_Tp *>' must be defined before it is used using type _LIBCPP_NODEBUG_TYPE = typename pointer_traits<_Ptr>::template rebind<void>; ^ /Users/buildslave/jenkins/workspace/lldb-cmake-sanitized/lldb-build/bin/../include/c++/v1/__memory/allocator_traits.h:234:35: note: in instantiation of template class 'std::__void_pointer<std::__shared_ptr_pointer<int *, std::shared_ptr<int>::__shared_ptr_default_delete<int, int>, std::allocator<int>> *, std::allocator<std::__shared_ptr_pointer<int *, std::shared_ptr<int>::__shared_ptr_default_delete<int, int>, std::allocator<int>>>, false>' requested here using void_pointer = typename __void_pointer<pointer, allocator_type>::type; ^ /Users/buildslave/jenkins/workspace/lldb-cmake-sanitized/lldb-build/bin/../include/c++/v1/__memory/shared_ptr.h:272:37: note: in instantiation of template class 'std::allocator_traits<std::allocator<std::__shared_ptr_pointer<int *, std::shared_ptr<int>::__shared_ptr_default_delete<int, int>, std::allocator<int>>>>' requested here typedef pointer_traits<typename _ATraits::pointer> _PTraits; ^ /Users/buildslave/jenkins/workspace/lldb-cmake-sanitized/lldb-build/bin/../include/c++/v1/__memory/shared_ptr.h:235:5: note: in instantiation of member function 'std::__shared_ptr_pointer<int *, std::shared_ptr<int>::__shared_ptr_default_delete<int, int>, std::allocator<int>>::__on_zero_shared_weak' requested here __shared_ptr_pointer(_Tp __p, _Dp __d, _Alloc __a) ^ /Users/buildslave/jenkins/workspace/lldb-cmake-sanitized/lldb-build/bin/../include/c++/v1/__memory/shared_ptr.h:453:24: note: in instantiation of member function 'std::__shared_ptr_pointer<int *, std::shared_ptr<int>::__shared_ptr_default_delete<int, int>, std::allocator<int>>::__shared_ptr_pointer' requested here __cntrl_ = new _CntrlBlk(__p, __shared_ptr_default_delete<_Tp, _Yp>(), _AllocT()); ^ /Users/buildslave/jenkins/workspace/lldb-cmake-sanitized/llvm-project/lldb/test/API/commands/expression/import-std-module/weak_ptr/main.cpp:4:24: note: in instantiation of function template specialization 'std::shared_ptr<int>::shared_ptr<int, void>' requested here std::shared_ptr<int> s(new int); ^ /Users/buildslave/jenkins/workspace/lldb-cmake-sanitized/lldb-build/bin/../include/c++/v1/__memory/pointer_traits.h:135:29: note: definition here is not reachable struct _LIBCPP_TEMPLATE_VIS pointer_traits<_Tp*> ^ 1 error generated. make: *** [main.o] Error 1

Hide Details

Test Directory: /Users/buildslave/jenkins/workspace/lldb-cmake-sanitized/llvm-project/lldb/test/API/commands/expression/import-std-module/weak_ptr ---------------------------------------------------------------------- Ran 4 tests in 19.539s

Hide Details

RESULT: FAILED (2 passes, 0 failures, 1 errors, 1 skipped, 0 expected failures, 0 unexpected successes)

Hide Details

--

Hide Details

******************** PASS: lldb-unit :: Utility/./UtilityTests/StreamTest.PutCharWhitespace (1582 of 2331) PASS: lldb-shell :: SymbolFile/DWARF/x86/dwarf5-implicit-const.s (1583 of 2331) PASS: lldb-shell :: ObjectFile/wasm/basic.yaml (1584 of 2331) PASS: lldb-unit :: Utility/./UtilityTests/ArgsTest.StringListConstructor (1585 of 2331) PASS: lldb-unit :: Utility/./UtilityTests/SerializationRountripTest.SerializeDeserializeObjectPointer (1586 of 2331) PASS: lldb-unit :: SymbolFile/NativePDB/./SymbolFileNativePDBTests/PDBFPOProgramToDWARFExpressionTests.InvalidOpUnary (1587 of 2331) PASS: lldb-unit :: Process/Utility/./ProcessUtilityTests/ProcSMapTests/LinuxProcSMapsTestFixture.ParseSMapRegions/4 (1588 of 2331) PASS: lldb-api :: functionalities/limit-debug-info/TestLimitDebugInfo.py (1589 of 2331) PASS: lldb-api :: functionalities/gdb_remote_client/TestStopPCs.py (1590 of 2331) PASS: lldb-unit :: Utility/./UtilityTests/StringListTest.SplitIntoLinesSingleTrailingCR (1591 of 2331) PASS: lldb-api :: macosx/order/TestOrderFile.py (1592 of 2331) PASS: lldb-api :: lang/objc/objc-ivar-offsets/TestObjCIvarOffsets.py (1593 of 2331) UNSUPPORTED: lldb-api :: commands/trace/TestTraceStartStop.py (1594 of 2331) PASS: lldb-api :: functionalities/data-formatter/data-formatter-caching/TestDataFormatterCaching.py (1595 of 2331) PASS: lldb-api :: functionalities/thread/concurrent_events/TestConcurrentSignalDelayBreak.py (1596 of 2331) PASS: lldb-unit :: Utility/./UtilityTests/SerializationRountripTest.SerializeDeserializeObjectReference (1597 of 2331) PASS: lldb-unit :: Utility/./UtilityTests/StreamTest.AddressRange (1598 of 2331) PASS: lldb-unit :: Utility/./UtilityTests/CompletionRequest.DuplicateFilteringWithComments (1599 of 2331) PASS: lldb-api :: lang/cpp/elaborated-types/TestElaboratedTypes.py (1600 of 2331) PASS: lldb-api :: functionalities/lazy-loading/TestLazyLoading.py (1601 of 2331) PASS: lldb-unit :: Core/./LLDBCoreTests/ModuleSpecTest.InvalidInMemoryBufferValidFile (1602 of 2331) PASS: lldb-api :: tools/lldb-server/TestGdbRemoteAttach.py (1603 of 2331) PASS: lldb-unit :: Interpreter/./InterpreterTests/OptionValueFileColonLine.setFromString (1604 of 2331) PASS: lldb-shell :: Minidump/dump-all.test (1605 of 2331) PASS: lldb-unit :: Expression/./ExpressionTests/ClangExpressionDeclMapTest.TestUnknownIdentifierLookup (1606 of 2331) PASS: lldb-shell :: ObjectFile/Breakpad/sections-trailing-func.test (1607 of 2331) PASS: lldb-shell :: SymbolFile/DWARF/x86/dir-separator-posix.s (1608 of 2331) PASS: lldb-unit :: Host/./HostTests/FileSystemTest.EnumerateDirectory (1609 of 2331) PASS: lldb-api :: functionalities/tail_call_frames/disambiguate_paths_to_common_sink/TestDisambiguatePathsToCommonSink.py (1610 of 2331) PASS: lldb-api :: functionalities/gdb_remote_client/TestRecognizeBreakpoint.py (1611 of 2331) PASS: lldb-unit :: Process/minidump/./LLDBMinidumpTests/MinidumpParserTest.GetPidWindows (1612 of 2331) PASS: lldb-shell :: SymbolFile/DWARF/x86/inline-function-address-shared.test (1613 of 2331) PASS: lldb-unit :: DataFormatter/./LLDBFormatterTests/StringPrinterTests.CxxASCII (1614 of 2331) PASS: lldb-api :: types/TestIntegerType.py (1615 of 2331) PASS: lldb-api :: lang/objc/objc-ivar-stripped/TestObjCIvarStripped.py (1616 of 2331) PASS: lldb-api :: tools/lldb-server/signal-filtering/TestGdbRemote_QPassSignals.py (1617 of 2331) UNSUPPORTED: lldb-shell :: SymbolFile/PDB/compilands.test (1618 of 2331) PASS: lldb-unit :: Utility/./UtilityTests/AnsiTerminal.KnownPrefix (1619 of 2331) PASS: lldb-unit :: Process/gdb-remote/./ProcessGdbRemoteTests/GDBRemoteClientBaseTest.SendContinueDelegateInterface (1620 of 2331) PASS: lldb-shell :: SymbolFile/DWARF/x86/find-basic-type.cpp (1621 of 2331) PASS: lldb-api :: functionalities/set-data/TestSetData.py (1622 of 2331) PASS: lldb-api :: commands/reproducer/invalid-args/TestInvalidArgsReproducer.py (1623 of 2331) UNSUPPORTED: lldb-shell :: SymbolFile/PDB/typedefs.test (1624 of 2331) UNSUPPORTED: lldb-shell :: Register/x86-fp-read.test (1625 of 2331) UNSUPPORTED: lldb-shell :: ScriptInterpreter/Lua/command_script_import.test (1626 of 2331) PASS: lldb-unit :: Utility/./UtilityTests/SubsystemRAIITest.SubsystemWithErrorFailure (1627 of 2331) UNSUPPORTED: lldb-api :: functionalities/exec/TestExec.py (1628 of 2331) PASS: lldb-unit :: Utility/./UtilityTests/StructuredDataTest.ParseJSONFromFile (1629 of 2331) PASS: lldb-unit :: Process/gdb-remote/./ProcessGdbRemoteTests/GDBRemoteCommunicationClientTest.TestPacketSpeedJSON (1630 of 2331) PASS: lldb-api :: commands/expression/char/TestExprsChar.py (1631 of 2331) PASS: lldb-api :: python_api/watchpoint/condition/TestWatchpointConditionAPI.py (1632 of 2331) PASS: lldb-shell :: SymbolFile/DWARF/x86/DW_AT_const_value.s (1633 of 2331) PASS: lldb-shell :: SymbolFile/Breakpad/stack-cfi-parsing.test (1634 of 2331) PASS: lldb-api :: lang/cpp/std-function-step-into-callable/TestStdFunctionStepIntoCallable.py (1635 of 2331) PASS: lldb-api :: functionalities/data-formatter/data-formatter-cpp/TestDataFormatterCpp.py (1636 of 2331) PASS: lldb-unit :: ScriptInterpreter/Python/./ScriptInterpreterPythonTests/PythonDataObjectsTest.TestGlobalNameResolutionWithDot (1637 of 2331) PASS: lldb-api :: lang/objc/rdar-10967107/TestRdar10967107.py (1638 of 2331) PASS: lldb-api :: functionalities/data-formatter/user-format-vs-summary/TestUserFormatVsSummary.py (1639 of 2331) PASS: lldb-api :: python_api/sbdata/TestSBData.py (1640 of 2331) PASS: lldb-unit :: Thread/./ThreadTests/ThreadTest.GetPrivateStopInfo (1641 of 2331) PASS: lldb-api :: lang/c/stepping/TestStepAndBreakpoints.py (1642 of 2331) PASS: lldb-unit :: Utility/./UtilityTests/StreamTest.PutHex32ByteOrderLittle (1643 of 2331) PASS: lldb-unit :: Symbol/./SymbolTests/TestTypeSystemClang.TestGetEnumIntegerTypeBasicTypes (1644 of 2331) PASS: lldb-unit :: Utility/./UtilityTests/RangeTest.SlideZero (1645 of 2331) UNSUPPORTED: lldb-api :: functionalities/data-formatter/data-formatter-stl/libstdcpp/smart_ptr/TestDataFormatterStdSmartPtr.py (1646 of 2331) PASS: lldb-api :: functionalities/breakpoint/inlined_breakpoints/TestInlinedBreakpoints.py (1647 of 2331) PASS: lldb-api :: python_api/sbstructureddata/TestStructuredDataAPI.py (1648 of 2331) PASS: lldb-api :: lang/cpp/template/TestTemplateArgs.py (1649 of 2331) PASS: lldb-unit :: Process/minidump/./LLDBMinidumpTests/RegisterContextMinidump.ConvertMinidumpContext_x86_32 (1650 of 2331) PASS: lldb-api :: lang/c/array_types/TestArrayTypes.py (1651 of 2331) PASS: lldb-api :: lang/objc/hidden-ivars/TestHiddenIvars.py (1652 of 2331) PASS: lldb-api :: macosx/duplicate-archive-members/TestDuplicateMembers.py (1653 of 2331) UNSUPPORTED: lldb-api :: tools/lldb-vscode/completions/TestVSCode_completions.py (1654 of 2331) PASS: lldb-unit :: Utility/./UtilityTests/VASprintfTest.BufferResize (1655 of 2331) PASS: lldb-unit :: Process/gdb-remote/./ProcessGdbRemoteTests/GDBRemoteCommunicationClientTest.GetModulesInfo_UUID20 (1656 of 2331) FAIL: lldb-api :: commands/expression/import-std-module/shared_ptr-dbg-info-content/TestSharedPtrDbgInfoContentFromStdModule.py (1657 of 2331) ******************** TEST 'lldb-api :: commands/expression/import-std-module/shared_ptr-dbg-info-content/TestSharedPtrDbgInfoContentFromStdModule.py' FAILED ******************** Script: -- /Users/buildslave/jenkins/workspace/lldb-cmake-sanitized/lldb-build/lldb-test-build.noindex/copied-python /Users/buildslave/jenkins/workspace/lldb-cmake-sanitized/llvm-project/lldb/test/API/dotest.py -u CXXFLAGS -u CFLAGS --codesign-identity lldb_codesign --arch x86_64 --build-dir /Users/buildslave/jenkins/workspace/lldb-cmake-sanitized/lldb-build/lldb-test-build.noindex -t --env TERM=vt100 --env LLVM_LIBS_DIR=/Users/buildslave/jenkins/workspace/lldb-cmake-sanitized/lldb-build/./lib --inferior-env ASAN_OPTIONS=detect_stack_use_after_return=1 --inferior-env DYLD_INSERT_LIBRARIES=/Users/buildslave/jenkins/workspace/lldb-cmake-sanitized/host-compiler/lib/clang/13.0.99/lib/darwin/libclang_rt.asan_osx_dynamic.dylib --arch x86_64 --build-dir /Users/buildslave/jenkins/workspace/lldb-cmake-sanitized/lldb-build/lldb-test-build.noindex --lldb-module-cache-dir /Users/buildslave/jenkins/workspace/lldb-cmake-sanitized/lldb-build/lldb-test-build.noindex/module-cache-lldb/lldb-api --clang-module-cache-dir /Users/buildslave/jenkins/workspace/lldb-cmake-sanitized/lldb-build/lldb-test-build.noindex/module-cache-clang/lldb-api --executable /Users/buildslave/jenkins/workspace/lldb-cmake-sanitized/lldb-build/./bin/lldb --compiler /Users/buildslave/jenkins/workspace/lldb-cmake-sanitized/lldb-build/./bin/clang --dsymutil /Users/buildslave/jenkins/workspace/lldb-cmake-sanitized/lldb-build/./bin/dsymutil --llvm-tools-dir /Users/buildslave/jenkins/workspace/lldb-cmake-sanitized/lldb-build/./bin --lldb-libs-dir /Users/buildslave/jenkins/workspace/lldb-cmake-sanitized/lldb-build/./lib /Users/buildslave/jenkins/workspace/lldb-cmake-sanitized/llvm-project/lldb/test/API/commands/expression/import-std-module/shared_ptr-dbg-info-content -p TestSharedPtrDbgInfoContentFromStdModule.py -- Exit Code: 1

Hide Details

Command Output (stdout): -- lldb version 13.0.99 (http://labmaster3.local/git/llvm-project.git revision cdd1adfb7d5d5048a7fdedc441e75db019fbb0b5) clang revision cdd1adfb7d5d5048a7fdedc441e75db019fbb0b5 llvm revision cdd1adfb7d5d5048a7fdedc441e75db019fbb0b5 Skipping the following test categories: ['darwin-log', 'libstdcxx', 'dwo', 'llgs', 'fork']

Hide Details

-- Command Output (stderr): -- Change dir to: /Users/buildslave/jenkins/workspace/lldb-cmake-sanitized/llvm-project/lldb/test/API/commands/expression/import-std-module/shared_ptr-dbg-info-content runCmd: settings clear -all output:

Hide Details

runCmd: settings set symbols.enable-external-lookup false output:

Hide Details

runCmd: settings set target.inherit-tcc true output:

Hide Details

runCmd: settings set target.detach-on-error false output:

Hide Details

runCmd: settings set target.auto-apply-fixits false output:

Hide Details

runCmd: settings set plugin.process.gdb-remote.packet-timeout 60 output:

Hide Details

runCmd: settings set symbols.clang-modules-cache-path "/Users/buildslave/jenkins/workspace/lldb-cmake-sanitized/lldb-build/lldb-test-build.noindex/module-cache-lldb/lldb-api" output:

Hide Details

runCmd: settings set use-color false output:

Hide Details

runCmd: setting set target.prefer-dynamic-value no-dynamic-values output:

Hide Details

runCmd: settings set target.env-vars ASAN_OPTIONS=detect_stack_use_after_return=1 DYLD_INSERT_LIBRARIES=/Users/buildslave/jenkins/workspace/lldb-cmake-sanitized/host-compiler/lib/clang/13.0.99/lib/darwin/libclang_rt.asan_osx_dynamic.dylib output:

Hide Details

runCmd: settings set target.env-vars ASAN_OPTIONS=detect_stack_use_after_return=1 DYLD_INSERT_LIBRARIES=/Users/buildslave/jenkins/workspace/lldb-cmake-sanitized/host-compiler/lib/clang/13.0.99/lib/darwin/libclang_rt.asan_osx_dynamic.dylib output:

Hide Details

runCmd: settings set target.import-std-module true output:

Hide Details

runCmd: expr s.reset() output:

Hide Details

Ran command: "expr s.reset()"

Hide Details

Got output:

Hide Details

Hide Details

<bound method SBProcess.Kill of <lldb.SBProcess; proxy of <Swig Object of type 'lldb::SBProcess *' at 0x11cdc2b40> >>: success

Hide Details

PASS: LLDB (/Users/buildslave/jenkins/workspace/lldb-cmake-sanitized/lldb-build/bin/clang-x86_64) :: test_dsym (TestSharedPtrDbgInfoContentFromStdModule.TestSharedPtrDbgInfoContent) runCmd: settings clear -all output:

Hide Details

runCmd: settings set symbols.enable-external-lookup false output:

Hide Details

runCmd: settings set target.inherit-tcc true output:

Hide Details

runCmd: settings set target.detach-on-error false output:

Hide Details

runCmd: settings set target.auto-apply-fixits false output:

Hide Details

runCmd: settings set plugin.process.gdb-remote.packet-timeout 60 output:

Hide Details

runCmd: settings set symbols.clang-modules-cache-path "/Users/buildslave/jenkins/workspace/lldb-cmake-sanitized/lldb-build/lldb-test-build.noindex/module-cache-lldb/lldb-api" output:

Hide Details

runCmd: settings set use-color false output:

Hide Details

runCmd: setting set target.prefer-dynamic-value no-dynamic-values output:

Hide Details

runCmd: settings set target.env-vars ASAN_OPTIONS=detect_stack_use_after_return=1 DYLD_INSERT_LIBRARIES=/Users/buildslave/jenkins/workspace/lldb-cmake-sanitized/host-compiler/lib/clang/13.0.99/lib/darwin/libclang_rt.asan_osx_dynamic.dylib output:

Hide Details

runCmd: settings set target.env-vars ASAN_OPTIONS=detect_stack_use_after_return=1 DYLD_INSERT_LIBRARIES=/Users/buildslave/jenkins/workspace/lldb-cmake-sanitized/host-compiler/lib/clang/13.0.99/lib/darwin/libclang_rt.asan_osx_dynamic.dylib output:

Hide Details

runCmd: settings set target.import-std-module true output:

Hide Details

runCmd: expr s.reset() output:

Hide Details

Ran command: "expr s.reset()"

Hide Details

Got output:

Hide Details

Hide Details

<bound method SBProcess.Kill of <lldb.SBProcess; proxy of <Swig Object of type 'lldb::SBProcess *' at 0x10591bcf0> >>: success

Hide Details

PASS: LLDB (/Users/buildslave/jenkins/workspace/lldb-cmake-sanitized/lldb-build/bin/clang-x86_64) :: test_dwarf (TestSharedPtrDbgInfoContentFromStdModule.TestSharedPtrDbgInfoContent) UNSUPPORTED: LLDB (/Users/buildslave/jenkins/workspace/lldb-cmake-sanitized/lldb-build/bin/clang-x86_64) :: test_dwo (TestSharedPtrDbgInfoContentFromStdModule.TestSharedPtrDbgInfoContent) (test case does not fall in any category of interest for this run) runCmd: settings clear -all output:

Hide Details

runCmd: settings set symbols.enable-external-lookup false output:

Hide Details

runCmd: settings set target.inherit-tcc true output:

Hide Details

runCmd: settings set target.detach-on-error false output:

Hide Details

runCmd: settings set target.auto-apply-fixits false output:

Hide Details

runCmd: settings set plugin.process.gdb-remote.packet-timeout 60 output:

Hide Details

runCmd: settings set symbols.clang-modules-cache-path "/Users/buildslave/jenkins/workspace/lldb-cmake-sanitized/lldb-build/lldb-test-build.noindex/module-cache-lldb/lldb-api" output:

Hide Details

runCmd: settings set use-color false output:

Hide Details

runCmd: setting set target.prefer-dynamic-value no-dynamic-values output:

Hide Details

runCmd: settings set target.env-vars ASAN_OPTIONS=detect_stack_use_after_return=1 DYLD_INSERT_LIBRARIES=/Users/buildslave/jenkins/workspace/lldb-cmake-sanitized/host-compiler/lib/clang/13.0.99/lib/darwin/libclang_rt.asan_osx_dynamic.dylib output:

Hide Details

FAIL: LLDB (/Users/buildslave/jenkins/workspace/lldb-cmake-sanitized/lldb-build/bin/clang-x86_64) :: test_gmodules (TestSharedPtrDbgInfoContentFromStdModule.TestSharedPtrDbgInfoContent) Restore dir to: /Users/buildslave/jenkins/workspace/lldb-cmake-sanitized/lldb-build/tools/lldb/test ====================================================================== ERROR: test_gmodules (TestSharedPtrDbgInfoContentFromStdModule.TestSharedPtrDbgInfoContent) ---------------------------------------------------------------------- Error when building test subject.

Hide Details

Build Command: make VPATH=/Users/buildslave/jenkins/workspace/lldb-cmake-sanitized/llvm-project/lldb/test/API/commands/expression/import-std-module/shared_ptr-dbg-info-content -C /Users/buildslave/jenkins/workspace/lldb-cmake-sanitized/lldb-build/lldb-test-build.noindex/commands/expression/import-std-module/shared_ptr-dbg-info-content/TestSharedPtrDbgInfoContentFromStdModule.test_gmodules -I /Users/buildslave/jenkins/workspace/lldb-cmake-sanitized/llvm-project/lldb/test/API/commands/expression/import-std-module/shared_ptr-dbg-info-content -I /Users/buildslave/jenkins/workspace/lldb-cmake-sanitized/llvm-project/lldb/packages/Python/lldbsuite/test/make -f /Users/buildslave/jenkins/workspace/lldb-cmake-sanitized/llvm-project/lldb/test/API/commands/expression/import-std-module/shared_ptr-dbg-info-content/Makefile MAKE_DSYM=NO MAKE_GMODULES=YES ARCH=x86_64 CC="/Users/buildslave/jenkins/workspace/lldb-cmake-sanitized/lldb-build/bin/clang" DSYMUTIL="/Users/buildslave/jenkins/workspace/lldb-cmake-sanitized/lldb-build/./bin/dsymutil" CLANG_MODULE_CACHE_DIR=/Users/buildslave/jenkins/workspace/lldb-cmake-sanitized/lldb-build/lldb-test-build.noindex/module-cache-clang/lldb-api

Hide Details

Build Command Output: /Users/buildslave/jenkins/workspace/lldb-cmake-sanitized/lldb-build/bin/clang -fmodules -gmodules -fmodules-cache-path=/Users/buildslave/jenkins/workspace/lldb-cmake-sanitized/lldb-build/lldb-test-build.noindex/module-cache-clang/lldb-api -gmodules -fcxx-modules -std=c++11 -g -O0 -fno-builtin -isysroot "/Applications/Xcode.app/Contents/Developer/Platforms/MacOSX.platform/Developer/SDKs/MacOSX10.15.sdk" -arch x86_64 -I/Users/buildslave/jenkins/workspace/lldb-cmake-sanitized/llvm-project/lldb/packages/Python/lldbsuite/test/make/../../../../../include -I/Users/buildslave/jenkins/workspace/lldb-cmake-sanitized/llvm-project/lldb/test/API/commands/expression/import-std-module/shared_ptr-dbg-info-content -I/Users/buildslave/jenkins/workspace/lldb-cmake-sanitized/llvm-project/lldb/packages/Python/lldbsuite/test/make -include /Users/buildslave/jenkins/workspace/lldb-cmake-sanitized/llvm-project/lldb/packages/Python/lldbsuite/test/make/test_common.h -fno-limit-debug-info -fmodules -gmodules -fmodules-cache-path=/Users/buildslave/jenkins/workspace/lldb-cmake-sanitized/lldb-build/lldb-test-build.noindex/module-cache-clang/lldb-api -gmodules -fcxx-modules -DLLDB_USING_LIBCPP -stdlib=libc++ --driver-mode=g++ -MT main.o -MD -MP -MF main.d -c -o main.o /Users/buildslave/jenkins/workspace/lldb-cmake-sanitized/llvm-project/lldb/test/API/commands/expression/import-std-module/shared_ptr-dbg-info-content/main.cpp In module 'std' imported from /Users/buildslave/jenkins/workspace/lldb-cmake-sanitized/llvm-project/lldb/test/API/commands/expression/import-std-module/shared_ptr-dbg-info-content/main.cpp:1: /Users/buildslave/jenkins/workspace/lldb-cmake-sanitized/lldb-build/bin/../include/c++/v1/__memory/allocator_traits.h:73:48: error: missing '#include "/Users/buildslave/jenkins/workspace/lldb-cmake-sanitized/lldb-build/bin/../include/c++/v1/__memory/pointer_traits.h"'; 'pointer_traits<_Tp *>' must be defined before it is used using type _LIBCPP_NODEBUG_TYPE = typename pointer_traits<_Ptr>::template rebind<void>; ^ /Users/buildslave/jenkins/workspace/lldb-cmake-sanitized/lldb-build/bin/../include/c++/v1/__memory/allocator_traits.h:234:35: note: in instantiation of template class 'std::__void_pointer<std::__shared_ptr_pointer<Foo *, std::shared_ptr<Foo>::__shared_ptr_default_delete<Foo, Foo>, std::allocator<Foo>> *, std::allocator<std::__shared_ptr_pointer<Foo *, std::shared_ptr<Foo>::__shared_ptr_default_delete<Foo, Foo>, std::allocator<Foo>>>, false>' requested here using void_pointer = typename __void_pointer<pointer, allocator_type>::type; ^ /Users/buildslave/jenkins/workspace/lldb-cmake-sanitized/lldb-build/bin/../include/c++/v1/__memory/shared_ptr.h:272:37: note: in instantiation of template class 'std::allocator_traits<std::allocator<std::__shared_ptr_pointer<Foo *, std::shared_ptr<Foo>::__shared_ptr_default_delete<Foo, Foo>, std::allocator<Foo>>>>' requested here typedef pointer_traits<typename _ATraits::pointer> _PTraits; ^ /Users/buildslave/jenkins/workspace/lldb-cmake-sanitized/lldb-build/bin/../include/c++/v1/__memory/shared_ptr.h:235:5: note: in instantiation of member function 'std::__shared_ptr_pointer<Foo *, std::shared_ptr<Foo>::__shared_ptr_default_delete<Foo, Foo>, std::allocator<Foo>>::__on_zero_shared_weak' requested here __shared_ptr_pointer(_Tp __p, _Dp __d, _Alloc __a) ^ /Users/buildslave/jenkins/workspace/lldb-cmake-sanitized/lldb-build/bin/../include/c++/v1/__memory/shared_ptr.h:453:24: note: in instantiation of member function 'std::__shared_ptr_pointer<Foo *, std::shared_ptr<Foo>::__shared_ptr_default_delete<Foo, Foo>, std::allocator<Foo>>::__shared_ptr_pointer' requested here __cntrl_ = new _CntrlBlk(__p, __shared_ptr_default_delete<_Tp, _Yp>(), _AllocT()); ^ /Users/buildslave/jenkins/workspace/lldb-cmake-sanitized/llvm-project/lldb/test/API/commands/expression/import-std-module/shared_ptr-dbg-info-content/main.cpp:8:24: note: in instantiation of function template specialization 'std::shared_ptr<Foo>::shared_ptr<Foo, void>' requested here std::shared_ptr<Foo> s(new Foo); ^ /Users/buildslave/jenkins/workspace/lldb-cmake-sanitized/lldb-build/bin/../include/c++/v1/__memory/pointer_traits.h:135:29: note: definition here is not reachable struct _LIBCPP_TEMPLATE_VIS pointer_traits<_Tp*> ^ 1 error generated. make: *** [main.o] Error 1

Hide Details

Test Directory: /Users/buildslave/jenkins/workspace/lldb-cmake-sanitized/llvm-project/lldb/test/API/commands/expression/import-std-module/shared_ptr-dbg-info-content ---------------------------------------------------------------------- Ran 4 tests in 19.279s

Hide Details

RESULT: FAILED (2 passes, 0 failures, 1 errors, 1 skipped, 0 expected failures, 0 unexpected successes)

Hide Details

--

Hide Details

******************** PASS: lldb-api :: functionalities/gdb_remote_client/TestArmRegisterDefinition.py (1658 of 2331) PASS: lldb-unit :: Expression/./ExpressionTests/CppModuleConfigurationTest.Sysroot (1659 of 2331) PASS: lldb-api :: lang/objc/modules/TestObjCModules.py (1660 of 2331) PASS: lldb-api :: functionalities/process_crash_info/TestProcessCrashInfo.py (1661 of 2331) PASS: lldb-unit :: Language/Highlighting/./HighlighterTests/HighlighterTest.DefaultHighlighterWithCursorOutOfBounds (1662 of 2331) PASS: lldb-api :: commands/expression/inline-namespace/TestInlineNamespace.py (1663 of 2331) PASS: lldb-unit :: Utility/./UtilityTests/ArgsTest.TestMultipleArgs (1664 of 2331) PASS: lldb-api :: lang/cpp/scope/TestCppScope.py (1665 of 2331) PASS: lldb-api :: functionalities/recursion/TestValueObjectRecursion.py (1666 of 2331) PASS: lldb-unit :: Utility/./UtilityTests/StreamTest.ShiftOperatorPtr (1667 of 2331) PASS: lldb-unit :: UnwindAssembly/x86/./UnwindAssemblyx86Tests/Testx86AssemblyInspectionEngine.TestPushR13 (1668 of 2331) PASS: lldb-unit :: Utility/./UtilityTests/ConstStringTest.format_provider (1669 of 2331) UNSUPPORTED: lldb-api :: tools/lldb-server/registers-target-xml-reading/TestGdbRemoteTargetXmlPacket.py (1670 of 2331) PASS: lldb-unit :: Host/./HostTests/MainLoopTest.Signal (1671 of 2331) PASS: lldb-unit :: Process/minidump/./LLDBMinidumpTests/RegisterContextMinidump.ConvertMinidumpContext_x86_64 (1672 of 2331) PASS: lldb-api :: functionalities/reproducers/fs-case-sensitivity/TestReproducerFSCaseSensitivity.py (1673 of 2331) PASS: lldb-api :: macosx/save_crashlog/TestSaveCrashlog.py (1674 of 2331) PASS: lldb-unit :: Expression/./ExpressionTests/DiagnosticManagerTest.GetStringMultiline (1675 of 2331) PASS: lldb-api :: commands/expression/test/TestExprs.py (1676 of 2331) PASS: lldb-api :: functionalities/gdb_remote_client/TestPartialGPacket.py (1677 of 2331) PASS: lldb-unit :: Language/Highlighting/./HighlighterTests/HighlighterTest.Keywords (1678 of 2331) PASS: lldb-shell :: SymbolFile/DWARF/x86/find-basic-function.cpp (1679 of 2331) PASS: lldb-api :: commands/expression/import-std-module/vector-dbg-info-content/TestDbgInfoContentVectorFromStdModule.py (1680 of 2331) PASS: lldb-shell :: Register/x86-multithread-write.test (1681 of 2331) PASS: lldb-unit :: Utility/./UtilityTests/BinaryStreamTest.PutULEB128ThreeBytes (1682 of 2331) UNSUPPORTED: lldb-shell :: Breakpoint/ppc64-localentry.test (1683 of 2331) PASS: lldb-api :: functionalities/gdb_remote_client/TestHaltFails.py (1684 of 2331) PASS: lldb-shell :: Quit/TestQuitExitCode30.test (1685 of 2331) PASS: lldb-api :: functionalities/tail_call_frames/cross_object/TestCrossObjectTailCalls.py (1686 of 2331) PASS: lldb-unit :: Utility/./UtilityTests/FileSpecTest.GuessPathStyle (1687 of 2331) PASS: lldb-api :: types/TestShortType.py (1688 of 2331) PASS: lldb-unit :: Utility/./UtilityTests/OptionsWithRawTest.UnterminatedQuote (1689 of 2331) PASS: lldb-unit :: Process/minidump/./LLDBMinidumpTests/MinidumpParserTest.GetMiscInfo_no_stream (1690 of 2331) PASS: lldb-api :: functionalities/inferior-crashing/TestInferiorCrashingStep.py (1691 of 2331) PASS: lldb-api :: functionalities/signal/raise/TestRaise.py (1692 of 2331) PASS: lldb-api :: lang/objc/modules-inline-functions/TestModulesInlineFunctions.py (1693 of 2331) PASS: lldb-unit :: ScriptInterpreter/Python/./ScriptInterpreterPythonTests/PythonDataObjectsTest.TestResetting (1694 of 2331) PASS: lldb-shell :: ObjectFile/ELF/PT_LOAD-overlap-PT_INTERP.yaml (1695 of 2331) PASS: lldb-api :: commands/expression/timeout/TestCallWithTimeout.py (1696 of 2331) PASS: lldb-unit :: ScriptInterpreter/Python/./ScriptInterpreterPythonTests/PythonDataObjectsTest.TestExtractingUInt64ThroughStructuredData (1697 of 2331) PASS: lldb-unit :: Utility/./UtilityTests/StringExtractorTest.GetHexBytes_Underflow (1698 of 2331) PASS: lldb-unit :: Utility/./UtilityTests/UriParserTest.MinimalPort (1699 of 2331) PASS: lldb-shell :: Quit/TestQuitExitCode-30.test (1700 of 2331) PASS: lldb-api :: functionalities/tail_call_frames/thread_step_out_message/TestArtificialFrameStepOutMessage.py (1701 of 2331) PASS: lldb-api :: commands/expression/issue_11588/Test11588.py (1702 of 2331) UNSUPPORTED: lldb-api :: functionalities/data-formatter/data-formatter-stl/libstdcpp/iterator/TestDataFormatterStdIterator.py (1703 of 2331) PASS: lldb-unit :: Utility/./UtilityTests/StringExtractorTest.DecodeHexU8_Underflow (1704 of 2331) PASS: lldb-api :: functionalities/tail_call_frames/ambiguous_tail_call_seq1/TestAmbiguousTailCallSeq1.py (1705 of 2331) PASS: lldb-api :: lang/cpp/overloaded-functions/TestOverloadedFunctions.py (1706 of 2331) PASS: lldb-unit :: Utility/./UtilityTests/CompletionRequest.TryCompleteCurrentArgBad (1707 of 2331) PASS: lldb-shell :: ObjectFile/PECOFF/basic-info.yaml (1708 of 2331) PASS: lldb-api :: types/TestDoubleTypesExpr.py (1709 of 2331) PASS: lldb-api :: functionalities/thread/concurrent_events/TestConcurrentTwoBreakpointsOneWatchpoint.py (1710 of 2331) PASS: lldb-api :: functionalities/data-formatter/compactvectors/TestCompactVectors.py (1711 of 2331) UNSUPPORTED: lldb-shell :: SymbolFile/DWARF/x86/DW_TAG_variable-DW_AT_decl_file-DW_AT_abstract_origin-crosscu1.s (1712 of 2331) PASS: lldb-unit :: ObjectFile/Breakpad/./ObjectFileBreakpadTests/StackCFIRecord.parse (1713 of 2331) PASS: lldb-shell :: ScriptInterpreter/None/import_module.test (1714 of 2331) PASS: lldb-unit :: Utility/./UtilityTests/SharedCluster.ClusterManager (1715 of 2331) PASS: lldb-api :: commands/expression/persistent_variables/TestPersistentVariables.py (1716 of 2331) PASS: lldb-unit :: ScriptInterpreter/Python/./ScriptInterpreterPythonTests/PythonDataObjectsTest.TestTypeNameResolutionNoDot (1717 of 2331) PASS: lldb-api :: functionalities/data-formatter/nsdictionarysynth/TestNSDictionarySynthetic.py (1718 of 2331) PASS: lldb-unit :: Host/./HostTests/NativeProcessProtocolTest.SetBreakpointFailWrite (1719 of 2331) PASS: lldb-shell :: Reproducer/TestHomeDir.test (1720 of 2331) PASS: lldb-unit :: Symbol/./SymbolTests/TestTypeSystemClang.TestUnifyAccessSpecifiers (1721 of 2331) PASS: lldb-unit :: ScriptInterpreter/Python/./ScriptInterpreterPythonTests/PythonDataObjectsTest.TestCallable (1722 of 2331) PASS: lldb-api :: functionalities/data-formatter/stringprinter/TestStringPrinter.py (1723 of 2331) PASS: lldb-unit :: Host/./HostTests/ConnectionFileDescriptorTest.TCPGetURIv4 (1724 of 2331) PASS: lldb-api :: functionalities/data-formatter/data-formatter-objc/nsstring/TestDataFormatterNSString.py (1725 of 2331) PASS: lldb-unit :: Host/./HostTests/FileSystemTest.GetByteSize (1726 of 2331) PASS: lldb-api :: commands/expression/import_base_class_when_class_has_derived_member/TestImportBaseClassWhenClassHasDerivedMember.py (1727 of 2331) PASS: lldb-unit :: Utility/./UtilityTests/StringListTest.RemoveBlankLines (1728 of 2331) UNSUPPORTED: lldb-api :: linux/mix-dwo-and-regular-objects/TestMixedDwarfBinary.py (1729 of 2331) UNSUPPORTED: lldb-api :: linux/add-symbols/TestTargetSymbolsAddCommand.py (1730 of 2331) PASS: lldb-unit :: UnwindAssembly/x86/./UnwindAssemblyx86Tests/Testx86AssemblyInspectionEngine.TestSpillRegToStackViaMOVx86_64 (1731 of 2331) PASS: lldb-unit :: Utility/./UtilityTests/StreamTest.PutHex64ByteOrderBig (1732 of 2331) PASS: lldb-unit :: Utility/./UtilityTests/RangeTest.ContainsRange (1733 of 2331) PASS: lldb-unit :: Target/./TargetTests/MCBasedABI.MapRegisterName (1734 of 2331) PASS: lldb-api :: python_api/watchpoint/TestSetWatchpoint.py (1735 of 2331) PASS: lldb-shell :: SymbolFile/DWARF/x86/debug_rnglists-dwo.s (1736 of 2331) PASS: lldb-unit :: Utility/./UtilityTests/RangeTest.DoesAdjoinOrIntersect (1737 of 2331) PASS: lldb-api :: functionalities/data-formatter/refpointer-recursion/TestDataFormatterRefPtrRecursion.py (1738 of 2331) PASS: lldb-shell :: Driver/TestHelp.test (1739 of 2331) PASS: lldb-api :: lang/objc/foundation/TestObjCMethods.py (1740 of 2331) PASS: lldb-api :: functionalities/data-formatter/nssetsynth/TestNSSetSynthetic.py (1741 of 2331) PASS: lldb-unit :: Language/CPlusPlus/./LanguageCPlusPlusTests/CPlusPlusLanguage.CPlusPlusNameParser (1742 of 2331) PASS: lldb-api :: commands/frame/diagnose/dereference-argument/TestDiagnoseDereferenceArgument.py (1743 of 2331) UNSUPPORTED: lldb-api :: iohandler/completion/TestIOHandlerCompletion.py (1744 of 2331) PASS: lldb-unit :: Utility/./UtilityTests/PassiveReplayTest.InstrumentedBarRef (1745 of 2331) PASS: lldb-unit :: Utility/./UtilityTests/FileSpecTest.EqualSeparator (1746 of 2331) PASS: lldb-shell :: SymbolFile/DWARF/x86/debug-types-line-tables.s (1747 of 2331) PASS: lldb-unit :: Utility/./UtilityTests/RangeTest.ContainsAddrInvalid (1748 of 2331) PASS: lldb-unit :: Utility/./UtilityTests/StreamTest.PutSLEB128 (1749 of 2331) PASS: lldb-unit :: Language/Highlighting/./HighlighterTests/HighlighterTest.ClangTrailingBackslashWithWhitespace (1750 of 2331) PASS: lldb-unit :: Utility/./UtilityTests/StringExtractorTest.GetHexBytes (1751 of 2331) PASS: lldb-unit :: Utility/./UtilityTests/RecordReplayTest.InstrumentedFooSameThis (1752 of 2331) PASS: lldb-shell :: ObjectFile/PECOFF/section-types.yaml (1753 of 2331) PASS: lldb-unit :: Expression/./ExpressionTests/CppModuleConfigurationTest.AmbiguousCLib (1754 of 2331) PASS: lldb-api :: tools/lldb-server/TestGdbRemoteProcessInfo.py (1755 of 2331) UNSUPPORTED: lldb-shell :: ScriptInterpreter/Lua/lua-python.test (1756 of 2331) PASS: lldb-api :: commands/frame/diagnose/dereference-function-return/TestDiagnoseDereferenceFunctionReturn.py (1757 of 2331) PASS: lldb-api :: functionalities/gdb_remote_client/TestNoGPacketSupported.py (1758 of 2331) PASS: lldb-api :: functionalities/breakpoint/auto_continue/TestBreakpointAutoContinue.py (1759 of 2331) PASS: lldb-shell :: SymbolFile/DWARF/x86/debug-names-compressed.cpp (1760 of 2331) PASS: lldb-unit :: Utility/./UtilityTests/UUIDTest.RelationalOperators (1761 of 2331) PASS: lldb-unit :: Utility/./UtilityTests/ScalarTest.SetValueFromData (1762 of 2331) PASS: lldb-api :: tools/lldb-vscode/breakpoint/TestVSCode_setBreakpoints.py (1763 of 2331) PASS: lldb-api :: lang/cpp/namespace/TestNamespaceLookup.py (1764 of 2331) PASS: lldb-unit :: Utility/./UtilityTests/GeneratorTest.Create (1765 of 2331) PASS: lldb-unit :: Utility/./UtilityTests/BinaryStreamTest.PutSLEB128One (1766 of 2331) PASS: lldb-api :: functionalities/dead-strip/TestDeadStrip.py (1767 of 2331) PASS: lldb-api :: commands/thread/select/TestThreadSelect.py (1768 of 2331) UNSUPPORTED: lldb-api :: functionalities/data-formatter/data-formatter-stl/libstdcpp/tuple/TestDataFormatterStdTuple.py (1769 of 2331) UNSUPPORTED: lldb-api :: functionalities/gdb_remote_client/TestWasm.py (1770 of 2331) PASS: lldb-unit :: Utility/./UtilityTests/RegularExpression.CopyAssignment (1771 of 2331) PASS: lldb-shell :: Register/Core/x86-64-freebsd-fp.test (1772 of 2331) PASS: lldb-api :: functionalities/tail_call_frames/unambiguous_sequence/TestUnambiguousTailCalls.py (1773 of 2331) PASS: lldb-api :: functionalities/tail_call_frames/disambiguate_tail_call_seq/TestDisambiguateTailCallSeq.py (1774 of 2331) PASS: lldb-shell :: Reproducer/TestProcessList.test (1775 of 2331) PASS: lldb-api :: lang/cpp/breakpoint-commands/TestCPPBreakpointCommands.py (1776 of 2331) PASS: lldb-shell :: SymbolFile/DWARF/x86/debug_ranges_and_rnglists.test (1777 of 2331) PASS: lldb-api :: functionalities/thread/concurrent_events/TestConcurrentWatchBreak.py (1778 of 2331) PASS: lldb-api :: functionalities/thread/concurrent_events/TestConcurrentCrashWithSignal.py (1779 of 2331) PASS: lldb-unit :: Language/Highlighting/./HighlighterTests/HighlighterTest.ClangCursorPosAfterOtherToken (1780 of 2331) PASS: lldb-shell :: SymbolFile/DWARF/x86/DW_TAG_variable-invalid_location.s (1781 of 2331) PASS: lldb-unit :: UnwindAssembly/x86/./UnwindAssemblyx86Tests/Testx86AssemblyInspectionEngine.TestStackRealign32BitDisp_x86_64 (1782 of 2331) PASS: lldb-unit :: Utility/./UtilityTests/StringLexerTest.AdvanceIf (1783 of 2331) PASS: lldb-api :: functionalities/thread/concurrent_events/TestConcurrentWatchBreakDelay.py (1784 of 2331) PASS: lldb-unit :: Expression/./ExpressionTests/DiagnosticManagerTest.AppendMessageSubsequentDiags (1785 of 2331) PASS: lldb-unit :: Host/./HostTests/Host.GetEnvironment (1786 of 2331) PASS: lldb-api :: functionalities/data-formatter/data-formatter-stl/libcxx/shared_ptr/TestDataFormatterLibcxxSharedPtr.py (1787 of 2331) PASS: lldb-api :: python_api/watchpoint/TestWatchpointIgnoreCount.py (1788 of 2331) PASS: lldb-unit :: Utility/./UtilityTests/StringListTest.LongestCommonPrefixSingleElement (1789 of 2331) PASS: lldb-unit :: Process/minidump/./LLDBMinidumpTests/MinidumpParserTest.GetThreadContext_x86_32 (1790 of 2331) UNSUPPORTED: lldb-shell :: SymbolFile/NativePDB/stack_unwinding01.cpp (1791 of 2331) UNSUPPORTED: lldb-api :: functionalities/darwin_log/filter/regex/activity-chain/TestDarwinLogFilterRegexActivityChain.py (1792 of 2331) PASS: lldb-unit :: Utility/./UtilityTests/RangeTest.ContainsEndInclusive (1793 of 2331) PASS: lldb-api :: commands/expression/error-limit/TestExprErrorLimit.py (1794 of 2331) PASS: lldb-unit :: Host/./HostTests/FileSystemTest.Resolve (1795 of 2331) PASS: lldb-api :: lang/objc/objc-new-syntax/TestObjCNewSyntaxDictionary.py (1796 of 2331) PASS: lldb-unit :: Utility/./UtilityTests/StreamTest.AddressNoSuffix (1797 of 2331) PASS: lldb-api :: functionalities/data-formatter/data-formatter-synthval/TestDataFormatterSynthVal.py (1798 of 2331) PASS: lldb-unit :: Utility/./UtilityTests/FileSpecTest.AppendPathComponent (1799 of 2331) PASS: lldb-unit :: Platform/./LLDBPlatformTests/PlatformDarwinTest.TestParseVersionBuildDir (1800 of 2331) PASS: lldb-unit :: Symbol/./SymbolTests/TestScratchTypeSystemClang.InferSubASTFromLangOpts (1801 of 2331) PASS: lldb-unit :: Process/gdb-remote/./ProcessGdbRemoteTests/GDBRemoteCommunicationClientTest.WriteRegisterNoSuffix (1802 of 2331) UNSUPPORTED: lldb-api :: tools/lldb-vscode/disconnect/TestVSCode_disconnect.py (1803 of 2331) PASS: lldb-api :: functionalities/scripted_process/TestScriptedProcess.py (1804 of 2331) PASS: lldb-unit :: Host/./HostTests/SocketTests/SocketTest.DecodeHostAndPort/ipv4 (1805 of 2331) PASS: lldb-api :: commands/target/stop-hooks/TestStopHookScripted.py (1806 of 2331) PASS: lldb-api :: lang/cpp/template-arguments/TestCppTemplateArguments.py (1807 of 2331) PASS: lldb-unit :: UnwindAssembly/x86/./UnwindAssemblyx86Tests/Testx86AssemblyInspectionEngine.Test64bitFramelessBigStackFrame (1808 of 2331) PASS: lldb-unit :: DataFormatter/./LLDBFormatterTests/TypeMatcherTests.CreatedBySameMatchStringExactNamePrefixes (1809 of 2331) PASS: lldb-api :: api/listeners/TestListener.py (1810 of 2331) PASS: lldb-unit :: Utility/./UtilityTests/StreamTest.PutMaxHex64ByteOrderLittle (1811 of 2331) PASS: lldb-api :: functionalities/data-formatter/data-formatter-objc/TestDataFormatterObjCExpr.py (1812 of 2331) PASS: lldb-api :: lang/cpp/char8_t/TestCxxChar8_t.py (1813 of 2331) PASS: lldb-api :: commands/apropos/with-process/TestAproposWithProcess.py (1814 of 2331) PASS: lldb-shell :: Minidump/Windows/find-module.test (1815 of 2331) UNSUPPORTED: lldb-api :: commands/gui/basic/TestGuiBasic.py (1816 of 2331) PASS: lldb-shell :: ObjectFile/ELF/section-addresses.yaml (1817 of 2331) PASS: lldb-unit :: Utility/./UtilityTests/VMRange.SetEndAddress (1818 of 2331) PASS: lldb-unit :: Utility/./UtilityTests/VMRange.CollectionContains (1819 of 2331) PASS: lldb-shell :: SymbolFile/DWARF/x86/dir-separator-no-comp-dir-relative-name.s (1820 of 2331) PASS: lldb-api :: functionalities/thread/create_after_attach/TestCreateAfterAttach.py (1821 of 2331) PASS: lldb-api :: functionalities/signal/TestSendSignal.py (1822 of 2331) PASS: lldb-unit :: Utility/./UtilityTests/StringLexerTest.Next (1823 of 2331) PASS: lldb-unit :: Utility/./UtilityTests/UriParserTest.TypicalPortPathIPv4 (1824 of 2331) PASS: lldb-unit :: Core/./LLDBCoreTests/ModuleSpecTest.TestELFFile (1825 of 2331) PASS: lldb-api :: functionalities/data-formatter/data-formatter-categories/TestDataFormatterCategories.py (1826 of 2331) PASS: lldb-shell :: ObjectFile/ELF/netbsd-exec-8.99.30-amd64.yaml (1827 of 2331) PASS: lldb-api :: functionalities/thread/concurrent_events/TestConcurrentDelaySignalWatch.py (1828 of 2331) PASS: lldb-unit :: Utility/./UtilityTests/XcodeSDKTest.GetSDKTypeForTriple (1829 of 2331) PASS: lldb-shell :: Settings/TestFrameFormatNoColor.test (1830 of 2331) PASS: lldb-shell :: SymbolFile/DWARF/x86/debug_rnglists.s (1831 of 2331) PASS: lldb-shell :: SymbolFile/DWARF/x86/dwarf5-debug_line-file-index.s (1832 of 2331) PASS: lldb-api :: tools/lldb-vscode/launch/TestVSCode_launch.py (1833 of 2331) PASS: lldb-unit :: Utility/./UtilityTests/AnsiTerminal.Twice (1834 of 2331) PASS: lldb-unit :: Utility/./UtilityTests/VMRange.ContainsRange (1835 of 2331) PASS: lldb-api :: functionalities/postmortem/minidump/TestMiniDump.py (1836 of 2331) PASS: lldb-unit :: ScriptInterpreter/Python/./ScriptInterpreterPythonTests/PythonDataObjectsTest.TestScript (1837 of 2331) PASS: lldb-unit :: Utility/./UtilityTests/ScalarTest.ComparisonFloat (1838 of 2331) PASS: lldb-api :: tools/lldb-vscode/attach/TestVSCode_attach.py (1839 of 2331) UNSUPPORTED: lldb-shell :: SymbolFile/NativePDB/ast-functions-msvc.cpp (1840 of 2331) UNSUPPORTED: lldb-api :: lang/cpp/printf/TestPrintf.py (1841 of 2331) PASS: lldb-api :: lang/cpp/class_types/TestClassTypesDisassembly.py (1842 of 2331) PASS: lldb-shell :: ScriptInterpreter/Python/scripted_breakpoint.test (1843 of 2331) UNSUPPORTED: lldb-api :: functionalities/data-formatter/data-formatter-stl/libstdcpp/list/TestDataFormatterStdList.py (1844 of 2331) PASS: lldb-unit :: Utility/./UtilityTests/StringLexerTest.NextIf (1845 of 2331) PASS: lldb-api :: functionalities/data-formatter/vector-types/TestVectorTypesFormatting.py (1846 of 2331) PASS: lldb-api :: functionalities/reproducers/attach/TestReproducerAttach.py (1847 of 2331) PASS: lldb-api :: lang/cpp/class-template-non-type-parameter-pack/TestClassTemplateNonTypeParameterPack.py (1848 of 2331) PASS: lldb-shell :: Reproducer/TestCrash.test (1849 of 2331) UNSUPPORTED: lldb-api :: functionalities/ptr_refs/TestPtrRefs.py (1850 of 2331) PASS: lldb-unit :: UnwindAssembly/x86/./UnwindAssemblyx86Tests/Testx86AssemblyInspectionEngine.TestPushESI (1851 of 2331) PASS: lldb-unit :: Process/minidump/./LLDBMinidumpTests/MinidumpParserTest.GetMiscInfoWindows (1852 of 2331) PASS: lldb-unit :: ScriptInterpreter/Python/./ScriptInterpreterPythonTests/PythonDataObjectsTest.TestPythonListManipulation (1853 of 2331) PASS: lldb-api :: commands/add-dsym/uuid/TestAddDsymCommand.py (1854 of 2331) PASS: lldb-api :: functionalities/data-formatter/data-formatter-globals/TestDataFormatterGlobals.py (1855 of 2331) PASS: lldb-unit :: Utility/./UtilityTests/StreamTest.PutULEB128 (1856 of 2331) PASS: lldb-unit :: Expression/./ExpressionTests/CppModuleConfigurationTest.LinuxLocalLibCpp (1857 of 2331) PASS: lldb-unit :: Utility/./UtilityTests/StreamTest.PutCharNull (1858 of 2331) PASS: lldb-api :: functionalities/breakpoint/serialize/TestBreakpointSerialization.py (1859 of 2331) PASS: lldb-shell :: ScriptInterpreter/Python/Crashlog/parser_json.test (1860 of 2331) XFAIL: lldb-shell :: Register/x86-mm-xmm-write.test (1861 of 2331) PASS: lldb-api :: lang/c/vla/TestVLA.py (1862 of 2331) PASS: lldb-unit :: Process/gdb-remote/./ProcessGdbRemoteTests/GDBRemoteCommunicationClientTest.GetQOffsets (1863 of 2331) PASS: lldb-shell :: SymbolFile/NativePDB/globals-fundamental.cpp (1864 of 2331) PASS: lldb-api :: python_api/exprpath_synthetic/TestExprPathSynthetic.py (1865 of 2331) UNSUPPORTED: lldb-shell :: BuildScript/toolchain-clang-cl.test (1866 of 2331) PASS: lldb-unit :: Host/./HostTests/HostInfoTest.GetXcodeSDK (1867 of 2331) PASS: lldb-shell :: ObjectFile/ELF/eh_frame-symbols.yaml (1868 of 2331) UNSUPPORTED: lldb-shell :: SymbolFile/PDB/calling-conventions.test (1869 of 2331) PASS: lldb-shell :: Driver/TestNoUseColor.test (1870 of 2331) PASS: lldb-api :: commands/frame/diagnose/inheritance/TestDiagnoseInheritance.py (1871 of 2331) PASS: lldb-api :: functionalities/thread/concurrent_events/TestConcurrentCrashWithBreak.py (1872 of 2331) PASS: lldb-api :: commands/expression/unwind_expression/TestUnwindExpression.py (1873 of 2331) PASS: lldb-api :: functionalities/data-formatter/type_summary_list_arg/TestTypeSummaryListArg.py (1874 of 2331) PASS: lldb-api :: python_api/watchpoint/watchlocation/TestTargetWatchAddress.py (1875 of 2331) UNSUPPORTED: lldb-shell :: SymbolFile/PDB/expressions.test (1876 of 2331) PASS: lldb-unit :: Core/./LLDBCoreTests/MangledTest.ResultForValidName (1877 of 2331) PASS: lldb-api :: commands/target/stop-hook/disable/TestTargetStopHookDisable.py (1878 of 2331) PASS: lldb-unit :: Process/minidump/./LLDBMinidumpTests/MinidumpParserTest.FindMemoryRangeWithFullMemoryMinidump (1879 of 2331) PASS: lldb-unit :: Utility/./UtilityTests/StreamTest.AddressRangeSize (1880 of 2331) PASS: lldb-unit :: Utility/./UtilityTests/ArgsTest.ReplaceArgumentAtIndexShort (1881 of 2331) PASS: lldb-shell :: Register/Core/x86-32-freebsd-addr.test (1882 of 2331) XFAIL: lldb-shell :: Unwind/prefer-debug-over-eh-frame.test (1883 of 2331) PASS: lldb-api :: functionalities/thread/concurrent_events/TestConcurrentSignalWatch.py (1884 of 2331) PASS: lldb-unit :: Utility/./UtilityTests/BinaryStreamTest.PutSLEB128OneByte (1885 of 2331) PASS: lldb-shell :: SymbolFile/DWARF/x86/DW_AT_const_value-bitfields.s (1886 of 2331) PASS: lldb-api :: lang/cpp/const_this/TestConstThis.py (1887 of 2331) PASS: lldb-unit :: Expression/./ExpressionTests/DWARFExpression.DW_OP_pick (1888 of 2331) PASS: lldb-api :: commands/expression/import-std-module/list/TestListFromStdModule.py (1889 of 2331) PASS: lldb-unit :: Process/minidump/./LLDBMinidumpTests/MinidumpParserTest.MinidumpDuplicateModuleSeparateCode (1890 of 2331) PASS: lldb-unit :: Utility/./UtilityTests/StringExtractorTest.GetNameColonValueContainsColon (1891 of 2331) PASS: lldb-api :: macosx/load-kext/TestLoadKext.py (1892 of 2331) PASS: lldb-unit :: Utility/./UtilityTests/BinaryStreamTest.PutULEB128SixBytes (1893 of 2331) PASS: lldb-api :: lang/cpp/offsetof/TestOffsetofCpp.py (1894 of 2331) PASS: lldb-unit :: Symbol/./SymbolTests/TestClangASTImporter.ImportInvalidType (1895 of 2331) PASS: lldb-unit :: Host/./HostTests/SocketTests/SocketTest.TCPListen0GetPort/ipv6 (1896 of 2331) PASS: lldb-unit :: Process/gdb-remote/./ProcessGdbRemoteTests/GDBRemoteClientBaseTest.SendContinueAndAsyncSignal (1897 of 2331) PASS: lldb-api :: lang/objc/objc-dyn-sbtype/TestObjCDynamicSBType.py (1898 of 2331) PASS: lldb-api :: commands/process/attach/attach_denied/TestAttachDenied.py (1899 of 2331) PASS: lldb-unit :: Core/./LLDBCoreTests/SourceLocationSpecTest.FileLineColumnComponents (1900 of 2331) PASS: lldb-unit :: Host/./HostTests/ConnectionFileDescriptorTest.TCPGetURIv6 (1901 of 2331) PASS: lldb-unit :: Symbol/./SymbolTests/SymbolsTest.TerminateLocateExecutableSymbolFileForUnknownExecutableAndUnknownSymbolFile (1902 of 2331) PASS: lldb-unit :: Utility/./UtilityTests/RecordReplayTest.InstrumentedBarRef (1903 of 2331) UNSUPPORTED: lldb-api :: tools/lldb-server/TestGdbRemoteModuleInfo.py (1904 of 2331) PASS: lldb-unit :: Host/./HostTests/SocketTests/SocketTest.UDPConnect/ipv4 (1905 of 2331) PASS: lldb-api :: commands/expression/two-files/TestObjCTypeQueryFromOtherCompileUnit.py (1906 of 2331) PASS: lldb-api :: lang/objc/modules-non-objc-target/TestObjCModulesNonObjCTarget.py (1907 of 2331) PASS: lldb-api :: functionalities/data-formatter/data-formatter-stl/libcxx/iterator/TestDataFormatterLibccIterator.py (1908 of 2331) PASS: lldb-shell :: Settings/TestSettingsSet.test (1909 of 2331) PASS: lldb-shell :: SymbolFile/NativePDB/ast-types.cpp (1910 of 2331) PASS: lldb-unit :: Core/./LLDBCoreTests/MangledTest.ResultForBlockInvocation (1911 of 2331) PASS: lldb-api :: lang/objc/modules-objc-property/TestModulesObjCProperty.py (1912 of 2331) UNSUPPORTED: lldb-api :: commands/gui/breakpoints/TestGuiBreakpoints.py (1913 of 2331) PASS: lldb-shell :: SymbolFile/DWARF/x86/static_scope.s (1914 of 2331) PASS: lldb-api :: lang/objc/modules-auto-import/TestModulesAutoImport.py (1915 of 2331) PASS: lldb-api :: functionalities/data-formatter/typedef_array/TestTypedefArray.py (1916 of 2331) UNSUPPORTED: lldb-api :: lang/objc/rdar-12408181/TestRdar12408181.py (1917 of 2331) PASS: lldb-unit :: Utility/./UtilityTests/StringListTest.GetMaxStringLengthMixed (1918 of 2331) PASS: lldb-api :: functionalities/return-value/TestReturnValue.py (1919 of 2331) PASS: lldb-api :: commands/expression/vector_of_enums/TestVectorOfEnums.py (1920 of 2331) PASS: lldb-api :: functionalities/data-formatter/data-formatter-stl/libcxx/queue/TestDataFormatterLibcxxQueue.py (1921 of 2331) PASS: lldb-shell :: VSCode/TestOptions.test (1922 of 2331) UNSUPPORTED: lldb-shell :: SymbolFile/DWARF/split-dwarf-expression-eval-bug.cpp (1923 of 2331) PASS: lldb-shell :: SymbolFile/DWARF/clang-ast-from-dwarf-unamed-and-anon-structs.cpp (1924 of 2331) UNSUPPORTED: lldb-shell :: ScriptInterpreter/Lua/watchpoint_callback.test (1925 of 2331) PASS: lldb-unit :: Utility/./UtilityTests/RangeTest.Equal (1926 of 2331) UNSUPPORTED: lldb-shell :: Subprocess/clone-follow-parent.test (1927 of 2331) PASS: lldb-api :: functionalities/thread_plan/TestThreadPlanCommands.py (1928 of 2331) PASS: lldb-api :: functionalities/gdb_remote_client/TestJLink6Armv7RegisterDefinition.py (1929 of 2331) PASS: lldb-shell :: SymbolFile/Breakpad/line-table-discontinuous-file-ids.test (1930 of 2331) UNSUPPORTED: lldb-shell :: Process/Windows/exception_access_violation.cpp (1931 of 2331) UNSUPPORTED: lldb-api :: functionalities/darwin_log/filter/exact_match/message/TestDarwinLogFilterMatchMessage.py (1932 of 2331) PASS: lldb-api :: functionalities/data-formatter/data-formatter-enum-format/TestDataFormatterEnumFormat.py (1933 of 2331) UNSUPPORTED: lldb-shell :: Register/x86-ymm-write.test (1934 of 2331) UNSUPPORTED: lldb-api :: arm/breakpoint-thumb-codesection/TestBreakpointThumbCodesection.py (1935 of 2331) PASS: lldb-unit :: Utility/./UtilityTests/OptionsWithRawTest.SingleWordSuffix (1936 of 2331) PASS: lldb-api :: commands/expression/static-initializers/TestStaticInitializers.py (1937 of 2331) PASS: lldb-unit :: Target/./TargetTests/PathMappingListTest.AbsoluteTests (1938 of 2331) PASS: lldb-shell :: Process/UnsupportedLanguage.test (1939 of 2331) PASS: lldb-unit :: Utility/./UtilityTests/StreamTest.AddressPrefixAndSuffix (1940 of 2331) PASS: lldb-unit :: Host/./HostTests/SocketTests/SocketTest.DomainListenConnectAccept/ipv6 (1941 of 2331) PASS: lldb-unit :: Utility/./UtilityTests/StreamTeeTest.DefaultConstructor (1942 of 2331) UNSUPPORTED: lldb-shell :: Subprocess/vfork-follow-parent-wp.test (1943 of 2331) PASS: lldb-api :: lang/cpp/global_operators/TestCppGlobalOperators.py (1944 of 2331) PASS: lldb-api :: functionalities/thread/concurrent_events/TestConcurrentSignalNWatchNBreak.py (1945 of 2331) PASS: lldb-unit :: SymbolFile/NativePDB/./SymbolFileNativePDBTests/PDBFPOProgramToDWARFExpressionTests.InvalidOpBinary (1946 of 2331) PASS: lldb-unit :: Symbol/./SymbolTests/LineEntryTest.GetSameLineContiguousAddressRangeNoInlines (1947 of 2331) PASS: lldb-unit :: Symbol/./SymbolTests/PostfixExpression.ParseOneExpression (1948 of 2331) PASS: lldb-unit :: Utility/./UtilityTests/StringExtractorTest.GetHexBytesAvail_FullString (1949 of 2331) UNSUPPORTED: lldb-api :: benchmarks/expression/TestExpressionCmd.py (1950 of 2331) PASS: lldb-api :: functionalities/gdb_remote_client/TestRemoteRegNums.py (1951 of 2331) PASS: lldb-api :: api/multiple-targets/TestMultipleTargets.py (1952 of 2331) PASS: lldb-unit :: Symbol/./SymbolTests/TestTypeSystemClang.TestFunctionTemplateInRecordConstruction (1953 of 2331) PASS: lldb-api :: lang/cpp/static_methods/TestCPPStaticMethods.py (1954 of 2331) PASS: lldb-api :: types/TestFloatTypesExpr.py (1955 of 2331) PASS: lldb-shell :: Commands/command-source.test (1956 of 2331) PASS: lldb-api :: functionalities/thread/concurrent_events/TestConcurrentDelayedCrashWithBreakpointSignal.py (1957 of 2331) UNSUPPORTED: lldb-shell :: Register/x86-zmm-write.test (1958 of 2331) PASS: lldb-api :: lang/objc/cpp_keyword_identifiers/TestCppKeywordsAsObjCIdentifiers.py (1959 of 2331) PASS: lldb-api :: functionalities/thread/crash_during_step/TestCrashDuringStep.py (1960 of 2331) PASS: lldb-api :: python_api/lldbutil/TestSwigVersion.py (1961 of 2331) PASS: lldb-api :: commands/expression/po_verbosity/TestPoVerbosity.py (1962 of 2331) PASS: lldb-shell :: Register/x86-64-gp-read.test (1963 of 2331) PASS: lldb-api :: python_api/lldbutil/iter/TestLLDBIterator.py (1964 of 2331) PASS: lldb-api :: python_api/interpreter/TestRunCommandInterpreterAPI.py (1965 of 2331) UNSUPPORTED: lldb-api :: functionalities/darwin_log/filter/regex/subsystem/TestDarwinLogFilterRegexSubsystem.py (1966 of 2331) PASS: lldb-api :: functionalities/thread/concurrent_events/TestConcurrentTwoBreakpointsOneSignal.py (1967 of 2331) PASS: lldb-unit :: Utility/./UtilityTests/StringExtractorGDBRemoteTest.GetPidTid (1968 of 2331) UNSUPPORTED: lldb-api :: commands/trace/TestTraceDumpInstructions.py (1969 of 2331) PASS: lldb-unit :: Core/./LLDBCoreTests/FormatEntityTest.DefinitionConstructionNameTypeData (1970 of 2331) PASS: lldb-api :: functionalities/data-formatter/data-formatter-objc/TestDataFormatterObjCKVO.py (1971 of 2331) PASS: lldb-api :: functionalities/thread/concurrent_events/TestConcurrentBreakpointDelayBreakpointOneSignal.py (1972 of 2331) PASS: lldb-api :: lang/objc/objc_direct-methods/TestObjCDirectMethods.py (1973 of 2331) PASS: lldb-unit :: UnwindAssembly/x86/./UnwindAssemblyx86Tests/Testx86AssemblyInspectionEngine.TestPushRBP (1974 of 2331) PASS: lldb-unit :: Utility/./UtilityTests/CompletionRequest.TestCompletionOwnership (1975 of 2331) PASS: lldb-api :: functionalities/postmortem/mach-core/TestMachCore.py (1976 of 2331) UNSUPPORTED: lldb-api :: macosx/macCatalystAppMacOSFramework/TestMacCatalystAppWithMacOSFramework.py (1977 of 2331) PASS: lldb-api :: functionalities/data-formatter/poarray/TestPrintObjectArray.py (1978 of 2331) PASS: lldb-api :: python_api/value/TestValueAPI.py (1979 of 2331) PASS: lldb-shell :: SymbolFile/DWARF/x86/dwarf5-index-is-used.cpp (1980 of 2331) PASS: lldb-api :: commands/expression/radar_9531204/TestPrintfAfterUp.py (1981 of 2331) PASS: lldb-api :: lang/cpp/chained-calls/TestCppChainedCalls.py (1982 of 2331) PASS: lldb-shell :: SymbolFile/NativePDB/tag-types.cpp (1983 of 2331) PASS: lldb-unit :: Core/./LLDBCoreTests/ModuleSpecTest.TestCOFFFile (1984 of 2331) PASS: lldb-shell :: SymbolFile/DWARF/x86/DW_AT_declaration-with-children.s (1985 of 2331) PASS: lldb-shell :: Reproducer/TestSynchronous.test (1986 of 2331) PASS: lldb-api :: functionalities/jitloader_gdb/TestJITLoaderGDB.py (1987 of 2331) PASS: lldb-unit :: Utility/./UtilityTests/StreamTest.PutCString (1988 of 2331) PASS: lldb-unit :: Utility/./UtilityTests/StreamTest.PutPtr (1989 of 2331) PASS: lldb-unit :: Host/./HostTests/NativeProcessProtocolTest.SetBreakpointFailRead (1990 of 2331) PASS: lldb-unit :: Utility/./UtilityTests/StringListTest.JoinMultiCharSeparator (1991 of 2331) PASS: lldb-unit :: Process/Utility/./ProcessUtilityTests/ProcSMapTests/LinuxProcSMapsTestFixture.ParseSMapRegions/5 (1992 of 2331) PASS: lldb-api :: functionalities/var_path/TestVarPath.py (1993 of 2331) PASS: lldb-unit :: Symbol/./SymbolTests/TestTypeSystemClang.TestFunctionTemplateConstruction (1994 of 2331) PASS: lldb-api :: functionalities/target_var/no_vars/TestTargetVarNoVars.py (1995 of 2331) PASS: lldb-unit :: Utility/./UtilityTests/StreamTest.AddressSuffix (1996 of 2331) UNSUPPORTED: lldb-api :: functionalities/thread/create_during_step/TestCreateDuringStep.py (1997 of 2331) PASS: lldb-unit :: Utility/./UtilityTests/StreamTest.PutBytesAsRawHex8ToLittleEndian (1998 of 2331) PASS: lldb-unit :: Utility/./UtilityTests/ScalarTest.Scalar_512 (1999 of 2331) UNSUPPORTED: lldb-api :: benchmarks/stepping/TestSteppingSpeed.py (2000 of 2331) PASS: lldb-unit :: Language/CPlusPlus/./LanguageCPlusPlusTests/CPlusPlusLanguage.ExtractContextAndIdentifier (2001 of 2331) PASS: lldb-unit :: Utility/./UtilityTests/StringLexerTest.HasAtLeast (2002 of 2331) PASS: lldb-api :: functionalities/data-formatter/pyobjsynthprovider/TestPyObjSynthProvider.py (2003 of 2331) PASS: lldb-api :: functionalities/data-formatter/data-formatter-named-summaries/TestDataFormatterNamedSummaries.py (2004 of 2331) PASS: lldb-unit :: UnwindAssembly/x86/./UnwindAssemblyx86Tests/Testx86AssemblyInspectionEngine.TestPushEBP (2005 of 2331) PASS: lldb-unit :: Host/./HostTests/FileSystemTest.OpenErrno (2006 of 2331) PASS: lldb-api :: commands/settings/use_source_cache/TestUseSourceCache.py (2007 of 2331) PASS: lldb-api :: commands/expression/dollar-in-variable/TestDollarInVariable.py (2008 of 2331) PASS: lldb-api :: commands/expression/radar_9673664/TestExprHelpExamples.py (2009 of 2331) PASS: lldb-shell :: ObjectFile/ELF/aarch64-relocations.yaml (2010 of 2331) PASS: lldb-unit :: Host/./HostTests/ProcessLaunchInfoTest.Constructor (2011 of 2331) PASS: lldb-api :: commands/session/save/TestSessionSave.py (2012 of 2331) PASS: lldb-unit :: Utility/./UtilityTests/OptionsWithRawTest.EmptySuffixSingleWhitespace (2013 of 2331) PASS: lldb-unit :: UnwindAssembly/x86/./UnwindAssemblyx86Tests/Testx86AssemblyInspectionEngine.TestPopESI (2014 of 2331) PASS: lldb-unit :: Utility/./UtilityTests/StreamTest.PutHex16ByteOrderLittle (2015 of 2331) PASS: lldb-api :: commands/expression/regression-access-function-template-in-record/TestRegressionAccessFunctionTemplateInRecord.py (2016 of 2331) PASS: lldb-shell :: SymbolFile/DWARF/x86/find-function-regex.cpp (2017 of 2331) PASS: lldb-api :: commands/command/script/TestCommandScript.py (2018 of 2331) PASS: lldb-unit :: Utility/./UtilityTests/OptionsWithRawTest.LeadingSpaceArgs (2019 of 2331) PASS: lldb-shell :: Driver/TestSingleQuote.test (2020 of 2331) PASS: lldb-unit :: Utility/./UtilityTests/ScalarTest.GetValue (2021 of 2331) PASS: lldb-api :: tools/lldb-vscode/console/TestVSCode_redirection_to_console.py (2022 of 2331) PASS: lldb-unit :: Core/./LLDBCoreTests/SourceFileCache.FindSourceFileNotFound (2023 of 2331) PASS: lldb-shell :: SymbolFile/Breakpad/line-table-missing-file.test (2024 of 2331) PASS: lldb-unit :: ScriptInterpreter/Python/./ScriptInterpreterPythonTests/PythonDataObjectsTest.TestRun (2025 of 2331) PASS: lldb-api :: python_api/frame/TestFrames.py (2026 of 2331) PASS: lldb-shell :: Driver/TestConvenienceVariables.test (2027 of 2331) PASS: lldb-unit :: UnwindAssembly/x86/./UnwindAssemblyx86Tests/Testx86AssemblyInspectionEngine.Test64bitFramelessSmallStackFrame (2028 of 2331) PASS: lldb-shell :: SymbolFile/DWARF/x86/inline-function-address.ll (2029 of 2331) PASS: lldb-api :: lang/objc/objc-new-syntax/TestObjCNewSyntaxLiteral.py (2030 of 2331) PASS: lldb-unit :: Utility/./UtilityTests/StringListTest.ShiftStdString (2031 of 2331) PASS: lldb-api :: commands/process/signal/TestProcessSignal.py (2032 of 2331) PASS: lldb-unit :: Symbol/./SymbolTests/TestTypeSystemClang.GetExeModuleWhenMissingSymbolFile (2033 of 2331) PASS: lldb-shell :: SymbolFile/DWARF/x86/split-dwarf-inlining.cpp (2034 of 2331) PASS: lldb-unit :: Utility/./UtilityTests/RangeTest.LessThan (2035 of 2331) PASS: lldb-shell :: Driver/TestError.test (2036 of 2331) PASS: lldb-api :: functionalities/breakpoint/breakpoint_ids/TestBreakpointIDs.py (2037 of 2331) PASS: lldb-api :: commands/frame/diagnose/local-variable/TestLocalVariable.py (2038 of 2331) PASS: lldb-unit :: Language/Highlighting/./HighlighterTests/HighlighterTest.ClangCursorPosBeforeOtherToken (2039 of 2331) PASS: lldb-unit :: Utility/./UtilityTests/StringExtractorTest.GetHexU8_InvalidHex_NoEof (2040 of 2331) PASS: lldb-unit :: Target/./TargetTests/ModuleCacheTest.GetAndPutUuidExists (2041 of 2331) PASS: lldb-unit :: Utility/./UtilityTests/StreamTeeTest.SetStreamAtIndexOutOfBounds (2042 of 2331) PASS: lldb-unit :: Host/./HostTests/NativeProcessProtocolTest.ReadCStringFromMemory_MaxSize (2043 of 2331) PASS: lldb-api :: functionalities/load_lazy/TestLoadUsingLazyBind.py (2044 of 2331) PASS: lldb-shell :: SymbolFile/Breakpad/line-table.test (2045 of 2331) PASS: lldb-unit :: UnwindAssembly/x86/./UnwindAssemblyx86Tests/Testx86AssemblyInspectionEngine.TestSimplex86_64Augmented (2046 of 2331) PASS: lldb-unit :: Utility/./UtilityTests/SerializationRountripTest.SerializeDeserializeCStringArray (2047 of 2331) PASS: lldb-unit :: Process/minidump/./LLDBMinidumpTests/MinidumpParserTest.MinidumpDuplicateModuleMappedSecond (2048 of 2331) PASS: lldb-unit :: UnwindAssembly/x86/./UnwindAssemblyx86Tests/Testx86AssemblyInspectionEngine.TestMovRSPtoRBP (2049 of 2331) PASS: lldb-unit :: Process/minidump/./LLDBMinidumpTests/MinidumpParserTest.GetThreadContext_x86_32_wow64 (2050 of 2331) PASS: lldb-api :: functionalities/multiword-commands/TestMultiWordCommands.py (2051 of 2331) PASS: lldb-api :: functionalities/data-formatter/data-formatter-objc/TestDataFormatterObjCCF.py (2052 of 2331) PASS: lldb-unit :: ScriptInterpreter/Python/./ScriptInterpreterPythonTests/PythonDataObjectsTest.TestPythonIntegerToStr (2053 of 2331) PASS: lldb-api :: lang/cpp/template-specialization-type/TestTemplateSpecializationType.py (2054 of 2331) PASS: lldb-unit :: Interpreter/./InterpreterTests/OptionArgParserTest.toBoolean (2055 of 2331) PASS: lldb-api :: commands/expression/fixits/TestFixIts.py (2056 of 2331) PASS: lldb-unit :: UnwindAssembly/x86/./UnwindAssemblyx86Tests/Testx86AssemblyInspectionEngine.TestPopRBPWithREX (2057 of 2331) PASS: lldb-api :: functionalities/data-formatter/setvaluefromcstring/TestSetValueFromCString.py (2058 of 2331) PASS: lldb-shell :: SymbolFile/DWARF/x86/DW_TAG_variable-DW_AT_const_value.s (2059 of 2331) PASS: lldb-unit :: Utility/./UtilityTests/TimeoutTest.Format (2060 of 2331) PASS: lldb-unit :: Language/CLanguages/./LanguageCLanguagesTests/CLanguages.LookupCLanguagesByLanguageType (2061 of 2331) PASS: lldb-api :: commands/help/TestHelp.py (2062 of 2331) PASS: lldb-api :: lang/c/shared_lib_stripped_symbols/TestSharedLibStrippedSymbols.py (2063 of 2331) PASS: lldb-api :: commands/watchpoints/watchpoint_on_vectors/TestValueOfVectorVariable.py (2064 of 2331) PASS: lldb-unit :: Core/./LLDBCoreTests/DumpDataExtractorTest.StartOffset (2065 of 2331) PASS: lldb-shell :: SymbolFile/DWARF/x86/dwarf5-split.s (2066 of 2331) PASS: lldb-unit :: Utility/./UtilityTests/NameMatchesTest.EndsWith (2067 of 2331) PASS: lldb-unit :: Utility/./UtilityTests/ScalarTest.TruncOrExtendTo (2068 of 2331) PASS: lldb-api :: functionalities/plugins/python_os_plugin/TestPythonOSPlugin.py (2069 of 2331) PASS: lldb-shell :: SymbolFile/DWARF/x86/apple-index-is-used.cpp (2070 of 2331) PASS: lldb-shell :: SymbolFile/Breakpad/line-table-mixed-path-styles.test (2071 of 2331) PASS: lldb-unit :: Utility/./UtilityTests/StringExtractorTest.GetHexBytesAvail_OddPair (2072 of 2331) PASS: lldb-api :: commands/frame/language/TestGuessLanguage.py (2073 of 2331) PASS: lldb-api :: lang/objcxx/cxx-bridged-po/TestObjCXXBridgedPO.py (2074 of 2331) PASS: lldb-unit :: ScriptInterpreter/Python/./ScriptInterpreterPythonTests/PythonDataObjectsTest.TestPythonStringToStructuredString (2075 of 2331) UNSUPPORTED: lldb-api :: commands/watchpoints/multi_watchpoint_slots/TestWatchpointMultipleSlots.py (2076 of 2331) PASS: lldb-api :: commands/watchpoints/step_over_watchpoint/TestStepOverWatchpoint.py (2077 of 2331) PASS: lldb-shell :: Commands/command-target-modules-dump-sections.yaml (2078 of 2331) PASS: lldb-unit :: Core/./LLDBCoreTests/ModuleSpecTest.InvalidInMemoryBuffer (2079 of 2331) PASS: lldb-api :: commands/expression/import-std-module/forward_list-dbg-info-content/TestDbgInfoContentForwardListFromStdModule.py (2080 of 2331) PASS: lldb-unit :: Symbol/./SymbolTests/TestTypeSystemClang.TestDisplayNameEmpty (2081 of 2331) PASS: lldb-api :: commands/watchpoints/hello_watchpoint/TestMyFirstWatchpoint.py (2082 of 2331) UNSUPPORTED: lldb-shell :: Unwind/eh-frame-augment-noop.test (2083 of 2331) PASS: lldb-shell :: Minidump/Windows/broken-unwind.test (2084 of 2331) PASS: lldb-unit :: Symbol/./SymbolTests/TestTypeSystemClang.TestIsClangType (2085 of 2331) UNSUPPORTED: lldb-shell :: ScriptInterpreter/Lua/bindings.test (2086 of 2331) PASS: lldb-unit :: UnwindAssembly/x86/./UnwindAssemblyx86Tests/Testx86AssemblyInspectionEngine.TestAddRSP (2087 of 2331) PASS: lldb-unit :: Process/Utility/./ProcessUtilityTests/ProcSMapTests/LinuxProcSMapsTestFixture.ParseSMapRegions/9 (2088 of 2331) PASS: lldb-unit :: UnwindAssembly/x86/./UnwindAssemblyx86Tests/Testx86AssemblyInspectionEngine.TestPopR14 (2089 of 2331) PASS: lldb-unit :: SymbolFile/NativePDB/./SymbolFileNativePDBTests/PDBFPOProgramToDWARFExpressionTests.InvalidAssignmentSingle (2090 of 2331) PASS: lldb-api :: lang/c/modules/TestCModules.py (2091 of 2331) PASS: lldb-api :: commands/expression/namespace_local_var_same_name_cpp_and_c/TestNamespaceLocalVarSameNameCppAndC.py (2092 of 2331) PASS: lldb-api :: lang/objc/objc-ivar-protocols/TestIvarProtocols.py (2093 of 2331) UNSUPPORTED: lldb-api :: linux/sepdebugsymlink/TestTargetSymbolsSepDebugSymlink.py (2094 of 2331) PASS: lldb-api :: functionalities/thread/concurrent_events/TestConcurrentNWatchNBreak.py (2095 of 2331) PASS: lldb-api :: lang/objc/warnings-in-expr-parser/TestObjCWarningsInExprParser.py (2096 of 2331) PASS: lldb-unit :: Utility/./UtilityTests/StringListTest.AppendListCStringArrayEmpty (2097 of 2331) PASS: lldb-unit :: Expression/./ExpressionTests/ClangHostTest.ComputeClangResourceDirectory (2098 of 2331) PASS: lldb-unit :: Process/gdb-remote/./ProcessGdbRemoteTests/GDBRemoteClientBaseTest.SendContinueAndWait (2099 of 2331) PASS: lldb-shell :: Driver/TestRepl.test (2100 of 2331) PASS: lldb-api :: functionalities/thread/ignore_suspended/TestIgnoreSuspendedThread.py (2101 of 2331) PASS: lldb-api :: commands/watchpoints/watchpoint_count/TestWatchpointCount.py (2102 of 2331) PASS: lldb-api :: python_api/hello_world/TestHelloWorld.py (2103 of 2331) PASS: lldb-unit :: SymbolFile/NativePDB/./SymbolFileNativePDBTests/PDBFPOProgramToDWARFExpressionTests.UnknownOp (2104 of 2331) PASS: lldb-api :: functionalities/thread/concurrent_events/TestConcurrentTwoBreakpointThreads.py (2105 of 2331) PASS: lldb-shell :: Register/x86-multithread-read.test (2106 of 2331) PASS: lldb-api :: lang/objc/objc-super/TestObjCSuper.py (2107 of 2331) PASS: lldb-shell :: Breakpoint/split-dwarf5-debug-stroffsets.test (2108 of 2331) PASS: lldb-api :: python_api/disassemble-raw-data/TestDisassembleRawData.py (2109 of 2331) PASS: lldb-unit :: SymbolFile/DWARF/./SymbolFileDWARFTests/SymbolFileDWARFTests.ParseArangesIgnoreEmpty (2110 of 2331) XFAIL: lldb-shell :: SymbolFile/DWARF/find-type-in-function.cpp (2111 of 2331) PASS: lldb-unit :: Utility/./UtilityTests/XcodeSDKTest.FindXcodeContentsDirectoryInPath (2112 of 2331) PASS: lldb-unit :: Process/minidump/./LLDBMinidumpTests/MinidumpParserTest.GetThreadsAndGetThreadContext (2113 of 2331) PASS: lldb-unit :: Utility/./UtilityTests/SerializationRountripTest.SerializeDeserializePod (2114 of 2331) PASS: lldb-unit :: Process/Utility/./ProcessUtilityTests/ProcMapTests/LinuxProcMapsTestFixture.ParseMapRegions/1 (2115 of 2331) PASS: lldb-unit :: Utility/./UtilityTests/FileSpecTest.Equal (2116 of 2331) UNSUPPORTED: lldb-shell :: SymbolFile/PDB/variables.test (2117 of 2331) UNSUPPORTED: lldb-shell :: ScriptInterpreter/Lua/quit.test (2118 of 2331) PASS: lldb-shell :: SymbolFile/DWARF/x86/debug_loclists-dwo.s (2119 of 2331) PASS: lldb-api :: commands/watchpoints/watchpoint_events/TestWatchpointEvents.py (2120 of 2331) PASS: lldb-unit :: Interpreter/./InterpreterTests/CompletionTest.DirCompletionUsername (2121 of 2331) PASS: lldb-api :: tools/lldb-vscode/evaluate/TestVSCode_evaluate.py (2122 of 2331) PASS: lldb-unit :: Utility/./UtilityTests/VMRange.ContainsAddr (2123 of 2331) PASS: lldb-unit :: UnwindAssembly/x86/./UnwindAssemblyx86Tests/Testx86AssemblyInspectionEngine.TestLEAVE (2124 of 2331) PASS: lldb-api :: lang/cpp/thread_local/TestThreadLocal.py (2125 of 2331) PASS: lldb-unit :: Utility/./UtilityTests/StreamTest.QuotedCString (2126 of 2331) PASS: lldb-unit :: Utility/./UtilityTests/StringListTest.LongestCommonPrefixEmpty (2127 of 2331) PASS: lldb-api :: lang/cpp/enum_types/TestCPP11EnumTypes.py (2128 of 2331) PASS: lldb-api :: lang/cpp/call-function/TestCallCPPFunction.py (2129 of 2331) PASS: lldb-api :: functionalities/breakpoint/move_nearest/TestMoveNearest.py (2130 of 2331) PASS: lldb-unit :: tools/lldb-server/tests/./LLDBServerTests/TestBase.DebugserverEnv (2131 of 2331) UNSUPPORTED: lldb-shell :: ObjectFile/ELF/minidebuginfo-set-and-hit-breakpoint.test (2132 of 2331) PASS: lldb-api :: lang/c/stepping/TestThreadStepInAvoidRegexp.py (2133 of 2331) PASS: lldb-shell :: ObjectFile/MachO/symtab.yaml (2134 of 2331) PASS: lldb-api :: functionalities/memory-region/TestMemoryRegion.py (2135 of 2331) PASS: lldb-api :: lang/objc/objc++/TestObjCXX.py (2136 of 2331) PASS: lldb-api :: functionalities/postmortem/elf-core/thread_crash/TestLinuxCoreThreads.py (2137 of 2331) UNSUPPORTED: lldb-shell :: SymbolFile/PDB/vbases.test (2138 of 2331) UNSUPPORTED: lldb-api :: lang/cpp/function-template-parameter-pack/TestFunctionTemplateParameterPack.py (2139 of 2331) PASS: lldb-unit :: Utility/./UtilityTests/StringListTest.JoinEmpty (2140 of 2331) PASS: lldb-api :: functionalities/gdb_remote_client/TestNestedRegDefinitions.py (2141 of 2331) PASS: lldb-unit :: UnwindAssembly/x86/./UnwindAssemblyx86Tests/Testx86AssemblyInspectionEngine.TestPushRBX (2142 of 2331) PASS: lldb-unit :: Utility/./UtilityTests/StringExtractorTest.GetHexU8_Extra_NoEof (2143 of 2331) PASS: lldb-unit :: Utility/./UtilityTests/ConstStringTest.UpdateMangledCounterpart (2144 of 2331) PASS: lldb-api :: commands/expression/codegen-crash-import-def-arraytype-element/TestImportDefinitionArrayType.py (2145 of 2331) PASS: lldb-unit :: Utility/./UtilityTests/BinaryStreamTest.PutSLEB128MaxValue (2146 of 2331) PASS: lldb-unit :: Process/gdb-remote/./ProcessGdbRemoteTests/GDBRemoteCommunicationServerTest.SendErrorResponse_ErrorNumber (2147 of 2331) PASS: lldb-api :: functionalities/archives/TestBSDArchives.py (2148 of 2331) PASS: lldb-api :: commands/expression/persistent_types/TestNestedPersistentTypes.py (2149 of 2331) PASS: lldb-api :: functionalities/data-formatter/data-formatter-stl/libcxx/vector/TestDataFormatterLibcxxVector.py (2150 of 2331) PASS: lldb-unit :: DataFormatter/./LLDBFormatterTests/TypeMatcherTests.GetMatchStringExactName (2151 of 2331) PASS: lldb-api :: commands/expression/ir-interpreter/TestIRInterpreter.py (2152 of 2331) PASS: lldb-api :: functionalities/gdb_remote_client/TestTargetXMLArch.py (2153 of 2331) PASS: lldb-unit :: Symbol/./SymbolTests/TestTypeSystemClang.TestConvertAccessTypeToAccessSpecifier (2154 of 2331) PASS: lldb-unit :: Utility/./UtilityTests/CompletionRequest.TryCompleteCurrentArgGood (2155 of 2331) PASS: lldb-unit :: Host/./HostTests/HostInfoTest.GetAugmentedArchSpec (2156 of 2331) UNSUPPORTED: lldb-shell :: Register/x86-gp-read.test (2157 of 2331) PASS: lldb-unit :: Utility/./UtilityTests/StreamTest.AddressEmptyPrefix (2158 of 2331) PASS: lldb-api :: functionalities/tail_call_frames/ambiguous_tail_call_seq2/TestAmbiguousTailCallSeq2.py (2159 of 2331) PASS: lldb-unit :: Interpreter/./InterpreterTests/CompletionTest.FileCompletionAbsolute (2160 of 2331) PASS: lldb-unit :: Utility/./UtilityTests/StatusTest.ErrorConversion (2161 of 2331) UNSUPPORTED: lldb-api :: functionalities/thread/concurrent_events/TestConcurrentManySignals.py (2162 of 2331) PASS: lldb-unit :: ObjectFile/Breakpad/./ObjectFileBreakpadTests/FuncRecord.parse (2163 of 2331) PASS: lldb-shell :: ScriptInterpreter/Python/scripted_breakpoint_lua.test (2164 of 2331) PASS: lldb-unit :: Core/./LLDBCoreTests/MangledTest.EmptyForInvalidName (2165 of 2331) PASS: lldb-unit :: ObjectFile/ELF/./ObjectFileELFTests/ObjectFileELFTest.GetSymtab_NoSymEntryPointArmThumbAddressClass (2166 of 2331) PASS: lldb-unit :: Utility/./UtilityTests/StringListTest.AppendStringCString (2167 of 2331) PASS: lldb-unit :: Expression/./ExpressionTests/DiagnosticManagerTest.PutString (2168 of 2331) PASS: lldb-unit :: Utility/./UtilityTests/TimerTest.CategoryTimes (2169 of 2331) PASS: lldb-api :: lang/c/conflicting-symbol/TestConflictingSymbol.py (2170 of 2331) PASS: lldb-api :: commands/watchpoints/watchpoint_commands/TestWatchpointCommands.py (2171 of 2331) PASS: lldb-shell :: ObjectFile/MachO/lc_version_min.yaml (2172 of 2331) PASS: lldb-unit :: Utility/./UtilityTests/StringLexerTest.PutBack (2173 of 2331) PASS: lldb-api :: commands/expression/import-std-module/unique_ptr-dbg-info-content/TestUniquePtrDbgInfoContent.py (2174 of 2331) PASS: lldb-shell :: SymbolFile/DWARF/x86/compilercontext.ll (2175 of 2331) PASS: lldb-unit :: SymbolFile/DWARF/./SymbolFileDWARFTests/SymbolFileDWARFTests.TestAbbrevOrder1Start5 (2176 of 2331) PASS: lldb-unit :: Process/gdb-remote/./ProcessGdbRemoteTests/GDBRemoteCommunicationClientTest.GetMemoryRegionInfoInvalidResponse (2177 of 2331) UNSUPPORTED: lldb-shell :: SymbolFile/PDB/function-level-linking.test (2178 of 2331) PASS: lldb-api :: macosx/find-app-in-bundle/TestFindAppInBundle.py (2179 of 2331) PASS: lldb-unit :: Host/./HostTests/SocketTests/SocketTest.DomainListenConnectAccept/ipv4 (2180 of 2331) PASS: lldb-api :: functionalities/inferior-crashing/recursive-inferior/TestRecursiveInferior.py (2181 of 2331) PASS: lldb-api :: functionalities/fat_archives/TestFatArchives.py (2182 of 2331) PASS: lldb-unit :: Utility/./UtilityTests/StringExtractorTest.GetHexU8_InvalidHex (2183 of 2331) PASS: lldb-api :: functionalities/gdb_remote_client/TestGDBRemoteDiskFileCompletion.py (2184 of 2331) PASS: lldb-unit :: Process/gdb-remote/./ProcessGdbRemoteTests/GDBRemoteClientBaseTest.SendContinueAndInterrupt2PacketBug (2185 of 2331) PASS: lldb-unit :: UnwindAssembly/x86/./UnwindAssemblyx86Tests/Testx86AssemblyInspectionEngine.TestPushECX (2186 of 2331) PASS: lldb-api :: functionalities/data-formatter/data-formatter-stl/libcxx/unordered/TestDataFormatterUnordered.py (2187 of 2331) UNSUPPORTED: lldb-shell :: ScriptInterpreter/Lua/nested_sessions.test (2188 of 2331) PASS: lldb-unit :: Signals/./SignalsTests/UnixSignalsTest.GetFilteredSignals (2189 of 2331) UNSUPPORTED: lldb-shell :: Register/aarch64-fp-read.test (2190 of 2331) PASS: lldb-unit :: Utility/./UtilityTests/EnvironmentTest.EnvpConstruction (2191 of 2331) PASS: lldb-api :: python_api/process/read-mem-cstring/TestReadMemCString.py (2192 of 2331) PASS: lldb-unit :: Utility/./UtilityTests/UriParserTest.SchemeHostSeparator (2193 of 2331) PASS: lldb-api :: functionalities/abbreviation/TestAbbreviations.py (2194 of 2331) PASS: lldb-unit :: Utility/./UtilityTests/StringListTest.CopyListEmpty (2195 of 2331) PASS: lldb-shell :: ObjectFile/ELF/base-address.yaml (2196 of 2331) PASS: lldb-api :: python_api/sbplatform/TestSBPlatform.py (2197 of 2331) PASS: lldb-api :: lang/cpp/incomplete-types/TestCppIncompleteTypes.py (2198 of 2331) PASS: lldb-shell :: SymbolFile/DWARF/x86/debug-types-dwarf5.s (2199 of 2331) PASS: lldb-shell :: SymbolFile/DWARF/x86/win-i386-line-table.s (2200 of 2331) PASS: lldb-api :: commands/apropos/basic/TestApropos.py (2201 of 2331) PASS: lldb-api :: lang/cpp/class-template-parameter-pack/TestClassTemplateParameterPack.py (2202 of 2331) UNSUPPORTED: lldb-api :: functionalities/darwin_log/filter/exact_match/activity/TestDarwinLogFilterMatchActivity.py (2203 of 2331) PASS: lldb-api :: tools/lldb-server/TestAppleSimulatorOSType.py (2204 of 2331) PASS: lldb-unit :: UnwindAssembly/x86/./UnwindAssemblyx86Tests/Testx86AssemblyInspectionEngine.TestCALLNextInsn (2205 of 2331) PASS: lldb-api :: functionalities/data-formatter/data-formatter-objc/TestDataFormatterObjNSException.py (2206 of 2331) PASS: lldb-unit :: Utility/./UtilityTests/StringListTest.JoinThree (2207 of 2331) PASS: lldb-api :: functionalities/target-new-solib-notifications/TestModuleLoadedNotifys.py (2208 of 2331) FAIL: lldb-api :: functionalities/data-formatter/parray/TestPrintArray.py (2209 of 2331) ******************** TEST 'lldb-api :: functionalities/data-formatter/parray/TestPrintArray.py' FAILED ******************** Script: -- /Users/buildslave/jenkins/workspace/lldb-cmake-sanitized/lldb-build/lldb-test-build.noindex/copied-python /Users/buildslave/jenkins/workspace/lldb-cmake-sanitized/llvm-project/lldb/test/API/dotest.py -u CXXFLAGS -u CFLAGS --codesign-identity lldb_codesign --arch x86_64 --build-dir /Users/buildslave/jenkins/workspace/lldb-cmake-sanitized/lldb-build/lldb-test-build.noindex -t --env TERM=vt100 --env LLVM_LIBS_DIR=/Users/buildslave/jenkins/workspace/lldb-cmake-sanitized/lldb-build/./lib --inferior-env ASAN_OPTIONS=detect_stack_use_after_return=1 --inferior-env DYLD_INSERT_LIBRARIES=/Users/buildslave/jenkins/workspace/lldb-cmake-sanitized/host-compiler/lib/clang/13.0.99/lib/darwin/libclang_rt.asan_osx_dynamic.dylib --arch x86_64 --build-dir /Users/buildslave/jenkins/workspace/lldb-cmake-sanitized/lldb-build/lldb-test-build.noindex --lldb-module-cache-dir /Users/buildslave/jenkins/workspace/lldb-cmake-sanitized/lldb-build/lldb-test-build.noindex/module-cache-lldb/lldb-api --clang-module-cache-dir /Users/buildslave/jenkins/workspace/lldb-cmake-sanitized/lldb-build/lldb-test-build.noindex/module-cache-clang/lldb-api --executable /Users/buildslave/jenkins/workspace/lldb-cmake-sanitized/lldb-build/./bin/lldb --compiler /Users/buildslave/jenkins/workspace/lldb-cmake-sanitized/lldb-build/./bin/clang --dsymutil /Users/buildslave/jenkins/workspace/lldb-cmake-sanitized/lldb-build/./bin/dsymutil --llvm-tools-dir /Users/buildslave/jenkins/workspace/lldb-cmake-sanitized/lldb-build/./bin --lldb-libs-dir /Users/buildslave/jenkins/workspace/lldb-cmake-sanitized/lldb-build/./lib /Users/buildslave/jenkins/workspace/lldb-cmake-sanitized/llvm-project/lldb/test/API/functionalities/data-formatter/parray -p TestPrintArray.py -- Exit Code: 1

Hide Details

Command Output (stdout): -- lldb version 13.0.99 (http://labmaster3.local/git/llvm-project.git revision cdd1adfb7d5d5048a7fdedc441e75db019fbb0b5) clang revision cdd1adfb7d5d5048a7fdedc441e75db019fbb0b5 llvm revision cdd1adfb7d5d5048a7fdedc441e75db019fbb0b5 Skipping the following test categories: ['darwin-log', 'libstdcxx', 'dwo', 'llgs', 'fork']

Hide Details

-- Command Output (stderr): -- Change dir to: /Users/buildslave/jenkins/workspace/lldb-cmake-sanitized/llvm-project/lldb/test/API/functionalities/data-formatter/parray runCmd: settings clear -all output:

Hide Details

runCmd: settings set symbols.enable-external-lookup false output:

Hide Details

runCmd: settings set target.inherit-tcc true output:

Hide Details

runCmd: settings set target.detach-on-error false output:

Hide Details

runCmd: settings set target.auto-apply-fixits false output:

Hide Details

runCmd: settings set plugin.process.gdb-remote.packet-timeout 60 output:

Hide Details

runCmd: settings set symbols.clang-modules-cache-path "/Users/buildslave/jenkins/workspace/lldb-cmake-sanitized/lldb-build/lldb-test-build.noindex/module-cache-lldb/lldb-api" output:

Hide Details

runCmd: settings set use-color false output:

Hide Details

runCmd: setting set target.prefer-dynamic-value no-dynamic-values output:

Hide Details

runCmd: settings set target.env-vars ASAN_OPTIONS=detect_stack_use_after_return=1 DYLD_INSERT_LIBRARIES=/Users/buildslave/jenkins/workspace/lldb-cmake-sanitized/host-compiler/lib/clang/13.0.99/lib/darwin/libclang_rt.asan_osx_dynamic.dylib output:

Hide Details

runCmd: file /Users/buildslave/jenkins/workspace/lldb-cmake-sanitized/lldb-build/lldb-test-build.noindex/functionalities/data-formatter/parray/TestPrintArray.test_print_array_dsym/a.out output: Current executable set to '/Users/buildslave/jenkins/workspace/lldb-cmake-sanitized/lldb-build/lldb-test-build.noindex/functionalities/data-formatter/parray/TestPrintArray.test_print_array_dsym/a.out' (x86_64).

Hide Details

Hide Details

runCmd: breakpoint set -f "main.cpp" -l 18 output: Breakpoint 1: where = a.out`main + 115 at main.cpp:18:3, address = 0x0000000100000e53

Hide Details

Hide Details

Expecting pattern: ^Breakpoint (?P<bpno>[0-9]+): (?P<num_locations>[0-9]+) locations\.$ Not matched

Hide Details

Expecting pattern: ^Breakpoint (?P<bpno>[0-9]+): (?P<num_locations>no) locations \(pending\)\. Not matched

Hide Details

Expecting pattern: ^Breakpoint (?P<bpno>[0-9]+): where = (?P<module>.*)`(?P<symbol>[+\-]{0,1}[^+]+)( \+ (?P<offset>[0-9]+)){0,1}( \[inlined\] (?P<inline_symbol>.*)){0,1} at (?P<file>[^:]+):(?P<line_no>[0-9]+)(?P<column>(:[0-9]+)?), address = (?P<address>0x[0-9a-fA-F]+)$ Matched

Hide Details

runCmd: run output: Process 64183 stopped * thread #1, queue = 'com.apple.main-thread', stop reason = breakpoint 1.1 frame #0: 0x0000000100000e53 a.out`main(argc=1, argv=0x00007ffeefbff8b8) at main.cpp:18:3 15 int* data = alloc<int>(5, [] (size_t idx) -> int { 16 return 2 * idx + 1; 17 }); -> 18 return 0; // break here ^ 19 } 20 Process 64183 launched: '/Users/buildslave/jenkins/workspace/lldb-cmake-sanitized/lldb-build/lldb-test-build.noindex/functionalities/data-formatter/parray/TestPrintArray.test_print_array_dsym/a.out' (x86_64)

Hide Details

Hide Details

runCmd: thread list output: Process 64183 stopped * thread #1: tid = 0x60ed93, 0x0000000100000e53 a.out`main(argc=1, argv=0x00007ffeefbff8b8) at main.cpp:18:3, queue = 'com.apple.main-thread', stop reason = breakpoint 1.1

Hide Details

Hide Details

Ran command: "thread list"

Hide Details

Got output: Process 64183 stopped * thread #1: tid = 0x60ed93, 0x0000000100000e53 a.out`main(argc=1, argv=0x00007ffeefbff8b8) at main.cpp:18:3, queue = 'com.apple.main-thread', stop reason = breakpoint 1.1

Hide Details

Expecting sub string: "stopped" (was found) Expecting sub string: "stop reason = breakpoint" (was found)

Hide Details

Adding tearDown hook: def cleanup(): self.runCmd('type format clear', check=False) self.runCmd('type summary clear', check=False) self.runCmd('type synth clear', check=False)

Hide Details

Hide Details

runCmd: expr --element-count 3 -- data output: (int *) $0 = 0x0000603000001780 { (int) [0] = 1 (int) [1] = 3 (int) [2] = 5 }

Hide Details

Hide Details

Ran command: "expr --element-count 3 -- data"

Hide Details

Got output: (int *) $0 = 0x0000603000001780 { (int) [0] = 1 (int) [1] = 3 (int) [2] = 5 }

Hide Details

Expecting sub string: "[0] = 1" (was found) Expecting sub string: "[1] = 3" (was found) Expecting sub string: "[2] = 5" (was found)

Hide Details

runCmd: expr data output: (int *) $1 = 0x0000603000001780

Hide Details

Hide Details

Ran command: "expr data"

Hide Details

Got output: (int *) $1 = 0x0000603000001780

Hide Details

Expecting sub string: "int *" (was found) Expecting sub string: "$" (was found) Expecting sub string: "0x" (was found)

Hide Details

runCmd: expr -f binary --element-count 0 -- data output: (int *) $2 = 0b0000000000000000011000000011000000000000000000000001011110000000

Hide Details

Hide Details

Ran command: "expr -f binary --element-count 0 -- data"

Hide Details

Got output: (int *) $2 = 0b0000000000000000011000000011000000000000000000000001011110000000

Hide Details

Expecting sub string: "int *" (was found) Expecting sub string: "$" (was found) Expecting sub string: "0b" (was found)

Hide Details

runCmd: expr -f hex --element-count 3 -- data output: (int *) $3 = 0x0000603000001780 { (int) [0] = 0x00000001 (int) [1] = 0x00000003 (int) [2] = 0x00000005 }

Hide Details

Hide Details

Ran command: "expr -f hex --element-count 3 -- data"

Hide Details

Got output: (int *) $3 = 0x0000603000001780 { (int) [0] = 0x00000001 (int) [1] = 0x00000003 (int) [2] = 0x00000005 }

Hide Details

Expecting sub string: "[0] = 0x" (was found) Expecting sub string: "1" (was found) Expecting sub string: "[1] = 0x" (was found) Expecting sub string: "3" (was found) Expecting sub string: "[2] = 0x" (was found) Expecting sub string: "5" (was found)

Hide Details

runCmd: expr -f binary --element-count 2 -- data output: (int *) $4 = 0x0000603000001780 { (int) [0] = 0b00000000000000000000000000000001 (int) [1] = 0b00000000000000000000000000000011 }

Hide Details

Hide Details

Ran command: "expr -f binary --element-count 2 -- data"

Hide Details

Got output: (int *) $4 = 0x0000603000001780 { (int) [0] = 0b00000000000000000000000000000001 (int) [1] = 0b00000000000000000000000000000011 }

Hide Details

Expecting sub string: "int *" (was found) Expecting sub string: "$" (was found) Expecting sub string: "0x" (was found) Expecting sub string: "[0] = 0b" (was found) Expecting sub string: "1" (was found) Expecting sub string: "[1] = 0b" (was found) Expecting sub string: "11" (was found)

Hide Details

runCmd: parray 3 data output: (int *) $5 = 0x0000603000001780 { (int) [0] = 1 (int) [1] = 3 (int) [2] = 5 }

Hide Details

Hide Details

Ran command: "parray 3 data"

Hide Details

Got output: (int *) $5 = 0x0000603000001780 { (int) [0] = 1 (int) [1] = 3 (int) [2] = 5 }

Hide Details

Expecting sub string: "[0] = 1" (was found) Expecting sub string: "[1] = 3" (was found) Expecting sub string: "[2] = 5" (was found)

Hide Details

runCmd: parray `1 + 1 + 1` data output: (int *) $7 = 0x0000603000001780 { (int) [0] = 1 (int) [1] = 3 (int) [2] = 5 }

Hide Details

Hide Details

Ran command: "parray `1 + 1 + 1` data"

Hide Details

Got output: (int *) $7 = 0x0000603000001780 { (int) [0] = 1 (int) [1] = 3 (int) [2] = 5 }

Hide Details

Expecting sub string: "[0] = 1" (was found) Expecting sub string: "[1] = 3" (was found) Expecting sub string: "[2] = 5" (was found)

Hide Details

runCmd: parray `data[1]` data output: (int *) $9 = 0x0000603000001780 { (int) [0] = 1 (int) [1] = 3 (int) [2] = 5 }

Hide Details

Hide Details

Ran command: "parray `data[1]` data"

Hide Details

Got output: (int *) $9 = 0x0000603000001780 { (int) [0] = 1 (int) [1] = 3 (int) [2] = 5 }

Hide Details

Expecting sub string: "[0] = 1" (was found) Expecting sub string: "[1] = 3" (was found) Expecting sub string: "[2] = 5" (was found)

Hide Details

runCmd: parray/x 3 data output: (int *) $10 = 0x0000603000001780 { (int) [0] = 0x00000001 (int) [1] = 0x00000003 (int) [2] = 0x00000005 }

Hide Details

Hide Details

Ran command: "parray/x 3 data"

Hide Details

Got output: (int *) $10 = 0x0000603000001780 { (int) [0] = 0x00000001 (int) [1] = 0x00000003 (int) [2] = 0x00000005 }

Hide Details

Expecting sub string: "[0] = 0x" (was found) Expecting sub string: "1" (was found) Expecting sub string: "[1] = 0x" (was found) Expecting sub string: "3" (was found) Expecting sub string: "[2] = 0x" (was found) Expecting sub string: "5" (was found)

Hide Details

runCmd: parray/x `data[1]` data output: (int *) $12 = 0x0000603000001780 { (int) [0] = 0x00000001 (int) [1] = 0x00000003 (int) [2] = 0x00000005 }

Hide Details

Hide Details

Ran command: "parray/x `data[1]` data"

Hide Details

Got output: (int *) $12 = 0x0000603000001780 { (int) [0] = 0x00000001 (int) [1] = 0x00000003 (int) [2] = 0x00000005 }

Hide Details

Expecting sub string: "[0] = 0x" (was found) Expecting sub string: "1" (was found) Expecting sub string: "[1] = 0x" (was found) Expecting sub string: "3" (was found) Expecting sub string: "[2] = 0x" (was found) Expecting sub string: "5" (was found)

Hide Details

runCmd: expr --element-count 10 -- 123 check of return status not required runCmd failed! error: expression cannot be used with --element-count as it does not refer to a pointer

Hide Details

Hide Details

Ran command: "expr --element-count 10 -- 123"

Hide Details

Got output: error: expression cannot be used with --element-count as it does not refer to a pointer

Hide Details

Expecting sub string: "expression cannot be used with --element-count as it does not refer to a pointer" (was found)

Hide Details

runCmd: expr --element-count 10 -- (void*)123 check of return status not required runCmd failed! error: expression cannot be used with --element-count as it refers to a pointer to void

Hide Details

Hide Details

Ran command: "expr --element-count 10 -- (void*)123"

Hide Details

Got output: error: expression cannot be used with --element-count as it refers to a pointer to void

Hide Details

Expecting sub string: "expression cannot be used with --element-count as it refers to a pointer to void" (was found)

Hide Details

runCmd: parray data check of return status not required runCmd failed! error: invalid element count 'data'

Hide Details

Hide Details

Ran command: "parray data"

Hide Details

Got output: error: invalid element count 'data'

Hide Details

Expecting sub string: "invalid element count 'data'" (was found)

Hide Details

runCmd: parray data data check of return status not required runCmd failed! error: invalid element count 'data'

Hide Details

Hide Details

Ran command: "parray data data"

Hide Details

Got output: error: invalid element count 'data'

Hide Details

Expecting sub string: "invalid element count 'data'" (was found)

Hide Details

runCmd: parray check of return status not required runCmd failed! error: Not enough arguments provided; you need at least 1 arguments to use this alias. error: 'parray' is not a valid command.

Hide Details

Hide Details

Ran command: "parray"

Hide Details

Got output: error: Not enough arguments provided; you need at least 1 arguments to use this alias. error: 'parray' is not a valid command.

Hide Details

Expecting sub string: "Not enough arguments provided" (was found)

Hide Details

<bound method SBProcess.Kill of <lldb.SBProcess; proxy of <Swig Object of type 'lldb::SBProcess *' at 0x10e53dc60> >>: success

Hide Details

Executing tearDown hook: def cleanup(): self.runCmd('type format clear', check=False) self.runCmd('type summary clear', check=False) self.runCmd('type synth clear', check=False)

Hide Details

Hide Details

runCmd: type format clear check of return status not required output:

Hide Details

runCmd: type summary clear check of return status not required output:

Hide Details

runCmd: type synth clear check of return status not required output:

Hide Details

PASS: LLDB (/Users/buildslave/jenkins/workspace/lldb-cmake-sanitized/lldb-build/bin/clang-x86_64) :: test_print_array_dsym (TestPrintArray.PrintArrayTestCase) runCmd: settings clear -all output:

Hide Details

runCmd: settings set symbols.enable-external-lookup false output:

Hide Details

runCmd: settings set target.inherit-tcc true output:

Hide Details

runCmd: settings set target.detach-on-error false output:

Hide Details

runCmd: settings set target.auto-apply-fixits false output:

Hide Details

runCmd: settings set plugin.process.gdb-remote.packet-timeout 60 output:

Hide Details

runCmd: settings set symbols.clang-modules-cache-path "/Users/buildslave/jenkins/workspace/lldb-cmake-sanitized/lldb-build/lldb-test-build.noindex/module-cache-lldb/lldb-api" output:

Hide Details

runCmd: settings set use-color false output:

Hide Details

runCmd: setting set target.prefer-dynamic-value no-dynamic-values output:

Hide Details

runCmd: settings set target.env-vars ASAN_OPTIONS=detect_stack_use_after_return=1 DYLD_INSERT_LIBRARIES=/Users/buildslave/jenkins/workspace/lldb-cmake-sanitized/host-compiler/lib/clang/13.0.99/lib/darwin/libclang_rt.asan_osx_dynamic.dylib output:

Hide Details

runCmd: file /Users/buildslave/jenkins/workspace/lldb-cmake-sanitized/lldb-build/lldb-test-build.noindex/functionalities/data-formatter/parray/TestPrintArray.test_print_array_dwarf/a.out output: Current executable set to '/Users/buildslave/jenkins/workspace/lldb-cmake-sanitized/lldb-build/lldb-test-build.noindex/functionalities/data-formatter/parray/TestPrintArray.test_print_array_dwarf/a.out' (x86_64).

Hide Details

Hide Details

runCmd: breakpoint set -f "main.cpp" -l 18 output: Breakpoint 1: where = a.out`main + 115 at main.cpp:18:3, address = 0x0000000100000e53

Hide Details

Hide Details

Expecting pattern: ^Breakpoint (?P<bpno>[0-9]+): (?P<num_locations>[0-9]+) locations\.$ Not matched

Hide Details

Expecting pattern: ^Breakpoint (?P<bpno>[0-9]+): (?P<num_locations>no) locations \(pending\)\. Not matched

Hide Details

Expecting pattern: ^Breakpoint (?P<bpno>[0-9]+): where = (?P<module>.*)`(?P<symbol>[+\-]{0,1}[^+]+)( \+ (?P<offset>[0-9]+)){0,1}( \[inlined\] (?P<inline_symbol>.*)){0,1} at (?P<file>[^:]+):(?P<line_no>[0-9]+)(?P<column>(:[0-9]+)?), address = (?P<address>0x[0-9a-fA-F]+)$ Matched

Hide Details

runCmd: run output: Process 64221 stopped * thread #1, queue = 'com.apple.main-thread', stop reason = breakpoint 1.1 frame #0: 0x0000000100000e53 a.out`main(argc=1, argv=0x00007ffeefbff8b8) at main.cpp:18:3 15 int* data = alloc<int>(5, [] (size_t idx) -> int { 16 return 2 * idx + 1; 17 }); -> 18 return 0; // break here ^ 19 } 20 Process 64221 launched: '/Users/buildslave/jenkins/workspace/lldb-cmake-sanitized/lldb-build/lldb-test-build.noindex/functionalities/data-formatter/parray/TestPrintArray.test_print_array_dwarf/a.out' (x86_64)

Hide Details

Hide Details

runCmd: thread list output: Process 64221 stopped * thread #1: tid = 0x60ee53, 0x0000000100000e53 a.out`main(argc=1, argv=0x00007ffeefbff8b8) at main.cpp:18:3, queue = 'com.apple.main-thread', stop reason = breakpoint 1.1

Hide Details

Hide Details

Ran command: "thread list"

Hide Details

Got output: Process 64221 stopped * thread #1: tid = 0x60ee53, 0x0000000100000e53 a.out`main(argc=1, argv=0x00007ffeefbff8b8) at main.cpp:18:3, queue = 'com.apple.main-thread', stop reason = breakpoint 1.1

Hide Details

Expecting sub string: "stopped" (was found) Expecting sub string: "stop reason = breakpoint" (was found)

Hide Details

Adding tearDown hook: def cleanup(): self.runCmd('type format clear', check=False) self.runCmd('type summary clear', check=False) self.runCmd('type synth clear', check=False)

Hide Details

Hide Details

runCmd: expr --element-count 3 -- data output: (int *) $0 = 0x0000603000001780 { (int) [0] = 1 (int) [1] = 3 (int) [2] = 5 }

Hide Details

Hide Details

Ran command: "expr --element-count 3 -- data"

Hide Details

Got output: (int *) $0 = 0x0000603000001780 { (int) [0] = 1 (int) [1] = 3 (int) [2] = 5 }

Hide Details

Expecting sub string: "[0] = 1" (was found) Expecting sub string: "[1] = 3" (was found) Expecting sub string: "[2] = 5" (was found)

Hide Details

runCmd: expr data output: (int *) $1 = 0x0000603000001780

Hide Details

Hide Details

Ran command: "expr data"

Hide Details

Got output: (int *) $1 = 0x0000603000001780

Hide Details

Expecting sub string: "int *" (was found) Expecting sub string: "$" (was found) Expecting sub string: "0x" (was found)

Hide Details

runCmd: expr -f binary --element-count 0 -- data output: (int *) $2 = 0b0000000000000000011000000011000000000000000000000001011110000000

Hide Details

Hide Details

Ran command: "expr -f binary --element-count 0 -- data"

Hide Details

Got output: (int *) $2 = 0b0000000000000000011000000011000000000000000000000001011110000000

Hide Details

Expecting sub string: "int *" (was found) Expecting sub string: "$" (was found) Expecting sub string: "0b" (was found)

Hide Details

runCmd: expr -f hex --element-count 3 -- data output: (int *) $3 = 0x0000603000001780 { (int) [0] = 0x00000001 (int) [1] = 0x00000003 (int) [2] = 0x00000005 }

Hide Details

Hide Details

Ran command: "expr -f hex --element-count 3 -- data"

Hide Details

Got output: (int *) $3 = 0x0000603000001780 { (int) [0] = 0x00000001 (int) [1] = 0x00000003 (int) [2] = 0x00000005 }

Hide Details

Expecting sub string: "[0] = 0x" (was found) Expecting sub string: "1" (was found) Expecting sub string: "[1] = 0x" (was found) Expecting sub string: "3" (was found) Expecting sub string: "[2] = 0x" (was found) Expecting sub string: "5" (was found)

Hide Details

runCmd: expr -f binary --element-count 2 -- data output: (int *) $4 = 0x0000603000001780 { (int) [0] = 0b00000000000000000000000000000001 (int) [1] = 0b00000000000000000000000000000011 }

Hide Details

Hide Details

Ran command: "expr -f binary --element-count 2 -- data"

Hide Details

Got output: (int *) $4 = 0x0000603000001780 { (int) [0] = 0b00000000000000000000000000000001 (int) [1] = 0b00000000000000000000000000000011 }

Hide Details

Expecting sub string: "int *" (was found) Expecting sub string: "$" (was found) Expecting sub string: "0x" (was found) Expecting sub string: "[0] = 0b" (was found) Expecting sub string: "1" (was found) Expecting sub string: "[1] = 0b" (was found) Expecting sub string: "11" (was found)

Hide Details

runCmd: parray 3 data output: (int *) $5 = 0x0000603000001780 { (int) [0] = 1 (int) [1] = 3 (int) [2] = 5 }

Hide Details

Hide Details

Ran command: "parray 3 data"

Hide Details

Got output: (int *) $5 = 0x0000603000001780 { (int) [0] = 1 (int) [1] = 3 (int) [2] = 5 }

Hide Details

Expecting sub string: "[0] = 1" (was found) Expecting sub string: "[1] = 3" (was found) Expecting sub string: "[2] = 5" (was found)

Hide Details

runCmd: parray `1 + 1 + 1` data output: (int *) $7 = 0x0000603000001780 { (int) [0] = 1 (int) [1] = 3 (int) [2] = 5 }

Hide Details

Hide Details

Ran command: "parray `1 + 1 + 1` data"

Hide Details

Got output: (int *) $7 = 0x0000603000001780 { (int) [0] = 1 (int) [1] = 3 (int) [2] = 5 }

Hide Details

Expecting sub string: "[0] = 1" (was found) Expecting sub string: "[1] = 3" (was found) Expecting sub string: "[2] = 5" (was found)

Hide Details

runCmd: parray `data[1]` data output: (int *) $9 = 0x0000603000001780 { (int) [0] = 1 (int) [1] = 3 (int) [2] = 5 }

Hide Details

Hide Details

Ran command: "parray `data[1]` data"

Hide Details

Got output: (int *) $9 = 0x0000603000001780 { (int) [0] = 1 (int) [1] = 3 (int) [2] = 5 }

Hide Details

Expecting sub string: "[0] = 1" (was found) Expecting sub string: "[1] = 3" (was found) Expecting sub string: "[2] = 5" (was found)

Hide Details

runCmd: parray/x 3 data output: (int *) $10 = 0x0000603000001780 { (int) [0] = 0x00000001 (int) [1] = 0x00000003 (int) [2] = 0x00000005 }

Hide Details

Hide Details

Ran command: "parray/x 3 data"

Hide Details

Got output: (int *) $10 = 0x0000603000001780 { (int) [0] = 0x00000001 (int) [1] = 0x00000003 (int) [2] = 0x00000005 }

Hide Details

Expecting sub string: "[0] = 0x" (was found) Expecting sub string: "1" (was found) Expecting sub string: "[1] = 0x" (was found) Expecting sub string: "3" (was found) Expecting sub string: "[2] = 0x" (was found) Expecting sub string: "5" (was found)

Hide Details

runCmd: parray/x `data[1]` data output: (int *) $12 = 0x0000603000001780 { (int) [0] = 0x00000001 (int) [1] = 0x00000003 (int) [2] = 0x00000005 }

Hide Details

Hide Details

Ran command: "parray/x `data[1]` data"

Hide Details

Got output: (int *) $12 = 0x0000603000001780 { (int) [0] = 0x00000001 (int) [1] = 0x00000003 (int) [2] = 0x00000005 }

Hide Details

Expecting sub string: "[0] = 0x" (was found) Expecting sub string: "1" (was found) Expecting sub string: "[1] = 0x" (was found) Expecting sub string: "3" (was found) Expecting sub string: "[2] = 0x" (was found) Expecting sub string: "5" (was found)

Hide Details

runCmd: expr --element-count 10 -- 123 check of return status not required runCmd failed! error: expression cannot be used with --element-count as it does not refer to a pointer

Hide Details

Hide Details

Ran command: "expr --element-count 10 -- 123"

Hide Details

Got output: error: expression cannot be used with --element-count as it does not refer to a pointer

Hide Details

Expecting sub string: "expression cannot be used with --element-count as it does not refer to a pointer" (was found)

Hide Details

runCmd: expr --element-count 10 -- (void*)123 check of return status not required runCmd failed! error: expression cannot be used with --element-count as it refers to a pointer to void

Hide Details

Hide Details

Ran command: "expr --element-count 10 -- (void*)123"

Hide Details

Got output: error: expression cannot be used with --element-count as it refers to a pointer to void

Hide Details

Expecting sub string: "expression cannot be used with --element-count as it refers to a pointer to void" (was found)

Hide Details

runCmd: parray data check of return status not required runCmd failed! error: invalid element count 'data'

Hide Details

Hide Details

Ran command: "parray data"

Hide Details

Got output: error: invalid element count 'data'

Hide Details

Expecting sub string: "invalid element count 'data'" (was found)

Hide Details

runCmd: parray data data check of return status not required runCmd failed! error: invalid element count 'data'

Hide Details

Hide Details

Ran command: "parray data data"

Hide Details

Got output: error: invalid element count 'data'

Hide Details

Expecting sub string: "invalid element count 'data'" (was found)

Hide Details

runCmd: parray check of return status not required runCmd failed! error: Not enough arguments provided; you need at least 1 arguments to use this alias. error: 'parray' is not a valid command.

Hide Details

Hide Details

Ran command: "parray"

Hide Details

Got output: error: Not enough arguments provided; you need at least 1 arguments to use this alias. error: 'parray' is not a valid command.

Hide Details

Expecting sub string: "Not enough arguments provided" (was found)

Hide Details

<bound method SBProcess.Kill of <lldb.SBProcess; proxy of <Swig Object of type 'lldb::SBProcess *' at 0x10df71cf0> >>: success

Hide Details

Executing tearDown hook: def cleanup(): self.runCmd('type format clear', check=False) self.runCmd('type summary clear', check=False) self.runCmd('type synth clear', check=False)

Hide Details

Hide Details

runCmd: type format clear check of return status not required output:

Hide Details

runCmd: type summary clear check of return status not required output:

Hide Details

runCmd: type synth clear check of return status not required output:

Hide Details

PASS: LLDB (/Users/buildslave/jenkins/workspace/lldb-cmake-sanitized/lldb-build/bin/clang-x86_64) :: test_print_array_dwarf (TestPrintArray.PrintArrayTestCase) UNSUPPORTED: LLDB (/Users/buildslave/jenkins/workspace/lldb-cmake-sanitized/lldb-build/bin/clang-x86_64) :: test_print_array_dwo (TestPrintArray.PrintArrayTestCase) (test case does not fall in any category of interest for this run) runCmd: settings clear -all output:

Hide Details

runCmd: settings set symbols.enable-external-lookup false output:

Hide Details

runCmd: settings set target.inherit-tcc true output:

Hide Details

runCmd: settings set target.detach-on-error false output:

Hide Details

runCmd: settings set target.auto-apply-fixits false output:

Hide Details

runCmd: settings set plugin.process.gdb-remote.packet-timeout 60 output:

Hide Details

runCmd: settings set symbols.clang-modules-cache-path "/Users/buildslave/jenkins/workspace/lldb-cmake-sanitized/lldb-build/lldb-test-build.noindex/module-cache-lldb/lldb-api" output:

Hide Details

runCmd: settings set use-color false output:

Hide Details

runCmd: setting set target.prefer-dynamic-value no-dynamic-values output:

Hide Details

runCmd: settings set target.env-vars ASAN_OPTIONS=detect_stack_use_after_return=1 DYLD_INSERT_LIBRARIES=/Users/buildslave/jenkins/workspace/lldb-cmake-sanitized/host-compiler/lib/clang/13.0.99/lib/darwin/libclang_rt.asan_osx_dynamic.dylib output:

Hide Details

FAIL: LLDB (/Users/buildslave/jenkins/workspace/lldb-cmake-sanitized/lldb-build/bin/clang-x86_64) :: test_print_array_gmodules (TestPrintArray.PrintArrayTestCase) Restore dir to: /Users/buildslave/jenkins/workspace/lldb-cmake-sanitized/lldb-build/tools/lldb/test ====================================================================== ERROR: test_print_array_gmodules (TestPrintArray.PrintArrayTestCase) Test that expr -Z works ---------------------------------------------------------------------- Error when building test subject.

Hide Details

Build Command: make VPATH=/Users/buildslave/jenkins/workspace/lldb-cmake-sanitized/llvm-project/lldb/test/API/functionalities/data-formatter/parray -C /Users/buildslave/jenkins/workspace/lldb-cmake-sanitized/lldb-build/lldb-test-build.noindex/functionalities/data-formatter/parray/TestPrintArray.test_print_array_gmodules -I /Users/buildslave/jenkins/workspace/lldb-cmake-sanitized/llvm-project/lldb/test/API/functionalities/data-formatter/parray -I /Users/buildslave/jenkins/workspace/lldb-cmake-sanitized/llvm-project/lldb/packages/Python/lldbsuite/test/make -f /Users/buildslave/jenkins/workspace/lldb-cmake-sanitized/llvm-project/lldb/test/API/functionalities/data-formatter/parray/Makefile MAKE_DSYM=NO MAKE_GMODULES=YES ARCH=x86_64 CC="/Users/buildslave/jenkins/workspace/lldb-cmake-sanitized/lldb-build/bin/clang" DSYMUTIL="/Users/buildslave/jenkins/workspace/lldb-cmake-sanitized/lldb-build/./bin/dsymutil" CLANG_MODULE_CACHE_DIR=/Users/buildslave/jenkins/workspace/lldb-cmake-sanitized/lldb-build/lldb-test-build.noindex/module-cache-clang/lldb-api

Hide Details

Build Command Output: /Users/buildslave/jenkins/workspace/lldb-cmake-sanitized/lldb-build/bin/clang -fmodules -gmodules -fmodules-cache-path=/Users/buildslave/jenkins/workspace/lldb-cmake-sanitized/lldb-build/lldb-test-build.noindex/module-cache-clang/lldb-api -gmodules -fcxx-modules -std=c++11 -g -O0 -fno-builtin -isysroot "/Applications/Xcode.app/Contents/Developer/Platforms/MacOSX.platform/Developer/SDKs/MacOSX10.15.sdk" -arch x86_64 -I/Users/buildslave/jenkins/workspace/lldb-cmake-sanitized/llvm-project/lldb/packages/Python/lldbsuite/test/make/../../../../../include -I/Users/buildslave/jenkins/workspace/lldb-cmake-sanitized/llvm-project/lldb/test/API/functionalities/data-formatter/parray -I/Users/buildslave/jenkins/workspace/lldb-cmake-sanitized/llvm-project/lldb/packages/Python/lldbsuite/test/make -include /Users/buildslave/jenkins/workspace/lldb-cmake-sanitized/llvm-project/lldb/packages/Python/lldbsuite/test/make/test_common.h -fno-limit-debug-info -fmodules -gmodules -fmodules-cache-path=/Users/buildslave/jenkins/workspace/lldb-cmake-sanitized/lldb-build/lldb-test-build.noindex/module-cache-clang/lldb-api -gmodules -fcxx-modules --driver-mode=g++ -MT main.o -MD -MP -MF main.d -c -o main.o /Users/buildslave/jenkins/workspace/lldb-cmake-sanitized/llvm-project/lldb/test/API/functionalities/data-formatter/parray/main.cpp In module 'std' imported from /Users/buildslave/jenkins/workspace/lldb-cmake-sanitized/llvm-project/lldb/test/API/functionalities/data-formatter/parray/main.cpp:1: /Users/buildslave/jenkins/workspace/lldb-cmake-sanitized/lldb-build/bin/../include/c++/v1/__memory/allocator_traits.h:73:48: error: missing '#include "/Users/buildslave/jenkins/workspace/lldb-cmake-sanitized/lldb-build/bin/../include/c++/v1/__memory/pointer_traits.h"'; 'pointer_traits<_Tp *>' must be defined before it is used using type _LIBCPP_NODEBUG_TYPE = typename pointer_traits<_Ptr>::template rebind<void>; ^ /Users/buildslave/jenkins/workspace/lldb-cmake-sanitized/lldb-build/bin/../include/c++/v1/__memory/allocator_traits.h:234:35: note: in instantiation of template class 'std::__void_pointer<(lambda at /Users/buildslave/jenkins/workspace/lldb-cmake-sanitized/llvm-project/lldb/test/API/functionalities/data-formatter/parray/main.cpp:15:29) *, std::allocator<(lambda at /Users/buildslave/jenkins/workspace/lldb-cmake-sanitized/llvm-project/lldb/test/API/functionalities/data-formatter/parray/main.cpp:15:29)>, false>' requested here using void_pointer = typename __void_pointer<pointer, allocator_type>::type; ^ /Users/buildslave/jenkins/workspace/lldb-cmake-sanitized/lldb-build/bin/../include/c++/v1/__memory/allocator_traits.h:354:48: note: in instantiation of template class 'std::allocator_traits<std::allocator<(lambda at /Users/buildslave/jenkins/workspace/lldb-cmake-sanitized/llvm-project/lldb/test/API/functionalities/data-formatter/parray/main.cpp:15:29)>>' requested here using type _LIBCPP_NODEBUG_TYPE = typename _Traits::template rebind_alloc<_Tp>; ^ /Users/buildslave/jenkins/workspace/lldb-cmake-sanitized/lldb-build/bin/../include/c++/v1/functional:1790:26: note: in instantiation of template class 'std::__rebind_alloc_helper<std::allocator_traits<std::allocator<(lambda at /Users/buildslave/jenkins/workspace/lldb-cmake-sanitized/llvm-project/lldb/test/API/functionalities/data-formatter/parray/main.cpp:15:29)>>, std::__function::__func<(lambda at /Users/buildslave/jenkins/workspace/lldb-cmake-sanitized/llvm-project/lldb/test/API/functionalities/data-formatter/parray/main.cpp:15:29), std::allocator<(lambda at /Users/buildslave/jenkins/workspace/lldb-cmake-sanitized/llvm-project/lldb/test/API/functionalities/data-formatter/parray/main.cpp:15:29)>, int (unsigned long)>>' requested here typedef typename __rebind_alloc_helper<__alloc_traits, _Fun>::type ^ /Users/buildslave/jenkins/workspace/lldb-cmake-sanitized/lldb-build/bin/../include/c++/v1/functional:1816:11: note: in instantiation of function template specialization 'std::__function::__value_func<int (unsigned long)>::__value_func<(lambda at /Users/buildslave/jenkins/workspace/lldb-cmake-sanitized/llvm-project/lldb/test/API/functionalities/data-formatter/parray/main.cpp:15:29), std::allocator<(lambda at /Users/buildslave/jenkins/workspace/lldb-cmake-sanitized/llvm-project/lldb/test/API/functionalities/data-formatter/parray/main.cpp:15:29)>>' requested here : __value_func(_VSTD::forward<_Fp>(__f), allocator<_Fp>()) {} ^ /Users/buildslave/jenkins/workspace/lldb-cmake-sanitized/lldb-build/bin/../include/c++/v1/functional:2512:50: note: in instantiation of function template specialization 'std::__function::__value_func<int (unsigned long)>::__value_func<(lambda at /Users/buildslave/jenkins/workspace/lldb-cmake-sanitized/llvm-project/lldb/test/API/functionalities/data-formatter/parray/main.cpp:15:29), void>' requested here function<_Rp(_ArgTypes...)>::function(_Fp __f) : __f_(_VSTD::move(__f)) {} ^ /Users/buildslave/jenkins/workspace/lldb-cmake-sanitized/llvm-project/lldb/test/API/functionalities/data-formatter/parray/main.cpp:15:29: note: in instantiation of function template specialization 'std::function<int (unsigned long)>::function<(lambda at /Users/buildslave/jenkins/workspace/lldb-cmake-sanitized/llvm-project/lldb/test/API/functionalities/data-formatter/parray/main.cpp:15:29), void>' requested here int* data = alloc<int>(5, [] (size_t idx) -> int { ^ /Users/buildslave/jenkins/workspace/lldb-cmake-sanitized/lldb-build/bin/../include/c++/v1/__memory/pointer_traits.h:135:29: note: definition here is not reachable struct _LIBCPP_TEMPLATE_VIS pointer_traits<_Tp*> ^ 1 error generated. make: *** [main.o] Error 1

Hide Details

Test Directory: /Users/buildslave/jenkins/workspace/lldb-cmake-sanitized/llvm-project/lldb/test/API/functionalities/data-formatter/parray ---------------------------------------------------------------------- Ran 4 tests in 14.256s

Hide Details

RESULT: FAILED (2 passes, 0 failures, 1 errors, 1 skipped, 0 expected failures, 0 unexpected successes)

Hide Details

--

Hide Details

******************** PASS: lldb-unit :: Core/./LLDBCoreTests/RichManglingContextTest.SwitchProvider (2210 of 2331) PASS: lldb-api :: functionalities/gdb_remote_client/TestMultiprocess.py (2211 of 2331) PASS: lldb-api :: functionalities/paths/TestPaths.py (2212 of 2331) PASS: lldb-unit :: Language/Highlighting/./HighlighterTests/HighlighterTest.ClangUnterminatedString (2213 of 2331) PASS: lldb-unit :: Expression/./ExpressionTests/DiagnosticManagerTest.AppendMessageNoDiag (2214 of 2331) PASS: lldb-unit :: Utility/./UtilityTests/RecordReplayTest.InstrumentedBarPtr (2215 of 2331) PASS: lldb-api :: functionalities/data-formatter/data-formatter-objc/TestDataFormatterObjCNSBundle.py (2216 of 2331) UNSUPPORTED: lldb-api :: lang/objc/foundation/TestFoundationDisassembly.py (2217 of 2331) PASS: lldb-unit :: Utility/./UtilityTests/VMRange.Reset (2218 of 2331) PASS: lldb-unit :: Utility/./UtilityTests/RangeTest.DefaultConstructor (2219 of 2331) PASS: lldb-shell :: ObjectFile/PECOFF/symbol.yaml (2220 of 2331) PASS: lldb-unit :: Process/Utility/./ProcessUtilityTests/ProcSMapTests/LinuxProcSMapsTestFixture.ParseSMapRegions/2 (2221 of 2331) PASS: lldb-unit :: ScriptInterpreter/Python/./ScriptInterpreterPythonTests/PythonDataObjectsTest.TestPythonCallableCheck (2222 of 2331) PASS: lldb-unit :: Utility/./UtilityTests/DataExtractorTest.GetBitfield (2223 of 2331) PASS: lldb-unit :: Utility/./UtilityTests/ConstStringTest.MangledCounterpart (2224 of 2331) PASS: lldb-unit :: ScriptInterpreter/Python/./ScriptInterpreterPythonTests/PythonDataObjectsTest.TestPythonDictionaryToStructuredDictionary (2225 of 2331) UNSUPPORTED: lldb-api :: functionalities/data-formatter/data-formatter-stl/libstdcpp/unique_ptr/TestDataFormatterStdUniquePtr.py (2226 of 2331) PASS: lldb-unit :: UnwindAssembly/x86/./UnwindAssemblyx86Tests/Testx86AssemblyInspectionEngine.TestSimple64bitFrameFunction (2227 of 2331) PASS: lldb-unit :: Host/./HostTests/NativeProcessProtocolTest.ReadMemoryWithoutTrap (2228 of 2331) UNSUPPORTED: lldb-shell :: ExecControl/StopHook/stop-hook-threads.test (2229 of 2331) PASS: lldb-unit :: Expression/./ExpressionTests/CppModuleConfigurationTest.MissingUsrInclude (2230 of 2331) PASS: lldb-api :: commands/expression/unicode-in-variable/TestUnicodeInVariable.py (2231 of 2331) PASS: lldb-api :: functionalities/thread/backtrace_all/TestBacktraceAll.py (2232 of 2331) PASS: lldb-unit :: Core/./LLDBCoreTests/ModuleSpecTest.TestMachOFile (2233 of 2331) PASS: lldb-api :: functionalities/data-formatter/data-formatter-synth/TestDataFormatterSynth.py (2234 of 2331) PASS: lldb-unit :: Utility/./UtilityTests/RecordReplayTest.InvalidSequence (2235 of 2331) PASS: lldb-unit :: UnwindAssembly/x86/./UnwindAssemblyx86Tests/Testx86AssemblyInspectionEngine.TestPopEBP (2236 of 2331) PASS: lldb-unit :: Language/Highlighting/./HighlighterTests/HighlighterTest.Colons (2237 of 2331) PASS: lldb-api :: lang/cpp/bool/TestCPPBool.py (2238 of 2331) PASS: lldb-shell :: Minidump/Windows/Sigsegv/sigsegv.test (2239 of 2331) PASS: lldb-api :: lang/objc/modules-compile-error/TestModulesCompileError.py (2240 of 2331) PASS: lldb-unit :: Utility/./UtilityTests/StreamTest.PutStringAsRawHex8 (2241 of 2331) PASS: lldb-unit :: ScriptInterpreter/Python/./ScriptInterpreterPythonTests/PythonDataObjectsTest.TestBorrowedReferences (2242 of 2331) PASS: lldb-unit :: Utility/./UtilityTests/GeneratorTest.GetOrCreate (2243 of 2331) PASS: lldb-unit :: Utility/./UtilityTests/ArgsTest.ReplaceArgumentAtIndexFarOutOfRange (2244 of 2331) PASS: lldb-api :: functionalities/target_var/TestTargetVar.py (2245 of 2331) PASS: lldb-unit :: DataFormatter/./LLDBFormatterTests/TypeMatcherTests.ExactName (2246 of 2331) UNSUPPORTED: lldb-api :: functionalities/darwin_log/source/debug/TestDarwinLogSourceDebug.py (2247 of 2331) PASS: lldb-unit :: Utility/./UtilityTests/StringListTest.InsertStringAtIndexEnd (2248 of 2331) PASS: lldb-api :: functionalities/data-formatter/data-formatter-skip-summary/TestDataFormatterSkipSummary.py (2249 of 2331) PASS: lldb-api :: commands/frame/diagnose/virtual-method-call/TestDiagnoseDereferenceVirtualMethodCall.py (2250 of 2331) PASS: lldb-unit :: Utility/./UtilityTests/DataExtractorTest.GetCStrAtEnd (2251 of 2331) PASS: lldb-unit :: Expression/./ExpressionTests/CppModuleConfigurationTest.IgnoreLibStdCpp (2252 of 2331) PASS: lldb-shell :: Breakpoint/debug_addrx.test (2253 of 2331) PASS: lldb-api :: functionalities/gdb_remote_client/TestGDBRemoteClient.py (2254 of 2331) PASS: lldb-unit :: Utility/./UtilityTests/StatusTest.ErrorCodeConstructor (2255 of 2331) PASS: lldb-api :: functionalities/data-formatter/data-formatter-stl/libcxx/tuple/TestDataFormatterLibcxxTuple.py (2256 of 2331) PASS: lldb-api :: python_api/frame/inlines/TestInlinedFrame.py (2257 of 2331) PASS: lldb-unit :: Language/Highlighting/./HighlighterTests/HighlighterTest.ClangCursorOutOfBounds (2258 of 2331) PASS: lldb-shell :: Unwind/eh-frame-dwarf-unwind.test (2259 of 2331) PASS: lldb-api :: macosx/dyld-trie-symbols/TestDyldTrieSymbols.py (2260 of 2331) PASS: lldb-api :: functionalities/breakpoint/breakpoint_ignore_count/TestBreakpointIgnoreCount.py (2261 of 2331) PASS: lldb-unit :: Utility/./UtilityTests/UserIDResolver.GetGroupName (2262 of 2331) PASS: lldb-unit :: Utility/./UtilityTests/RecordReplayTest.InstrumentedFoo (2263 of 2331) PASS: lldb-api :: functionalities/data-formatter/hexcaps/TestDataFormatterHexCaps.py (2264 of 2331) UNSUPPORTED: lldb-api :: functionalities/darwin_log/filter/exact_match/category/TestDarwinLogFilterMatchCategory.py (2265 of 2331) PASS: lldb-api :: functionalities/data-formatter/data-formatter-objc/nsindexpath/TestDataFormatterNSIndexPath.py (2266 of 2331) PASS: lldb-api :: functionalities/process_group/TestChangeProcessGroup.py (2267 of 2331) PASS: lldb-api :: functionalities/dynamic_value_child_count/TestDynamicValueChildCount.py (2268 of 2331) UNSUPPORTED: lldb-api :: functionalities/thread/break_after_join/TestBreakAfterJoin.py (2269 of 2331) UNSUPPORTED: lldb-api :: commands/trace/multiple-threads/TestTraceStartStopMultipleThreads.py (2270 of 2331) PASS: lldb-shell :: Driver/LocalLLDBInit.test (2271 of 2331) UNSUPPORTED: lldb-api :: functionalities/thread/thread_specific_break_plus_condition/TestThreadSpecificBpPlusCondition.py (2272 of 2331) PASS: lldb-unit :: Utility/./UtilityTests/StringListTest.GetMaxStringLengthEmpty (2273 of 2331) PASS: lldb-unit :: Interpreter/./InterpreterTests/OptionArgParserTest.toChar (2274 of 2331) PASS: lldb-unit :: Utility/./UtilityTests/StreamTest.PutChar (2275 of 2331) PASS: lldb-api :: lang/cpp/llvm-style/TestLLVMStyle.py (2276 of 2331) PASS: lldb-unit :: Utility/./UtilityTests/StringExtractorTest.InitEmpty (2277 of 2331) PASS: lldb-unit :: Utility/./UtilityTests/StringListTest.LongestCommonPrefixDuplicateElement (2278 of 2331) PASS: lldb-unit :: Utility/./UtilityTests/ProcessInstanceInfoList.Yaml (2279 of 2331) PASS: lldb-api :: functionalities/data-formatter/data-formatter-stl/libcxx/vbool/TestDataFormatterLibcxxVBool.py (2280 of 2331) PASS: lldb-unit :: Utility/./UtilityTests/RecordReplayTest.InstrumentedBar (2281 of 2331) PASS: lldb-unit :: Utility/./UtilityTests/RangeTest.Union (2282 of 2331) PASS: lldb-unit :: Symbol/./SymbolTests/PostfixExpression.ToDWARF (2283 of 2331) PASS: lldb-unit :: SymbolFile/NativePDB/./SymbolFileNativePDBTests/PDBFPOProgramToDWARFExpressionTests.UnresolvedDependentCyclicRegisterAssignmentReference (2284 of 2331) PASS: lldb-api :: lang/c/function_types/TestFunctionTypes.py (2285 of 2331) PASS: lldb-api :: lang/cpp/diamond/TestDiamond.py (2286 of 2331) PASS: lldb-unit :: Utility/./UtilityTests/RangeTest.NotEqualInvalid (2287 of 2331) PASS: lldb-api :: functionalities/breakpoint/breakpoint_command/TestBreakpointCommandsFromPython.py (2288 of 2331) PASS: lldb-api :: commands/watchpoints/multiple_hits/TestMultipleHits.py (2289 of 2331) PASS: lldb-unit :: ObjectFile/Breakpad/./ObjectFileBreakpadTests/FileRecord.parse (2290 of 2331) PASS: lldb-unit :: Utility/./UtilityTests/ListenerTest.GetEventWait (2291 of 2331) PASS: lldb-api :: functionalities/load_unload/TestLoadUnload.py (2292 of 2331) UNSUPPORTED: lldb-api :: functionalities/darwin_log/filter/regex/activity/TestDarwinLogFilterRegexActivity.py (2293 of 2331) PASS: lldb-shell :: Reproducer/TestDump.test (2294 of 2331) PASS: lldb-api :: functionalities/data-formatter/data-formatter-stl/libcxx/atomic/TestLibCxxAtomic.py (2295 of 2331) PASS: lldb-api :: commands/frame/diagnose/bad-reference/TestBadReference.py (2296 of 2331) PASS: lldb-unit :: Utility/./UtilityTests/ProcessInstanceInfoMatch.Name (2297 of 2331) PASS: lldb-api :: lang/c/anonymous/TestAnonymous.py (2298 of 2331) PASS: lldb-api :: python_api/sberror/TestSBError.py (2299 of 2331) PASS: lldb-api :: tools/lldb-vscode/breakpoint/TestVSCode_setExceptionBreakpoints.py (2300 of 2331) UNSUPPORTED: lldb-api :: lang/objc/modules-update/TestClangModulesUpdate.py (2301 of 2331) UNSUPPORTED: lldb-api :: functionalities/unwind/ehframe/TestEhFrameUnwind.py (2302 of 2331) PASS: lldb-unit :: Signals/./SignalsTests/UnixSignalsTest.GetInfo (2303 of 2331) PASS: lldb-unit :: Process/minidump/./LLDBMinidumpTests/MinidumpParserTest.MinidumpDuplicateModuleMappedSecondHigh (2304 of 2331) PASS: lldb-unit :: Utility/./UtilityTests/UriParserTest.BracketedHostnameWithColon (2305 of 2331) PASS: lldb-api :: python_api/debugger/TestDebuggerAPI.py (2306 of 2331) PASS: lldb-shell :: ObjectFile/PECOFF/dep-modules.yaml (2307 of 2331) PASS: lldb-shell :: SymbolFile/DWARF/x86/parallel-indexing-stress.s (2308 of 2331) PASS: lldb-api :: types/TestLongTypesExpr.py (2309 of 2331) UNSUPPORTED: lldb-shell :: Minidump/Windows/arm-fp-unwind.test (2310 of 2331) PASS: lldb-shell :: SymbolFile/NativePDB/disassembly.cpp (2311 of 2331) PASS: lldb-api :: functionalities/wrong_commands/TestWrongCommands.py (2312 of 2331) PASS: lldb-api :: commands/expression/context-object-objc/TestContextObjectObjc.py (2313 of 2331) PASS: lldb-unit :: Utility/./UtilityTests/NameMatchesTest.StartsWith (2314 of 2331) PASS: lldb-api :: lang/objc/foundation/TestObjCMethodsString.py (2315 of 2331) PASS: lldb-api :: commands/expression/import-std-module/list-dbg-info-content/TestDbgInfoContentListFromStdModule.py (2316 of 2331) PASS: lldb-unit :: Utility/./UtilityTests/CompletionRequest.Constructor (2317 of 2331) PASS: lldb-shell :: SymbolFile/NativePDB/function-types-calling-conv.cpp (2318 of 2331) UNSUPPORTED: lldb-api :: commands/register/register/aarch64_sve_registers/rw_access_static_config/TestSVERegisters.py (2319 of 2331) PASS: lldb-api :: lang/c/offsetof/TestOffsetof.py (2320 of 2331) PASS: lldb-shell :: SymbolFile/DWARF/x86/split-dwarf-multiple-cu.ll (2321 of 2331) PASS: lldb-unit :: UnwindAssembly/x86/./UnwindAssemblyx86Tests/Testx86AssemblyInspectionEngine.TestStackRealignMSVC_i386 (2322 of 2331) PASS: lldb-unit :: Editline/./EditlineTests/EditlineTestFixture.EditlineReceivesMultiLineText (2323 of 2331) PASS: lldb-unit :: Utility/./UtilityTests/StringExtractorTest.GetHexBytesAvail_Partial (2324 of 2331) PASS: lldb-unit :: Utility/./UtilityTests/StreamTest.PutCStringWithStringRef (2325 of 2331) PASS: lldb-unit :: Symbol/./SymbolTests/TestClangASTImporter.CanImportInvalidType (2326 of 2331) PASS: lldb-api :: commands/command/invalid-args/TestInvalidArgsCommand.py (2327 of 2331) PASS: lldb-unit :: Process/gdb-remote/./ProcessGdbRemoteTests/GDBRemoteCommunicationClientTest.SendSignalsToIgnore (2328 of 2331) PASS: lldb-api :: functionalities/data-formatter/data-formatter-stl/libcxx/initializerlist/TestInitializerList.py (2329 of 2331) PASS: lldb-api :: functionalities/tail_call_frames/disambiguate_call_site/TestDisambiguateCallSite.py (2330 of 2331) PASS: lldb-api :: lang/objc/foundation/TestConstStrings.py (2331 of 2331) Slowest Tests: -------------------------------------------------------------------------- 408.84s: lldb-api :: tools/lldb-server/TestLldbGdbServer.py 249.69s: lldb-api :: api/multithreaded/TestMultithreaded.py 123.42s: lldb-api :: functionalities/completion/TestCompletion.py 116.56s: lldb-api :: lang/objc/hidden-ivars/TestHiddenIvars.py 115.30s: lldb-api :: lang/objc/exceptions/TestObjCExceptions.py 109.94s: lldb-api :: lang/objc/objc-new-syntax/TestObjCNewSyntaxLiteral.py 109.33s: lldb-api :: lang/objc/foundation/TestObjCMethods.py 105.01s: lldb-api :: types/TestLongTypesExpr.py 100.45s: lldb-api :: lang/cpp/namespace/TestNamespaceLookup.py 96.80s: lldb-api :: lang/objc/real-definition/TestRealDefinition.py 91.75s: lldb-api :: functionalities/gdb_remote_client/TestWasm.py 81.29s: lldb-api :: lang/objc/objc-new-syntax/TestObjCNewSyntaxArray.py 81.23s: lldb-api :: commands/expression/import-std-module/queue/TestQueueFromStdModule.py 81.15s: lldb-api :: commands/expression/import-std-module/stack/TestStackFromStdModule.py 80.98s: lldb-api :: lang/objc/objc-new-syntax/TestObjCNewSyntaxDictionary.py 75.98s: lldb-api :: tools/lldb-server/TestGdbRemoteThreadsInStopReply.py 71.18s: lldb-api :: commands/settings/TestSettings.py 70.93s: lldb-api :: types/TestShortTypeExpr.py 67.06s: lldb-api :: python_api/target/TestTargetAPI.py 66.65s: lldb-api :: types/TestIntegerTypeExpr.py

Hide Details

Tests Times: -------------------------------------------------------------------------- [ Range ] :: [ Percentage ] :: [ Count ] -------------------------------------------------------------------------- [400s,420s) :: [ ] :: [ 1/2331] [380s,400s) :: [ ] :: [ 0/2331] [360s,380s) :: [ ] :: [ 0/2331] [340s,360s) :: [ ] :: [ 0/2331] [320s,340s) :: [ ] :: [ 0/2331] [300s,320s) :: [ ] :: [ 0/2331] [280s,300s) :: [ ] :: [ 0/2331] [260s,280s) :: [ ] :: [ 0/2331] [240s,260s) :: [ ] :: [ 1/2331] [220s,240s) :: [ ] :: [ 0/2331] [200s,220s) :: [ ] :: [ 0/2331] [180s,200s) :: [ ] :: [ 0/2331] [160s,180s) :: [ ] :: [ 0/2331] [140s,160s) :: [ ] :: [ 0/2331] [120s,140s) :: [ ] :: [ 1/2331] [100s,120s) :: [ ] :: [ 6/2331] [ 80s,100s) :: [ ] :: [ 6/2331] [ 60s, 80s) :: [ ] :: [ 13/2331] [ 40s, 60s) :: [ ] :: [ 39/2331] [ 20s, 40s) :: [** ] :: [ 139/2331] [ 0s, 20s) :: [************************************ ] :: [2125/2331] -------------------------------------------------------------------------- ******************** Failed Tests (6): lldb-api :: commands/expression/import-std-module/shared_ptr-dbg-info-content/TestSharedPtrDbgInfoContentFromStdModule.py lldb-api :: commands/expression/import-std-module/shared_ptr/TestSharedPtrFromStdModule.py lldb-api :: commands/expression/import-std-module/weak_ptr-dbg-info-content/TestDbgInfoContentWeakPtrFromStdModule.py lldb-api :: commands/expression/import-std-module/weak_ptr/TestWeakPtrFromStdModule.py lldb-api :: functionalities/data-formatter/data-formatter-stl/libcxx/function/TestLibCxxFunction.py lldb-api :: functionalities/data-formatter/parray/TestPrintArray.py

Hide Details

Hide Details

Testing Time: 3564.98s Unsupported : 208 Passed : 2107 Expectedly Failed: 10 Failed : 6 FAILED: tools/lldb/test/CMakeFiles/check-lldb cd /Users/buildslave/jenkins/workspace/lldb-cmake-sanitized/lldb-build/tools/lldb/test && /usr/local/Frameworks/Python.framework/Versions/3.7/bin/python3.7 /Users/buildslave/jenkins/workspace/lldb-cmake-sanitized/lldb-build/./bin/llvm-lit -v --time-tests --shuffle --xunit-xml-output=/Users/buildslave/jenkins/workspace/lldb-cmake-sanitized/test/results.xml -v -j 4 --timeout 1200 /Users/buildslave/jenkins/workspace/lldb-cmake-sanitized/lldb-build/tools/lldb/test ninja: build stopped: subcommand failed. Command failed: Command '['/usr/bin/env', 'TERM=vt100', '/usr/local/bin/ninja', '-v', 'check-lldb']' returned non-zero exit status 1. Command: ['/usr/bin/env', 'TERM=vt100', '/usr/local/bin/ninja', '-v', 'check-lldb'] [Pipeline] } [Pipeline] // timeout [Pipeline] } [Pipeline] // stage [Pipeline] stage [Pipeline] { (Declarative: Post Actions) [Pipeline] scanForIssues [Clang (LLVM based)] Sleeping for 5 seconds due to JENKINS-32191... [Clang (LLVM based)] Parsing console log (workspace: '/Users/buildslave/jenkins/workspace/lldb-cmake-sanitized') [Clang (LLVM based)] Successfully parsed console log [Clang (LLVM based)] -> found 1 issue (skipped 5 duplicates) [Clang (LLVM based)] Post processing issues on 'green-dragon-23' with source code encoding 'UTF-8' [Clang (LLVM based)] Creating SCM blamer to obtain author and commit information for affected files [Clang (LLVM based)] -> No blamer installed yet. You need to install the 'git-forensics' plugin to enable blaming for Git. [Clang (LLVM based)] Resolving file names for all issues in source directory '/Users/buildslave/jenkins/workspace/lldb-cmake-sanitized' [Clang (LLVM based)] -> resolved paths in source directory (1 found, 0 not found) [Clang (LLVM based)] Resolving module names from module definitions (build.xml, pom.xml, or Manifest.mf files) [Clang (LLVM based)] -> resolved module names for 1 issues [Clang (LLVM based)] Resolving package names (or namespaces) by parsing the affected files [Clang (LLVM based)] -> resolved package names of 1 affected files [Clang (LLVM based)] No filter has been set, publishing all 1 issues [Clang (LLVM based)] Creating fingerprints for all affected code blocks to track issues over different builds [Clang (LLVM based)] -> created fingerprints for 1 issues (skipped 0 issues) [Clang (LLVM based)] Copying affected files to Jenkins' build folder '/Users/Shared/Jenkins/Home/jobs/lldb-cmake-sanitized/builds/1866/files-with-issues' [Clang (LLVM based)] -> 1 copied, 0 not in workspace, 0 not-found, 0 with I/O error [Clang (LLVM based)] Repository miner is not configured, skipping repository mining [Pipeline] junit Recording test results [Checks API] No suitable checks publisher found. [Pipeline] } [Pipeline] // stage [Pipeline] } [Pipeline] // withEnv [Pipeline] } [Pipeline] // node [Pipeline] End of Pipeline ERROR: script returned exit code 1 Finished: FAILURE