Console Output

Skipping 9,368 KB.. Full Log
runCmd: settings clear -all
output: 

Hide Details

runCmd: settings set symbols.enable-external-lookup false output:

Hide Details

runCmd: settings set target.inherit-tcc true output:

Hide Details

runCmd: settings set target.detach-on-error false output:

Hide Details

runCmd: settings set target.auto-apply-fixits false output:

Hide Details

runCmd: settings set plugin.process.gdb-remote.packet-timeout 60 output:

Hide Details

runCmd: settings set symbols.clang-modules-cache-path "/Users/buildslave/jenkins/workspace/lldb-cmake-sanitized/lldb-build/lldb-test-build.noindex/module-cache-lldb/lldb-api" output:

Hide Details

runCmd: settings set use-color false output:

Hide Details

runCmd: setting set target.prefer-dynamic-value no-dynamic-values output:

Hide Details

runCmd: settings set target.env-vars ASAN_OPTIONS=detect_stack_use_after_return=1 DYLD_INSERT_LIBRARIES=/Users/buildslave/jenkins/workspace/lldb-cmake-sanitized/host-compiler/lib/clang/13.0.99/lib/darwin/libclang_rt.asan_osx_dynamic.dylib output:

Hide Details

runCmd: file /Users/buildslave/jenkins/workspace/lldb-cmake-sanitized/lldb-build/lldb-test-build.noindex/functionalities/data-formatter/ostypeformatting/TestFormattersOsType.test_ostype_with_run_command_dsym/a.out output: Current executable set to '/Users/buildslave/jenkins/workspace/lldb-cmake-sanitized/lldb-build/lldb-test-build.noindex/functionalities/data-formatter/ostypeformatting/TestFormattersOsType.test_ostype_with_run_command_dsym/a.out' (x86_64).

Hide Details

Hide Details

runCmd: breakpoint set -f "main.mm" -l 11 output: Breakpoint 1: where = a.out`main + 52 at main.mm:11:6, address = 0x0000000100000f74

Hide Details

Hide Details

Expecting pattern: ^Breakpoint (?P<bpno>[0-9]+): (?P<num_locations>[0-9]+) locations\.$ Not matched

Hide Details

Expecting pattern: ^Breakpoint (?P<bpno>[0-9]+): (?P<num_locations>no) locations \(pending\)\. Not matched

Hide Details

Expecting pattern: ^Breakpoint (?P<bpno>[0-9]+): where = (?P<module>.*)`(?P<symbol>[+\-]{0,1}[^+]+)( \+ (?P<offset>[0-9]+)){0,1}( \[inlined\] (?P<inline_symbol>.*)){0,1} at (?P<file>[^:]+):(?P<line_no>[0-9]+)(?P<column>(:[0-9]+)?), address = (?P<address>0x[0-9a-fA-F]+)$ Matched

Hide Details

runCmd: run output: Process 51234 stopped * thread #1, queue = 'com.apple.main-thread', stop reason = breakpoint 1.1 frame #0: 0x0000000100000f74 a.out`main(argc=1, argv=0x00007ffeefbff878) at main.mm:11:6 8 OSType a = 'test'; 9 OSType b = 'best'; 10 -> 11 [pool drain];// Set break point at this line. ^ 12 return 0; 13 } 14 Process 51234 launched: '/Users/buildslave/jenkins/workspace/lldb-cmake-sanitized/lldb-build/lldb-test-build.noindex/functionalities/data-formatter/ostypeformatting/TestFormattersOsType.test_ostype_with_run_command_dsym/a.out' (x86_64)

Hide Details

Hide Details

runCmd: thread list output: Process 51234 stopped * thread #1: tid = 0x375b1, 0x0000000100000f74 a.out`main(argc=1, argv=0x00007ffeefbff878) at main.mm:11:6, queue = 'com.apple.main-thread', stop reason = breakpoint 1.1

Hide Details

Hide Details

Ran command: "thread list"

Hide Details

Got output: Process 51234 stopped * thread #1: tid = 0x375b1, 0x0000000100000f74 a.out`main(argc=1, argv=0x00007ffeefbff878) at main.mm:11:6, queue = 'com.apple.main-thread', stop reason = breakpoint 1.1

Hide Details

Expecting sub string: "stopped" (was found) Expecting sub string: "stop reason = breakpoint" (was found)

Hide Details

Adding tearDown hook: def cleanup(): self.runCmd('type format clear', check=False) self.runCmd('type summary clear', check=False) self.runCmd('type synth clear', check=False)

Hide Details

Hide Details

runCmd: frame variable output: (int) argc = 1 (const char **) argv = 0x00007ffeefbff878 (NSAutoreleasePool *) pool = 0x0000604000001190 (OSType) a = 'test' 'test' (OSType) b = 'best' 'best'

Hide Details

Hide Details

Ran command: "frame variable"

Hide Details

Got output: (int) argc = 1 (const char **) argv = 0x00007ffeefbff878 (NSAutoreleasePool *) pool = 0x0000604000001190 (OSType) a = 'test' 'test' (OSType) b = 'best' 'best'

Hide Details

Expecting sub string: "'test'" (was found) Expecting sub string: "'best'" (was found)

Hide Details

<bound method SBProcess.Kill of <lldb.SBProcess; proxy of <Swig Object of type 'lldb::SBProcess *' at 0x124de7930> >>: success

Hide Details

Executing tearDown hook: def cleanup(): self.runCmd('type format clear', check=False) self.runCmd('type summary clear', check=False) self.runCmd('type synth clear', check=False)

Hide Details

Hide Details

runCmd: type format clear check of return status not required output:

Hide Details

runCmd: type summary clear check of return status not required output:

Hide Details

runCmd: type synth clear check of return status not required output:

Hide Details

PASS: LLDB (/Users/buildslave/jenkins/workspace/lldb-cmake-sanitized/lldb-build/bin/clang-x86_64) :: test_ostype_with_run_command_dsym (TestFormattersOsType.DataFormatterOSTypeTestCase) runCmd: settings clear -all output:

Hide Details

runCmd: settings set symbols.enable-external-lookup false output:

Hide Details

runCmd: settings set target.inherit-tcc true output:

Hide Details

runCmd: settings set target.detach-on-error false output:

Hide Details

runCmd: settings set target.auto-apply-fixits false output:

Hide Details

runCmd: settings set plugin.process.gdb-remote.packet-timeout 60 output:

Hide Details

runCmd: settings set symbols.clang-modules-cache-path "/Users/buildslave/jenkins/workspace/lldb-cmake-sanitized/lldb-build/lldb-test-build.noindex/module-cache-lldb/lldb-api" output:

Hide Details

runCmd: settings set use-color false output:

Hide Details

runCmd: setting set target.prefer-dynamic-value no-dynamic-values output:

Hide Details

runCmd: settings set target.env-vars ASAN_OPTIONS=detect_stack_use_after_return=1 DYLD_INSERT_LIBRARIES=/Users/buildslave/jenkins/workspace/lldb-cmake-sanitized/host-compiler/lib/clang/13.0.99/lib/darwin/libclang_rt.asan_osx_dynamic.dylib output:

Hide Details

runCmd: file /Users/buildslave/jenkins/workspace/lldb-cmake-sanitized/lldb-build/lldb-test-build.noindex/functionalities/data-formatter/ostypeformatting/TestFormattersOsType.test_ostype_with_run_command_dwarf/a.out output: Current executable set to '/Users/buildslave/jenkins/workspace/lldb-cmake-sanitized/lldb-build/lldb-test-build.noindex/functionalities/data-formatter/ostypeformatting/TestFormattersOsType.test_ostype_with_run_command_dwarf/a.out' (x86_64).

Hide Details

Hide Details

runCmd: breakpoint set -f "main.mm" -l 11 output: Breakpoint 1: where = a.out`main + 52 at main.mm:11:6, address = 0x0000000100000f74

Hide Details

Hide Details

Expecting pattern: ^Breakpoint (?P<bpno>[0-9]+): (?P<num_locations>[0-9]+) locations\.$ Not matched

Hide Details

Expecting pattern: ^Breakpoint (?P<bpno>[0-9]+): (?P<num_locations>no) locations \(pending\)\. Not matched

Hide Details

Expecting pattern: ^Breakpoint (?P<bpno>[0-9]+): where = (?P<module>.*)`(?P<symbol>[+\-]{0,1}[^+]+)( \+ (?P<offset>[0-9]+)){0,1}( \[inlined\] (?P<inline_symbol>.*)){0,1} at (?P<file>[^:]+):(?P<line_no>[0-9]+)(?P<column>(:[0-9]+)?), address = (?P<address>0x[0-9a-fA-F]+)$ Matched

Hide Details

runCmd: run runCmd failed! error: process exited with status -1 (tried to attach to process already being debugged)

Hide Details

Hide Details

Command 'run' failed!

Hide Details

FAIL: LLDB (/Users/buildslave/jenkins/workspace/lldb-cmake-sanitized/lldb-build/bin/clang-x86_64) :: test_ostype_with_run_command_dwarf (TestFormattersOsType.DataFormatterOSTypeTestCase) <bound method SBProcess.Kill of <lldb.SBProcess; proxy of <Swig Object of type 'lldb::SBProcess *' at 0x10da53d20> >>: success

Hide Details

UNSUPPORTED: LLDB (/Users/buildslave/jenkins/workspace/lldb-cmake-sanitized/lldb-build/bin/clang-x86_64) :: test_ostype_with_run_command_dwo (TestFormattersOsType.DataFormatterOSTypeTestCase) (test case does not fall in any category of interest for this run) runCmd: settings clear -all output:

Hide Details

runCmd: settings set symbols.enable-external-lookup false output:

Hide Details

runCmd: settings set target.inherit-tcc true output:

Hide Details

runCmd: settings set target.detach-on-error false output:

Hide Details

runCmd: settings set target.auto-apply-fixits false output:

Hide Details

runCmd: settings set plugin.process.gdb-remote.packet-timeout 60 output:

Hide Details

runCmd: settings set symbols.clang-modules-cache-path "/Users/buildslave/jenkins/workspace/lldb-cmake-sanitized/lldb-build/lldb-test-build.noindex/module-cache-lldb/lldb-api" output:

Hide Details

runCmd: settings set use-color false output:

Hide Details

runCmd: setting set target.prefer-dynamic-value no-dynamic-values output:

Hide Details

runCmd: settings set target.env-vars ASAN_OPTIONS=detect_stack_use_after_return=1 DYLD_INSERT_LIBRARIES=/Users/buildslave/jenkins/workspace/lldb-cmake-sanitized/host-compiler/lib/clang/13.0.99/lib/darwin/libclang_rt.asan_osx_dynamic.dylib output:

Hide Details

runCmd: file /Users/buildslave/jenkins/workspace/lldb-cmake-sanitized/lldb-build/lldb-test-build.noindex/functionalities/data-formatter/ostypeformatting/TestFormattersOsType.test_ostype_with_run_command_gmodules/a.out output: Current executable set to '/Users/buildslave/jenkins/workspace/lldb-cmake-sanitized/lldb-build/lldb-test-build.noindex/functionalities/data-formatter/ostypeformatting/TestFormattersOsType.test_ostype_with_run_command_gmodules/a.out' (x86_64).

Hide Details

Hide Details

runCmd: breakpoint set -f "main.mm" -l 11 output: Breakpoint 1: where = a.out`main + 52 at main.mm:11:6, address = 0x0000000100000f74

Hide Details

Hide Details

Expecting pattern: ^Breakpoint (?P<bpno>[0-9]+): (?P<num_locations>[0-9]+) locations\.$ Not matched

Hide Details

Expecting pattern: ^Breakpoint (?P<bpno>[0-9]+): (?P<num_locations>no) locations \(pending\)\. Not matched

Hide Details

Expecting pattern: ^Breakpoint (?P<bpno>[0-9]+): where = (?P<module>.*)`(?P<symbol>[+\-]{0,1}[^+]+)( \+ (?P<offset>[0-9]+)){0,1}( \[inlined\] (?P<inline_symbol>.*)){0,1} at (?P<file>[^:]+):(?P<line_no>[0-9]+)(?P<column>(:[0-9]+)?), address = (?P<address>0x[0-9a-fA-F]+)$ Matched

Hide Details

runCmd: run runCmd failed! error: process exited with status -1 (tried to attach to process already being debugged)

Hide Details

Hide Details

Command 'run' failed!

Hide Details

FAIL: LLDB (/Users/buildslave/jenkins/workspace/lldb-cmake-sanitized/lldb-build/bin/clang-x86_64) :: test_ostype_with_run_command_gmodules (TestFormattersOsType.DataFormatterOSTypeTestCase) <bound method SBProcess.Kill of <lldb.SBProcess; proxy of <Swig Object of type 'lldb::SBProcess *' at 0x124606930> >>: success

Hide Details

Restore dir to: /Users/buildslave/jenkins/workspace/lldb-cmake-sanitized/lldb-build/tools/lldb/test ====================================================================== FAIL: test_ostype_with_run_command_dwarf (TestFormattersOsType.DataFormatterOSTypeTestCase) Test the formatters we use for OSType. ---------------------------------------------------------------------- Traceback (most recent call last): File "/Users/buildslave/jenkins/workspace/lldb-cmake-sanitized/llvm-project/lldb/packages/Python/lldbsuite/test/lldbtest.py", line 1830, in test_method return attrvalue(self) File "/Users/buildslave/jenkins/workspace/lldb-cmake-sanitized/llvm-project/lldb/test/API/functionalities/data-formatter/ostypeformatting/TestFormattersOsType.py", line 32, in test_ostype_with_run_command self.runCmd("run", RUN_SUCCEEDED) File "/Users/buildslave/jenkins/workspace/lldb-cmake-sanitized/llvm-project/lldb/packages/Python/lldbsuite/test/lldbtest.py", line 2161, in runCmd msg if (msg) else CMD_MSG(cmd)) AssertionError: False is not True : Process is launched successfully Error output: error: process exited with status -1 (tried to attach to process already being debugged)

Hide Details

Config=x86_64-/Users/buildslave/jenkins/workspace/lldb-cmake-sanitized/lldb-build/bin/clang ====================================================================== FAIL: test_ostype_with_run_command_gmodules (TestFormattersOsType.DataFormatterOSTypeTestCase) Test the formatters we use for OSType. ---------------------------------------------------------------------- Traceback (most recent call last): File "/Users/buildslave/jenkins/workspace/lldb-cmake-sanitized/llvm-project/lldb/packages/Python/lldbsuite/test/lldbtest.py", line 1830, in test_method return attrvalue(self) File "/Users/buildslave/jenkins/workspace/lldb-cmake-sanitized/llvm-project/lldb/test/API/functionalities/data-formatter/ostypeformatting/TestFormattersOsType.py", line 32, in test_ostype_with_run_command self.runCmd("run", RUN_SUCCEEDED) File "/Users/buildslave/jenkins/workspace/lldb-cmake-sanitized/llvm-project/lldb/packages/Python/lldbsuite/test/lldbtest.py", line 2161, in runCmd msg if (msg) else CMD_MSG(cmd)) AssertionError: False is not True : Process is launched successfully Error output: error: process exited with status -1 (tried to attach to process already being debugged)

Hide Details

Config=x86_64-/Users/buildslave/jenkins/workspace/lldb-cmake-sanitized/lldb-build/bin/clang ---------------------------------------------------------------------- Ran 4 tests in 84.266s

Hide Details

RESULT: FAILED (1 passes, 2 failures, 0 errors, 1 skipped, 0 expected failures, 0 unexpected successes)

Hide Details

--

Hide Details

******************** PASS: lldb-unit :: Language/Highlighting/./HighlighterTests/HighlighterTest.ClangTrailingBackslashWithWhitespace (1645 of 2332) FAIL: lldb-shell :: Commands/command-script-import.test (1646 of 2332) ******************** TEST 'lldb-shell :: Commands/command-script-import.test' FAILED ******************** Script: -- : 'RUN: at line 2'; echo 'b main' > /Users/buildslave/jenkins/workspace/lldb-cmake-sanitized/lldb-build/tools/lldb/test/Shell/Commands/Output/command-script-import.test.tmp.in : 'RUN: at line 3'; echo 'run' >> /Users/buildslave/jenkins/workspace/lldb-cmake-sanitized/lldb-build/tools/lldb/test/Shell/Commands/Output/command-script-import.test.tmp.in : 'RUN: at line 4'; echo 'command script import /Users/buildslave/jenkins/workspace/lldb-cmake-sanitized/llvm-project/lldb/test/Shell/Commands/Inputs/frame.py' >> /Users/buildslave/jenkins/workspace/lldb-cmake-sanitized/lldb-build/tools/lldb/test/Shell/Commands/Output/command-script-import.test.tmp.in : 'RUN: at line 6'; /Users/buildslave/jenkins/workspace/lldb-cmake-sanitized/lldb-build/bin/clang --target=specify-a-target-or-use-a-_host-substitution --target=x86_64-apple-darwin19.5.0 -isysroot /Applications/Xcode.app/Contents/Developer/Platforms/MacOSX.platform/Developer/SDKs/MacOSX.sdk -fmodules-cache-path=/Users/buildslave/jenkins/workspace/lldb-cmake-sanitized/lldb-build/lldb-test-build.noindex/module-cache-clang/lldb-shell -g -O0 /Users/buildslave/jenkins/workspace/lldb-cmake-sanitized/llvm-project/lldb/test/Shell/Commands/Inputs/main.c -o /Users/buildslave/jenkins/workspace/lldb-cmake-sanitized/lldb-build/tools/lldb/test/Shell/Commands/Output/command-script-import.test.tmp.out : 'RUN: at line 7'; /Users/buildslave/jenkins/workspace/lldb-cmake-sanitized/lldb-build/bin/lldb --no-lldbinit -S /Users/buildslave/jenkins/workspace/lldb-cmake-sanitized/lldb-build/tools/lldb/test/Shell/lit-lldb-init -b -s /Users/buildslave/jenkins/workspace/lldb-cmake-sanitized/lldb-build/tools/lldb/test/Shell/Commands/Output/command-script-import.test.tmp.in -o 'script print("script: {}".format(lldb.frame))' /Users/buildslave/jenkins/workspace/lldb-cmake-sanitized/lldb-build/tools/lldb/test/Shell/Commands/Output/command-script-import.test.tmp.out | /Users/buildslave/jenkins/workspace/lldb-cmake-sanitized/lldb-build/bin/FileCheck /Users/buildslave/jenkins/workspace/lldb-cmake-sanitized/llvm-project/lldb/test/Shell/Commands/command-script-import.test -- Exit Code: 1

Hide Details

Command Output (stderr): -- clang-13: warning: argument unused during compilation: '-fmodules-cache-path=/Users/buildslave/jenkins/workspace/lldb-cmake-sanitized/lldb-build/lldb-test-build.noindex/module-cache-clang/lldb-shell' [-Wunused-command-line-argument] error: process exited with status -1 (tried to attach to process already being debugged) /Users/buildslave/jenkins/workspace/lldb-cmake-sanitized/llvm-project/lldb/test/Shell/Commands/command-script-import.test:10:10: error: CHECK: expected string not found in input # CHECK: frame.py: None ^ <stdin>:1:1: note: scanning from here (lldb) command source -s 0 '/Users/buildslave/jenkins/workspace/lldb-cmake-sanitized/lldb-build/tools/lldb/test/Shell/lit-lldb-init' ^ <stdin>:18:46: note: possible intended match here (lldb) script print("script: {}".format(lldb.frame)) ^

Hide Details

Input file: <stdin> Check file: /Users/buildslave/jenkins/workspace/lldb-cmake-sanitized/llvm-project/lldb/test/Shell/Commands/command-script-import.test

Hide Details

-dump-input=help explains the following input dump.

Hide Details

Input was: <<<<<< 1: (lldb) command source -s 0 '/Users/buildslave/jenkins/workspace/lldb-cmake-sanitized/lldb-build/tools/lldb/test/Shell/lit-lldb-init' check:10'0 X~~~~~~~~~~~~~~~~~~~~~~~~~~~~~~~~~~~~~~~~~~~~~~~~~~~~~~~~~~~~~~~~~~~~~~~~~~~~~~~~~~~~~~~~~~~~~~~~~~~~~~~~~~~~~~~~~~~~~~~~~~~~~~~~~~~~ error: no match found 2: Executing commands in '/Users/buildslave/jenkins/workspace/lldb-cmake-sanitized/lldb-build/tools/lldb/test/Shell/lit-lldb-init'. check:10'0 ~~~~~~~~~~~~~~~~~~~~~~~~~~~~~~~~~~~~~~~~~~~~~~~~~~~~~~~~~~~~~~~~~~~~~~~~~~~~~~~~~~~~~~~~~~~~~~~~~~~~~~~~~~~~~~~~~~~~~~~~~~~~~~~~~ 3: (lldb) # LLDB init file for the LIT tests. check:10'0 ~~~~~~~~~~~~~~~~~~~~~~~~~~~~~~~~~~~~~~~~~~~ 4: (lldb) settings set symbols.enable-external-lookup false check:10'0 ~~~~~~~~~~~~~~~~~~~~~~~~~~~~~~~~~~~~~~~~~~~~~~~~~~~~~~~~~ 5: (lldb) settings set plugin.process.gdb-remote.packet-timeout 60 check:10'0 ~~~~~~~~~~~~~~~~~~~~~~~~~~~~~~~~~~~~~~~~~~~~~~~~~~~~~~~~~~~~~~~~ 6: (lldb) settings set interpreter.echo-comment-commands false check:10'0 ~~~~~~~~~~~~~~~~~~~~~~~~~~~~~~~~~~~~~~~~~~~~~~~~~~~~~~~~~~~~ . . . 13: (lldb) command source -s 0 '/Users/buildslave/jenkins/workspace/lldb-cmake-sanitized/lldb-build/tools/lldb/test/Shell/Commands/Output/command-script-import.test.tmp.in' check:10'0 ~~~~~~~~~~~~~~~~~~~~~~~~~~~~~~~~~~~~~~~~~~~~~~~~~~~~~~~~~~~~~~~~~~~~~~~~~~~~~~~~~~~~~~~~~~~~~~~~~~~~~~~~~~~~~~~~~~~~~~~~~~~~~~~~~~~~~~~~~~~~~~~~~~~~~~~~~~~~~~~~~~~~~~~~~ 14: Executing commands in '/Users/buildslave/jenkins/workspace/lldb-cmake-sanitized/lldb-build/tools/lldb/test/Shell/Commands/Output/command-script-import.test.tmp.in'. check:10'0 ~~~~~~~~~~~~~~~~~~~~~~~~~~~~~~~~~~~~~~~~~~~~~~~~~~~~~~~~~~~~~~~~~~~~~~~~~~~~~~~~~~~~~~~~~~~~~~~~~~~~~~~~~~~~~~~~~~~~~~~~~~~~~~~~~~~~~~~~~~~~~~~~~~~~~~~~~~~~~~~~~~~~~ 15: (lldb) b main check:10'0 ~~~~~~~~~~~~~~ 16: Breakpoint 1: where = command-script-import.test.tmp.out`main + 15 at main.c:2:21, address = 0x0000000100000f9f check:10'0 ~~~~~~~~~~~~~~~~~~~~~~~~~~~~~~~~~~~~~~~~~~~~~~~~~~~~~~~~~~~~~~~~~~~~~~~~~~~~~~~~~~~~~~~~~~~~~~~~~~~~~~~~~~~~~~~~ 17: (lldb) run check:10'0 ~~~~~~~~~~~ 18: (lldb) script print("script: {}".format(lldb.frame)) check:10'0 ~~~~~~~~~~~~~~~~~~~~~~~~~~~~~~~~~~~~~~~~~~~~~~~~~~~~~ check:10'1 ? possible intended match 19: script: No value check:10'0 ~~~~~~~~~~~~~~~~~ >>>>>>

Hide Details

--

Hide Details

******************** UNSUPPORTED: lldb-api :: functionalities/tty/TestTerminal.py (1647 of 2332) PASS: lldb-unit :: Editline/./EditlineTests/EditlineTestFixture.EditlineReceivesMultiLineText (1648 of 2332) PASS: lldb-api :: python_api/lldbutil/process/TestPrintStackTraces.py (1649 of 2332) PASS: lldb-api :: commands/breakpoint/set/func-regex/TestBreakpointRegexError.py (1650 of 2332) PASS: lldb-unit :: Symbol/./SymbolTests/SymbolsTest.LocateExecutableSymbolFileForUnknownExecutableAndMissingSymbolFile (1651 of 2332) FAIL: lldb-api :: lang/c/array_types/TestArrayTypes.py (1652 of 2332) ******************** TEST 'lldb-api :: lang/c/array_types/TestArrayTypes.py' FAILED ******************** Script: -- /Users/buildslave/jenkins/workspace/lldb-cmake-sanitized/lldb-build/lldb-test-build.noindex/copied-python /Users/buildslave/jenkins/workspace/lldb-cmake-sanitized/llvm-project/lldb/test/API/dotest.py -u CXXFLAGS -u CFLAGS --codesign-identity lldb_codesign --arch x86_64 --build-dir /Users/buildslave/jenkins/workspace/lldb-cmake-sanitized/lldb-build/lldb-test-build.noindex -t --env TERM=vt100 --env LLVM_LIBS_DIR=/Users/buildslave/jenkins/workspace/lldb-cmake-sanitized/lldb-build/./lib --inferior-env ASAN_OPTIONS=detect_stack_use_after_return=1 --inferior-env DYLD_INSERT_LIBRARIES=/Users/buildslave/jenkins/workspace/lldb-cmake-sanitized/host-compiler/lib/clang/13.0.99/lib/darwin/libclang_rt.asan_osx_dynamic.dylib --arch x86_64 --build-dir /Users/buildslave/jenkins/workspace/lldb-cmake-sanitized/lldb-build/lldb-test-build.noindex --lldb-module-cache-dir /Users/buildslave/jenkins/workspace/lldb-cmake-sanitized/lldb-build/lldb-test-build.noindex/module-cache-lldb/lldb-api --clang-module-cache-dir /Users/buildslave/jenkins/workspace/lldb-cmake-sanitized/lldb-build/lldb-test-build.noindex/module-cache-clang/lldb-api --executable /Users/buildslave/jenkins/workspace/lldb-cmake-sanitized/lldb-build/./bin/lldb --compiler /Users/buildslave/jenkins/workspace/lldb-cmake-sanitized/lldb-build/./bin/clang --dsymutil /Users/buildslave/jenkins/workspace/lldb-cmake-sanitized/lldb-build/./bin/dsymutil --llvm-tools-dir /Users/buildslave/jenkins/workspace/lldb-cmake-sanitized/lldb-build/./bin --lldb-libs-dir /Users/buildslave/jenkins/workspace/lldb-cmake-sanitized/lldb-build/./lib /Users/buildslave/jenkins/workspace/lldb-cmake-sanitized/llvm-project/lldb/test/API/lang/c/array_types -p TestArrayTypes.py -- Exit Code: 1

Hide Details

Command Output (stdout): -- lldb version 13.0.99 (http://labmaster3.local/git/llvm-project.git revision 9625d61eb66c12388875e081b63ebed7e42c6bbb) clang revision 9625d61eb66c12388875e081b63ebed7e42c6bbb llvm revision 9625d61eb66c12388875e081b63ebed7e42c6bbb Skipping the following test categories: ['darwin-log', 'libstdcxx', 'dwo', 'llgs', 'fork']

Hide Details

-- Command Output (stderr): -- Change dir to: /Users/buildslave/jenkins/workspace/lldb-cmake-sanitized/llvm-project/lldb/test/API/lang/c/array_types runCmd: settings clear -all output:

Hide Details

runCmd: settings set symbols.enable-external-lookup false output:

Hide Details

runCmd: settings set target.inherit-tcc true output:

Hide Details

runCmd: settings set target.detach-on-error false output:

Hide Details

runCmd: settings set target.auto-apply-fixits false output:

Hide Details

runCmd: settings set plugin.process.gdb-remote.packet-timeout 60 output:

Hide Details

runCmd: settings set symbols.clang-modules-cache-path "/Users/buildslave/jenkins/workspace/lldb-cmake-sanitized/lldb-build/lldb-test-build.noindex/module-cache-lldb/lldb-api" output:

Hide Details

runCmd: settings set use-color false output:

Hide Details

runCmd: setting set target.prefer-dynamic-value no-dynamic-values output:

Hide Details

runCmd: settings set target.env-vars ASAN_OPTIONS=detect_stack_use_after_return=1 DYLD_INSERT_LIBRARIES=/Users/buildslave/jenkins/workspace/lldb-cmake-sanitized/host-compiler/lib/clang/13.0.99/lib/darwin/libclang_rt.asan_osx_dynamic.dylib output:

Hide Details

looking at: SBBreakpoint: id = 1, file = 'main.c', line = 34, exact_match = 0, locations = 1

Hide Details

Checking string: "SBBreakpoint: id = 1, file = 'main.c', line = 34, exact_match = 0, locations = 1"

Hide Details

Expecting sub string: "file = 'main.c'" (was found) Expecting sub string: "line = 34" (was found) Expecting sub string: "locations = 1" (was found)

Hide Details

looking at: SBBreakpoint: id = 1, file = 'main.c', line = 34, exact_match = 0, locations = 1

Hide Details

Checking string: "SBBreakpoint: id = 1, file = 'main.c', line = 34, exact_match = 0, locations = 1"

Hide Details

Not expecting sub string: "resolved = 1" (was not found)

Hide Details

looking at: SBProcess: pid = 51430, state = exited, threads = 0, executable = a.out

Hide Details

Checking string: "SBProcess: pid = 51430, state = exited, threads = 0, executable = a.out"

Hide Details

Expecting sub string: "state = stopped" (was not found) Process looks good

Hide Details

FAIL: LLDB (/Users/buildslave/jenkins/workspace/lldb-cmake-sanitized/lldb-build/bin/clang-x86_64) :: test_and_python_api_dsym (TestArrayTypes.ArrayTypesTestCase) <bound method SBProcess.Kill of <lldb.SBProcess; proxy of <Swig Object of type 'lldb::SBProcess *' at 0x10bc83630> >>: success

Hide Details

runCmd: settings clear -all output:

Hide Details

runCmd: settings set symbols.enable-external-lookup false output:

Hide Details

runCmd: settings set target.inherit-tcc true output:

Hide Details

runCmd: settings set target.detach-on-error false output:

Hide Details

runCmd: settings set target.auto-apply-fixits false output:

Hide Details

runCmd: settings set plugin.process.gdb-remote.packet-timeout 60 output:

Hide Details

runCmd: settings set symbols.clang-modules-cache-path "/Users/buildslave/jenkins/workspace/lldb-cmake-sanitized/lldb-build/lldb-test-build.noindex/module-cache-lldb/lldb-api" output:

Hide Details

runCmd: settings set use-color false output:

Hide Details

runCmd: setting set target.prefer-dynamic-value no-dynamic-values output:

Hide Details

runCmd: settings set target.env-vars ASAN_OPTIONS=detect_stack_use_after_return=1 DYLD_INSERT_LIBRARIES=/Users/buildslave/jenkins/workspace/lldb-cmake-sanitized/host-compiler/lib/clang/13.0.99/lib/darwin/libclang_rt.asan_osx_dynamic.dylib output:

Hide Details

looking at: SBBreakpoint: id = 1, file = 'main.c', line = 34, exact_match = 0, locations = 1

Hide Details

Checking string: "SBBreakpoint: id = 1, file = 'main.c', line = 34, exact_match = 0, locations = 1"

Hide Details

Expecting sub string: "file = 'main.c'" (was found) Expecting sub string: "line = 34" (was found) Expecting sub string: "locations = 1" (was found)

Hide Details

looking at: SBBreakpoint: id = 1, file = 'main.c', line = 34, exact_match = 0, locations = 1

Hide Details

Checking string: "SBBreakpoint: id = 1, file = 'main.c', line = 34, exact_match = 0, locations = 1"

Hide Details

Not expecting sub string: "resolved = 1" (was not found)

Hide Details

looking at: SBProcess: pid = 51495, state = stopped, threads = 1, executable = a.out

Hide Details

Checking string: "SBProcess: pid = 51495, state = stopped, threads = 1, executable = a.out"

Hide Details

Expecting sub string: "state = stopped" (was found) Expecting sub string: "executable = a.out" (was found)

Hide Details

looking at: thread #1: tid = 0x379d7, 0x0000000100000e0f a.out`main(argc=1, argv=0x00007ffeefbff8d8) at main.c:34:22, queue = 'com.apple.main-thread', stop reason = breakpoint 1.1

Hide Details

Checking string: "thread #1: tid = 0x379d7, 0x0000000100000e0f a.out`main(argc=1, argv=0x00007ffeefbff8d8) at main.c:34:22, queue = 'com.apple.main-thread', stop reason = breakpoint 1.1"

Hide Details

Expecting sub string: "tid = 0x379d7" (was found)

Hide Details

looking at: SBBreakpoint: id = 1, file = 'main.c', line = 34, exact_match = 0, locations = 1

Hide Details

Checking string: "SBBreakpoint: id = 1, file = 'main.c', line = 34, exact_match = 0, locations = 1"

Hide Details

Expecting sub string: "file = 'main.c'" (was found) Expecting sub string: "line = 34" (was found) Expecting sub string: "locations = 1" (was found)

Hide Details

looking at: frame #0: 0x0000000100000e0f a.out`main(argc=1, argv=0x00007ffeefbff8d8) at main.c:34:22

Hide Details

Checking string: "frame #0: 0x0000000100000e0f a.out`main(argc=1, argv=0x00007ffeefbff8d8) at main.c:34:22"

Hide Details

Expecting sub string: "#0" (was found)

Hide Details

looking at: (char *[4]) strings = ([0] = "Hello", [1] = "Hola", [2] = "Bonjour", [3] = "Guten Tag")

Hide Details

Checking string: "(char *[4]) strings = ([0] = "Hello", [1] = "Hola", [2] = "Bonjour", [3] = "Guten Tag")"

Hide Details

Expecting sub string: "strings" (was found)

Hide Details

strings: TypeName -> char *[4] ByteSize -> 32 NumChildren -> 4 Value -> None ValueAsUnsigned -> 0 ValueType -> local_variable Summary -> None IsPointerType -> False Location -> 0x00007ffeefbff870 [3]: TypeName -> char * ByteSize -> 8 NumChildren -> 1 Value -> 0x0000000100000fa7 ValueAsUnsigned -> 4294971303 ValueType -> local_variable Summary -> "Guten Tag" IsPointerType -> True Location -> 0x00007ffeefbff888 char_16: TypeName -> char [16] ByteSize -> 16 NumChildren -> 16 Value -> None ValueAsUnsigned -> 0 ValueType -> local_variable Summary -> "Hello World\n" IsPointerType -> False Location -> 0x00007ffeefbff890 ushort_matrix: TypeName -> unsigned short [2][3] ByteSize -> 12 NumChildren -> 2 Value -> None ValueAsUnsigned -> 0 ValueType -> local_variable Summary -> None IsPointerType -> False Location -> 0x00007ffeefbff834 [0]: TypeName -> unsigned short [3] ByteSize -> 6 NumChildren -> 3 Value -> None ValueAsUnsigned -> 0 ValueType -> local_variable Summary -> None IsPointerType -> False Location -> 0x00007ffeefbff834 [2]: TypeName -> unsigned short ByteSize -> 2 NumChildren -> 0 Value -> 3 ValueAsUnsigned -> 3 ValueType -> local_variable Summary -> None IsPointerType -> False Location -> 0x00007ffeefbff838 long_6: TypeName -> long [6] ByteSize -> 48 NumChildren -> 6 Value -> None ValueAsUnsigned -> 0 ValueType -> local_variable Summary -> None IsPointerType -> False Location -> 0x00007ffeefbff7f0 [5]: TypeName -> long ByteSize -> 8 NumChildren -> 0 Value -> 6 ValueAsUnsigned -> 6 ValueType -> local_variable Summary -> None IsPointerType -> False Location -> 0x00007ffeefbff818 argc: TypeName -> int ByteSize -> 4 NumChildren -> 0 Value -> 1 ValueAsUnsigned -> 1 ValueType -> argument_variable Summary -> None IsPointerType -> False Location -> 0x00007ffeefbff748 <bound method SBProcess.Kill of <lldb.SBProcess; proxy of <Swig Object of type 'lldb::SBProcess *' at 0x10af2cd20> >>: success

Hide Details

PASS: LLDB (/Users/buildslave/jenkins/workspace/lldb-cmake-sanitized/lldb-build/bin/clang-x86_64) :: test_and_python_api_dwarf (TestArrayTypes.ArrayTypesTestCase) UNSUPPORTED: LLDB (/Users/buildslave/jenkins/workspace/lldb-cmake-sanitized/lldb-build/bin/clang-x86_64) :: test_and_python_api_dwo (TestArrayTypes.ArrayTypesTestCase) (test case does not fall in any category of interest for this run) runCmd: settings clear -all output:

Hide Details

runCmd: settings set symbols.enable-external-lookup false output:

Hide Details

runCmd: settings set target.inherit-tcc true output:

Hide Details

runCmd: settings set target.detach-on-error false output:

Hide Details

runCmd: settings set target.auto-apply-fixits false output:

Hide Details

runCmd: settings set plugin.process.gdb-remote.packet-timeout 60 output:

Hide Details

runCmd: settings set symbols.clang-modules-cache-path "/Users/buildslave/jenkins/workspace/lldb-cmake-sanitized/lldb-build/lldb-test-build.noindex/module-cache-lldb/lldb-api" output:

Hide Details

runCmd: settings set use-color false output:

Hide Details

runCmd: setting set target.prefer-dynamic-value no-dynamic-values output:

Hide Details

runCmd: settings set target.env-vars ASAN_OPTIONS=detect_stack_use_after_return=1 DYLD_INSERT_LIBRARIES=/Users/buildslave/jenkins/workspace/lldb-cmake-sanitized/host-compiler/lib/clang/13.0.99/lib/darwin/libclang_rt.asan_osx_dynamic.dylib output:

Hide Details

looking at: SBBreakpoint: id = 1, file = 'main.c', line = 34, exact_match = 0, locations = 1

Hide Details

Checking string: "SBBreakpoint: id = 1, file = 'main.c', line = 34, exact_match = 0, locations = 1"

Hide Details

Expecting sub string: "file = 'main.c'" (was found) Expecting sub string: "line = 34" (was found) Expecting sub string: "locations = 1" (was found)

Hide Details

looking at: SBBreakpoint: id = 1, file = 'main.c', line = 34, exact_match = 0, locations = 1

Hide Details

Checking string: "SBBreakpoint: id = 1, file = 'main.c', line = 34, exact_match = 0, locations = 1"

Hide Details

Not expecting sub string: "resolved = 1" (was not found)

Hide Details

looking at: SBProcess: pid = 51569, state = stopped, threads = 1, executable = a.out

Hide Details

Checking string: "SBProcess: pid = 51569, state = stopped, threads = 1, executable = a.out"

Hide Details

Expecting sub string: "state = stopped" (was found) Expecting sub string: "executable = a.out" (was found)

Hide Details

looking at: thread #1: tid = 0x37b3a, 0x0000000100000e0f a.out`main(argc=1, argv=0x00007ffeefbff8c8) at main.c:34:22, queue = 'com.apple.main-thread', stop reason = breakpoint 1.1

Hide Details

Checking string: "thread #1: tid = 0x37b3a, 0x0000000100000e0f a.out`main(argc=1, argv=0x00007ffeefbff8c8) at main.c:34:22, queue = 'com.apple.main-thread', stop reason = breakpoint 1.1"

Hide Details

Expecting sub string: "tid = 0x37b3a" (was found)

Hide Details

looking at: SBBreakpoint: id = 1, file = 'main.c', line = 34, exact_match = 0, locations = 1

Hide Details

Checking string: "SBBreakpoint: id = 1, file = 'main.c', line = 34, exact_match = 0, locations = 1"

Hide Details

Expecting sub string: "file = 'main.c'" (was found) Expecting sub string: "line = 34" (was found) Expecting sub string: "locations = 1" (was found)

Hide Details

looking at: frame #0: 0x0000000100000e0f a.out`main(argc=1, argv=0x00007ffeefbff8c8) at main.c:34:22

Hide Details

Checking string: "frame #0: 0x0000000100000e0f a.out`main(argc=1, argv=0x00007ffeefbff8c8) at main.c:34:22"

Hide Details

Expecting sub string: "#0" (was found)

Hide Details

looking at: (char *[4]) strings = ([0] = "Hello", [1] = "Hola", [2] = "Bonjour", [3] = "Guten Tag")

Hide Details

Checking string: "(char *[4]) strings = ([0] = "Hello", [1] = "Hola", [2] = "Bonjour", [3] = "Guten Tag")"

Hide Details

Expecting sub string: "strings" (was found)

Hide Details

strings: TypeName -> char *[4] ByteSize -> 32 NumChildren -> 4 Value -> None ValueAsUnsigned -> 0 ValueType -> local_variable Summary -> None IsPointerType -> False Location -> 0x00007ffeefbff860 [3]: TypeName -> char * ByteSize -> 8 NumChildren -> 1 Value -> 0x0000000100000fa7 ValueAsUnsigned -> 4294971303 ValueType -> local_variable Summary -> "Guten Tag" IsPointerType -> True Location -> 0x00007ffeefbff878 char_16: TypeName -> char [16] ByteSize -> 16 NumChildren -> 16 Value -> None ValueAsUnsigned -> 0 ValueType -> local_variable Summary -> "Hello World\n" IsPointerType -> False Location -> 0x00007ffeefbff880 ushort_matrix: TypeName -> unsigned short [2][3] ByteSize -> 12 NumChildren -> 2 Value -> None ValueAsUnsigned -> 0 ValueType -> local_variable Summary -> None IsPointerType -> False Location -> 0x00007ffeefbff824 [0]: TypeName -> unsigned short [3] ByteSize -> 6 NumChildren -> 3 Value -> None ValueAsUnsigned -> 0 ValueType -> local_variable Summary -> None IsPointerType -> False Location -> 0x00007ffeefbff824 [2]: TypeName -> unsigned short ByteSize -> 2 NumChildren -> 0 Value -> 3 ValueAsUnsigned -> 3 ValueType -> local_variable Summary -> None IsPointerType -> False Location -> 0x00007ffeefbff828 long_6: TypeName -> long [6] ByteSize -> 48 NumChildren -> 6 Value -> None ValueAsUnsigned -> 0 ValueType -> local_variable Summary -> None IsPointerType -> False Location -> 0x00007ffeefbff7e0 [5]: TypeName -> long ByteSize -> 8 NumChildren -> 0 Value -> 6 ValueAsUnsigned -> 6 ValueType -> local_variable Summary -> None IsPointerType -> False Location -> 0x00007ffeefbff808 argc: TypeName -> int ByteSize -> 4 NumChildren -> 0 Value -> 1 ValueAsUnsigned -> 1 ValueType -> argument_variable Summary -> None IsPointerType -> False Location -> 0x00007ffeefbff738 <bound method SBProcess.Kill of <lldb.SBProcess; proxy of <Swig Object of type 'lldb::SBProcess *' at 0x10bc83b40> >>: success

Hide Details

PASS: LLDB (/Users/buildslave/jenkins/workspace/lldb-cmake-sanitized/lldb-build/bin/clang-x86_64) :: test_and_python_api_gmodules (TestArrayTypes.ArrayTypesTestCase) runCmd: settings clear -all output:

Hide Details

runCmd: settings set symbols.enable-external-lookup false output:

Hide Details

runCmd: settings set target.inherit-tcc true output:

Hide Details

runCmd: settings set target.detach-on-error false output:

Hide Details

runCmd: settings set target.auto-apply-fixits false output:

Hide Details

runCmd: settings set plugin.process.gdb-remote.packet-timeout 60 output:

Hide Details

runCmd: settings set symbols.clang-modules-cache-path "/Users/buildslave/jenkins/workspace/lldb-cmake-sanitized/lldb-build/lldb-test-build.noindex/module-cache-lldb/lldb-api" output:

Hide Details

runCmd: settings set use-color false output:

Hide Details

runCmd: setting set target.prefer-dynamic-value no-dynamic-values output:

Hide Details

runCmd: settings set target.env-vars ASAN_OPTIONS=detect_stack_use_after_return=1 DYLD_INSERT_LIBRARIES=/Users/buildslave/jenkins/workspace/lldb-cmake-sanitized/host-compiler/lib/clang/13.0.99/lib/darwin/libclang_rt.asan_osx_dynamic.dylib output:

Hide Details

runCmd: file /Users/buildslave/jenkins/workspace/lldb-cmake-sanitized/lldb-build/lldb-test-build.noindex/lang/c/array_types/TestArrayTypes.test_and_run_command_dsym/a.out output: Current executable set to '/Users/buildslave/jenkins/workspace/lldb-cmake-sanitized/lldb-build/lldb-test-build.noindex/lang/c/array_types/TestArrayTypes.test_and_run_command_dsym/a.out' (x86_64).

Hide Details

Hide Details

runCmd: breakpoint set -f "main.c" -l 34 output: Breakpoint 1: where = a.out`main + 447 at main.c:34:22, address = 0x0000000100000e0f

Hide Details

Hide Details

Expecting pattern: ^Breakpoint (?P<bpno>[0-9]+): (?P<num_locations>[0-9]+) locations\.$ Not matched

Hide Details

Expecting pattern: ^Breakpoint (?P<bpno>[0-9]+): (?P<num_locations>no) locations \(pending\)\. Not matched

Hide Details

Expecting pattern: ^Breakpoint (?P<bpno>[0-9]+): where = (?P<module>.*)`(?P<symbol>[+\-]{0,1}[^+]+)( \+ (?P<offset>[0-9]+)){0,1}( \[inlined\] (?P<inline_symbol>.*)){0,1} at (?P<file>[^:]+):(?P<line_no>[0-9]+)(?P<column>(:[0-9]+)?), address = (?P<address>0x[0-9a-fA-F]+)$ Matched

Hide Details

runCmd: run output: Process 51611 stopped * thread #1, queue = 'com.apple.main-thread', stop reason = breakpoint 1.1 frame #0: 0x0000000100000e0f a.out`main(argc=1, argv=0x00007ffeefbff8d8) at main.c:34:22 31 {1,2}, 32 {3,4} 33 }; -> 34 struct point_tag points_2_4_matrix[2][4] = { // Set break point at this line. ^ 35 {{ 1, 2}, { 3, 4}, { 5, 6}, { 7, 8}}, 36 {{11,22}, {33,44}, {55,66}, {77,88}} 37 }; Process 51611 launched: '/Users/buildslave/jenkins/workspace/lldb-cmake-sanitized/lldb-build/lldb-test-build.noindex/lang/c/array_types/TestArrayTypes.test_and_run_command_dsym/a.out' (x86_64)

Hide Details

Hide Details

runCmd: process status output: Process 51611 stopped * thread #1, queue = 'com.apple.main-thread', stop reason = breakpoint 1.1 frame #0: 0x0000000100000e0f a.out`main(argc=1, argv=0x00007ffeefbff8d8) at main.c:34:22 31 {1,2}, 32 {3,4} 33 }; -> 34 struct point_tag points_2_4_matrix[2][4] = { // Set break point at this line. ^ 35 {{ 1, 2}, { 3, 4}, { 5, 6}, { 7, 8}}, 36 {{11,22}, {33,44}, {55,66}, {77,88}} 37 };

Hide Details

Hide Details

runCmd: thread list output: Process 51611 stopped * thread #1: tid = 0x37bcd, 0x0000000100000e0f a.out`main(argc=1, argv=0x00007ffeefbff8d8) at main.c:34:22, queue = 'com.apple.main-thread', stop reason = breakpoint 1.1

Hide Details

Hide Details

Ran command: "thread list"

Hide Details

Got output: Process 51611 stopped * thread #1: tid = 0x37bcd, 0x0000000100000e0f a.out`main(argc=1, argv=0x00007ffeefbff8d8) at main.c:34:22, queue = 'com.apple.main-thread', stop reason = breakpoint 1.1

Hide Details

Expecting sub string: "stopped" (was found) Expecting sub string: "stop reason = breakpoint" (was found)

Hide Details

runCmd: breakpoint list -f output: Current breakpoints: 1: file = 'main.c', line = 34, exact_match = 0, locations = 1, resolved = 1, hit count = 1 1.1: where = a.out`main + 447 at main.c:34:22, address = 0x0000000100000e0f, resolved, hit count = 1

Hide Details

Hide Details

Hide Details

Ran command: "breakpoint list -f"

Hide Details

Got output: Current breakpoints: 1: file = 'main.c', line = 34, exact_match = 0, locations = 1, resolved = 1, hit count = 1 1.1: where = a.out`main + 447 at main.c:34:22, address = 0x0000000100000e0f, resolved, hit count = 1

Hide Details

Hide Details

Expecting sub string: "resolved, hit count = 1" (was found)

Hide Details

runCmd: frame variable --show-types strings output: (char *[4]) strings = { (char *) [0] = 0x0000000100000f94 "Hello" (char *) [1] = 0x0000000100000f9a "Hola" (char *) [2] = 0x0000000100000f9f "Bonjour" (char *) [3] = 0x0000000100000fa7 "Guten Tag" }

Hide Details

Hide Details

Ran command: "frame variable --show-types strings"

Hide Details

Got output: (char *[4]) strings = { (char *) [0] = 0x0000000100000f94 "Hello" (char *) [1] = 0x0000000100000f9a "Hola" (char *) [2] = 0x0000000100000f9f "Bonjour" (char *) [3] = 0x0000000100000fa7 "Guten Tag" }

Hide Details

Expecting start string: "(char *[4])" (was found) Expecting sub string: "(char *) [0]" (was found) Expecting sub string: "Hello" (was found) Expecting sub string: "(char *) [1]" (was found) Expecting sub string: "Hola" (was found) Expecting sub string: "(char *) [2]" (was found) Expecting sub string: "Bonjour" (was found) Expecting sub string: "(char *) [3]" (was found) Expecting sub string: "Guten Tag" (was found)

Hide Details

runCmd: frame variable --show-types --raw -- char_16 output: (char [16]) char_16 = { (char) [0] = 'H' (char) [1] = 'e' (char) [2] = 'l' (char) [3] = 'l' (char) [4] = 'o' (char) [5] = ' ' (char) [6] = 'W' (char) [7] = 'o' (char) [8] = 'r' (char) [9] = 'l' (char) [10] = 'd' (char) [11] = '\n' (char) [12] = '\0' (char) [13] = '\0' (char) [14] = '\0' (char) [15] = '\0' }

Hide Details

Hide Details

Ran command: "frame variable --show-types --raw -- char_16"

Hide Details

Got output: (char [16]) char_16 = { (char) [0] = 'H' (char) [1] = 'e' (char) [2] = 'l' (char) [3] = 'l' (char) [4] = 'o' (char) [5] = ' ' (char) [6] = 'W' (char) [7] = 'o' (char) [8] = 'r' (char) [9] = 'l' (char) [10] = 'd' (char) [11] = '\n' (char) [12] = '\0' (char) [13] = '\0' (char) [14] = '\0' (char) [15] = '\0' }

Hide Details

Expecting sub string: "(char) [0]" (was found) Expecting sub string: "(char) [15]" (was found)

Hide Details

runCmd: frame variable --show-types ushort_matrix output: (unsigned short [2][3]) ushort_matrix = { (unsigned short [3]) [0] = { (unsigned short) [0] = 1 (unsigned short) [1] = 2 (unsigned short) [2] = 3 } (unsigned short [3]) [1] = { (unsigned short) [0] = 11 (unsigned short) [1] = 22 (unsigned short) [2] = 33 } }

Hide Details

Hide Details

Ran command: "frame variable --show-types ushort_matrix"

Hide Details

Got output: (unsigned short [2][3]) ushort_matrix = { (unsigned short [3]) [0] = { (unsigned short) [0] = 1 (unsigned short) [1] = 2 (unsigned short) [2] = 3 } (unsigned short [3]) [1] = { (unsigned short) [0] = 11 (unsigned short) [1] = 22 (unsigned short) [2] = 33 } }

Hide Details

Expecting start string: "(unsigned short [2][3])" (was found)

Hide Details

runCmd: frame variable --show-types long_6 output: (long [6]) long_6 = { (long) [0] = 1 (long) [1] = 2 (long) [2] = 3 (long) [3] = 4 (long) [4] = 5 (long) [5] = 6 }

Hide Details

Hide Details

Ran command: "frame variable --show-types long_6"

Hide Details

Got output: (long [6]) long_6 = { (long) [0] = 1 (long) [1] = 2 (long) [2] = 3 (long) [3] = 4 (long) [4] = 5 (long) [5] = 6 }

Hide Details

Expecting start string: "(long [6])" (was found)

Hide Details

<bound method SBProcess.Kill of <lldb.SBProcess; proxy of <Swig Object of type 'lldb::SBProcess *' at 0x10af2cc30> >>: success

Hide Details

PASS: LLDB (/Users/buildslave/jenkins/workspace/lldb-cmake-sanitized/lldb-build/bin/clang-x86_64) :: test_and_run_command_dsym (TestArrayTypes.ArrayTypesTestCase) runCmd: settings clear -all output:

Hide Details

runCmd: settings set symbols.enable-external-lookup false output:

Hide Details

runCmd: settings set target.inherit-tcc true output:

Hide Details

runCmd: settings set target.detach-on-error false output:

Hide Details

runCmd: settings set target.auto-apply-fixits false output:

Hide Details

runCmd: settings set plugin.process.gdb-remote.packet-timeout 60 output:

Hide Details

runCmd: settings set symbols.clang-modules-cache-path "/Users/buildslave/jenkins/workspace/lldb-cmake-sanitized/lldb-build/lldb-test-build.noindex/module-cache-lldb/lldb-api" output:

Hide Details

runCmd: settings set use-color false output:

Hide Details

runCmd: setting set target.prefer-dynamic-value no-dynamic-values output:

Hide Details

runCmd: settings set target.env-vars ASAN_OPTIONS=detect_stack_use_after_return=1 DYLD_INSERT_LIBRARIES=/Users/buildslave/jenkins/workspace/lldb-cmake-sanitized/host-compiler/lib/clang/13.0.99/lib/darwin/libclang_rt.asan_osx_dynamic.dylib output:

Hide Details

runCmd: file /Users/buildslave/jenkins/workspace/lldb-cmake-sanitized/lldb-build/lldb-test-build.noindex/lang/c/array_types/TestArrayTypes.test_and_run_command_dwarf/a.out output: Current executable set to '/Users/buildslave/jenkins/workspace/lldb-cmake-sanitized/lldb-build/lldb-test-build.noindex/lang/c/array_types/TestArrayTypes.test_and_run_command_dwarf/a.out' (x86_64).

Hide Details

Hide Details

runCmd: breakpoint set -f "main.c" -l 34 output: Breakpoint 1: where = a.out`main + 447 at main.c:34:22, address = 0x0000000100000e0f

Hide Details

Hide Details

Expecting pattern: ^Breakpoint (?P<bpno>[0-9]+): (?P<num_locations>[0-9]+) locations\.$ Not matched

Hide Details

Expecting pattern: ^Breakpoint (?P<bpno>[0-9]+): (?P<num_locations>no) locations \(pending\)\. Not matched

Hide Details

Expecting pattern: ^Breakpoint (?P<bpno>[0-9]+): where = (?P<module>.*)`(?P<symbol>[+\-]{0,1}[^+]+)( \+ (?P<offset>[0-9]+)){0,1}( \[inlined\] (?P<inline_symbol>.*)){0,1} at (?P<file>[^:]+):(?P<line_no>[0-9]+)(?P<column>(:[0-9]+)?), address = (?P<address>0x[0-9a-fA-F]+)$ Matched

Hide Details

runCmd: run output: Process 51631 stopped * thread #1, queue = 'com.apple.main-thread', stop reason = breakpoint 1.1 frame #0: 0x0000000100000e0f a.out`main(argc=1, argv=0x00007ffeefbff8d0) at main.c:34:22 31 {1,2}, 32 {3,4} 33 }; -> 34 struct point_tag points_2_4_matrix[2][4] = { // Set break point at this line. ^ 35 {{ 1, 2}, { 3, 4}, { 5, 6}, { 7, 8}}, 36 {{11,22}, {33,44}, {55,66}, {77,88}} 37 }; Process 51631 launched: '/Users/buildslave/jenkins/workspace/lldb-cmake-sanitized/lldb-build/lldb-test-build.noindex/lang/c/array_types/TestArrayTypes.test_and_run_command_dwarf/a.out' (x86_64)

Hide Details

Hide Details

runCmd: process status output: Process 51631 stopped * thread #1, queue = 'com.apple.main-thread', stop reason = breakpoint 1.1 frame #0: 0x0000000100000e0f a.out`main(argc=1, argv=0x00007ffeefbff8d0) at main.c:34:22 31 {1,2}, 32 {3,4} 33 }; -> 34 struct point_tag points_2_4_matrix[2][4] = { // Set break point at this line. ^ 35 {{ 1, 2}, { 3, 4}, { 5, 6}, { 7, 8}}, 36 {{11,22}, {33,44}, {55,66}, {77,88}} 37 };

Hide Details

Hide Details

runCmd: thread list output: Process 51631 stopped * thread #1: tid = 0x37c4d, 0x0000000100000e0f a.out`main(argc=1, argv=0x00007ffeefbff8d0) at main.c:34:22, queue = 'com.apple.main-thread', stop reason = breakpoint 1.1

Hide Details

Hide Details

Ran command: "thread list"

Hide Details

Got output: Process 51631 stopped * thread #1: tid = 0x37c4d, 0x0000000100000e0f a.out`main(argc=1, argv=0x00007ffeefbff8d0) at main.c:34:22, queue = 'com.apple.main-thread', stop reason = breakpoint 1.1

Hide Details

Expecting sub string: "stopped" (was found) Expecting sub string: "stop reason = breakpoint" (was found)

Hide Details

runCmd: breakpoint list -f output: Current breakpoints: 1: file = 'main.c', line = 34, exact_match = 0, locations = 1, resolved = 1, hit count = 1 1.1: where = a.out`main + 447 at main.c:34:22, address = 0x0000000100000e0f, resolved, hit count = 1

Hide Details

Hide Details

Hide Details

Ran command: "breakpoint list -f"

Hide Details

Got output: Current breakpoints: 1: file = 'main.c', line = 34, exact_match = 0, locations = 1, resolved = 1, hit count = 1 1.1: where = a.out`main + 447 at main.c:34:22, address = 0x0000000100000e0f, resolved, hit count = 1

Hide Details

Hide Details

Expecting sub string: "resolved, hit count = 1" (was found)

Hide Details

runCmd: frame variable --show-types strings output: (char *[4]) strings = { (char *) [0] = 0x0000000100000f94 "Hello" (char *) [1] = 0x0000000100000f9a "Hola" (char *) [2] = 0x0000000100000f9f "Bonjour" (char *) [3] = 0x0000000100000fa7 "Guten Tag" }

Hide Details

Hide Details

Ran command: "frame variable --show-types strings"

Hide Details

Got output: (char *[4]) strings = { (char *) [0] = 0x0000000100000f94 "Hello" (char *) [1] = 0x0000000100000f9a "Hola" (char *) [2] = 0x0000000100000f9f "Bonjour" (char *) [3] = 0x0000000100000fa7 "Guten Tag" }

Hide Details

Expecting start string: "(char *[4])" (was found) Expecting sub string: "(char *) [0]" (was found) Expecting sub string: "Hello" (was found) Expecting sub string: "(char *) [1]" (was found) Expecting sub string: "Hola" (was found) Expecting sub string: "(char *) [2]" (was found) Expecting sub string: "Bonjour" (was found) Expecting sub string: "(char *) [3]" (was found) Expecting sub string: "Guten Tag" (was found)

Hide Details

runCmd: frame variable --show-types --raw -- char_16 output: (char [16]) char_16 = { (char) [0] = 'H' (char) [1] = 'e' (char) [2] = 'l' (char) [3] = 'l' (char) [4] = 'o' (char) [5] = ' ' (char) [6] = 'W' (char) [7] = 'o' (char) [8] = 'r' (char) [9] = 'l' (char) [10] = 'd' (char) [11] = '\n' (char) [12] = '\0' (char) [13] = '\0' (char) [14] = '\0' (char) [15] = '\0' }

Hide Details

Hide Details

Ran command: "frame variable --show-types --raw -- char_16"

Hide Details

Got output: (char [16]) char_16 = { (char) [0] = 'H' (char) [1] = 'e' (char) [2] = 'l' (char) [3] = 'l' (char) [4] = 'o' (char) [5] = ' ' (char) [6] = 'W' (char) [7] = 'o' (char) [8] = 'r' (char) [9] = 'l' (char) [10] = 'd' (char) [11] = '\n' (char) [12] = '\0' (char) [13] = '\0' (char) [14] = '\0' (char) [15] = '\0' }

Hide Details

Expecting sub string: "(char) [0]" (was found) Expecting sub string: "(char) [15]" (was found)

Hide Details

runCmd: frame variable --show-types ushort_matrix output: (unsigned short [2][3]) ushort_matrix = { (unsigned short [3]) [0] = { (unsigned short) [0] = 1 (unsigned short) [1] = 2 (unsigned short) [2] = 3 } (unsigned short [3]) [1] = { (unsigned short) [0] = 11 (unsigned short) [1] = 22 (unsigned short) [2] = 33 } }

Hide Details

Hide Details

Ran command: "frame variable --show-types ushort_matrix"

Hide Details

Got output: (unsigned short [2][3]) ushort_matrix = { (unsigned short [3]) [0] = { (unsigned short) [0] = 1 (unsigned short) [1] = 2 (unsigned short) [2] = 3 } (unsigned short [3]) [1] = { (unsigned short) [0] = 11 (unsigned short) [1] = 22 (unsigned short) [2] = 33 } }

Hide Details

Expecting start string: "(unsigned short [2][3])" (was found)

Hide Details

runCmd: frame variable --show-types long_6 output: (long [6]) long_6 = { (long) [0] = 1 (long) [1] = 2 (long) [2] = 3 (long) [3] = 4 (long) [4] = 5 (long) [5] = 6 }

Hide Details

Hide Details

Ran command: "frame variable --show-types long_6"

Hide Details

Got output: (long [6]) long_6 = { (long) [0] = 1 (long) [1] = 2 (long) [2] = 3 (long) [3] = 4 (long) [4] = 5 (long) [5] = 6 }

Hide Details

Expecting start string: "(long [6])" (was found)

Hide Details

<bound method SBProcess.Kill of <lldb.SBProcess; proxy of <Swig Object of type 'lldb::SBProcess *' at 0x10bc83630> >>: success

Hide Details

PASS: LLDB (/Users/buildslave/jenkins/workspace/lldb-cmake-sanitized/lldb-build/bin/clang-x86_64) :: test_and_run_command_dwarf (TestArrayTypes.ArrayTypesTestCase) UNSUPPORTED: LLDB (/Users/buildslave/jenkins/workspace/lldb-cmake-sanitized/lldb-build/bin/clang-x86_64) :: test_and_run_command_dwo (TestArrayTypes.ArrayTypesTestCase) (test case does not fall in any category of interest for this run) runCmd: settings clear -all output:

Hide Details

runCmd: settings set symbols.enable-external-lookup false output:

Hide Details

runCmd: settings set target.inherit-tcc true output:

Hide Details

runCmd: settings set target.detach-on-error false output:

Hide Details

runCmd: settings set target.auto-apply-fixits false output:

Hide Details

runCmd: settings set plugin.process.gdb-remote.packet-timeout 60 output:

Hide Details

runCmd: settings set symbols.clang-modules-cache-path "/Users/buildslave/jenkins/workspace/lldb-cmake-sanitized/lldb-build/lldb-test-build.noindex/module-cache-lldb/lldb-api" output:

Hide Details

runCmd: settings set use-color false output:

Hide Details

runCmd: setting set target.prefer-dynamic-value no-dynamic-values output:

Hide Details

runCmd: settings set target.env-vars ASAN_OPTIONS=detect_stack_use_after_return=1 DYLD_INSERT_LIBRARIES=/Users/buildslave/jenkins/workspace/lldb-cmake-sanitized/host-compiler/lib/clang/13.0.99/lib/darwin/libclang_rt.asan_osx_dynamic.dylib output:

Hide Details

runCmd: file /Users/buildslave/jenkins/workspace/lldb-cmake-sanitized/lldb-build/lldb-test-build.noindex/lang/c/array_types/TestArrayTypes.test_and_run_command_gmodules/a.out output: Current executable set to '/Users/buildslave/jenkins/workspace/lldb-cmake-sanitized/lldb-build/lldb-test-build.noindex/lang/c/array_types/TestArrayTypes.test_and_run_command_gmodules/a.out' (x86_64).

Hide Details

Hide Details

runCmd: breakpoint set -f "main.c" -l 34 output: Breakpoint 1: where = a.out`main + 447 at main.c:34:22, address = 0x0000000100000e0f

Hide Details

Hide Details

Expecting pattern: ^Breakpoint (?P<bpno>[0-9]+): (?P<num_locations>[0-9]+) locations\.$ Not matched

Hide Details

Expecting pattern: ^Breakpoint (?P<bpno>[0-9]+): (?P<num_locations>no) locations \(pending\)\. Not matched

Hide Details

Expecting pattern: ^Breakpoint (?P<bpno>[0-9]+): where = (?P<module>.*)`(?P<symbol>[+\-]{0,1}[^+]+)( \+ (?P<offset>[0-9]+)){0,1}( \[inlined\] (?P<inline_symbol>.*)){0,1} at (?P<file>[^:]+):(?P<line_no>[0-9]+)(?P<column>(:[0-9]+)?), address = (?P<address>0x[0-9a-fA-F]+)$ Matched

Hide Details

runCmd: run output: Process 51658 stopped * thread #1, queue = 'com.apple.main-thread', stop reason = breakpoint 1.1 frame #0: 0x0000000100000e0f a.out`main(argc=1, argv=0x00007ffeefbff8c8) at main.c:34:22 31 {1,2}, 32 {3,4} 33 }; -> 34 struct point_tag points_2_4_matrix[2][4] = { // Set break point at this line. ^ 35 {{ 1, 2}, { 3, 4}, { 5, 6}, { 7, 8}}, 36 {{11,22}, {33,44}, {55,66}, {77,88}} 37 }; Process 51658 launched: '/Users/buildslave/jenkins/workspace/lldb-cmake-sanitized/lldb-build/lldb-test-build.noindex/lang/c/array_types/TestArrayTypes.test_and_run_command_gmodules/a.out' (x86_64)

Hide Details

Hide Details

runCmd: process status output: Process 51658 stopped * thread #1, queue = 'com.apple.main-thread', stop reason = breakpoint 1.1 frame #0: 0x0000000100000e0f a.out`main(argc=1, argv=0x00007ffeefbff8c8) at main.c:34:22 31 {1,2}, 32 {3,4} 33 }; -> 34 struct point_tag points_2_4_matrix[2][4] = { // Set break point at this line. ^ 35 {{ 1, 2}, { 3, 4}, { 5, 6}, { 7, 8}}, 36 {{11,22}, {33,44}, {55,66}, {77,88}} 37 };

Hide Details

Hide Details

runCmd: thread list output: Process 51658 stopped * thread #1: tid = 0x37cdb, 0x0000000100000e0f a.out`main(argc=1, argv=0x00007ffeefbff8c8) at main.c:34:22, queue = 'com.apple.main-thread', stop reason = breakpoint 1.1

Hide Details

Hide Details

Ran command: "thread list"

Hide Details

Got output: Process 51658 stopped * thread #1: tid = 0x37cdb, 0x0000000100000e0f a.out`main(argc=1, argv=0x00007ffeefbff8c8) at main.c:34:22, queue = 'com.apple.main-thread', stop reason = breakpoint 1.1

Hide Details

Expecting sub string: "stopped" (was found) Expecting sub string: "stop reason = breakpoint" (was found)

Hide Details

runCmd: breakpoint list -f output: Current breakpoints: 1: file = 'main.c', line = 34, exact_match = 0, locations = 1, resolved = 1, hit count = 1 1.1: where = a.out`main + 447 at main.c:34:22, address = 0x0000000100000e0f, resolved, hit count = 1

Hide Details

Hide Details

Hide Details

Ran command: "breakpoint list -f"

Hide Details

Got output: Current breakpoints: 1: file = 'main.c', line = 34, exact_match = 0, locations = 1, resolved = 1, hit count = 1 1.1: where = a.out`main + 447 at main.c:34:22, address = 0x0000000100000e0f, resolved, hit count = 1

Hide Details

Hide Details

Expecting sub string: "resolved, hit count = 1" (was found)

Hide Details

runCmd: frame variable --show-types strings output: (char *[4]) strings = { (char *) [0] = 0x0000000100000f94 "Hello" (char *) [1] = 0x0000000100000f9a "Hola" (char *) [2] = 0x0000000100000f9f "Bonjour" (char *) [3] = 0x0000000100000fa7 "Guten Tag" }

Hide Details

Hide Details

Ran command: "frame variable --show-types strings"

Hide Details

Got output: (char *[4]) strings = { (char *) [0] = 0x0000000100000f94 "Hello" (char *) [1] = 0x0000000100000f9a "Hola" (char *) [2] = 0x0000000100000f9f "Bonjour" (char *) [3] = 0x0000000100000fa7 "Guten Tag" }

Hide Details

Expecting start string: "(char *[4])" (was found) Expecting sub string: "(char *) [0]" (was found) Expecting sub string: "Hello" (was found) Expecting sub string: "(char *) [1]" (was found) Expecting sub string: "Hola" (was found) Expecting sub string: "(char *) [2]" (was found) Expecting sub string: "Bonjour" (was found) Expecting sub string: "(char *) [3]" (was found) Expecting sub string: "Guten Tag" (was found)

Hide Details

runCmd: frame variable --show-types --raw -- char_16 output: (char [16]) char_16 = { (char) [0] = 'H' (char) [1] = 'e' (char) [2] = 'l' (char) [3] = 'l' (char) [4] = 'o' (char) [5] = ' ' (char) [6] = 'W' (char) [7] = 'o' (char) [8] = 'r' (char) [9] = 'l' (char) [10] = 'd' (char) [11] = '\n' (char) [12] = '\0' (char) [13] = '\0' (char) [14] = '\0' (char) [15] = '\0' }

Hide Details

Hide Details

Ran command: "frame variable --show-types --raw -- char_16"

Hide Details

Got output: (char [16]) char_16 = { (char) [0] = 'H' (char) [1] = 'e' (char) [2] = 'l' (char) [3] = 'l' (char) [4] = 'o' (char) [5] = ' ' (char) [6] = 'W' (char) [7] = 'o' (char) [8] = 'r' (char) [9] = 'l' (char) [10] = 'd' (char) [11] = '\n' (char) [12] = '\0' (char) [13] = '\0' (char) [14] = '\0' (char) [15] = '\0' }

Hide Details

Expecting sub string: "(char) [0]" (was found) Expecting sub string: "(char) [15]" (was found)

Hide Details

runCmd: frame variable --show-types ushort_matrix output: (unsigned short [2][3]) ushort_matrix = { (unsigned short [3]) [0] = { (unsigned short) [0] = 1 (unsigned short) [1] = 2 (unsigned short) [2] = 3 } (unsigned short [3]) [1] = { (unsigned short) [0] = 11 (unsigned short) [1] = 22 (unsigned short) [2] = 33 } }

Hide Details

Hide Details

Ran command: "frame variable --show-types ushort_matrix"

Hide Details

Got output: (unsigned short [2][3]) ushort_matrix = { (unsigned short [3]) [0] = { (unsigned short) [0] = 1 (unsigned short) [1] = 2 (unsigned short) [2] = 3 } (unsigned short [3]) [1] = { (unsigned short) [0] = 11 (unsigned short) [1] = 22 (unsigned short) [2] = 33 } }

Hide Details

Expecting start string: "(unsigned short [2][3])" (was found)

Hide Details

runCmd: frame variable --show-types long_6 output: (long [6]) long_6 = { (long) [0] = 1 (long) [1] = 2 (long) [2] = 3 (long) [3] = 4 (long) [4] = 5 (long) [5] = 6 }

Hide Details

Hide Details

Ran command: "frame variable --show-types long_6"

Hide Details

Got output: (long [6]) long_6 = { (long) [0] = 1 (long) [1] = 2 (long) [2] = 3 (long) [3] = 4 (long) [4] = 5 (long) [5] = 6 }

Hide Details

Expecting start string: "(long [6])" (was found)

Hide Details

<bound method SBProcess.Kill of <lldb.SBProcess; proxy of <Swig Object of type 'lldb::SBProcess *' at 0x10af2cd20> >>: success

Hide Details

PASS: LLDB (/Users/buildslave/jenkins/workspace/lldb-cmake-sanitized/lldb-build/bin/clang-x86_64) :: test_and_run_command_gmodules (TestArrayTypes.ArrayTypesTestCase) Restore dir to: /Users/buildslave/jenkins/workspace/lldb-cmake-sanitized/lldb-build/tools/lldb/test ====================================================================== FAIL: test_and_python_api_dsym (TestArrayTypes.ArrayTypesTestCase) Use Python APIs to inspect variables with array types. ---------------------------------------------------------------------- Traceback (most recent call last): File "/Users/buildslave/jenkins/workspace/lldb-cmake-sanitized/llvm-project/lldb/packages/Python/lldbsuite/test/lldbtest.py", line 1830, in test_method return attrvalue(self) File "/Users/buildslave/jenkins/workspace/lldb-cmake-sanitized/llvm-project/lldb/packages/Python/lldbsuite/test/decorators.py", line 119, in wrapper func(*args, **kwargs) File "/Users/buildslave/jenkins/workspace/lldb-cmake-sanitized/llvm-project/lldb/test/API/lang/c/array_types/TestArrayTypes.py", line 116, in test_and_python_api "executable = a.out"]) File "/Users/buildslave/jenkins/workspace/lldb-cmake-sanitized/llvm-project/lldb/packages/Python/lldbsuite/test/lldbtest.py", line 2550, in expect self.fail(log_msg) AssertionError: Checking string: "SBProcess: pid = 51430, state = exited, threads = 0, executable = a.out"

Hide Details

Expecting sub string: "state = stopped" (was not found) Process looks good Config=x86_64-/Users/buildslave/jenkins/workspace/lldb-cmake-sanitized/lldb-build/bin/clang ---------------------------------------------------------------------- Ran 8 tests in 49.046s

Hide Details

RESULT: FAILED (5 passes, 1 failures, 0 errors, 2 skipped, 0 expected failures, 0 unexpected successes)

Hide Details

--

Hide Details

******************** PASS: lldb-unit :: Utility/./UtilityTests/RangeTest.LessThanInvalid (1653 of 2332) PASS: lldb-unit :: Utility/./UtilityTests/SerializationRountripTest.SerializeDeserializeCStringNull (1654 of 2332) UNSUPPORTED: lldb-shell :: SymbolFile/PDB/variables-locations.test (1655 of 2332) PASS: lldb-shell :: ObjectFile/ELF/PT_LOAD.yaml (1656 of 2332) PASS: lldb-api :: functionalities/data-formatter/data-formatter-stl/libstdcpp/unique_ptr/invalid/TestDataFormatterInvalidStdUniquePtr.py (1657 of 2332) FAIL: lldb-api :: functionalities/inline-stepping/TestInlineStepping.py (1658 of 2332) ******************** TEST 'lldb-api :: functionalities/inline-stepping/TestInlineStepping.py' FAILED ******************** Script: -- /Users/buildslave/jenkins/workspace/lldb-cmake-sanitized/lldb-build/lldb-test-build.noindex/copied-python /Users/buildslave/jenkins/workspace/lldb-cmake-sanitized/llvm-project/lldb/test/API/dotest.py -u CXXFLAGS -u CFLAGS --codesign-identity lldb_codesign --arch x86_64 --build-dir /Users/buildslave/jenkins/workspace/lldb-cmake-sanitized/lldb-build/lldb-test-build.noindex -t --env TERM=vt100 --env LLVM_LIBS_DIR=/Users/buildslave/jenkins/workspace/lldb-cmake-sanitized/lldb-build/./lib --inferior-env ASAN_OPTIONS=detect_stack_use_after_return=1 --inferior-env DYLD_INSERT_LIBRARIES=/Users/buildslave/jenkins/workspace/lldb-cmake-sanitized/host-compiler/lib/clang/13.0.99/lib/darwin/libclang_rt.asan_osx_dynamic.dylib --arch x86_64 --build-dir /Users/buildslave/jenkins/workspace/lldb-cmake-sanitized/lldb-build/lldb-test-build.noindex --lldb-module-cache-dir /Users/buildslave/jenkins/workspace/lldb-cmake-sanitized/lldb-build/lldb-test-build.noindex/module-cache-lldb/lldb-api --clang-module-cache-dir /Users/buildslave/jenkins/workspace/lldb-cmake-sanitized/lldb-build/lldb-test-build.noindex/module-cache-clang/lldb-api --executable /Users/buildslave/jenkins/workspace/lldb-cmake-sanitized/lldb-build/./bin/lldb --compiler /Users/buildslave/jenkins/workspace/lldb-cmake-sanitized/lldb-build/./bin/clang --dsymutil /Users/buildslave/jenkins/workspace/lldb-cmake-sanitized/lldb-build/./bin/dsymutil --llvm-tools-dir /Users/buildslave/jenkins/workspace/lldb-cmake-sanitized/lldb-build/./bin --lldb-libs-dir /Users/buildslave/jenkins/workspace/lldb-cmake-sanitized/lldb-build/./lib /Users/buildslave/jenkins/workspace/lldb-cmake-sanitized/llvm-project/lldb/test/API/functionalities/inline-stepping -p TestInlineStepping.py -- Exit Code: 1

Hide Details

Command Output (stdout): -- lldb version 13.0.99 (http://labmaster3.local/git/llvm-project.git revision 9625d61eb66c12388875e081b63ebed7e42c6bbb) clang revision 9625d61eb66c12388875e081b63ebed7e42c6bbb llvm revision 9625d61eb66c12388875e081b63ebed7e42c6bbb Skipping the following test categories: ['darwin-log', 'libstdcxx', 'dwo', 'llgs', 'fork']

Hide Details

-- Command Output (stderr): -- Change dir to: /Users/buildslave/jenkins/workspace/lldb-cmake-sanitized/llvm-project/lldb/test/API/functionalities/inline-stepping runCmd: settings clear -all output:

Hide Details

runCmd: settings set symbols.enable-external-lookup false output:

Hide Details

runCmd: settings set target.inherit-tcc true output:

Hide Details

runCmd: settings set target.detach-on-error false output:

Hide Details

runCmd: settings set target.auto-apply-fixits false output:

Hide Details

runCmd: settings set plugin.process.gdb-remote.packet-timeout 60 output:

Hide Details

runCmd: settings set symbols.clang-modules-cache-path "/Users/buildslave/jenkins/workspace/lldb-cmake-sanitized/lldb-build/lldb-test-build.noindex/module-cache-lldb/lldb-api" output:

Hide Details

runCmd: settings set use-color false output:

Hide Details

runCmd: setting set target.prefer-dynamic-value no-dynamic-values output:

Hide Details

runCmd: settings set target.env-vars ASAN_OPTIONS=detect_stack_use_after_return=1 DYLD_INSERT_LIBRARIES=/Users/buildslave/jenkins/workspace/lldb-cmake-sanitized/host-compiler/lib/clang/13.0.99/lib/darwin/libclang_rt.asan_osx_dynamic.dylib output:

Hide Details

<bound method SBProcess.Kill of <lldb.SBProcess; proxy of <Swig Object of type 'lldb::SBProcess *' at 0x12992ba80> >>: success

Hide Details

PASS: LLDB (/Users/buildslave/jenkins/workspace/lldb-cmake-sanitized/lldb-build/bin/clang-x86_64) :: test_step_in_template_with_python_api_dsym (TestInlineStepping.TestInlineStepping) runCmd: settings clear -all output:

Hide Details

runCmd: settings set symbols.enable-external-lookup false output:

Hide Details

runCmd: settings set target.inherit-tcc true output:

Hide Details

runCmd: settings set target.detach-on-error false output:

Hide Details

runCmd: settings set target.auto-apply-fixits false output:

Hide Details

runCmd: settings set plugin.process.gdb-remote.packet-timeout 60 output:

Hide Details

runCmd: settings set symbols.clang-modules-cache-path "/Users/buildslave/jenkins/workspace/lldb-cmake-sanitized/lldb-build/lldb-test-build.noindex/module-cache-lldb/lldb-api" output:

Hide Details

runCmd: settings set use-color false output:

Hide Details

runCmd: setting set target.prefer-dynamic-value no-dynamic-values output:

Hide Details

runCmd: settings set target.env-vars ASAN_OPTIONS=detect_stack_use_after_return=1 DYLD_INSERT_LIBRARIES=/Users/buildslave/jenkins/workspace/lldb-cmake-sanitized/host-compiler/lib/clang/13.0.99/lib/darwin/libclang_rt.asan_osx_dynamic.dylib output:

Hide Details

FAIL: LLDB (/Users/buildslave/jenkins/workspace/lldb-cmake-sanitized/lldb-build/bin/clang-x86_64) :: test_step_in_template_with_python_api_dwarf (TestInlineStepping.TestInlineStepping) <bound method SBProcess.Kill of <lldb.SBProcess; proxy of <Swig Object of type 'lldb::SBProcess *' at 0x112593d20> >>: success

Hide Details

UNSUPPORTED: LLDB (/Users/buildslave/jenkins/workspace/lldb-cmake-sanitized/lldb-build/bin/clang-x86_64) :: test_step_in_template_with_python_api_dwo (TestInlineStepping.TestInlineStepping) (test case does not fall in any category of interest for this run) runCmd: settings clear -all output:

Hide Details

runCmd: settings set symbols.enable-external-lookup false output:

Hide Details

runCmd: settings set target.inherit-tcc true output:

Hide Details

runCmd: settings set target.detach-on-error false output:

Hide Details

runCmd: settings set target.auto-apply-fixits false output:

Hide Details

runCmd: settings set plugin.process.gdb-remote.packet-timeout 60 output:

Hide Details

runCmd: settings set symbols.clang-modules-cache-path "/Users/buildslave/jenkins/workspace/lldb-cmake-sanitized/lldb-build/lldb-test-build.noindex/module-cache-lldb/lldb-api" output:

Hide Details

runCmd: settings set use-color false output:

Hide Details

runCmd: setting set target.prefer-dynamic-value no-dynamic-values output:

Hide Details

runCmd: settings set target.env-vars ASAN_OPTIONS=detect_stack_use_after_return=1 DYLD_INSERT_LIBRARIES=/Users/buildslave/jenkins/workspace/lldb-cmake-sanitized/host-compiler/lib/clang/13.0.99/lib/darwin/libclang_rt.asan_osx_dynamic.dylib output:

Hide Details

FAIL: LLDB (/Users/buildslave/jenkins/workspace/lldb-cmake-sanitized/lldb-build/bin/clang-x86_64) :: test_step_in_template_with_python_api_gmodules (TestInlineStepping.TestInlineStepping) <bound method SBProcess.Kill of <lldb.SBProcess; proxy of <Swig Object of type 'lldb::SBProcess *' at 0x1291cccc0> >>: success

Hide Details

runCmd: settings clear -all output:

Hide Details

runCmd: settings set symbols.enable-external-lookup false output:

Hide Details

runCmd: settings set target.inherit-tcc true output:

Hide Details

runCmd: settings set target.detach-on-error false output:

Hide Details

runCmd: settings set target.auto-apply-fixits false output:

Hide Details

runCmd: settings set plugin.process.gdb-remote.packet-timeout 60 output:

Hide Details

runCmd: settings set symbols.clang-modules-cache-path "/Users/buildslave/jenkins/workspace/lldb-cmake-sanitized/lldb-build/lldb-test-build.noindex/module-cache-lldb/lldb-api" output:

Hide Details

runCmd: settings set use-color false output:

Hide Details

runCmd: setting set target.prefer-dynamic-value no-dynamic-values output:

Hide Details

runCmd: settings set target.env-vars ASAN_OPTIONS=detect_stack_use_after_return=1 DYLD_INSERT_LIBRARIES=/Users/buildslave/jenkins/workspace/lldb-cmake-sanitized/host-compiler/lib/clang/13.0.99/lib/darwin/libclang_rt.asan_osx_dynamic.dylib output:

Hide Details

FAIL: LLDB (/Users/buildslave/jenkins/workspace/lldb-cmake-sanitized/lldb-build/bin/clang-x86_64) :: test_step_over_with_python_api_dsym (TestInlineStepping.TestInlineStepping) <bound method SBProcess.Kill of <lldb.SBProcess; proxy of <Swig Object of type 'lldb::SBProcess *' at 0x112593c30> >>: success

Hide Details

runCmd: settings clear -all output:

Hide Details

runCmd: settings set symbols.enable-external-lookup false output:

Hide Details

runCmd: settings set target.inherit-tcc true output:

Hide Details

runCmd: settings set target.detach-on-error false output:

Hide Details

runCmd: settings set target.auto-apply-fixits false output:

Hide Details

runCmd: settings set plugin.process.gdb-remote.packet-timeout 60 output:

Hide Details

runCmd: settings set symbols.clang-modules-cache-path "/Users/buildslave/jenkins/workspace/lldb-cmake-sanitized/lldb-build/lldb-test-build.noindex/module-cache-lldb/lldb-api" output:

Hide Details

runCmd: settings set use-color false output:

Hide Details

runCmd: setting set target.prefer-dynamic-value no-dynamic-values output:

Hide Details

runCmd: settings set target.env-vars ASAN_OPTIONS=detect_stack_use_after_return=1 DYLD_INSERT_LIBRARIES=/Users/buildslave/jenkins/workspace/lldb-cmake-sanitized/host-compiler/lib/clang/13.0.99/lib/darwin/libclang_rt.asan_osx_dynamic.dylib output:

Hide Details

<bound method SBProcess.Kill of <lldb.SBProcess; proxy of <Swig Object of type 'lldb::SBProcess *' at 0x12939a300> >>: success

Hide Details

PASS: LLDB (/Users/buildslave/jenkins/workspace/lldb-cmake-sanitized/lldb-build/bin/clang-x86_64) :: test_step_over_with_python_api_dwarf (TestInlineStepping.TestInlineStepping) UNSUPPORTED: LLDB (/Users/buildslave/jenkins/workspace/lldb-cmake-sanitized/lldb-build/bin/clang-x86_64) :: test_step_over_with_python_api_dwo (TestInlineStepping.TestInlineStepping) (test case does not fall in any category of interest for this run) runCmd: settings clear -all output:

Hide Details

runCmd: settings set symbols.enable-external-lookup false output:

Hide Details

runCmd: settings set target.inherit-tcc true output:

Hide Details

runCmd: settings set target.detach-on-error false output:

Hide Details

runCmd: settings set target.auto-apply-fixits false output:

Hide Details

runCmd: settings set plugin.process.gdb-remote.packet-timeout 60 output:

Hide Details

runCmd: settings set symbols.clang-modules-cache-path "/Users/buildslave/jenkins/workspace/lldb-cmake-sanitized/lldb-build/lldb-test-build.noindex/module-cache-lldb/lldb-api" output:

Hide Details

runCmd: settings set use-color false output:

Hide Details

runCmd: setting set target.prefer-dynamic-value no-dynamic-values output:

Hide Details

runCmd: settings set target.env-vars ASAN_OPTIONS=detect_stack_use_after_return=1 DYLD_INSERT_LIBRARIES=/Users/buildslave/jenkins/workspace/lldb-cmake-sanitized/host-compiler/lib/clang/13.0.99/lib/darwin/libclang_rt.asan_osx_dynamic.dylib output:

Hide Details

<bound method SBProcess.Kill of <lldb.SBProcess; proxy of <Swig Object of type 'lldb::SBProcess *' at 0x12912a8d0> >>: success

Hide Details

PASS: LLDB (/Users/buildslave/jenkins/workspace/lldb-cmake-sanitized/lldb-build/bin/clang-x86_64) :: test_step_over_with_python_api_gmodules (TestInlineStepping.TestInlineStepping) runCmd: settings clear -all output:

Hide Details

runCmd: settings set symbols.enable-external-lookup false output:

Hide Details

runCmd: settings set target.inherit-tcc true output:

Hide Details

runCmd: settings set target.detach-on-error false output:

Hide Details

runCmd: settings set target.auto-apply-fixits false output:

Hide Details

runCmd: settings set plugin.process.gdb-remote.packet-timeout 60 output:

Hide Details

runCmd: settings set symbols.clang-modules-cache-path "/Users/buildslave/jenkins/workspace/lldb-cmake-sanitized/lldb-build/lldb-test-build.noindex/module-cache-lldb/lldb-api" output:

Hide Details

runCmd: settings set use-color false output:

Hide Details

runCmd: setting set target.prefer-dynamic-value no-dynamic-values output:

Hide Details

runCmd: settings set target.env-vars ASAN_OPTIONS=detect_stack_use_after_return=1 DYLD_INSERT_LIBRARIES=/Users/buildslave/jenkins/workspace/lldb-cmake-sanitized/host-compiler/lib/clang/13.0.99/lib/darwin/libclang_rt.asan_osx_dynamic.dylib output:

Hide Details

<bound method SBProcess.Kill of <lldb.SBProcess; proxy of <Swig Object of type 'lldb::SBProcess *' at 0x12939a300> >>: success

Hide Details

PASS: LLDB (/Users/buildslave/jenkins/workspace/lldb-cmake-sanitized/lldb-build/bin/clang-x86_64) :: test_with_python_api_dsym (TestInlineStepping.TestInlineStepping) runCmd: settings clear -all output:

Hide Details

runCmd: settings set symbols.enable-external-lookup false output:

Hide Details

runCmd: settings set target.inherit-tcc true output:

Hide Details

runCmd: settings set target.detach-on-error false output:

Hide Details

runCmd: settings set target.auto-apply-fixits false output:

Hide Details

runCmd: settings set plugin.process.gdb-remote.packet-timeout 60 output:

Hide Details

runCmd: settings set symbols.clang-modules-cache-path "/Users/buildslave/jenkins/workspace/lldb-cmake-sanitized/lldb-build/lldb-test-build.noindex/module-cache-lldb/lldb-api" output:

Hide Details

runCmd: settings set use-color false output:

Hide Details

runCmd: setting set target.prefer-dynamic-value no-dynamic-values output:

Hide Details

runCmd: settings set target.env-vars ASAN_OPTIONS=detect_stack_use_after_return=1 DYLD_INSERT_LIBRARIES=/Users/buildslave/jenkins/workspace/lldb-cmake-sanitized/host-compiler/lib/clang/13.0.99/lib/darwin/libclang_rt.asan_osx_dynamic.dylib output:

Hide Details

<bound method SBProcess.Kill of <lldb.SBProcess; proxy of <Swig Object of type 'lldb::SBProcess *' at 0x12992bea0> >>: success

Hide Details

PASS: LLDB (/Users/buildslave/jenkins/workspace/lldb-cmake-sanitized/lldb-build/bin/clang-x86_64) :: test_with_python_api_dwarf (TestInlineStepping.TestInlineStepping) UNSUPPORTED: LLDB (/Users/buildslave/jenkins/workspace/lldb-cmake-sanitized/lldb-build/bin/clang-x86_64) :: test_with_python_api_dwo (TestInlineStepping.TestInlineStepping) (test case does not fall in any category of interest for this run) runCmd: settings clear -all output:

Hide Details

runCmd: settings set symbols.enable-external-lookup false output:

Hide Details

runCmd: settings set target.inherit-tcc true output:

Hide Details

runCmd: settings set target.detach-on-error false output:

Hide Details

runCmd: settings set target.auto-apply-fixits false output:

Hide Details

runCmd: settings set plugin.process.gdb-remote.packet-timeout 60 output:

Hide Details

runCmd: settings set symbols.clang-modules-cache-path "/Users/buildslave/jenkins/workspace/lldb-cmake-sanitized/lldb-build/lldb-test-build.noindex/module-cache-lldb/lldb-api" output:

Hide Details

runCmd: settings set use-color false output:

Hide Details

runCmd: setting set target.prefer-dynamic-value no-dynamic-values output:

Hide Details

runCmd: settings set target.env-vars ASAN_OPTIONS=detect_stack_use_after_return=1 DYLD_INSERT_LIBRARIES=/Users/buildslave/jenkins/workspace/lldb-cmake-sanitized/host-compiler/lib/clang/13.0.99/lib/darwin/libclang_rt.asan_osx_dynamic.dylib output:

Hide Details

<bound method SBProcess.Kill of <lldb.SBProcess; proxy of <Swig Object of type 'lldb::SBProcess *' at 0x12939a300> >>: success

Hide Details

PASS: LLDB (/Users/buildslave/jenkins/workspace/lldb-cmake-sanitized/lldb-build/bin/clang-x86_64) :: test_with_python_api_gmodules (TestInlineStepping.TestInlineStepping) Restore dir to: /Users/buildslave/jenkins/workspace/lldb-cmake-sanitized/lldb-build/tools/lldb/test ====================================================================== FAIL: test_step_in_template_with_python_api_dwarf (TestInlineStepping.TestInlineStepping) Test stepping in to templated functions. ---------------------------------------------------------------------- Traceback (most recent call last): File "/Users/buildslave/jenkins/workspace/lldb-cmake-sanitized/llvm-project/lldb/packages/Python/lldbsuite/test/lldbtest.py", line 1830, in test_method return attrvalue(self) File "/Users/buildslave/jenkins/workspace/lldb-cmake-sanitized/llvm-project/lldb/packages/Python/lldbsuite/test/decorators.py", line 119, in wrapper func(*args, **kwargs) File "/Users/buildslave/jenkins/workspace/lldb-cmake-sanitized/llvm-project/lldb/test/API/functionalities/inline-stepping/TestInlineStepping.py", line 35, in test_step_in_template_with_python_api self.step_in_template() File "/Users/buildslave/jenkins/workspace/lldb-cmake-sanitized/llvm-project/lldb/test/API/functionalities/inline-stepping/TestInlineStepping.py", line 311, in step_in_template self.fail("Failed to stop at first breakpoint in main.") AssertionError: Failed to stop at first breakpoint in main. Config=x86_64-/Users/buildslave/jenkins/workspace/lldb-cmake-sanitized/lldb-build/bin/clang ====================================================================== FAIL: test_step_in_template_with_python_api_gmodules (TestInlineStepping.TestInlineStepping) Test stepping in to templated functions. ---------------------------------------------------------------------- Traceback (most recent call last): File "/Users/buildslave/jenkins/workspace/lldb-cmake-sanitized/llvm-project/lldb/packages/Python/lldbsuite/test/lldbtest.py", line 1830, in test_method return attrvalue(self) File "/Users/buildslave/jenkins/workspace/lldb-cmake-sanitized/llvm-project/lldb/packages/Python/lldbsuite/test/decorators.py", line 119, in wrapper func(*args, **kwargs) File "/Users/buildslave/jenkins/workspace/lldb-cmake-sanitized/llvm-project/lldb/test/API/functionalities/inline-stepping/TestInlineStepping.py", line 35, in test_step_in_template_with_python_api self.step_in_template() File "/Users/buildslave/jenkins/workspace/lldb-cmake-sanitized/llvm-project/lldb/test/API/functionalities/inline-stepping/TestInlineStepping.py", line 311, in step_in_template self.fail("Failed to stop at first breakpoint in main.") AssertionError: Failed to stop at first breakpoint in main. Config=x86_64-/Users/buildslave/jenkins/workspace/lldb-cmake-sanitized/lldb-build/bin/clang ====================================================================== FAIL: test_step_over_with_python_api_dsym (TestInlineStepping.TestInlineStepping) Test stepping over and into inlined functions. ---------------------------------------------------------------------- Traceback (most recent call last): File "/Users/buildslave/jenkins/workspace/lldb-cmake-sanitized/llvm-project/lldb/packages/Python/lldbsuite/test/lldbtest.py", line 1830, in test_method return attrvalue(self) File "/Users/buildslave/jenkins/workspace/lldb-cmake-sanitized/llvm-project/lldb/test/API/functionalities/inline-stepping/TestInlineStepping.py", line 28, in test_step_over_with_python_api self.inline_stepping_step_over() File "/Users/buildslave/jenkins/workspace/lldb-cmake-sanitized/llvm-project/lldb/test/API/functionalities/inline-stepping/TestInlineStepping.py", line 277, in inline_stepping_step_over self.fail("Failed to stop at first breakpoint in main.") AssertionError: Failed to stop at first breakpoint in main. Config=x86_64-/Users/buildslave/jenkins/workspace/lldb-cmake-sanitized/lldb-build/bin/clang ---------------------------------------------------------------------- Ran 12 tests in 133.809s

Hide Details

RESULT: FAILED (6 passes, 3 failures, 0 errors, 3 skipped, 0 expected failures, 0 unexpected successes)

Hide Details

--

Hide Details

******************** PASS: lldb-api :: functionalities/tail_call_frames/ambiguous_tail_call_seq1/TestAmbiguousTailCallSeq1.py (1659 of 2332) PASS: lldb-unit :: Process/Utility/./ProcessUtilityTests/ProcSMapTests/LinuxProcSMapsTestFixture.ParseSMapRegions/8 (1660 of 2332) PASS: lldb-api :: test_utils/TestPExpectTest.py (1661 of 2332) PASS: lldb-shell :: ObjectFile/ELF/null-jmprel.yaml (1662 of 2332) PASS: lldb-shell :: Register/Core/x86-64-netbsd-gp.test (1663 of 2332) PASS: lldb-unit :: SymbolFile/DWARF/./SymbolFileDWARFTests/DWARFUnitTest.NullUnitDie (1664 of 2332) UNSUPPORTED: lldb-shell :: SymbolFile/dissassemble-entry-point.s (1665 of 2332) UNSUPPORTED: lldb-api :: commands/expression/multiline-navigation/TestMultilineNavigation.py (1666 of 2332) PASS: lldb-unit :: Process/Utility/./ProcessUtilityTests/ProcMapTests/LinuxProcMapsTestFixture.ParseMapRegions/8 (1667 of 2332) PASS: lldb-unit :: Process/minidump/./LLDBMinidumpTests/MinidumpParserTest.GetLinuxProcStatus_no_stream (1668 of 2332) PASS: lldb-api :: functionalities/breakpoint/address_breakpoints/TestAddressBreakpoints.py (1669 of 2332) PASS: lldb-api :: commands/expression/import-std-module/retry-with-std-module/TestRetryWithStdModule.py (1670 of 2332) PASS: lldb-unit :: Utility/./UtilityTests/RangeTest.SlideZero (1671 of 2332) PASS: lldb-unit :: Utility/./UtilityTests/StringListTest.SplitIntoLines (1672 of 2332) PASS: lldb-shell :: SymbolFile/DWARF/x86/DW_AT_const_value.s (1673 of 2332) PASS: lldb-api :: lang/objc/hidden-ivars/TestHiddenIvars.py (1674 of 2332) PASS: lldb-unit :: Process/gdb-remote/./ProcessGdbRemoteTests/GDBRemoteCommunicationClientTest.SyncThreadState (1675 of 2332) UNSUPPORTED: lldb-shell :: Register/arm-gp-read.test (1676 of 2332) PASS: lldb-unit :: Process/minidump/./LLDBMinidumpTests/RegisterContextMinidump.ConvertMinidumpContext_x86_32 (1677 of 2332) PASS: lldb-api :: python_api/value/TestValueAPI.py (1678 of 2332) PASS: lldb-unit :: Symbol/./SymbolTests/TestTypeSystemClang.TestFunctionTemplateConstruction (1679 of 2332) PASS: lldb-api :: functionalities/target_var/no_vars/TestTargetVarNoVars.py (1680 of 2332) PASS: lldb-unit :: Utility/./UtilityTests/ArgsTest.GetArgumentArrayRef (1681 of 2332) PASS: lldb-unit :: Utility/./UtilityTests/ArgsTest.GetShellSafeArgument (1682 of 2332) PASS: lldb-shell :: Quit/TestQuitExitCodeHex0.test (1683 of 2332) PASS: lldb-unit :: Process/gdb-remote/./ProcessGdbRemoteTests/GDBRemoteClientBaseTest.SendContinueAndAsyncPacket (1684 of 2332) PASS: lldb-api :: macosx/find-dsym/bundle-with-dot-in-filename/TestBundleWithDotInFilename.py (1685 of 2332) UNSUPPORTED: lldb-shell :: Register/x86-64-zmm-write.test (1686 of 2332) PASS: lldb-api :: python_api/exprpath_synthetic/TestExprPathSynthetic.py (1687 of 2332) PASS: lldb-api :: lang/cpp/dynamic-value/TestDynamicValue.py (1688 of 2332) PASS: lldb-unit :: Core/./LLDBCoreTests/DumpDataExtractorTest.StartOffset (1689 of 2332) PASS: lldb-api :: functionalities/data-formatter/data-formatter-skip-summary/TestDataFormatterSkipSummary.py (1690 of 2332) PASS: lldb-unit :: Utility/./UtilityTests/DataExtractorTest.GetBitfield (1691 of 2332) UNSUPPORTED: lldb-api :: functionalities/data-formatter/data-formatter-stl/libstdcpp/vbool/TestDataFormatterStdVBool.py (1692 of 2332) PASS: lldb-api :: commands/expression/codegen-crash-import-def-arraytype-element/TestImportDefinitionArrayType.py (1693 of 2332) PASS: lldb-unit :: Utility/./UtilityTests/RangeTest.DefaultConstructor (1694 of 2332) PASS: lldb-api :: lang/objc/variadic_methods/TestVariadicMethods.py (1695 of 2332) PASS: lldb-api :: lang/cpp/char8_t/TestCxxChar8_t.py (1696 of 2332) PASS: lldb-unit :: Utility/./UtilityTests/UriParserTest.SchemeHostSeparator (1697 of 2332) PASS: lldb-api :: commands/expression/save_jit_objects/TestSaveJITObjects.py (1698 of 2332) PASS: lldb-api :: functionalities/inferior-crashing/recursive-inferior/TestRecursiveInferiorStep.py (1699 of 2332) UNSUPPORTED: lldb-api :: commands/expression/call-restarts/TestCallThatRestarts.py (1700 of 2332) UNSUPPORTED: lldb-api :: lang/objc/foundation/TestFoundationDisassembly.py (1701 of 2332) PASS: lldb-api :: functionalities/thread/concurrent_events/TestConcurrentCrashWithBreak.py (1702 of 2332) UNSUPPORTED: lldb-api :: functionalities/data-formatter/data-formatter-stl/libstdcpp/iterator/TestDataFormatterStdIterator.py (1703 of 2332) PASS: lldb-shell :: ScriptInterpreter/Python/sb_address_exception.test (1704 of 2332) PASS: lldb-api :: functionalities/data-formatter/data-formatter-synth/TestDataFormatterSynth.py (1705 of 2332) PASS: lldb-api :: functionalities/gdb_remote_client/TestGDBRemoteClient.py (1706 of 2332) PASS: lldb-api :: functionalities/gdb_remote_client/TestArmRegisterDefinition.py (1707 of 2332) PASS: lldb-unit :: Utility/./UtilityTests/OptionsWithRawTest.SingleWhitespaceInput (1708 of 2332) PASS: lldb-unit :: Language/Highlighting/./HighlighterTests/HighlighterTest.ClangCursorOutOfBounds (1709 of 2332) PASS: lldb-unit :: Utility/./UtilityTests/UriParserTest.TypicalPortPathIPv6 (1710 of 2332) PASS: lldb-unit :: Utility/./UtilityTests/ConstStringTest.YAML (1711 of 2332) PASS: lldb-shell :: Process/UnsupportedLanguage.test (1712 of 2332) PASS: lldb-api :: lang/cpp/breakpoint_in_member_func_w_non_primitive_params/TestBreakpointInMemberFuncWNonPrimitiveParams.py (1713 of 2332) PASS: lldb-unit :: ScriptInterpreter/Python/./ScriptInterpreterPythonTests/PythonDataObjectsTest.TestTypeNameResolutionNoDot (1714 of 2332) UNSUPPORTED: lldb-shell :: Register/x86-64-ymm16-write.test (1715 of 2332) PASS: lldb-api :: driver/batch_mode/TestBatchMode.py (1716 of 2332) PASS: lldb-unit :: Utility/./UtilityTests/RangeDataVector.FindEntryIndexesThatContain_Overlap (1717 of 2332) PASS: lldb-unit :: Language/Highlighting/./HighlighterTests/HighlighterTest.ClangStringLiterals (1718 of 2332) UNSUPPORTED: lldb-shell :: SymbolFile/DWARF/split-dwarf-expression-eval-bug.cpp (1719 of 2332) PASS: lldb-api :: functionalities/multiword-commands/TestMultiWordCommands.py (1720 of 2332) PASS: lldb-api :: python_api/target/TestTargetAPI.py (1721 of 2332) UNSUPPORTED: lldb-shell :: Register/x86-ymm-write.test (1722 of 2332) PASS: lldb-shell :: SymbolFile/NativePDB/function-types-builtins.cpp (1723 of 2332) PASS: lldb-unit :: Utility/./UtilityTests/AnsiTerminal.Empty (1724 of 2332) PASS: lldb-unit :: UnwindAssembly/x86/./UnwindAssemblyx86Tests/Testx86AssemblyInspectionEngine.TestSimple64bitFrameFunction (1725 of 2332) PASS: lldb-unit :: SymbolFile/DWARF/./SymbolFileDWARFTests/SymbolFileDWARFTests.TestAbbrevOrder1Start5 (1726 of 2332) PASS: lldb-api :: commands/expression/import-std-module/forward_decl_from_module/TestForwardDeclFromStdModule.py (1727 of 2332) UNSUPPORTED: lldb-shell :: SymbolFile/NativePDB/typedefs.cpp (1728 of 2332) PASS: lldb-unit :: SymbolFile/DWARF/./SymbolFileDWARFTests/SymbolFileDWARFTests.TestAbbrevNullAttrValidForm (1729 of 2332) PASS: lldb-unit :: Utility/./UtilityTests/GeneratorTest.YamlMultiProvider (1730 of 2332) PASS: lldb-shell :: ObjectFile/Breakpad/sections.test (1731 of 2332) PASS: lldb-api :: functionalities/data-formatter/data-formatter-ptr-to-array/TestPtrToArrayFormatting.py (1732 of 2332) PASS: lldb-unit :: Utility/./UtilityTests/DataExtractorTest.GetULEB128_bit63 (1733 of 2332) PASS: lldb-api :: commands/expression/scoped_enums/TestScopedEnumType.py (1734 of 2332) PASS: lldb-api :: lang/objc/objc-static-method-stripped/TestObjCStaticMethodStripped.py (1735 of 2332) PASS: lldb-api :: functionalities/data-formatter/poarray/TestPrintObjectArray.py (1736 of 2332) PASS: lldb-unit :: UnwindAssembly/x86/./UnwindAssemblyx86Tests/Testx86AssemblyInspectionEngine.TestSimplei386ugmented (1737 of 2332) PASS: lldb-unit :: Host/./HostTests/SocketTests/SocketTest.DomainListenConnectAccept/ipv4 (1738 of 2332) PASS: lldb-api :: python_api/function_symbol/TestSymbolAPI.py (1739 of 2332) PASS: lldb-unit :: Core/./LLDBCoreTests/DumpDataExtractorTest.MultiLine (1740 of 2332) PASS: lldb-unit :: Utility/./UtilityTests/OptionsWithRawTest.SingleWordSuffix (1741 of 2332) PASS: lldb-api :: lang/c/forward/TestForwardDeclaration.py (1742 of 2332) UNSUPPORTED: lldb-api :: python_api/disassemble-raw-data/TestDisassemble_VST1_64.py (1743 of 2332) PASS: lldb-api :: functionalities/wrong_commands/TestWrongCommands.py (1744 of 2332) PASS: lldb-unit :: Utility/./UtilityTests/ConstStringTest.format_provider (1745 of 2332) PASS: lldb-unit :: ScriptInterpreter/Python/./ScriptInterpreterPythonTests/PythonDataObjectsTest.TestGlobalNameResolutionWithDot (1746 of 2332) UNSUPPORTED: lldb-api :: iohandler/unicode/TestUnicode.py (1747 of 2332) PASS: lldb-unit :: Utility/./UtilityTests/LogChannelEnabledTest.LogVerboseThread (1748 of 2332) PASS: lldb-unit :: Expression/./ExpressionTests/CppModuleConfigurationTest.IgnoreLibStdCpp (1749 of 2332) PASS: lldb-unit :: SymbolFile/NativePDB/./SymbolFileNativePDBTests/PDBFPOProgramToDWARFExpressionTests.InvalidOpBinary (1750 of 2332) PASS: lldb-unit :: Language/Highlighting/./HighlighterTests/HighlighterTest.ClangUnterminatedString (1751 of 2332) UNSUPPORTED: lldb-shell :: ScriptInterpreter/Lua/print.test (1752 of 2332) PASS: lldb-api :: lang/cpp/template-specialization-type/TestTemplateSpecializationType.py (1753 of 2332) PASS: lldb-api :: functionalities/breakpoint/breakpoint_names/TestBreakpointNames.py (1754 of 2332) PASS: lldb-api :: lang/cpp/multiple-inheritance/TestCppMultipleInheritance.py (1755 of 2332) PASS: lldb-shell :: ObjectFile/PECOFF/invalid-export-table.yaml (1756 of 2332) PASS: lldb-unit :: Utility/./UtilityTests/OptionsWithRawTest.UnterminatedQuote (1757 of 2332) PASS: lldb-unit :: UnwindAssembly/x86/./UnwindAssemblyx86Tests/Testx86AssemblyInspectionEngine.TestAddESP (1758 of 2332) PASS: lldb-unit :: Utility/./UtilityTests/StringLexerTest.AdvanceIf (1759 of 2332) PASS: lldb-api :: functionalities/data-formatter/data-formatter-objc/TestDataFormatterObjCCF.py (1760 of 2332) PASS: lldb-api :: lang/objc/real-definition/TestRealDefinition.py (1761 of 2332) UNSUPPORTED: lldb-shell :: ObjectFile/PECOFF/disassemble-thumb.yaml (1762 of 2332) PASS: lldb-api :: commands/expression/import-std-module/no-std-module/TestMissingStdModule.py (1763 of 2332) PASS: lldb-api :: lang/cpp/unsigned_types/TestUnsignedTypes.py (1764 of 2332) PASS: lldb-unit :: Utility/./UtilityTests/ArchSpecTest.MergeFromMachOUnknown (1765 of 2332) PASS: lldb-api :: functionalities/thread/concurrent_events/TestConcurrentTwoWatchpointsOneDelayBreakpoint.py (1766 of 2332) PASS: lldb-unit :: Utility/./UtilityTests/StreamTest.PutHex8 (1767 of 2332) PASS: lldb-shell :: SymbolFile/DWARF/x86/DW_OP_piece-smaller-than-struct.s (1768 of 2332) PASS: lldb-unit :: Process/Utility/./ProcessUtilityTests/ProcMapTests/LinuxProcMapsTestFixture.ParseMapRegions/5 (1769 of 2332) PASS: lldb-api :: lang/objc/forward-decl/TestForwardDecl.py (1770 of 2332) PASS: lldb-api :: lang/cpp/break-on-initializers/TestBreakOnCPP11Initializers.py (1771 of 2332) PASS: lldb-shell :: ObjectFile/ELF/minidebuginfo-corrupt-xz.yaml (1772 of 2332) PASS: lldb-unit :: Process/Utility/./ProcessUtilityTests/ProcSMapTests/LinuxProcSMapsTestFixture.ParseSMapRegions/5 (1773 of 2332) PASS: lldb-unit :: Symbol/./SymbolTests/DWARFCallFrameInfoTest.Basic_dwarf3 (1774 of 2332) PASS: lldb-unit :: Utility/./UtilityTests/Flags.IsClear (1775 of 2332) PASS: lldb-api :: functionalities/thread/backtrace_all/TestBacktraceAll.py (1776 of 2332) PASS: lldb-unit :: Utility/./UtilityTests/StringExtractorTest.GetHexU8_Underflow2 (1777 of 2332) PASS: lldb-unit :: Host/./HostTests/MainLoopTest.UnmonitoredSignal (1778 of 2332) PASS: lldb-api :: functionalities/data-formatter/data-formatter-objc/TestDataFormatterObjCNSData.py (1779 of 2332) PASS: lldb-api :: commands/disassemble/basic/TestDisassembleBreakpoint.py (1780 of 2332) PASS: lldb-unit :: Host/./HostTests/SocketTests/SocketTest.DomainGetConnectURI/ipv4 (1781 of 2332) PASS: lldb-unit :: Interpreter/./InterpreterTests/OptionArgParserTest.toBoolean (1782 of 2332) PASS: lldb-unit :: Utility/./UtilityTests/DataExtractorTest.GetDouble (1783 of 2332) PASS: lldb-api :: types/TestCharTypeExpr.py (1784 of 2332) PASS: lldb-unit :: Symbol/./SymbolTests/TestTypeSystemClang.TestDisplayNameEmpty (1785 of 2332) PASS: lldb-unit :: Utility/./UtilityTests/ArchSpecTest.TripleComponentsWereSpecified (1786 of 2332) UNSUPPORTED: lldb-api :: iohandler/resize/TestIOHandlerResize.py (1787 of 2332) PASS: lldb-unit :: Process/Utility/./ProcessUtilityTests/ProcMapTests/LinuxProcMapsTestFixture.ParseMapRegions/3 (1788 of 2332) PASS: lldb-shell :: SymbolFile/DWARF/x86/limit-debug-info.s (1789 of 2332) PASS: lldb-shell :: SymbolFile/DWARF/x86/debug-names-compressed.cpp (1790 of 2332) PASS: lldb-unit :: Utility/./UtilityTests/XcodeSDKTest.SDKSupportsModules (1791 of 2332) PASS: lldb-api :: commands/frame/diagnose/virtual-method-call/TestDiagnoseDereferenceVirtualMethodCall.py (1792 of 2332) PASS: lldb-api :: python_api/disassemble-raw-data/TestDisassembleRawData.py (1793 of 2332) PASS: lldb-unit :: SymbolFile/NativePDB/./SymbolFileNativePDBTests/PDBFPOProgramToDWARFExpressionTests.UnresolvedCyclicRegisterAssignmentReference (1794 of 2332) PASS: lldb-unit :: Utility/./UtilityTests/StringListTest.ShiftMove (1795 of 2332) PASS: lldb-api :: commands/expression/two-files/TestObjCTypeQueryFromOtherCompileUnit.py (1796 of 2332) PASS: lldb-unit :: UnwindAssembly/x86/./UnwindAssemblyx86Tests/Testx86AssemblyInspectionEngine.TestPushRBPWithREX (1797 of 2332) PASS: lldb-shell :: Driver/TestConvenienceVariables.test (1798 of 2332) PASS: lldb-unit :: Utility/./UtilityTests/StringListTest.AppendStringMove (1799 of 2332) PASS: lldb-unit :: Utility/./UtilityTests/StreamTeeTest.SetStreamAtIndexOverwrite (1800 of 2332) PASS: lldb-unit :: Utility/./UtilityTests/PassiveReplayTest.InstrumentedBarPtr (1801 of 2332) PASS: lldb-api :: commands/platform/basic/TestPlatformCommand.py (1802 of 2332) PASS: lldb-shell :: SymbolFile/DWARF/x86/debug_loclists-dwo.s (1803 of 2332) PASS: lldb-api :: commands/version/TestVersion.py (1804 of 2332) PASS: lldb-unit :: Utility/./UtilityTests/VASprintfTest.BufferResize (1805 of 2332) PASS: lldb-unit :: ObjectFile/Breakpad/./ObjectFileBreakpadTests/ModuleRecord.parse (1806 of 2332) PASS: lldb-unit :: Utility/./UtilityTests/RegularExpression.Valid (1807 of 2332) PASS: lldb-api :: functionalities/thread/concurrent_events/TestConcurrentCrashWithSignal.py (1808 of 2332) PASS: lldb-api :: tools/lldb-server/TestGdbRemote_vCont.py (1809 of 2332) PASS: lldb-unit :: Utility/./UtilityTests/ScalarTest.Comparison (1810 of 2332) UNSUPPORTED: lldb-api :: functionalities/darwin_log/filter/exact_match/category/TestDarwinLogFilterMatchCategory.py (1811 of 2332) PASS: lldb-unit :: Utility/./UtilityTests/LogChannelEnabledTest.LogGetLogThread (1812 of 2332) PASS: lldb-shell :: SymbolFile/DWARF/x86/array-sizes.s (1813 of 2332) PASS: lldb-unit :: Process/Utility/./ProcessUtilityTests/ProcSMapTests/LinuxProcSMapsTestFixture.ParseSMapRegions/9 (1814 of 2332) PASS: lldb-api :: functionalities/data-formatter/type_summary_list_arg/TestTypeSummaryListArg.py (1815 of 2332) PASS: lldb-api :: lang/cpp/namespace_definitions/TestNamespaceDefinitions.py (1816 of 2332) PASS: lldb-api :: functionalities/thread/thread_exit/TestThreadExit.py (1817 of 2332) PASS: lldb-api :: functionalities/data-formatter/data-formatter-advanced/TestDataFormatterAdv.py (1818 of 2332) PASS: lldb-unit :: Process/gdb-remote/./ProcessGdbRemoteTests/GDBRemoteCommunicationServerTest.SendErrorResponse_ErrorNumber (1819 of 2332) PASS: lldb-unit :: Symbol/./SymbolTests/TestTypeSystemClang.TestRemoveFastQualifiers (1820 of 2332) PASS: lldb-unit :: Expression/./ExpressionTests/DWARFExpression.DW_OP_unknown (1821 of 2332) PASS: lldb-shell :: ObjectFile/MachO/lc_build_version.yaml (1822 of 2332) PASS: lldb-unit :: tools/lldb-server/tests/./LLDBServerTests/TestBase.DebugserverEnv (1823 of 2332) PASS: lldb-shell :: Quit/TestQuitExitCodeHexA.test (1824 of 2332) PASS: lldb-unit :: Utility/./UtilityTests/StringExtractorTest.GetHexBytes_Partial (1825 of 2332) PASS: lldb-api :: commands/watchpoints/watchpoint_commands/TestWatchpointCommands.py (1826 of 2332) PASS: lldb-unit :: Utility/./UtilityTests/ScalarTest.SetValueFromData (1827 of 2332) PASS: lldb-unit :: Utility/./UtilityTests/BinaryStreamTest.PutULEB128MaxValue (1828 of 2332) PASS: lldb-unit :: Symbol/./SymbolTests/TestClangASTImporter.CopyDeclTagDecl (1829 of 2332) PASS: lldb-unit :: Process/gdb-remote/./ProcessGdbRemoteTests/GDBRemoteCommunicationServerTest.SendErrorResponse_StringError (1830 of 2332) PASS: lldb-unit :: Utility/./UtilityTests/Flags.AnyClear (1831 of 2332) PASS: lldb-api :: commands/expression/import-std-module/vector-of-vectors/TestVectorOfVectorsFromStdModule.py (1832 of 2332) PASS: lldb-unit :: Utility/./UtilityTests/RangeTest.Clear (1833 of 2332) PASS: lldb-unit :: Language/Highlighting/./HighlighterTests/HighlighterTest.DefaultHighlighterWithCursorOutOfBounds (1834 of 2332) PASS: lldb-unit :: Core/./LLDBCoreTests/MangledTest.ResultForValidName (1835 of 2332) PASS: lldb-unit :: Utility/./UtilityTests/ScalarTest.SetValueFromCString (1836 of 2332) PASS: lldb-unit :: Utility/./UtilityTests/StringListTest.ForRangeEmpty (1837 of 2332) PASS: lldb-unit :: Host/./HostTests/ProcessLaunchInfoTest.Constructor (1838 of 2332) PASS: lldb-api :: functionalities/data-formatter/data-formatter-proper-plurals/TestFormattersOneIsSingular.py (1839 of 2332) PASS: lldb-api :: functionalities/object-file/TestImageListMultiArchitecture.py (1840 of 2332) PASS: lldb-unit :: Utility/./UtilityTests/VMRange.SetEndAddress (1841 of 2332) PASS: lldb-api :: python_api/findvalue_duplist/TestSBFrameFindValue.py (1842 of 2332) PASS: lldb-unit :: Utility/./UtilityTests/BinaryStreamTest.PutSLEB128EightBytes (1843 of 2332) PASS: lldb-api :: functionalities/breakpoint/source_regexp/TestSourceRegexBreakpoints.py (1844 of 2332) PASS: lldb-unit :: Utility/./UtilityTests/RecordReplayTest.InstrumentedBarPtr (1845 of 2332) PASS: lldb-unit :: Interpreter/./InterpreterTests/OptionArgParserTest.toScriptLanguage (1846 of 2332) PASS: lldb-shell :: ScriptInterpreter/Python/fail_breakpoint_oneline.test (1847 of 2332) PASS: lldb-api :: functionalities/plugins/python_os_plugin/stepping_plugin_threads/TestOSPluginStepping.py (1848 of 2332) PASS: lldb-unit :: Utility/./UtilityTests/ArgsTest.AppendArguments (1849 of 2332) PASS: lldb-unit :: Platform/./LLDBPlatformTests/PlatformDarwinTest.FindComponentInPath (1850 of 2332) PASS: lldb-unit :: SymbolFile/NativePDB/./SymbolFileNativePDBTests/PDBFPOProgramToDWARFExpressionTests.InvalidOpUnary (1851 of 2332) PASS: lldb-unit :: Utility/./UtilityTests/VMRange.IsValid (1852 of 2332) PASS: lldb-api :: functionalities/postmortem/mach-core/TestMachCore.py (1853 of 2332) PASS: lldb-shell :: ObjectFile/ELF/PT_LOAD-overlap.yaml (1854 of 2332) PASS: lldb-unit :: Utility/./UtilityTests/StringExtractorTest.GetHexU8_Exact_NoEof (1855 of 2332) UNSUPPORTED: lldb-shell :: Register/x86-64-xmm16-write.test (1856 of 2332) PASS: lldb-unit :: Utility/./UtilityTests/StringExtractorTest.GetU64LittleEndian (1857 of 2332) PASS: lldb-shell :: ScriptInterpreter/None/none.test (1858 of 2332) UNSUPPORTED: lldb-shell :: Register/aarch64-gp-read.test (1859 of 2332) PASS: lldb-api :: commands/process/attach/attach_denied/TestAttachDenied.py (1860 of 2332) PASS: lldb-shell :: SymbolFile/DWARF/x86/debug-types-basic.test (1861 of 2332) PASS: lldb-api :: functionalities/gdb_remote_client/TestRegDefinitionInParts.py (1862 of 2332) PASS: lldb-unit :: Language/Highlighting/./HighlighterTests/HighlighterTest.Keywords (1863 of 2332) PASS: lldb-api :: commands/expression/import-std-module/pair/TestPairFromStdModule.py (1864 of 2332) PASS: lldb-api :: functionalities/data-formatter/boolreference/TestFormattersBoolRefPtr.py (1865 of 2332) PASS: lldb-api :: macosx/load-kext/TestLoadKext.py (1866 of 2332) PASS: lldb-api :: python_api/frame/TestFrames.py (1867 of 2332) PASS: lldb-api :: commands/expression/import-std-module/unique_ptr/TestUniquePtrFromStdModule.py (1868 of 2332) PASS: lldb-api :: lang/cpp/incomplete-types/TestCppIncompleteTypes.py (1869 of 2332) UNSUPPORTED: lldb-api :: functionalities/ubsan/basic/TestUbsanBasic.py (1870 of 2332) PASS: lldb-shell :: SymbolFile/DWARF/x86/find-method-local-struct.cpp (1871 of 2332) PASS: lldb-api :: lang/objcxx/cxx-bridged-po/TestObjCXXBridgedPO.py (1872 of 2332) PASS: lldb-unit :: UnwindAssembly/x86/./UnwindAssemblyx86Tests/Testx86AssemblyInspectionEngine.TestStackRealign8BitDisp_i386 (1873 of 2332) PASS: lldb-shell :: SymbolFile/DWARF/x86/dwarf5-index-is-used.cpp (1874 of 2332) PASS: lldb-unit :: Host/./HostTests/SocketTests/SocketTest.UDPGetConnectURI/ipv4 (1875 of 2332) PASS: lldb-unit :: Utility/./UtilityTests/BinaryStreamTest.PutULEB128EightBytes (1876 of 2332) UNSUPPORTED: lldb-api :: arm/breakpoint-thumb-codesection/TestBreakpointThumbCodesection.py (1877 of 2332) PASS: lldb-api :: lang/c/stepping/TestThreadStepping.py (1878 of 2332) PASS: lldb-api :: python_api/watchpoint/TestWatchpointIter.py (1879 of 2332) PASS: lldb-unit :: DataFormatter/./LLDBFormatterTests/TypeMatcherTests.CreatedBySameMatchStringExactNamePrefixes (1880 of 2332) PASS: lldb-unit :: ObjectFile/ELF/./ObjectFileELFTests/ObjectFileELFTest.GetSymtab_NoSymEntryPointArmThumbAddressClass (1881 of 2332) PASS: lldb-shell :: Commands/command-image-lookup.yaml (1882 of 2332) PASS: lldb-api :: functionalities/data-formatter/data-formatter-stl/libcxx/string/TestDataFormatterLibcxxString.py (1883 of 2332) PASS: lldb-api :: functionalities/thread/exit_during_step/TestExitDuringStep.py (1884 of 2332) PASS: lldb-unit :: Expression/./ExpressionTests/CppModuleConfigurationTest.LibCppV2 (1885 of 2332) PASS: lldb-api :: commands/expression/entry-bp/TestExprEntryBP.py (1886 of 2332) UNSUPPORTED: lldb-api :: functionalities/darwin_log/filter/exact_match/message/TestDarwinLogFilterMatchMessage.py (1887 of 2332) UNSUPPORTED: lldb-api :: commands/trace/TestTraceSchema.py (1888 of 2332) PASS: lldb-unit :: Utility/./UtilityTests/ScalarTest.Equality (1889 of 2332) PASS: lldb-unit :: Host/./HostTests/SocketTests/SocketTest.TCPListen0GetPort/ipv4 (1890 of 2332) PASS: lldb-unit :: Expression/./ExpressionTests/CppModuleConfigurationTest.UnknownLibCppFile (1891 of 2332) PASS: lldb-unit :: Utility/./UtilityTests/StringExtractorTest.GetHexU8_InvalidHex (1892 of 2332) PASS: lldb-unit :: Utility/./UtilityTests/LogChannelTest.List (1893 of 2332) UNSUPPORTED: lldb-api :: tools/lldb-server/TestGdbRemoteAuxvSupport.py (1894 of 2332) PASS: lldb-unit :: UnwindAssembly/x86/./UnwindAssemblyx86Tests/Testx86AssemblyInspectionEngine.TestPopR13 (1895 of 2332) PASS: lldb-unit :: Utility/./UtilityTests/StringLexerTest.NextIfList (1896 of 2332) PASS: lldb-unit :: Utility/./UtilityTests/RangeTest.Constructor (1897 of 2332) PASS: lldb-api :: functionalities/data-formatter/data-formatter-stl/libcxx/deque/TestDataFormatterLibcxxDeque.py (1898 of 2332) PASS: lldb-api :: functionalities/thread/concurrent_events/TestConcurrentDelayedCrashWithBreakpointSignal.py (1899 of 2332) UNSUPPORTED: lldb-api :: tools/lldb-server/TestGdbRemoteModuleInfo.py (1900 of 2332) PASS: lldb-unit :: Utility/./UtilityTests/TimerTest.CategoryTimes (1901 of 2332) PASS: lldb-api :: commands/watchpoints/multiple_threads/TestWatchpointMultipleThreads.py (1902 of 2332) PASS: lldb-api :: functionalities/set-data/TestSetData.py (1903 of 2332) PASS: lldb-shell :: Register/Core/x86-64-linux-addr.test (1904 of 2332) PASS: lldb-shell :: SymbolFile/DWARF/x86/dwp.s (1905 of 2332) PASS: lldb-unit :: Utility/./UtilityTests/StringListTest.AppendListCStringArrayEmpty (1906 of 2332) PASS: lldb-api :: lang/cpp/static_methods/TestCPPStaticMethods.py (1907 of 2332) PASS: lldb-unit :: DataFormatter/./LLDBFormatterTests/TypeMatcherTests.RegexMatchPart (1908 of 2332) PASS: lldb-api :: functionalities/data-formatter/data-formatter-objc/TestDataFormatterObjCNSContainer.py (1909 of 2332) PASS: lldb-shell :: ObjectFile/ELF/eh_frame-symbols.yaml (1910 of 2332) PASS: lldb-unit :: Utility/./UtilityTests/ArchSpecTest.OperatorBool (1911 of 2332) PASS: lldb-unit :: Core/./LLDBCoreTests/MangledTest.EmptyForInvalidName (1912 of 2332) PASS: lldb-api :: functionalities/breakpoint/auto_continue/TestBreakpointAutoContinue.py (1913 of 2332) PASS: lldb-api :: functionalities/thread/concurrent_events/TestConcurrentTwoWatchpointsOneSignal.py (1914 of 2332) PASS: lldb-shell :: ObjectFile/ELF/PT_LOAD-overlap-section.yaml (1915 of 2332) UNSUPPORTED: lldb-api :: linux/aarch64/mte_memory_region/TestAArch64LinuxMTEMemoryRegion.py (1916 of 2332) PASS: lldb-unit :: Utility/./UtilityTests/RangeTest.Union (1917 of 2332) PASS: lldb-unit :: ScriptInterpreter/Python/./ScriptInterpreterPythonTests/PythonDataObjectsTest.TestGlobalNameResolutionNoDot (1918 of 2332) PASS: lldb-unit :: Utility/./UtilityTests/StreamTest.AddressPrefixAndSuffix (1919 of 2332) PASS: lldb-api :: commands/expression/weak_symbols/TestWeakSymbols.py (1920 of 2332) PASS: lldb-api :: functionalities/postmortem/minidump-new/TestMiniDumpUUID.py (1921 of 2332) PASS: lldb-api :: functionalities/thread/concurrent_events/TestConcurrentTwoBreakpointThreads.py (1922 of 2332) PASS: lldb-api :: lang/cpp/class_types/TestClassTypes.py (1923 of 2332) PASS: lldb-unit :: Utility/./UtilityTests/LogChannelEnabledTest.LLDB_LOG_ERROR (1924 of 2332) PASS: lldb-unit :: Target/./TargetTests/ExecutionContextTest.GetByteOrderProcess (1925 of 2332) PASS: lldb-unit :: Platform/Android/./AdbClientTests/AdbClientTest.CreateByDeviceId (1926 of 2332) PASS: lldb-shell :: SymbolFile/NativePDB/source-list.cpp (1927 of 2332) PASS: lldb-api :: lang/cpp/typeof/TestTypeOfDeclTypeExpr.py (1928 of 2332) PASS: lldb-unit :: Process/minidump/./LLDBMinidumpTests/MinidumpParserTest.GetMemoryRegionInfoFromMemoryList (1929 of 2332) PASS: lldb-unit :: Utility/./UtilityTests/StatusTest.ErrorCodeConstructor (1930 of 2332) PASS: lldb-unit :: Utility/./UtilityTests/StreamTest.AddressRangeEmptyRange (1931 of 2332) PASS: lldb-unit :: Language/Highlighting/./HighlighterTests/HighlighterTest.ClangPreserveNewLine (1932 of 2332) PASS: lldb-unit :: debugserver/./debugserverTests/RNBSocket.LoopBackListenIPv6 (1933 of 2332) PASS: lldb-unit :: Language/Highlighting/./HighlighterTests/HighlighterTest.HighlighterSelectionType (1934 of 2332) UNSUPPORTED: lldb-api :: functionalities/darwin_log/filter/exact_match/activity-chain/TestDarwinLogFilterMatchActivityChain.py (1935 of 2332) PASS: lldb-unit :: Utility/./UtilityTests/UUIDTest.Validity (1936 of 2332) PASS: lldb-unit :: Utility/./UtilityTests/ArchSpecTest.TestParseMachCPUDashSubtypeTripleSimple (1937 of 2332) PASS: lldb-unit :: UnwindAssembly/x86/./UnwindAssemblyx86Tests/Testx86AssemblyInspectionEngine.TestLEAVE (1938 of 2332) PASS: lldb-unit :: ScriptInterpreter/Python/./ScriptInterpreterPythonTests/PythonDataObjectsTest.TestPythonByteArray (1939 of 2332) PASS: lldb-shell :: SymbolFile/Breakpad/line-table.test (1940 of 2332) PASS: lldb-unit :: Host/./HostTests/FileSystemTest.Readable (1941 of 2332) PASS: lldb-unit :: Core/./LLDBCoreTests/SourceFileCache.FindSourceFileNotFound (1942 of 2332) PASS: lldb-api :: python_api/value/empty_class/TestValueAPIEmptyClass.py (1943 of 2332) PASS: lldb-api :: functionalities/data-formatter/nssetsynth/TestNSSetSynthetic.py (1944 of 2332) PASS: lldb-unit :: Symbol/./SymbolTests/TestTypeSystemClang.TestGetBasicTypeFromName (1945 of 2332) PASS: lldb-shell :: SymbolFile/DWARF/x86/compilercontext.ll (1946 of 2332) PASS: lldb-api :: functionalities/thread/concurrent_events/TestConcurrentManyBreakpoints.py (1947 of 2332) PASS: lldb-unit :: Core/./LLDBCoreTests/SourceLocationSpecTest.FileLineColumnComponents (1948 of 2332) PASS: lldb-api :: functionalities/thread/concurrent_events/TestConcurrentCrashWithWatchpoint.py (1949 of 2332) PASS: lldb-unit :: Target/./TargetTests/ExecutionContextTest.GetByteOrderTarget (1950 of 2332) PASS: lldb-api :: functionalities/data-formatter/data-formatter-objc/TestDataFormatterObjCNSError.py (1951 of 2332) UNSUPPORTED: lldb-shell :: SymbolFile/DWARF/debug-types-expressions.test (1952 of 2332) PASS: lldb-api :: lang/cpp/dynamic-value-same-basename/TestDynamicValueSameBase.py (1953 of 2332) PASS: lldb-unit :: Utility/./UtilityTests/ScalarTest.LongLongAssigmentOperator (1954 of 2332) PASS: lldb-unit :: Process/gdb-remote/./ProcessGdbRemoteTests/GDBRemoteCommunicationClientTest.GetMemoryRegionInfo (1955 of 2332) PASS: lldb-api :: commands/settings/quoting/TestQuoting.py (1956 of 2332) PASS: lldb-unit :: Process/minidump/./LLDBMinidumpTests/MinidumpParserTest.MinidumpDuplicateModuleMappedSecond (1957 of 2332) PASS: lldb-shell :: Breakpoint/case-sensitive.test (1958 of 2332) PASS: lldb-api :: commands/expression/calculator_mode/TestCalculatorMode.py (1959 of 2332) UNSUPPORTED: lldb-api :: functionalities/thread/concurrent_events/TestConcurrentManySignals.py (1960 of 2332) PASS: lldb-unit :: SymbolFile/DWARF/./SymbolFileDWARFTests/SymbolFileDWARFTests.TestAbilitiesForDWARF (1961 of 2332) PASS: lldb-api :: functionalities/breakpoint/inlined_breakpoints/TestInlinedBreakpoints.py (1962 of 2332) PASS: lldb-shell :: SymbolFile/DWARF/x86/find-qualified-variable.cpp (1963 of 2332) PASS: lldb-unit :: Core/./LLDBCoreTests/DumpDataExtractorTest.NullStream (1964 of 2332) PASS: lldb-unit :: Utility/./UtilityTests/StringListTest.JoinSingle (1965 of 2332) PASS: lldb-api :: commands/target/modules/search-paths/insert/TestTargetModulesSearchpathsInsert.py (1966 of 2332) PASS: lldb-unit :: Utility/./UtilityTests/StringListTest.JoinNonSpace (1967 of 2332) PASS: lldb-unit :: Utility/./UtilityTests/StreamTeeTest.Constructor2Streams (1968 of 2332) PASS: lldb-shell :: ObjectFile/PECOFF/export-dllfunc.yaml (1969 of 2332) PASS: lldb-unit :: Signals/./SignalsTests/UnixSignalsTest.GetInfo (1970 of 2332) PASS: lldb-unit :: UnwindAssembly/x86/./UnwindAssemblyx86Tests/Testx86AssemblyInspectionEngine.TestPopEBP (1971 of 2332) PASS: lldb-api :: lang/c/struct_types/TestStructTypes.py (1972 of 2332) PASS: lldb-unit :: Utility/./UtilityTests/ProcessInstanceInfoList.Yaml (1973 of 2332) PASS: lldb-api :: functionalities/gdb_remote_client/TestIOSSimulator.py (1974 of 2332) PASS: lldb-api :: lang/objc/radar-9691614/TestObjCMethodReturningBOOL.py (1975 of 2332) PASS: lldb-unit :: Utility/./UtilityTests/VMRange.ContainsAddr (1976 of 2332) PASS: lldb-unit :: Expression/./ExpressionTests/CppModuleConfigurationTest.LinuxLocalLibCpp (1977 of 2332) PASS: lldb-unit :: Utility/./UtilityTests/DataExtractorTest.GetCStr (1978 of 2332) PASS: lldb-api :: commands/expression/vector_of_enums/TestVectorOfEnums.py (1979 of 2332) PASS: lldb-api :: commands/expression/class_template_specialization_empty_pack/TestClassTemplateSpecializationParametersHandling.py (1980 of 2332) PASS: lldb-unit :: Language/Highlighting/./HighlighterTests/HighlighterTest.ClangScalarLiterals (1981 of 2332) PASS: lldb-api :: python_api/breakpoint/TestBreakpointAPI.py (1982 of 2332) UNSUPPORTED: lldb-api :: macosx/macCatalystAppMacOSFramework/TestMacCatalystAppWithMacOSFramework.py (1983 of 2332) PASS: lldb-unit :: Utility/./UtilityTests/ConstStringTest.NullAndEmptyStates (1984 of 2332) PASS: lldb-shell :: Minidump/dump-all.test (1985 of 2332) PASS: lldb-api :: api/command-return-object/TestSBCommandReturnObject.py (1986 of 2332) UNSUPPORTED: lldb-api :: benchmarks/expression/TestRepeatedExprs.py (1987 of 2332) PASS: lldb-unit :: Utility/./UtilityTests/StreamTest.AddressRangeSize (1988 of 2332) PASS: lldb-shell :: Quit/TestQuitExitCode-30.test (1989 of 2332) PASS: lldb-shell :: ObjectFile/PECOFF/symbol.yaml (1990 of 2332) UNSUPPORTED: lldb-api :: iohandler/autosuggestion/TestAutosuggestion.py (1991 of 2332) PASS: lldb-unit :: Host/./HostTests/NativeProcessProtocolTest.ReadCStringFromMemory_CrossPageBoundary (1992 of 2332) PASS: lldb-api :: macosx/DBGSourcePathRemapping/TestDSYMSourcePathRemapping.py (1993 of 2332) UNSUPPORTED: lldb-api :: functionalities/breakpoint/breakpoint_in_delayslot/TestAvoidBreakpointInDelaySlot.py (1994 of 2332) PASS: lldb-unit :: Utility/./UtilityTests/StringListTest.CopyListSingle (1995 of 2332) PASS: lldb-unit :: UnwindAssembly/x86/./UnwindAssemblyx86Tests/Testx86AssemblyInspectionEngine.Test32bitFramelessSmallStackFrame (1996 of 2332) PASS: lldb-unit :: Target/./TargetTests/PathMappingListTest.RemapRoot (1997 of 2332) PASS: lldb-unit :: DataFormatter/./LLDBFormatterTests/FormatManagerTests.CompatibleLangs (1998 of 2332) PASS: lldb-api :: functionalities/data-formatter/data-formatter-named-summaries/TestDataFormatterNamedSummaries.py (1999 of 2332) PASS: lldb-unit :: Utility/./UtilityTests/UriParserTest.SchemeHostSeparator3 (2000 of 2332) PASS: lldb-api :: python_api/process/TestProcessAPI.py (2001 of 2332) PASS: lldb-api :: commands/expression/invalid-args/TestInvalidArgsExpression.py (2002 of 2332) PASS: lldb-shell :: ScriptInterpreter/Python/Crashlog/json.test (2003 of 2332) PASS: lldb-api :: lang/cpp/gmodules/TestWithModuleDebugging.py (2004 of 2332) PASS: lldb-shell :: ObjectFile/PECOFF/basic-info-arm64.yaml (2005 of 2332) PASS: lldb-shell :: ScriptInterpreter/None/import_module.test (2006 of 2332) PASS: lldb-api :: commands/expression/import-std-module/vector-dbg-info-content/TestDbgInfoContentVectorFromStdModule.py (2007 of 2332) PASS: lldb-api :: lang/objc/blocks/TestObjCIvarsInBlocks.py (2008 of 2332) PASS: lldb-shell :: ObjectFile/PECOFF/section-types.yaml (2009 of 2332) PASS: lldb-shell :: BuildScript/modes.test (2010 of 2332) PASS: lldb-unit :: Host/./HostTests/SocketTests/SocketTest.TCPGetAddress/ipv4 (2011 of 2332) PASS: lldb-api :: commands/expression/context-object-objc/TestContextObjectObjc.py (2012 of 2332) PASS: lldb-shell :: Register/x86-64-read.test (2013 of 2332) PASS: lldb-unit :: Process/gdb-remote/./ProcessGdbRemoteTests/GDBRemoteCommunicationClientTest.WriteRegister (2014 of 2332) PASS: lldb-unit :: UnwindAssembly/x86/./UnwindAssemblyx86Tests/Testx86AssemblyInspectionEngine.TestStackRealignMSVC_i386 (2015 of 2332) PASS: lldb-api :: commands/expression/char/TestExprsChar.py (2016 of 2332) PASS: lldb-api :: functionalities/data-formatter/refpointer-recursion/TestDataFormatterRefPtrRecursion.py (2017 of 2332) PASS: lldb-api :: functionalities/data-formatter/data-formatter-objc/TestDataFormatterObjCNSDate.py (2018 of 2332) PASS: lldb-unit :: Host/./HostTests/FileSystemTest.OpenErrno (2019 of 2332) PASS: lldb-unit :: Language/Highlighting/./HighlighterTests/HighlighterTest.ClangSquareBrackets (2020 of 2332) PASS: lldb-api :: commands/expression/radar_9531204/TestPrintfAfterUp.py (2021 of 2332) PASS: lldb-api :: lang/objc/objc-static-method/TestObjCStaticMethod.py (2022 of 2332) PASS: lldb-unit :: Expression/./ExpressionTests/DiagnosticManagerTest.AppendMessageSubsequentDiags (2023 of 2332) PASS: lldb-unit :: DataFormatter/./LLDBFormatterTests/TypeMatcherTests.GetMatchStringExactName (2024 of 2332) PASS: lldb-unit :: Utility/./UtilityTests/LogChannelEnabledTest.log_options (2025 of 2332) PASS: lldb-api :: functionalities/breakpoint/debugbreak/TestDebugBreak.py (2026 of 2332) PASS: lldb-unit :: Utility/./UtilityTests/LogTest.LLDB_LOG_nullptr (2027 of 2332) PASS: lldb-shell :: ExecControl/StopHook/stop-hook.test (2028 of 2332) PASS: lldb-api :: commands/watchpoints/watchpoint_on_vectors/TestValueOfVectorVariable.py (2029 of 2332) PASS: lldb-unit :: Utility/./UtilityTests/ScalarTest.APIntConstructor (2030 of 2332) PASS: lldb-api :: lang/cpp/std-function-step-into-callable/TestStdFunctionStepIntoCallable.py (2031 of 2332) PASS: lldb-shell :: Driver/TestError.test (2032 of 2332) PASS: lldb-unit :: Expression/./ExpressionTests/CppModuleConfigurationTest.Sysroot (2033 of 2332) PASS: lldb-api :: functionalities/data-formatter/data-formatter-stl/libcxx/shared_ptr/TestDataFormatterLibcxxSharedPtr.py (2034 of 2332) PASS: lldb-unit :: Process/gdb-remote/./ProcessGdbRemoteTests/GDBRemoteCommunicationClientTest.WriteRegisterNoSuffix (2035 of 2332) PASS: lldb-unit :: Process/gdb-remote/./ProcessGdbRemoteTests/GDBRemoteCommunicationClientTest.GetModulesInfoInvalidResponse (2036 of 2332) PASS: lldb-shell :: Minidump/memory-region-from-module.yaml (2037 of 2332) PASS: lldb-shell :: SymbolFile/DWARF/x86/find-basic-variable.cpp (2038 of 2332) UNSUPPORTED: lldb-api :: functionalities/unwind/standard/TestStandardUnwind.py (2039 of 2332) PASS: lldb-unit :: Utility/./UtilityTests/UriParserTest.Minimal (2040 of 2332) PASS: lldb-shell :: Register/Core/x86-32-linux-addr.test (2041 of 2332) PASS: lldb-unit :: Process/gdb-remote/./ProcessGdbRemoteTests/GDBRemoteCommunicationTest.ReadPacket_checksum (2042 of 2332) PASS: lldb-api :: lang/cpp/char1632_t/TestChar1632T.py (2043 of 2332) PASS: lldb-unit :: Target/./TargetTests/ModuleCacheTest.GetAndPutUuidExists (2044 of 2332) PASS: lldb-unit :: Target/./TargetTests/MemoryRegionInfoTest.Formatv (2045 of 2332) PASS: lldb-unit :: Utility/./UtilityTests/BinaryStreamTest.PutSLEB128ThreeBytes (2046 of 2332) PASS: lldb-unit :: Utility/./UtilityTests/RangeTest.Equal (2047 of 2332) UNSUPPORTED: lldb-api :: functionalities/thread/multi_break/TestMultipleBreakpoints.py (2048 of 2332) PASS: lldb-unit :: Utility/./UtilityTests/StreamTest.AddressEmptyPrefix (2049 of 2332) PASS: lldb-unit :: Process/gdb-remote/./ProcessGdbRemoteTests/PortMapTest.FreePortForProcess (2050 of 2332) PASS: lldb-api :: lang/objc/modules-non-objc-target/TestObjCModulesNonObjCTarget.py (2051 of 2332) PASS: lldb-api :: commands/apropos/with-process/TestAproposWithProcess.py (2052 of 2332) PASS: lldb-api :: lang/cpp/operator-overload/TestOperatorOverload.py (2053 of 2332) PASS: lldb-api :: lang/objc/modules-cache/TestClangModulesCache.py (2054 of 2332) PASS: lldb-api :: functionalities/data-formatter/data-formatter-stl/libcxx/multimap/TestDataFormatterLibccMultiMap.py (2055 of 2332) PASS: lldb-unit :: Process/Utility/./ProcessUtilityTests/RegisterContext_x86Test.FullToAbridgedTagWord (2056 of 2332) PASS: lldb-api :: lang/c/anonymous/TestAnonymous.py (2057 of 2332) PASS: lldb-api :: tools/lldb-vscode/breakpoint/TestVSCode_setBreakpoints.py (2058 of 2332) PASS: lldb-api :: commands/expression/import-std-module/non-module-type-separation/TestNonModuleTypeSeparation.py (2059 of 2332) PASS: lldb-unit :: Utility/./UtilityTests/StringExtractorTest.GetHexU8_Extra (2060 of 2332) PASS: lldb-unit :: Symbol/./SymbolTests/TestTypeSystemClang.TestIsClangType (2061 of 2332) PASS: lldb-api :: lang/objc/bitfield_ivars/TestBitfieldIvars.py (2062 of 2332) PASS: lldb-unit :: UnwindAssembly/x86/./UnwindAssemblyx86Tests/Testx86AssemblyInspectionEngine.TestSubRSP (2063 of 2332) PASS: lldb-unit :: Utility/./UtilityTests/RangeTest.ContainsAddr (2064 of 2332) PASS: lldb-unit :: ScriptInterpreter/Python/./ScriptInterpreterPythonTests/PythonDataObjectsTest.TestPythonIntegerToStructuredInteger (2065 of 2332) PASS: lldb-unit :: Utility/./UtilityTests/FileSpecTest.GetPath (2066 of 2332) PASS: lldb-shell :: ObjectFile/wasm/embedded-debug-sections.yaml (2067 of 2332) UNSUPPORTED: lldb-shell :: SymbolFile/DWARF/x86/DW_TAG_variable-DW_AT_decl_file-DW_AT_abstract_origin-crosscu1.s (2068 of 2332) PASS: lldb-api :: functionalities/fat_archives/TestFatArchives.py (2069 of 2332) PASS: lldb-unit :: Target/./TargetTests/ExecutionContextTest.GetByteOrder (2070 of 2332) PASS: lldb-unit :: UnwindAssembly/x86/./UnwindAssemblyx86Tests/Testx86AssemblyInspectionEngine.TestPushR12 (2071 of 2332) PASS: lldb-api :: commands/expression/import-std-module/empty-module/TestEmptyStdModule.py (2072 of 2332) PASS: lldb-unit :: ScriptInterpreter/Python/./ScriptInterpreterPythonTests/PythonDataObjectsTest.TestRun (2073 of 2332) PASS: lldb-unit :: Expression/./ExpressionTests/CppModuleConfigurationTest.AmbiguousLibCpp (2074 of 2332) PASS: lldb-unit :: Utility/./UtilityTests/BinaryStreamTest.PutSLEB128One (2075 of 2332) PASS: lldb-unit :: Language/Highlighting/./HighlighterTests/HighlighterTest.HighlighterSelectionPath (2076 of 2332) PASS: lldb-api :: lang/cpp/type_lookup/TestCppTypeLookup.py (2077 of 2332) UNSUPPORTED: lldb-shell :: Register/x86-64-zmm-read.test (2078 of 2332) PASS: lldb-unit :: Expression/./ExpressionTests/DiagnosticManagerTest.GetStringPreserveOrder (2079 of 2332) PASS: lldb-api :: functionalities/process_group/TestChangeProcessGroup.py (2080 of 2332) PASS: lldb-shell :: ScriptInterpreter/Python/command_relative_import.test (2081 of 2332) PASS: lldb-api :: commands/expression/import-std-module/iterator/TestIteratorFromStdModule.py (2082 of 2332) PASS: lldb-shell :: SymbolFile/NativePDB/ast-functions.cpp (2083 of 2332) UNSUPPORTED: lldb-api :: benchmarks/expression/TestExpressionCmd.py (2084 of 2332) PASS: lldb-unit :: Utility/./UtilityTests/BinaryStreamTest.PutSLEB128MaxValue (2085 of 2332) PASS: lldb-api :: commands/command/nested_alias/TestNestedAlias.py (2086 of 2332) UNSUPPORTED: lldb-shell :: SymbolFile/PDB/function-nested-block.test (2087 of 2332) PASS: lldb-api :: functionalities/tail_call_frames/cross_object/TestCrossObjectTailCalls.py (2088 of 2332) PASS: lldb-unit :: DataFormatter/./LLDBFormatterTests/StringPrinterTests.SwiftUTF8 (2089 of 2332) PASS: lldb-api :: functionalities/backticks/TestBackticksWithoutATarget.py (2090 of 2332) PASS: lldb-api :: commands/watchpoints/watchpoint_commands/command/TestWatchpointCommandPython.py (2091 of 2332) PASS: lldb-unit :: Utility/./UtilityTests/BinaryStreamTest.PutSLEB128FourBytes (2092 of 2332) PASS: lldb-unit :: Expression/./ExpressionTests/DiagnosticManagerTest.PutStringSeverities (2093 of 2332) PASS: lldb-api :: functionalities/data-formatter/data-formatter-smart-array/TestDataFormatterSmartArray.py (2094 of 2332) PASS: lldb-shell :: lldb-server/TestErrorMessages.test (2095 of 2332) PASS: lldb-shell :: SymbolFile/Breakpad/stack-cfi-parsing.test (2096 of 2332) PASS: lldb-api :: commands/expression/function_template_specialization_temp_args/TestFunctionTemplateSpecializationTempArgs.py (2097 of 2332) PASS: lldb-api :: lang/objc/objc++/TestObjCXX.py (2098 of 2332) PASS: lldb-shell :: Expr/TestIRMemoryMap.test (2099 of 2332) PASS: lldb-api :: python_api/process/io/TestProcessIO.py (2100 of 2332) PASS: lldb-shell :: SymbolFile/DWARF/DW_AT_range-DW_FORM_sec_offset.s (2101 of 2332) PASS: lldb-unit :: Process/gdb-remote/./ProcessGdbRemoteTests/GDBRemoteCommunicationClientTest.GetMemoryRegionInfoInvalidResponse (2102 of 2332) UNSUPPORTED: lldb-api :: functionalities/darwin_log/filter/regex/subsystem/TestDarwinLogFilterRegexSubsystem.py (2103 of 2332) PASS: lldb-unit :: debugserver/./debugserverTests/RNBSocket.LoopBackConnectIPv6 (2104 of 2332) PASS: lldb-shell :: Reproducer/TestFileRepro.test (2105 of 2332) UNSUPPORTED: lldb-api :: commands/trace/TestTraceLoad.py (2106 of 2332) PASS: lldb-unit :: Host/./HostTests/SocketTests/SocketTest.DomainGetConnectURI/ipv6 (2107 of 2332) PASS: lldb-shell :: Reproducer/TestDump.test (2108 of 2332) PASS: lldb-unit :: Process/Utility/./ProcessUtilityTests/ProcMapTests/LinuxProcMapsTestFixture.ParseMapRegions/1 (2109 of 2332) PASS: lldb-unit :: Host/./HostTests/FileSystemTest.Resolve (2110 of 2332) PASS: lldb-api :: functionalities/thread/concurrent_events/TestConcurrentWatchpointWithDelayWatchpointThreads.py (2111 of 2332) PASS: lldb-api :: types/TestRecursiveTypes.py (2112 of 2332) PASS: lldb-api :: python_api/watchpoint/TestWatchpointIgnoreCount.py (2113 of 2332) PASS: lldb-unit :: Host/./HostTests/NativeProcessProtocolTest.SetBreakpointFailVerify (2114 of 2332) PASS: lldb-unit :: ScriptInterpreter/Python/./ScriptInterpreterPythonTests/PythonDataObjectsTest.TestBorrowedReferences (2115 of 2332) PASS: lldb-api :: commands/thread/select/TestThreadSelect.py (2116 of 2332) PASS: lldb-api :: tools/lldb-server/TestGdbRemoteHostInfo.py (2117 of 2332) PASS: lldb-api :: functionalities/data-formatter/data-formatter-caching/TestDataFormatterCaching.py (2118 of 2332) PASS: lldb-api :: functionalities/inferior-crashing/TestInferiorCrashing.py (2119 of 2332) PASS: lldb-unit :: Utility/./UtilityTests/ArgsTest.ReplaceArgumentAtIndexFarOutOfRange (2120 of 2332) PASS: lldb-api :: functionalities/memory/cache/TestMemoryCache.py (2121 of 2332) PASS: lldb-unit :: Utility/./UtilityTests/StreamTest.PutCharWhitespace (2122 of 2332) PASS: lldb-api :: api/multiple-debuggers/TestMultipleDebuggers.py (2123 of 2332) PASS: lldb-unit :: Symbol/./SymbolTests/TestClangASTImporter.DeportDeclTagDecl (2124 of 2332) PASS: lldb-unit :: Host/./HostTests/FileSystemTest.MakeAbsolute (2125 of 2332) PASS: lldb-shell :: ObjectFile/ELF/PT_LOAD-empty.yaml (2126 of 2332) UNSUPPORTED: lldb-shell :: Unwind/unwind-plan-dwarf-dump.test (2127 of 2332) PASS: lldb-unit :: Process/Utility/./ProcessUtilityTests/ProcSMapTests/LinuxProcSMapsTestFixture.ParseSMapRegions/6 (2128 of 2332) PASS: lldb-api :: functionalities/memory-region/TestMemoryRegion.py (2129 of 2332) PASS: lldb-api :: tools/lldb-server/TestGdbRemoteRegisterState.py (2130 of 2332) PASS: lldb-api :: python_api/get-value-32bit-int/TestGetValue32BitInt.py (2131 of 2332) PASS: lldb-api :: lang/objc/objc-struct-return/TestObjCStructReturn.py (2132 of 2332) PASS: lldb-unit :: Process/minidump/./LLDBMinidumpTests/MinidumpParserTest.GetThreadContext_x86_32_wow64 (2133 of 2332) PASS: lldb-api :: commands/expression/completion-crash-incomplete-record/TestCompletionCrashIncompleteRecord.py (2134 of 2332) PASS: lldb-shell :: Driver/TestNoUseColor.test (2135 of 2332) PASS: lldb-unit :: Symbol/./SymbolTests/PostfixExpression.ParseFPOProgram (2136 of 2332) PASS: lldb-shell :: Commands/command-disassemble-process.yaml (2137 of 2332) UNSUPPORTED: lldb-api :: macosx/simulator/TestSimulatorPlatform.py (2138 of 2332) PASS: lldb-api :: lang/objc/objc-stepping/TestObjCStepping.py (2139 of 2332) PASS: lldb-api :: commands/quit/TestQuit.py (2140 of 2332) PASS: lldb-unit :: Utility/./UtilityTests/UriParserTest.MinimalPath (2141 of 2332) PASS: lldb-unit :: Utility/./UtilityTests/ArgsTest.ReplaceArgumentAtIndexOutOfRange (2142 of 2332) PASS: lldb-api :: macosx/builtin-debugtrap/TestBuiltinDebugTrap.py (2143 of 2332) PASS: lldb-api :: sanity/TestModuleCacheSanity.py (2144 of 2332) PASS: lldb-unit :: Expression/./ExpressionTests/CppModuleConfigurationTest.MissingLibCpp (2145 of 2332) PASS: lldb-shell :: ObjectFile/PECOFF/dep-modules.yaml (2146 of 2332) PASS: lldb-api :: commands/expression/import-std-module/list/TestListFromStdModule.py (2147 of 2332) UNSUPPORTED: lldb-shell :: SymbolFile/PDB/ast-restore.test (2148 of 2332) PASS: lldb-unit :: Utility/./UtilityTests/StreamTest.PutBytesAsRawHex8ToBigEndian (2149 of 2332) PASS: lldb-api :: functionalities/archives/TestBSDArchives.py (2150 of 2332) PASS: lldb-unit :: Utility/./UtilityTests/OptionsWithRawTest.EmptySuffix (2151 of 2332) UNSUPPORTED: lldb-api :: tools/intel-features/intel-pt/test/TestIntelPTSimpleBinary.py (2152 of 2332) PASS: lldb-unit :: Utility/./UtilityTests/DataExtractorTest.PeekData (2153 of 2332) PASS: lldb-shell :: SymbolFile/NativePDB/ast-methods.cpp (2154 of 2332) PASS: lldb-shell :: ObjectFile/ELF/build-id-case.yaml (2155 of 2332) UNSUPPORTED: lldb-shell :: Register/x86-zmm-read.test (2156 of 2332) PASS: lldb-shell :: Quit/TestQuitExitCodeImplicit0.test (2157 of 2332) PASS: lldb-unit :: UnwindAssembly/x86/./UnwindAssemblyx86Tests/Testx86AssemblyInspectionEngine.TestSimplex86_64Augmented (2158 of 2332) PASS: lldb-unit :: Process/minidump/./LLDBMinidumpTests/MinidumpParserTest.GetMemoryRegionInfoLinuxMaps (2159 of 2332) PASS: lldb-api :: commands/session/save/TestSessionSave.py (2160 of 2332) PASS: lldb-unit :: Utility/./UtilityTests/BroadcasterTest.EventTypeHasListeners (2161 of 2332) PASS: lldb-unit :: Utility/./UtilityTests/StringExtractorGDBRemoteTest.GetPidTidMultipleValues (2162 of 2332) PASS: lldb-unit :: Expression/./ExpressionTests/CppModuleConfigurationTest.UnrelatedLibrary (2163 of 2332) PASS: lldb-api :: python_api/sblaunchinfo/TestSBLaunchInfo.py (2164 of 2332) PASS: lldb-unit :: Utility/./UtilityTests/StringListTest.GetSize (2165 of 2332) PASS: lldb-api :: functionalities/thread/ignore_suspended/TestIgnoreSuspendedThread.py (2166 of 2332) PASS: lldb-api :: lang/cpp/dynamic-value/TestCppValueCast.py (2167 of 2332) PASS: lldb-unit :: Utility/./UtilityTests/ArgsTest.TestMultipleArgs (2168 of 2332) PASS: lldb-api :: lang/objc/direct-dispatch-step/TestObjCDirectDispatchStepping.py (2169 of 2332) PASS: lldb-api :: functionalities/load_unload/TestLoadUnload.py (2170 of 2332) PASS: lldb-unit :: Host/./HostTests/SocketTests/SocketTest.DomainListenConnectAccept/ipv6 (2171 of 2332) PASS: lldb-api :: functionalities/source-map/TestTargetSourceMap.py (2172 of 2332) PASS: lldb-unit :: Process/./ProcessEventDataTests/ProcessEventDataTest.ShouldStop (2173 of 2332) XFAIL: lldb-shell :: Register/x86-64-fp-write.test (2174 of 2332) PASS: lldb-api :: functionalities/thread/concurrent_events/TestConcurrentCrashWithWatchpointBreakpointSignal.py (2175 of 2332) PASS: lldb-unit :: Utility/./UtilityTests/StringListTest.GetMaxStringLengthIncreasingSize (2176 of 2332) PASS: lldb-api :: lang/cpp/keywords_enabled/TestCppKeywordsEnabled.py (2177 of 2332) PASS: lldb-unit :: Utility/./UtilityTests/FileSpecTest.CopyByAppendingPathComponent (2178 of 2332) PASS: lldb-unit :: Utility/./UtilityTests/SerializationRountripTest.SerializeDeserializeObjectPointer (2179 of 2332) PASS: lldb-api :: functionalities/thread/exit_during_break/TestExitDuringBreak.py (2180 of 2332) PASS: lldb-api :: functionalities/data-formatter/data-formatter-stl/libcxx/variant/TestDataFormatterLibcxxVariant.py (2181 of 2332) PASS: lldb-unit :: Utility/./UtilityTests/OptionsWithRawTest.MultiWordSuffix (2182 of 2332) PASS: lldb-api :: commands/expression/import-std-module/stack/TestStackFromStdModule.py (2183 of 2332) PASS: lldb-unit :: Utility/./UtilityTests/Flags.GetBitSize (2184 of 2332) PASS: lldb-shell :: Commands/command-target-modules-dump-sections.yaml (2185 of 2332) PASS: lldb-shell :: SymbolFile/DWARF/x86/dwo-type-in-main-file.s (2186 of 2332) PASS: lldb-shell :: SymbolFile/DWARF/x86/debug_loc.s (2187 of 2332) PASS: lldb-unit :: Utility/./UtilityTests/DataExtractorTest.GetMaxS64 (2188 of 2332) PASS: lldb-api :: functionalities/scripted_process/TestScriptedProcess.py (2189 of 2332) PASS: lldb-unit :: Utility/./UtilityTests/StructuredDataTest.ParseJSONFromFile (2190 of 2332) PASS: lldb-api :: lang/objc/print-obj/TestPrintObj.py (2191 of 2332) PASS: lldb-unit :: Target/./TargetTests/PathMappingListTest.RelativeTests (2192 of 2332) UNSUPPORTED: lldb-shell :: SymbolFile/target-symbols-add-unwind.test (2193 of 2332) PASS: lldb-unit :: Symbol/./SymbolTests/TestClangASTImporter.CopyTypeTagDecl (2194 of 2332) UNSUPPORTED: lldb-api :: functionalities/signal/handle-segv/TestHandleSegv.py (2195 of 2332) PASS: lldb-api :: functionalities/breakpoint/breakpoint_conditions/TestBreakpointConditions.py (2196 of 2332) PASS: lldb-api :: functionalities/data-formatter/summary-string-onfail/Test-rdar-9974002.py (2197 of 2332) PASS: lldb-api :: commands/expression/import-std-module/forward_list/TestForwardListFromStdModule.py (2198 of 2332) PASS: lldb-api :: lang/cpp/llvm-style/TestLLVMStyle.py (2199 of 2332) PASS: lldb-api :: functionalities/thread/concurrent_events/TestConcurrentTwoWatchpointThreads.py (2200 of 2332) PASS: lldb-api :: lang/cpp/dereferencing_references/TestCPPDereferencingReferences.py (2201 of 2332) UNSUPPORTED: lldb-api :: commands/register/register/intel_xtended_registers/mpx_bound_violation/TestBoundViolation.py (2202 of 2332) PASS: lldb-unit :: Utility/./UtilityTests/StreamTest.AddressPrefix (2203 of 2332) PASS: lldb-api :: lang/cpp/inlines/TestInlines.py (2204 of 2332) PASS: lldb-unit :: UnwindAssembly/x86/./UnwindAssemblyx86Tests/Testx86AssemblyInspectionEngine.TestPushRBX (2205 of 2332) PASS: lldb-api :: lang/cpp/chained-calls/TestCppChainedCalls.py (2206 of 2332) PASS: lldb-unit :: Process/minidump/./LLDBMinidumpTests/MinidumpParserTest.GetMemoryRegionInfo (2207 of 2332) PASS: lldb-shell :: SymbolFile/NativePDB/break-by-line.cpp (2208 of 2332) PASS: lldb-api :: commands/expression/import-std-module/queue/TestQueueFromStdModule.py (2209 of 2332) PASS: lldb-unit :: Utility/./UtilityTests/VMRange.CollectionContains (2210 of 2332) PASS: lldb-api :: python_api/sbstructureddata/TestStructuredDataAPI.py (2211 of 2332) PASS: lldb-api :: macosx/version_zero/TestGetVersionZeroVersion.py (2212 of 2332) PASS: lldb-unit :: Utility/./UtilityTests/StringExtractorTest.GetHexU8_Extra_NoEof (2213 of 2332) PASS: lldb-shell :: SymbolFile/DWARF/x86/dwarf5-debug_line-file-index.s (2214 of 2332) PASS: lldb-api :: commands/watchpoints/hello_watchpoint/TestMyFirstWatchpoint.py (2215 of 2332) PASS: lldb-unit :: Utility/./UtilityTests/FileSpecTest.Yaml (2216 of 2332) PASS: lldb-api :: lang/objc/objc-property/TestObjCProperty.py (2217 of 2332) UNSUPPORTED: lldb-shell :: ObjectFile/ELF/minidebuginfo-no-lzma.yaml (2218 of 2332) PASS: lldb-unit :: Process/minidump/./LLDBMinidumpTests/MinidumpParserTest.FindMemoryRangeWithFullMemoryMinidump (2219 of 2332) PASS: lldb-unit :: Process/minidump/./LLDBMinidumpTests/RegisterContextMinidump.ConvertMinidumpContext_x86_64 (2220 of 2332) PASS: lldb-unit :: Utility/./UtilityTests/ArgsTest.Yaml (2221 of 2332) PASS: lldb-unit :: SymbolFile/NativePDB/./SymbolFileNativePDBTests/PDBFPOProgramToDWARFExpressionTests.UnknownOp (2222 of 2332) PASS: lldb-unit :: UnwindAssembly/x86/./UnwindAssemblyx86Tests/Testx86AssemblyInspectionEngine.TestPopR12 (2223 of 2332) PASS: lldb-unit :: Utility/./UtilityTests/BinaryStreamTest.PutULEB128SixBytes (2224 of 2332) UNSUPPORTED: lldb-api :: benchmarks/startup/TestStartupDelays.py (2225 of 2332) PASS: lldb-unit :: Language/CPlusPlus/./LanguageCPlusPlusTests/CPlusPlusLanguage.FindAlternateFunctionManglings (2226 of 2332) UNSUPPORTED: lldb-api :: lang/objc/modules-update/TestClangModulesUpdate.py (2227 of 2332) PASS: lldb-unit :: Thread/./ThreadTests/ThreadTest.SetStopInfo (2228 of 2332) PASS: lldb-unit :: Target/./TargetTests/MCBasedABI.MapRegisterName (2229 of 2332) PASS: lldb-api :: functionalities/find-line-entry/TestFindLineEntry.py (2230 of 2332) UNSUPPORTED: lldb-api :: benchmarks/libcxxmap/TestBenchmarkLibcxxMap.py (2231 of 2332) PASS: lldb-unit :: Core/./LLDBCoreTests/DumpDataExtractorTest.FormatCharArray (2232 of 2332) PASS: lldb-api :: lang/cpp/extern_c/TestExternCSymbols.py (2233 of 2332) PASS: lldb-unit :: Utility/./UtilityTests/StreamTest.Indent (2234 of 2332) PASS: lldb-api :: functionalities/thread/concurrent_events/TestConcurrentSignalWatch.py (2235 of 2332) PASS: lldb-unit :: Platform/./LLDBPlatformTests/PlatformAppleSimulatorTest.TestSimHasSimEnvionament (2236 of 2332) PASS: lldb-shell :: Register/x86-64-gp-read.test (2237 of 2332) PASS: lldb-shell :: Driver/TestUseColor.test (2238 of 2332) PASS: lldb-api :: functionalities/param_entry_vals/basic_entry_values/TestBasicEntryValues.py (2239 of 2332) PASS: lldb-api :: commands/process/attach/TestProcessAttach.py (2240 of 2332) PASS: lldb-shell :: ScriptInterpreter/Python/Crashlog/parser_text.test (2241 of 2332) PASS: lldb-unit :: UnwindAssembly/x86/./UnwindAssemblyx86Tests/Testx86AssemblyInspectionEngine.TestPushImm (2242 of 2332) PASS: lldb-api :: sample_test/TestSampleTest.py (2243 of 2332) PASS: lldb-unit :: Utility/./UtilityTests/UUIDTest.RelationalOperators (2244 of 2332) PASS: lldb-unit :: Utility/./UtilityTests/LogChannelTest.Disable (2245 of 2332) PASS: lldb-unit :: Symbol/./SymbolTests/TestClangASTImporter.CompleteFwdDeclWithOtherOrigin (2246 of 2332) UNSUPPORTED: lldb-api :: functionalities/asan/TestReportData.py (2247 of 2332) PASS: lldb-api :: lang/c/conflicting-symbol/TestConflictingSymbol.py (2248 of 2332) PASS: lldb-unit :: Language/Highlighting/./HighlighterTests/HighlighterTest.Colons (2249 of 2332) PASS: lldb-shell :: Reproducer/Functionalities/TestImageList.test (2250 of 2332) PASS: lldb-shell :: Reproducer/TestDiscard.test (2251 of 2332) PASS: lldb-api :: functionalities/breakpoint/breakpoint_options/TestBreakpointOptions.py (2252 of 2332) PASS: lldb-api :: lang/cpp/global_operators/TestCppGlobalOperators.py (2253 of 2332) PASS: lldb-shell :: SymbolFile/DWARF/x86/dwarf5-atomic.s (2254 of 2332) UNSUPPORTED: lldb-api :: linux/thread/create_during_instruction_step/TestCreateDuringInstructionStep.py (2255 of 2332) PASS: lldb-api :: commands/expression/call-function/TestCallStdStringFunction.py (2256 of 2332) XFAIL: lldb-shell :: Register/x86-64-fp-read.test (2257 of 2332) PASS: lldb-api :: commands/platform/process/list/TestProcessList.py (2258 of 2332) PASS: lldb-api :: tools/lldb-server/signal-filtering/TestGdbRemote_QPassSignals.py (2259 of 2332) PASS: lldb-unit :: Core/./LLDBCoreTests/MangledTest.NameIndexes_FindFunctionSymbols (2260 of 2332) PASS: lldb-api :: lang/cpp/typedef/TestCppTypedef.py (2261 of 2332) PASS: lldb-api :: lang/cpp/unique-types/TestUniqueTypes.py (2262 of 2332) UNSUPPORTED: lldb-shell :: Unwind/basic-block-sections.test (2263 of 2332) PASS: lldb-unit :: ScriptInterpreter/Python/./ScriptInterpreterPythonTests/PythonDataObjectsTest.TestPythonListToStructuredList (2264 of 2332) PASS: lldb-api :: functionalities/inferior-crashing/recursive-inferior/TestRecursiveInferior.py (2265 of 2332) PASS: lldb-unit :: Utility/./UtilityTests/DataExtractorTest.GetCStrAtNullOffset (2266 of 2332) PASS: lldb-unit :: Utility/./UtilityTests/RangeTest.Slide (2267 of 2332) PASS: lldb-unit :: Signals/./SignalsTests/UnixSignalsTest.GetFilteredSignals (2268 of 2332) PASS: lldb-shell :: SymbolFile/DWARF/x86/debug_ranges-missing-section.s (2269 of 2332) PASS: lldb-api :: macosx/duplicate-archive-members/TestDuplicateMembers.py (2270 of 2332) PASS: lldb-shell :: Driver/TestFile.test (2271 of 2332) PASS: lldb-api :: lang/c/global_variables/TestGlobalVariables.py (2272 of 2332) UNSUPPORTED: lldb-api :: macosx/posix_spawn/TestLaunchProcessPosixSpawn.py (2273 of 2332) PASS: lldb-shell :: SymbolFile/DWARF/x86/DW_AT_loclists_base.s (2274 of 2332) PASS: lldb-unit :: Utility/./UtilityTests/StreamTest.AddressSize (2275 of 2332) PASS: lldb-api :: lang/cpp/function_refs/TestFunctionRefs.py (2276 of 2332) UNSUPPORTED: lldb-shell :: SymbolFile/Breakpad/stack-cfi-arm.yaml (2277 of 2332) PASS: lldb-api :: commands/platform/file/read/TestPlatformFileRead.py (2278 of 2332) PASS: lldb-api :: tools/lldb-server/TestGdbRemoteSingleStep.py (2279 of 2332) PASS: lldb-unit :: Host/./HostTests/FileSystemTest.GetByteSize (2280 of 2332) PASS: lldb-unit :: SymbolFile/NativePDB/./SymbolFileNativePDBTests/PDBFPOProgramToDWARFExpressionTests.SingleAssignmentRegisterRef (2281 of 2332) PASS: lldb-unit :: Utility/./UtilityTests/StringListTest.GetMaxStringLengthEmpty (2282 of 2332) PASS: lldb-api :: commands/process/launch-with-shellexpand/TestLaunchWithShellExpand.py (2283 of 2332) PASS: lldb-api :: functionalities/thread/concurrent_events/TestConcurrentSignalNWatchNBreak.py (2284 of 2332) UNSUPPORTED: lldb-api :: functionalities/darwin_log/filter/exact_match/activity/TestDarwinLogFilterMatchActivity.py (2285 of 2332) PASS: lldb-api :: python_api/lldbutil/TestSwigVersion.py (2286 of 2332) PASS: lldb-api :: tools/lldb-server/thread-name/TestGdbRemoteThreadName.py (2287 of 2332) PASS: lldb-api :: python_api/value/change_values/TestChangeValueAPI.py (2288 of 2332) PASS: lldb-shell :: SymbolFile/DWARF/x86/dwarf5-split.s (2289 of 2332) PASS: lldb-api :: functionalities/thread/step_out/TestThreadStepOut.py (2290 of 2332) PASS: lldb-unit :: Utility/./UtilityTests/OptionsWithRawTest.WhitespaceSuffix (2291 of 2332) PASS: lldb-unit :: Utility/./UtilityTests/UriParserTest.TypicalPortPathIPv4 (2292 of 2332) PASS: lldb-unit :: Utility/./UtilityTests/StringListTest.InsertStringAtIndexOutOfBounds (2293 of 2332) PASS: lldb-unit :: Process/minidump/./LLDBMinidumpTests/MinidumpParserTest.GetMemory (2294 of 2332) PASS: lldb-unit :: Host/./HostTests/FileSystemTest.GetPermissions (2295 of 2332) PASS: lldb-unit :: Utility/./UtilityTests/ArchSpecTest.TestParseMachCPUDashSubtypeTripleExtra (2296 of 2332) PASS: lldb-unit :: Utility/./UtilityTests/BinaryStreamTest.PutSLEB128OneByte (2297 of 2332) UNSUPPORTED: lldb-api :: functionalities/darwin_log/format/TestDarwinLogMessageFormat.py (2298 of 2332) PASS: lldb-shell :: Minidump/memory-region.yaml (2299 of 2332) PASS: lldb-unit :: Utility/./UtilityTests/StreamTeeTest.GetStreamAtIndexOutOfBoundsEmpty (2300 of 2332) PASS: lldb-api :: functionalities/data-formatter/data-formatter-stl/libcxx/unique_ptr/TestDataFormatterLibcxxUniquePtr.py (2301 of 2332) PASS: lldb-unit :: Process/./ProcessEventDataTests/ProcessEventDataTest.DoOnRemoval (2302 of 2332) PASS: lldb-api :: functionalities/target_var/TestTargetVar.py (2303 of 2332) PASS: lldb-unit :: Utility/./UtilityTests/ArchSpecTest.YAML (2304 of 2332) PASS: lldb-unit :: Utility/./UtilityTests/ArgsTest.ReplaceArgumentAtIndexLonger (2305 of 2332) PASS: lldb-unit :: Utility/./UtilityTests/ArgsTest.ReplaceArgumentAtIndexEqual (2306 of 2332) PASS: lldb-unit :: Utility/./UtilityTests/RangeTest.SetRangeBase (2307 of 2332) PASS: lldb-unit :: Utility/./UtilityTests/UriParserTest.BadPort2 (2308 of 2332) PASS: lldb-unit :: UnwindAssembly/x86/./UnwindAssemblyx86Tests/Testx86AssemblyInspectionEngine.TestSubESP (2309 of 2332) PASS: lldb-api :: functionalities/data-formatter/nsarraysynth/TestNSArraySynthetic.py (2310 of 2332) PASS: lldb-shell :: Reproducer/TestDSYM.test (2311 of 2332) PASS: lldb-unit :: Utility/./UtilityTests/XcodeSDKTest.MergeTest (2312 of 2332) PASS: lldb-shell :: ObjectFile/ELF/compressed-sections.yaml (2313 of 2332) PASS: lldb-api :: lang/c/stepping/TestThreadStepInAvoidRegexp.py (2314 of 2332) PASS: lldb-shell :: ObjectFile/ELF/gnu-debuglink.yaml (2315 of 2332) PASS: lldb-api :: functionalities/deleted-executable/TestDeletedExecutable.py (2316 of 2332) PASS: lldb-unit :: Process/minidump/./LLDBMinidumpTests/MinidumpParserTest.GetMiscInfo_no_stream (2317 of 2332) PASS: lldb-shell :: SymbolFile/NativePDB/s_constant.cpp (2318 of 2332) PASS: lldb-unit :: Utility/./UtilityTests/StringExtractorTest.GetNameColonValueNoSemicolon (2319 of 2332) PASS: lldb-unit :: Utility/./UtilityTests/ArgsTest.TestTrailingBackslash (2320 of 2332) PASS: lldb-unit :: Process/minidump/./LLDBMinidumpTests/MinidumpParserTest.GetThreadContext_x86_64 (2321 of 2332) PASS: lldb-unit :: ScriptInterpreter/Python/./ScriptInterpreterPythonTests/PythonDataObjectsTest.TestExceptions (2322 of 2332) PASS: lldb-unit :: Utility/./UtilityTests/StringExtractorTest.DecodeHexU8_Underflow2 (2323 of 2332) PASS: lldb-unit :: Utility/./UtilityTests/StringListTest.Clear (2324 of 2332) PASS: lldb-unit :: Utility/./UtilityTests/Flags.Test (2325 of 2332) PASS: lldb-api :: lang/objc/modules/TestObjCModules.py (2326 of 2332) UNSUPPORTED: lldb-api :: linux/add-symbols/TestTargetSymbolsAddCommand.py (2327 of 2332) PASS: lldb-unit :: Utility/./UtilityTests/FileSpecTest.Equal (2328 of 2332) PASS: lldb-unit :: Symbol/./SymbolTests/TestClangASTImporter.MetadataPropagationAfterCopying (2329 of 2332) PASS: lldb-api :: functionalities/breakpoint/hardware_breakpoints/require_hw_breakpoints/TestRequireHWBreakpoints.py (2330 of 2332) PASS: lldb-api :: macosx/dyld-trie-symbols/TestDyldTrieSymbols.py (2331 of 2332) PASS: lldb-api :: commands/expression/import-std-module/deque-dbg-info-content/TestDbgInfoContentDequeFromStdModule.py (2332 of 2332) Slowest Tests: -------------------------------------------------------------------------- 408.32s: lldb-api :: tools/lldb-server/TestLldbGdbServer.py 233.79s: lldb-api :: api/multithreaded/TestMultithreaded.py 212.67s: lldb-api :: lang/objc/hidden-ivars/TestHiddenIvars.py 135.39s: lldb-api :: functionalities/inline-stepping/TestInlineStepping.py 131.08s: lldb-api :: lang/objc/exceptions/TestObjCExceptions.py 123.16s: lldb-api :: functionalities/completion/TestCompletion.py 103.41s: lldb-api :: types/TestLongTypesExpr.py 103.26s: lldb-api :: lang/cpp/namespace/TestNamespaceLookup.py 97.68s: lldb-api :: lang/objc/foundation/TestObjCMethods.py 96.74s: lldb-api :: lang/objc/objc-new-syntax/TestObjCNewSyntaxLiteral.py 94.01s: lldb-api :: lang/objc/real-definition/TestRealDefinition.py 91.64s: lldb-api :: functionalities/gdb_remote_client/TestWasm.py 85.80s: lldb-api :: functionalities/data-formatter/ostypeformatting/TestFormattersOsType.py 82.06s: lldb-api :: lang/objc/objc_direct-methods/TestObjCDirectMethods.py 80.74s: lldb-api :: commands/expression/import-std-module/stack/TestStackFromStdModule.py 80.02s: lldb-api :: commands/expression/import-std-module/queue/TestQueueFromStdModule.py 78.69s: lldb-api :: lang/objc/objc-new-syntax/TestObjCNewSyntaxDictionary.py 78.14s: lldb-api :: lang/objc/objc-new-syntax/TestObjCNewSyntaxArray.py 77.37s: lldb-api :: lang/objc/foundation/TestObjCMethodsNSError.py 75.60s: lldb-api :: tools/lldb-server/TestGdbRemoteThreadsInStopReply.py

Hide Details

Tests Times: -------------------------------------------------------------------------- [ Range ] :: [ Percentage ] :: [ Count ] -------------------------------------------------------------------------- [400s,420s) :: [ ] :: [ 1/2332] [380s,400s) :: [ ] :: [ 0/2332] [360s,380s) :: [ ] :: [ 0/2332] [340s,360s) :: [ ] :: [ 0/2332] [320s,340s) :: [ ] :: [ 0/2332] [300s,320s) :: [ ] :: [ 0/2332] [280s,300s) :: [ ] :: [ 0/2332] [260s,280s) :: [ ] :: [ 0/2332] [240s,260s) :: [ ] :: [ 1/2332] [220s,240s) :: [ ] :: [ 0/2332] [200s,220s) :: [ ] :: [ 1/2332] [180s,200s) :: [ ] :: [ 0/2332] [160s,180s) :: [ ] :: [ 0/2332] [140s,160s) :: [ ] :: [ 0/2332] [120s,140s) :: [ ] :: [ 3/2332] [100s,120s) :: [ ] :: [ 3/2332] [ 80s,100s) :: [ ] :: [ 9/2332] [ 60s, 80s) :: [ ] :: [ 10/2332] [ 40s, 60s) :: [ ] :: [ 39/2332] [ 20s, 40s) :: [** ] :: [ 142/2332] [ 0s, 20s) :: [************************************ ] :: [2123/2332] -------------------------------------------------------------------------- ******************** Failed Tests (5): lldb-api :: functionalities/data-formatter/ostypeformatting/TestFormattersOsType.py lldb-api :: functionalities/inline-stepping/TestInlineStepping.py lldb-api :: lang/c/array_types/TestArrayTypes.py lldb-api :: lang/objc/objc_direct-methods/TestObjCDirectMethods.py lldb-shell :: Commands/command-script-import.test

Hide Details

Hide Details

Testing Time: 3610.68s Unsupported : 208 Passed : 2109 Expectedly Failed: 10 Failed : 5 FAILED: tools/lldb/test/CMakeFiles/check-lldb cd /Users/buildslave/jenkins/workspace/lldb-cmake-sanitized/lldb-build/tools/lldb/test && /usr/local/Frameworks/Python.framework/Versions/3.7/bin/python3.7 /Users/buildslave/jenkins/workspace/lldb-cmake-sanitized/lldb-build/./bin/llvm-lit -v --time-tests --shuffle --xunit-xml-output=/Users/buildslave/jenkins/workspace/lldb-cmake-sanitized/test/results.xml -v -j 4 --timeout 1200 /Users/buildslave/jenkins/workspace/lldb-cmake-sanitized/lldb-build/tools/lldb/test ninja: build stopped: subcommand failed. Command failed: Command '['/usr/bin/env', 'TERM=vt100', '/usr/local/bin/ninja', '-v', 'check-lldb']' returned non-zero exit status 1. Command: ['/usr/bin/env', 'TERM=vt100', '/usr/local/bin/ninja', '-v', 'check-lldb'] [Pipeline] } [Pipeline] // timeout [Pipeline] } [Pipeline] // stage [Pipeline] stage [Pipeline] { (Declarative: Post Actions) [Pipeline] scanForIssues [Clang (LLVM based)] Sleeping for 5 seconds due to JENKINS-32191... [Clang (LLVM based)] Parsing console log (workspace: '/Users/buildslave/jenkins/workspace/lldb-cmake-sanitized') [Clang (LLVM based)] Successfully parsed console log [Clang (LLVM based)] -> found 4 issues (skipped 0 duplicates) [Clang (LLVM based)] Post processing issues on 'green-dragon-23' with source code encoding 'UTF-8' [Clang (LLVM based)] Creating SCM blamer to obtain author and commit information for affected files [Clang (LLVM based)] -> No blamer installed yet. You need to install the 'git-forensics' plugin to enable blaming for Git. [Clang (LLVM based)] Resolving file names for all issues in source directory '/Users/buildslave/jenkins/workspace/lldb-cmake-sanitized' [Clang (LLVM based)] -> resolved paths in source directory (4 found, 0 not found) [Clang (LLVM based)] Resolving module names from module definitions (build.xml, pom.xml, or Manifest.mf files) [Clang (LLVM based)] -> resolved module names for 4 issues [Clang (LLVM based)] Resolving package names (or namespaces) by parsing the affected files [Clang (LLVM based)] -> resolved package names of 4 affected files [Clang (LLVM based)] No filter has been set, publishing all 4 issues [Clang (LLVM based)] Creating fingerprints for all affected code blocks to track issues over different builds [Clang (LLVM based)] -> created fingerprints for 4 issues (skipped 0 issues) [Clang (LLVM based)] Copying affected files to Jenkins' build folder '/Users/Shared/Jenkins/Home/jobs/lldb-cmake-sanitized/builds/1876/files-with-issues' [Clang (LLVM based)] -> 4 copied, 0 not in workspace, 0 not-found, 0 with I/O error [Clang (LLVM based)] Repository miner is not configured, skipping repository mining [Pipeline] junit Recording test results [Checks API] No suitable checks publisher found. [Pipeline] } [Pipeline] // stage [Pipeline] } [Pipeline] // withEnv [Pipeline] } [Pipeline] // node [Pipeline] End of Pipeline ERROR: script returned exit code 1 Finished: FAILURE