Console Output

Skipping 9,295 KB.. Full Log
PASS: lldb-shell :: Commands/command-regex-unalias.test (869 of 2333)
PASS: lldb-shell :: ObjectFile/ELF/short-build-id.yaml (870 of 2333)
PASS: lldb-api :: lang/cpp/template-specialization-type/TestTemplateSpecializationType.py (871 of 2333)
PASS: lldb-unit :: Utility/./UtilityTests/XcodeSDKTest.FindXcodeContentsDirectoryInPath (872 of 2333)
PASS: lldb-shell :: ObjectFile/ELF/PT_LOAD-overlap.yaml (873 of 2333)
PASS: lldb-unit :: Process/gdb-remote/./ProcessGdbRemoteTests/GDBRemoteCommunicationClientTest.GetMemoryRegionInfoInvalidResponse (874 of 2333)
PASS: lldb-unit :: Utility/./UtilityTests/ArgsTest.ReplaceArgumentAtIndexEqual (875 of 2333)
UNSUPPORTED: lldb-shell :: Unwind/eh-frame-augment-noop.test (876 of 2333)
UNSUPPORTED: lldb-shell :: ScriptInterpreter/Lua/command_script_import.test (877 of 2333)
PASS: lldb-shell :: Reproducer/TestDriverOptions.test (878 of 2333)
UNSUPPORTED: lldb-shell :: SymbolFile/Breakpad/stack-cfi-arm.yaml (879 of 2333)
PASS: lldb-api :: functionalities/data-formatter/poarray/TestPrintObjectArray.py (880 of 2333)
PASS: lldb-api :: commands/add-dsym/uuid/TestAddDsymCommand.py (881 of 2333)
PASS: lldb-api :: commands/expression/diagnostics/TestExprDiagnostics.py (882 of 2333)
PASS: lldb-unit :: Process/minidump/./LLDBMinidumpTests/MinidumpParserTest.GetPidWindows (883 of 2333)
PASS: lldb-unit :: Thread/./ThreadTests/ThreadTest.SetStopInfo (884 of 2333)
PASS: lldb-shell :: ScriptInterpreter/Python/scripted_breakpoint.test (885 of 2333)
PASS: lldb-unit :: UnwindAssembly/x86/./UnwindAssemblyx86Tests/Testx86AssemblyInspectionEngine.TestPushEBX (886 of 2333)
PASS: lldb-unit :: SymbolFile/DWARF/./SymbolFileDWARFTests/SymbolFileDWARFTests.TestAbbrevNullAttrValidForm (887 of 2333)
UNSUPPORTED: lldb-api :: commands/trace/TestTraceSchema.py (888 of 2333)
PASS: lldb-api :: lang/cpp/type_lookup/TestCppTypeLookup.py (889 of 2333)
PASS: lldb-shell :: Settings/TestDefaultModuleCachePath.test (890 of 2333)
PASS: lldb-api :: commands/watchpoints/hello_watchpoint/TestMyFirstWatchpoint.py (891 of 2333)
PASS: lldb-unit :: Utility/./UtilityTests/SerializationRountripTest.SerializeDeserializePodReferences (892 of 2333)
PASS: lldb-unit :: Utility/./UtilityTests/ArgsTest.TestUnknownEscape (893 of 2333)
UNSUPPORTED: lldb-api :: arm/breakpoint-thumb-codesection/TestBreakpointThumbCodesection.py (894 of 2333)
PASS: lldb-api :: functionalities/thread/concurrent_events/TestConcurrentCrashWithBreak.py (895 of 2333)
PASS: lldb-unit :: UnwindAssembly/x86/./UnwindAssemblyx86Tests/Testx86AssemblyInspectionEngine.TestSimple32bitFrameFunction (896 of 2333)
PASS: lldb-api :: lang/objc/orderedset/TestOrderedSet.py (897 of 2333)
PASS: lldb-api :: functionalities/gdb_remote_client/TestGDBRemoteClient.py (898 of 2333)
UNSUPPORTED: lldb-api :: functionalities/thread/thread_specific_break_plus_condition/TestThreadSpecificBpPlusCondition.py (899 of 2333)
PASS: lldb-api :: lang/objc/conflicting-definition/TestConflictingDefinition.py (900 of 2333)
PASS: lldb-shell :: Reproducer/TestVerify.test (901 of 2333)
PASS: lldb-api :: lang/cpp/wchar_t/TestCxxWCharT.py (902 of 2333)
PASS: lldb-unit :: Symbol/./SymbolTests/LineEntryTest.GetSameLineContiguousAddressRangeOneInline (903 of 2333)
PASS: lldb-shell :: ScriptInterpreter/Python/command_import.test (904 of 2333)
PASS: lldb-unit :: SymbolFile/NativePDB/./SymbolFileNativePDBTests/PDBFPOProgramToDWARFExpressionTests.MultipleDependentAssignments (905 of 2333)
UNSUPPORTED: lldb-api :: functionalities/gdb_remote_client/TestWasm.py (906 of 2333)
PASS: lldb-unit :: ScriptInterpreter/Python/./ScriptInterpreterPythonTests/PythonDataObjectsTest.TestPythonCallableCheck (907 of 2333)
PASS: lldb-api :: commands/expression/context-object-objc/TestContextObjectObjc.py (908 of 2333)
UNSUPPORTED: lldb-shell :: Unwind/unwind-plan-dwarf-dump.test (909 of 2333)
PASS: lldb-api :: functionalities/data-formatter/data-formatter-categories/TestDataFormatterCategories.py (910 of 2333)
PASS: lldb-unit :: Host/./HostTests/FileSystemTest.GetByteSize (911 of 2333)
PASS: lldb-api :: tools/lldb-server/TestGdbRemoteExpeditedRegisters.py (912 of 2333)
PASS: lldb-shell :: Quit/TestQuitExitCode30.test (913 of 2333)
PASS: lldb-api :: functionalities/data-formatter/builtin-formats/TestBuiltinFormats.py (914 of 2333)
PASS: lldb-api :: lang/cpp/thread_local/TestThreadLocal.py (915 of 2333)
PASS: lldb-shell :: SymbolFile/DWARF/x86/debug_line-relative_path.s (916 of 2333)
PASS: lldb-shell :: SymbolFile/DWARF/x86/find-inline-method.s (917 of 2333)
PASS: lldb-api :: lang/objc/objc-static-method-stripped/TestObjCStaticMethodStripped.py (918 of 2333)
PASS: lldb-api :: commands/platform/file/read/TestPlatformFileRead.py (919 of 2333)
PASS: lldb-unit :: Platform/./LLDBPlatformTests/PlatformAppleSimulatorTest.TestHostPlatformToSim (920 of 2333)
PASS: lldb-api :: commands/command/source/TestCommandSource.py (921 of 2333)
PASS: lldb-shell :: Minidump/Windows/broken-unwind.test (922 of 2333)
PASS: lldb-unit :: Process/gdb-remote/./ProcessGdbRemoteTests/GDBRemoteClientBaseTest.InterruptNoResponse (923 of 2333)
PASS: lldb-unit :: Host/./HostTests/PipeTest.OpenAsReader (924 of 2333)
PASS: lldb-unit :: Target/./TargetTests/MCBasedABI.MapRegisterName (925 of 2333)
PASS: lldb-unit :: Utility/./UtilityTests/ScalarTest.ComparisonFloat (926 of 2333)
PASS: lldb-unit :: Utility/./UtilityTests/StringListTest.GetSize (927 of 2333)
PASS: lldb-api :: functionalities/thread/concurrent_events/TestConcurrentWatchpointWithDelayWatchpointThreads.py (928 of 2333)
PASS: lldb-api :: macosx/function-starts/TestFunctionStarts.py (929 of 2333)
PASS: lldb-shell :: SymbolFile/DWARF/clang-ast-from-dwarf-objc-property.m (930 of 2333)
PASS: lldb-unit :: Utility/./UtilityTests/RangeTest.ContainsRangeStartingFromZero (931 of 2333)
PASS: lldb-api :: lang/cpp/alignas_base_class/TestAlignAsBaseClass.py (932 of 2333)
PASS: lldb-unit :: Symbol/./SymbolTests/TestTypeSystemClang.TestGetEnumIntegerTypeUnexpectedType (933 of 2333)
PASS: lldb-api :: lang/cpp/char8_t/TestCxxChar8_t.py (934 of 2333)
PASS: lldb-unit :: DataFormatter/./LLDBFormatterTests/StringPrinterTests.CxxASCII (935 of 2333)
PASS: lldb-api :: commands/frame/language/TestGuessLanguage.py (936 of 2333)
PASS: lldb-unit :: Process/Utility/./ProcessUtilityTests/ProcSMapTests/LinuxProcSMapsTestFixture.ParseSMapRegions/3 (937 of 2333)
PASS: lldb-unit :: Language/CPlusPlus/./LanguageCPlusPlusTests/CPlusPlusLanguage.CPlusPlusNameParser (938 of 2333)
UNSUPPORTED: lldb-api :: linux/mix-dwo-and-regular-objects/TestMixedDwarfBinary.py (939 of 2333)
PASS: lldb-unit :: Language/Highlighting/./HighlighterTests/HighlighterTest.ClangCursorPos (940 of 2333)
PASS: lldb-unit :: Process/gdb-remote/./ProcessGdbRemoteTests/GDBRemoteClientBaseTest.SendContinueAndAsyncSignal (941 of 2333)
PASS: lldb-api :: functionalities/recursion/TestValueObjectRecursion.py (942 of 2333)
PASS: lldb-unit :: Process/gdb-remote/./ProcessGdbRemoteTests/PortMapTest.FreePort (943 of 2333)
PASS: lldb-api :: macosx/profile_vrs_detach/TestDetachVrsProfile.py (944 of 2333)
PASS: lldb-api :: functionalities/unwind/noreturn/TestNoreturnUnwind.py (945 of 2333)
PASS: lldb-shell :: SymbolFile/DWARF/x86/debug_loc.s (946 of 2333)
PASS: lldb-api :: functionalities/tail_call_frames/cross_dso/TestCrossDSOTailCalls.py (947 of 2333)
PASS: lldb-shell :: ObjectFile/PECOFF/symbol.yaml (948 of 2333)
PASS: lldb-api :: lang/objc/objc-property/TestObjCProperty.py (949 of 2333)
PASS: lldb-unit :: Utility/./UtilityTests/StreamTest.QuotedCString (950 of 2333)
PASS: lldb-unit :: Symbol/./SymbolTests/TestTypeSystemClang.OnlyPackName (951 of 2333)
PASS: lldb-unit :: ObjectFile/Breakpad/./ObjectFileBreakpadTests/InfoRecord.parse (952 of 2333)
PASS: lldb-unit :: Process/minidump/./LLDBMinidumpTests/MinidumpParserTest.GetMemory (953 of 2333)
PASS: lldb-api :: commands/frame/diagnose/virtual-method-call/TestDiagnoseDereferenceVirtualMethodCall.py (954 of 2333)
PASS: lldb-api :: lang/objc/objc-runtime-ivars/TestRuntimeIvars.py (955 of 2333)
PASS: lldb-unit :: Utility/./UtilityTests/StringExtractorGDBRemoteTest.GetPidTidMultipleValues (956 of 2333)
PASS: lldb-api :: tools/lldb-server/TestGdbRemote_qThreadStopInfo.py (957 of 2333)
PASS: lldb-unit :: ScriptInterpreter/Python/./ScriptInterpreterPythonTests/PythonDataObjectsTest.TestOwnedReferences (958 of 2333)
PASS: lldb-unit :: Process/./ProcessEventDataTests/ProcessEventDataTest.DoOnRemoval (959 of 2333)
PASS: lldb-unit :: Host/./HostTests/NativeProcessProtocolTest.SetBreakpointFailVerify (960 of 2333)
PASS: lldb-unit :: Host/./HostTests/FileSystemTest.EnumerateDirectory (961 of 2333)
PASS: lldb-shell :: SymbolFile/DWARF/x86/apple-index-is-used.cpp (962 of 2333)
PASS: lldb-api :: macosx/find-app-in-bundle/TestFindAppInBundle.py (963 of 2333)
PASS: lldb-unit :: Core/./LLDBCoreTests/UniqueCStringMap.NoDefaultConstructor (964 of 2333)
PASS: lldb-shell :: SymbolFile/NativePDB/locate-pdb.cpp (965 of 2333)
PASS: lldb-unit :: Process/minidump/./LLDBMinidumpTests/MinidumpParserTest.GetThreadContext_x86_32_wow64 (966 of 2333)
PASS: lldb-api :: python_api/function_symbol/TestDisasmAPI.py (967 of 2333)
PASS: lldb-shell :: ObjectFile/Breakpad/sections-trailing-func.test (968 of 2333)
PASS: lldb-unit :: SymbolFile/NativePDB/./SymbolFileNativePDBTests/PDBFPOProgramToDWARFExpressionTests.UnresolvedRegisterAssignmentReference (969 of 2333)
PASS: lldb-unit :: Utility/./UtilityTests/StringExtractorTest.DecodeHexU8_InvalidHex2 (970 of 2333)
PASS: lldb-shell :: SymbolFile/Breakpad/unwind-via-stack-win-no-memory-info.yaml (971 of 2333)
PASS: lldb-unit :: Utility/./UtilityTests/StringListTest.Join (972 of 2333)
PASS: lldb-unit :: Core/./LLDBCoreTests/RichManglingContextTest.SwitchProvider (973 of 2333)
PASS: lldb-unit :: Process/gdb-remote/./ProcessGdbRemoteTests/PortMapTest.AllowPort (974 of 2333)
PASS: lldb-unit :: Utility/./UtilityTests/LogTest.LLDB_LOG_nullptr (975 of 2333)
PASS: lldb-api :: lang/cpp/breakpoint_in_member_func_w_non_primitive_params/TestBreakpointInMemberFuncWNonPrimitiveParams.py (976 of 2333)
PASS: lldb-unit :: Utility/./UtilityTests/NameMatchesTest.Equals (977 of 2333)
PASS: lldb-api :: commands/frame/diagnose/complicated-expression/TestComplicatedExpression.py (978 of 2333)
PASS: lldb-api :: macosx/find-dsym/deep-bundle/TestDeepBundle.py (979 of 2333)
PASS: lldb-unit :: ObjectFile/ELF/./ObjectFileELFTests/ObjectFileELFTest.GetModuleSpecifications_EarlySectionHeaders (980 of 2333)
PASS: lldb-api :: commands/target/create-deps/TestTargetCreateDeps.py (981 of 2333)
PASS: lldb-shell :: SymbolFile/NativePDB/function-types-classes.cpp (982 of 2333)
PASS: lldb-unit :: Signals/./SignalsTests/UnixSignalsTest.Iteration (983 of 2333)
UNSUPPORTED: lldb-api :: benchmarks/expression/TestExpressionCmd.py (984 of 2333)
PASS: lldb-api :: functionalities/data-formatter/hexcaps/TestDataFormatterHexCaps.py (985 of 2333)
PASS: lldb-api :: commands/target/stop-hooks/TestStopHooks.py (986 of 2333)
PASS: lldb-unit :: UnwindAssembly/x86/./UnwindAssemblyx86Tests/Testx86AssemblyInspectionEngine.TestPushESI (987 of 2333)
PASS: lldb-api :: functionalities/step_scripted/TestStepScripted.py (988 of 2333)
PASS: lldb-api :: functionalities/thread/concurrent_events/TestConcurrentWatchpointDelayWatchpointOneBreakpoint.py (989 of 2333)
PASS: lldb-unit :: Host/./HostTests/SocketTests/SocketTest.UDPGetConnectURI/ipv4 (990 of 2333)
PASS: lldb-unit :: Process/Utility/./ProcessUtilityTests/ProcSMapTests/LinuxProcSMapsTestFixture.ParseSMapRegions/8 (991 of 2333)
PASS: lldb-api :: commands/expression/import-std-module/vector-of-vectors/TestVectorOfVectorsFromStdModule.py (992 of 2333)
PASS: lldb-api :: functionalities/breakpoint/consecutive_breakpoints/TestConsecutiveBreakpoints.py (993 of 2333)
PASS: lldb-shell :: Commands/CommandScriptImmediateOutput/CommandScriptImmediateOutputConsole.test (994 of 2333)
PASS: lldb-api :: commands/expression/namespace_local_var_same_name_cpp_and_c/TestNamespaceLocalVarSameNameCppAndC.py (995 of 2333)
PASS: lldb-unit :: Utility/./UtilityTests/StreamTest.PutMaxHex64ByteOrderBig (996 of 2333)
PASS: lldb-api :: tools/lldb-server/register-reading/TestGdbRemoteGPacket.py (997 of 2333)
PASS: lldb-unit :: Utility/./UtilityTests/StringExtractorTest.GetHexU8_Underflow_NoEof (998 of 2333)
PASS: lldb-api :: functionalities/thread/concurrent_events/TestConcurrentTwoBreakpointThreads.py (999 of 2333)
PASS: lldb-unit :: Utility/./UtilityTests/OptionsWithRawTest.ArgsButNoLeadingDash (1000 of 2333)
PASS: lldb-unit :: ScriptInterpreter/Python/./ScriptInterpreterPythonTests/PythonDataObjectsTest.TestPythonDictionaryToStructuredDictionary (1001 of 2333)
PASS: lldb-unit :: Language/Highlighting/./HighlighterTests/HighlighterTest.ClangTrailingBackslashBeforeNewline (1002 of 2333)
PASS: lldb-shell :: ObjectFile/ELF/compressed-sections.yaml (1003 of 2333)
PASS: lldb-api :: functionalities/breakpoint/breakpoint_command/TestBreakpointCommand.py (1004 of 2333)
UNSUPPORTED: lldb-shell :: ScriptInterpreter/Lua/print.test (1005 of 2333)
PASS: lldb-shell :: Driver/TestNoUseColor.test (1006 of 2333)
PASS: lldb-api :: commands/expression/import-std-module/empty-module/TestEmptyStdModule.py (1007 of 2333)
PASS: lldb-unit :: Utility/./UtilityTests/UUIDTest.StringConverion (1008 of 2333)
PASS: lldb-shell :: SymbolFile/DWARF/x86/module-ownership.mm (1009 of 2333)
PASS: lldb-shell :: ObjectFile/ELF/section-addresses.yaml (1010 of 2333)
PASS: lldb-api :: tools/lldb-server/TestGdbRemoteProcessInfo.py (1011 of 2333)
PASS: lldb-unit :: Utility/./UtilityTests/StreamTest.ChangingByteOrder (1012 of 2333)
PASS: lldb-unit :: Utility/./UtilityTests/CompletionRequest.FakeLastArg (1013 of 2333)
PASS: lldb-unit :: Language/Highlighting/./HighlighterTests/HighlighterTest.ClangPPDirectives (1014 of 2333)
PASS: lldb-unit :: Utility/./UtilityTests/BinaryStreamTest.PutULEB128Zero (1015 of 2333)
PASS: lldb-unit :: Utility/./UtilityTests/RangeTest.DoesIntersect (1016 of 2333)
PASS: lldb-unit :: Expression/./ExpressionTests/DiagnosticManagerTest.AddDiagnostic (1017 of 2333)
PASS: lldb-unit :: Utility/./UtilityTests/ScalarTest.Equality (1018 of 2333)
PASS: lldb-shell :: SymbolFile/DWARF/x86/DW_TAG_basic_type_DW_ATE_UTF_nonC.ll (1019 of 2333)
PASS: lldb-unit :: ScriptInterpreter/Python/./ScriptInterpreterPythonTests/PythonDataObjectsTest.TestExceptions (1020 of 2333)
PASS: lldb-unit :: Utility/./UtilityTests/RangeTest.DefaultConstructor (1021 of 2333)
PASS: lldb-api :: api/log/TestAPILog.py (1022 of 2333)
PASS: lldb-unit :: Utility/./UtilityTests/ConstStringTest.format_provider (1023 of 2333)
PASS: lldb-unit :: Utility/./UtilityTests/Flags.AllClear (1024 of 2333)
PASS: lldb-api :: commands/command/nested_alias/TestNestedAlias.py (1025 of 2333)
PASS: lldb-unit :: Process/Utility/./ProcessUtilityTests/ProcSMapTests/LinuxProcSMapsTestFixture.ParseSMapRegions/6 (1026 of 2333)
PASS: lldb-unit :: Utility/./UtilityTests/RegularExpression.Invalid (1027 of 2333)
PASS: lldb-unit :: Language/Highlighting/./HighlighterTests/HighlighterTest.ClangSquareBrackets (1028 of 2333)
PASS: lldb-unit :: Language/Highlighting/./HighlighterTests/HighlighterTest.DefaultHighlighter (1029 of 2333)
PASS: lldb-api :: functionalities/signal/TestSendSignal.py (1030 of 2333)
PASS: lldb-api :: functionalities/gdb_remote_client/TestGDBRemoteLoad.py (1031 of 2333)
UNSUPPORTED: lldb-api :: commands/platform/connect/TestPlatformConnect.py (1032 of 2333)
PASS: lldb-api :: python_api/watchpoint/TestWatchpointIter.py (1033 of 2333)
UNSUPPORTED: lldb-shell :: ScriptInterpreter/Lua/fail_breakpoint_oneline.test (1034 of 2333)
PASS: lldb-unit :: Process/gdb-remote/./ProcessGdbRemoteTests/GDBRemoteCommunicationClientTest.GetModulesInfo (1035 of 2333)
PASS: lldb-unit :: Utility/./UtilityTests/StreamTest.PutBytesAsRawHex8ToMixedEndian (1036 of 2333)
PASS: lldb-unit :: Expression/./ExpressionTests/CppModuleConfigurationTest.Xcode (1037 of 2333)
PASS: lldb-unit :: Process/minidump/./LLDBMinidumpTests/MinidumpParserTest.MinidumpDuplicateModuleMappedFirst (1038 of 2333)
PASS: lldb-unit :: Utility/./UtilityTests/StringListTest.InsertStringAtIndexOutOfBounds (1039 of 2333)
PASS: lldb-api :: lang/objc/objc++/TestObjCXX.py (1040 of 2333)
PASS: lldb-unit :: Utility/./UtilityTests/StreamTest.ShiftOperatorStrings (1041 of 2333)
PASS: lldb-api :: lang/cpp/accelerator-table/TestCPPAccelerator.py (1042 of 2333)
PASS: lldb-unit :: Utility/./UtilityTests/ProcessInfoTest.Constructor (1043 of 2333)
UNSUPPORTED: lldb-shell :: ExecControl/StopHook/stop-hook-threads.test (1044 of 2333)
PASS: lldb-unit :: Process/Utility/./ProcessUtilityTests/ProcSMapTests/LinuxProcSMapsTestFixture.ParseSMapRegions/7 (1045 of 2333)
UNSUPPORTED: lldb-shell :: Register/x86-64-xmm16-read.test (1046 of 2333)
PASS: lldb-unit :: Language/Highlighting/./HighlighterTests/HighlighterTest.ClangStringLiterals (1047 of 2333)
PASS: lldb-unit :: Host/./HostTests/SocketTests/SocketTest.DomainGetConnectURI/ipv6 (1048 of 2333)
UNSUPPORTED: lldb-shell :: Expr/TestIRMemoryMapWindows.test (1049 of 2333)
PASS: lldb-unit :: Utility/./UtilityTests/TimerTest.CategoryTimes2 (1050 of 2333)
PASS: lldb-api :: commands/expression/ir-interpreter/TestIRInterpreter.py (1051 of 2333)
PASS: lldb-unit :: Utility/./UtilityTests/StringExtractorTest.GetHexBytes_Underflow (1052 of 2333)
PASS: lldb-unit :: Utility/./UtilityTests/VASprintfTest.NoBufferResize (1053 of 2333)
PASS: lldb-unit :: Utility/./UtilityTests/XcodeSDKTest.GetSDKTypeForTriple (1054 of 2333)
PASS: lldb-unit :: Utility/./UtilityTests/ConstStringTest.MangledCounterpart (1055 of 2333)
UNSUPPORTED: lldb-api :: functionalities/darwin_log/filter/regex/activity-chain/TestDarwinLogFilterRegexActivityChain.py (1056 of 2333)
PASS: lldb-api :: types/TestLongTypesExpr.py (1057 of 2333)
PASS: lldb-api :: commands/expression/unwind_expression/TestUnwindExpression.py (1058 of 2333)
PASS: lldb-unit :: Utility/./UtilityTests/ConstStringTest.CompareStringRef (1059 of 2333)
PASS: lldb-api :: functionalities/thread/concurrent_events/TestConcurrentWatchBreakDelay.py (1060 of 2333)
PASS: lldb-shell :: SymbolFile/DWARF/x86/debug_rnglists.s (1061 of 2333)
PASS: lldb-unit :: UnwindAssembly/x86/./UnwindAssemblyx86Tests/Testx86AssemblyInspectionEngine.TestPushR12 (1062 of 2333)
PASS: lldb-api :: tools/lldb-server/memory-allocation/TestGdbRemoteMemoryAllocation.py (1063 of 2333)
PASS: lldb-unit :: SymbolFile/NativePDB/./SymbolFileNativePDBTests/PDBFPOProgramToDWARFExpressionTests.DependencyChain (1064 of 2333)
UNSUPPORTED: lldb-shell :: SymbolFile/PDB/variables-locations.test (1065 of 2333)
PASS: lldb-shell :: Register/Core/x86-64-netbsd-gp.test (1066 of 2333)
PASS: lldb-unit :: ObjectFile/Breakpad/./ObjectFileBreakpadTests/StackCFIRecord.parse (1067 of 2333)
PASS: lldb-unit :: Utility/./UtilityTests/ScalarTest.GetValue (1068 of 2333)
PASS: lldb-api :: functionalities/unwind/zeroth_frame/TestZerothFrame.py (1069 of 2333)
PASS: lldb-api :: functionalities/data-formatter/data-formatter-stl/libcxx/queue/TestDataFormatterLibcxxQueue.py (1070 of 2333)
UNSUPPORTED: lldb-shell :: ObjectFile/PECOFF/disassemble-thumb.yaml (1071 of 2333)
PASS: lldb-unit :: ObjectFile/MachO/./ObjectFileMachOTests/ObjectFileMachOTest.ModuleFromSharedCacheInfo (1072 of 2333)
UNSUPPORTED: lldb-api :: commands/gui/breakpoints/TestGuiBreakpoints.py (1073 of 2333)
UNSUPPORTED: lldb-shell :: Breakpoint/ppc64-localentry.test (1074 of 2333)
PASS: lldb-api :: functionalities/wrong_commands/TestWrongCommands.py (1075 of 2333)
PASS: lldb-api :: lang/c/shared_lib_stripped_symbols/TestSharedLibStrippedSymbols.py (1076 of 2333)
PASS: lldb-unit :: Utility/./UtilityTests/StringListTest.CopyListSingle (1077 of 2333)
UNSUPPORTED: lldb-api :: arm/breakpoint-it/TestBreakpointIt.py (1078 of 2333)
PASS: lldb-api :: functionalities/data-formatter/cstring-utf8-summary/TestCstringUnicode.py (1079 of 2333)
PASS: lldb-unit :: SymbolFile/DWARF/./SymbolFileDWARFTests/SymbolFileDWARFTests.TestAbbrevMissingTerminator (1080 of 2333)
PASS: lldb-shell :: ObjectFile/PECOFF/sections.yaml (1081 of 2333)
PASS: lldb-api :: commands/expression/codegen-crash-import-def-arraytype-element/TestImportDefinitionArrayType.py (1082 of 2333)
PASS: lldb-unit :: Expression/./ExpressionTests/CppModuleConfigurationTest.UnknownLibCppFile (1083 of 2333)
PASS: lldb-shell :: ObjectFile/ELF/avr-basic-info.yaml (1084 of 2333)
PASS: lldb-shell :: Breakpoint/single-file-split-dwarf.test (1085 of 2333)
PASS: lldb-unit :: SymbolFile/DWARF/./SymbolFileDWARFTests/SymbolFileDWARFTests.ParseArangesSkipErrors (1086 of 2333)
PASS: lldb-unit :: Core/./LLDBCoreTests/FormatEntity.LookupAllEntriesInTree (1087 of 2333)
PASS: lldb-api :: functionalities/thread/concurrent_events/TestConcurrentTwoBreakpointsOneDelaySignal.py (1088 of 2333)
PASS: lldb-unit :: UnwindAssembly/x86/./UnwindAssemblyx86Tests/Testx86AssemblyInspectionEngine.TestPushEDI (1089 of 2333)
PASS: lldb-unit :: Symbol/./SymbolTests/PostfixExpression.ParseFPOProgram (1090 of 2333)
PASS: lldb-unit :: Utility/./UtilityTests/StringExtractorTest.GetU64BigEndian (1091 of 2333)
PASS: lldb-unit :: ObjectFile/ELF/./ObjectFileELFTests/ObjectFileELFTest.GetSymtab_NoSymEntryPointArmThumbAddressClass (1092 of 2333)
PASS: lldb-unit :: Utility/./UtilityTests/BinaryStreamTest.PutULEB128MaxValue (1093 of 2333)
PASS: lldb-api :: commands/thread/select/TestThreadSelect.py (1094 of 2333)
PASS: lldb-api :: commands/command/script/import/rdar-12586188/TestRdar12586188.py (1095 of 2333)
PASS: lldb-shell :: ObjectFile/Breakpad/uuid-matching-mac.test (1096 of 2333)
PASS: lldb-unit :: Utility/./UtilityTests/BinaryStreamTest.PutULEB128One (1097 of 2333)
PASS: lldb-unit :: Host/./HostTests/SocketTests/SocketTest.UDPConnect/ipv4 (1098 of 2333)
PASS: lldb-unit :: Core/./LLDBCoreTests/SourceFileCache.FindSourceFileNotFound (1099 of 2333)
PASS: lldb-unit :: ScriptInterpreter/Python/./ScriptInterpreterPythonTests/PythonDataObjectsTest.TestPythonInteger (1100 of 2333)
PASS: lldb-api :: commands/expression/import-std-module/array/TestArrayFromStdModule.py (1101 of 2333)
PASS: lldb-unit :: SymbolFile/NativePDB/./SymbolFileNativePDBTests/PDBFPOProgramToDWARFExpressionTests.MissingTargetRegister (1102 of 2333)
PASS: lldb-unit :: Utility/./UtilityTests/ArgsTest.GetArgumentArrayRef (1103 of 2333)
PASS: lldb-api :: commands/target/dump-symtab-demangle/TestDumpSymtabDemangle.py (1104 of 2333)
PASS: lldb-api :: python_api/sbdata/TestSBData.py (1105 of 2333)
PASS: lldb-unit :: SymbolFile/NativePDB/./SymbolFileNativePDBTests/PDBFPOProgramToDWARFExpressionTests.MultipleIndependentAssignments (1106 of 2333)
PASS: lldb-unit :: Utility/./UtilityTests/StringListTest.AppendList (1107 of 2333)
UNSUPPORTED: lldb-api :: commands/trace/multiple-threads/TestTraceStartStopMultipleThreads.py (1108 of 2333)
PASS: lldb-api :: functionalities/data-formatter/data-formatter-objc/TestDataFormatterObjNSException.py (1109 of 2333)
PASS: lldb-unit :: Utility/./UtilityTests/BinaryStreamTest.PutULEB128ThreeBytes (1110 of 2333)
PASS: lldb-api :: lang/cpp/overloaded-functions/TestOverloadedFunctions.py (1111 of 2333)
PASS: lldb-unit :: Utility/./UtilityTests/TimerTest.CategoryTimesStats (1112 of 2333)
PASS: lldb-unit :: Host/./HostTests/NativeProcessProtocolTest.SetBreakpoint (1113 of 2333)
PASS: lldb-api :: lang/cpp/llvm-style/TestLLVMStyle.py (1114 of 2333)
PASS: lldb-unit :: ObjectFile/Breakpad/./ObjectFileBreakpadTests/PublicRecord.parse (1115 of 2333)
PASS: lldb-api :: lang/objc/cpp_keyword_identifiers/TestCppKeywordsAsObjCIdentifiers.py (1116 of 2333)
PASS: lldb-api :: api/check_public_api_headers/TestPublicAPIHeaders.py (1117 of 2333)
PASS: lldb-api :: lang/objc/warnings-in-expr-parser/TestObjCWarningsInExprParser.py (1118 of 2333)
PASS: lldb-shell :: Watchpoint/SetErrorCases.test (1119 of 2333)
PASS: lldb-unit :: Utility/./UtilityTests/StringExtractorTest.InitEmpty (1120 of 2333)
PASS: lldb-api :: tools/lldb-server/TestGdbRemote_vCont.py (1121 of 2333)
PASS: lldb-api :: lang/cpp/class-template-non-type-parameter-pack/TestClassTemplateNonTypeParameterPack.py (1122 of 2333)
UNSUPPORTED: lldb-api :: functionalities/unwind/standard/TestStandardUnwind.py (1123 of 2333)
PASS: lldb-unit :: Expression/./ExpressionTests/DiagnosticManagerTest.GetStringNoDiags (1124 of 2333)
PASS: lldb-shell :: Unwind/eh-frame-dwarf-unwind.test (1125 of 2333)
PASS: lldb-api :: lang/cpp/dynamic-value/TestDynamicValue.py (1126 of 2333)
PASS: lldb-shell :: lldb-server/TestGdbserverPort.test (1127 of 2333)
PASS: lldb-api :: commands/platform/process/list/TestProcessList.py (1128 of 2333)
PASS: lldb-shell :: Minidump/memory-region-from-module.yaml (1129 of 2333)
PASS: lldb-api :: functionalities/breakpoint/inlined_breakpoints/TestInlinedBreakpoints.py (1130 of 2333)
PASS: lldb-unit :: Utility/./UtilityTests/BinaryStreamTest.PutULEB128EightBytes (1131 of 2333)
PASS: lldb-unit :: Utility/./UtilityTests/BinaryStreamTest.PutSLEB128Zero (1132 of 2333)
UNSUPPORTED: lldb-api :: functionalities/tsan/multiple/TestTsanMultiple.py (1133 of 2333)
PASS: lldb-api :: macosx/save_crashlog/TestSaveCrashlog.py (1134 of 2333)
PASS: lldb-api :: lang/objc/modules/TestObjCModules.py (1135 of 2333)
PASS: lldb-unit :: Utility/./UtilityTests/ReproducerTest.SetCapture (1136 of 2333)
PASS: lldb-unit :: Utility/./UtilityTests/RangeTest.DoesAdjoinOrIntersect (1137 of 2333)
PASS: lldb-api :: functionalities/thread/exit_during_step/TestExitDuringStep.py (1138 of 2333)
UNSUPPORTED: lldb-api :: tools/lldb-server/TestGdbRemoteAuxvSupport.py (1139 of 2333)
PASS: lldb-api :: types/TestDoubleTypes.py (1140 of 2333)
PASS: lldb-shell :: Quit/TestQuitExitCode0.test (1141 of 2333)
PASS: lldb-unit :: Process/minidump/./LLDBMinidumpTests/MinidumpParserTest.FindMemoryRangeWithFullMemoryMinidump (1142 of 2333)
PASS: lldb-unit :: Utility/./UtilityTests/StreamTeeTest.Flush (1143 of 2333)
PASS: lldb-api :: functionalities/data-formatter/data-formatter-synthtype/TestDataFormatterSynthType.py (1144 of 2333)
PASS: lldb-api :: commands/expression/import-std-module/basic/TestImportStdModule.py (1145 of 2333)
PASS: lldb-api :: functionalities/gdb_remote_client/TestRegDefinitionInParts.py (1146 of 2333)
PASS: lldb-api :: functionalities/plugins/python_os_plugin/TestPythonOSPlugin.py (1147 of 2333)
PASS: lldb-unit :: Host/./HostTests/FileSystemTest.Readable (1148 of 2333)
PASS: lldb-api :: functionalities/tail_call_frames/disambiguate_tail_call_seq/TestDisambiguateTailCallSeq.py (1149 of 2333)
PASS: lldb-unit :: Utility/./UtilityTests/StateTest.Formatv (1150 of 2333)
PASS: lldb-api :: python_api/watchpoint/watchlocation/TestSetWatchlocation.py (1151 of 2333)
PASS: lldb-api :: functionalities/data-formatter/data-formatter-objc/nsstring/TestDataFormatterNSString.py (1152 of 2333)
PASS: lldb-unit :: ScriptInterpreter/Python/./ScriptInterpreterPythonTests/PythonDataObjectsTest.TestObjectAttributes (1153 of 2333)
PASS: lldb-shell :: ObjectFile/ELF/PT_LOAD-overlap-section.yaml (1154 of 2333)
PASS: lldb-unit :: Core/./LLDBCoreTests/MangledTest.EmptyForInvalidName (1155 of 2333)
PASS: lldb-unit :: SymbolFile/DWARF/./SymbolFileDWARFTests/SymbolFileDWARFTests.ParseArangesWithMultipleTerminators (1156 of 2333)
PASS: lldb-unit :: Symbol/./SymbolTests/Type.CompilerContextPattern (1157 of 2333)
UNSUPPORTED: lldb-shell :: Minidump/Windows/arm-fp-unwind.test (1158 of 2333)
PASS: lldb-shell :: SymbolFile/DWARF/x86/find-basic-type.cpp (1159 of 2333)
PASS: lldb-unit :: Utility/./UtilityTests/FileSpecTest.GetPath (1160 of 2333)
PASS: lldb-unit :: Symbol/./SymbolTests/PostfixExpression.ParseOneExpression (1161 of 2333)
PASS: lldb-unit :: UnwindAssembly/x86/./UnwindAssemblyx86Tests/Testx86AssemblyInspectionEngine.TestDisassemblyJunkBytes (1162 of 2333)
PASS: lldb-unit :: Symbol/./SymbolTests/TestClangASTImporter.CopyTypeTagDecl (1163 of 2333)
PASS: lldb-unit :: Process/minidump/./LLDBMinidumpTests/MinidumpParserTest.GetThreadsAndGetThreadContext (1164 of 2333)
PASS: lldb-unit :: Expression/./ExpressionTests/DiagnosticManagerTest.AppendMessageAttachToLastDiag (1165 of 2333)
PASS: lldb-unit :: ScriptInterpreter/Python/./ScriptInterpreterPythonTests/PythonDataObjectsTest.TestInstanceNameResolutionNoDot (1166 of 2333)
PASS: lldb-api :: commands/target/stop-hook/disable/TestTargetStopHookDisable.py (1167 of 2333)
PASS: lldb-api :: python_api/sbvalue_persist/TestSBValuePersist.py (1168 of 2333)
PASS: lldb-unit :: Host/./HostTests/FileSystemTest.OpenErrno (1169 of 2333)
PASS: lldb-unit :: UnwindAssembly/x86/./UnwindAssemblyx86Tests/Testx86AssemblyInspectionEngine.TestPopRBPWithREX (1170 of 2333)
PASS: lldb-shell :: SymbolFile/Breakpad/line-table.test (1171 of 2333)
PASS: lldb-api :: functionalities/gdb_remote_client/TestqOffsets.py (1172 of 2333)
PASS: lldb-shell :: ObjectFile/ELF/PT_LOAD-overlap-PT_TLS.yaml (1173 of 2333)
PASS: lldb-unit :: Utility/./UtilityTests/RangeDataVector.FindEntryIndexesThatContain (1174 of 2333)
PASS: lldb-api :: commands/expression/import-std-module/vector-dbg-info-content/TestDbgInfoContentVectorFromStdModule.py (1175 of 2333)
PASS: lldb-unit :: Symbol/./SymbolTests/TestClangASTImporter.CanImportInvalidType (1176 of 2333)
PASS: lldb-unit :: Utility/./UtilityTests/OptionsWithRawTest.EmptyInput (1177 of 2333)
PASS: lldb-api :: python_api/watchpoint/TestWatchpointIgnoreCount.py (1178 of 2333)
PASS: lldb-unit :: Expression/./ExpressionTests/DWARFExpression.DW_OP_piece (1179 of 2333)
PASS: lldb-api :: tools/lldb-vscode/step/TestVSCode_step.py (1180 of 2333)
PASS: lldb-shell :: VSCode/TestOptions.test (1181 of 2333)
PASS: lldb-shell :: ObjectFile/PECOFF/export-dllfunc.yaml (1182 of 2333)
PASS: lldb-shell :: ObjectFile/PDB/object.test (1183 of 2333)
PASS: lldb-unit :: Utility/./UtilityTests/DataExtractorTest.PeekData (1184 of 2333)
PASS: lldb-api :: lang/c/cpp_keyword_identifiers/TestCppKeywordsAsCIdentifiers.py (1185 of 2333)
PASS: lldb-unit :: Utility/./UtilityTests/SerializationRountripTest.SerializeDeserializeCStringArray (1186 of 2333)
PASS: lldb-api :: lang/c/shared_lib/TestSharedLib.py (1187 of 2333)
PASS: lldb-unit :: Utility/./UtilityTests/Predicate.WaitForValueEqualTo (1188 of 2333)
PASS: lldb-shell :: SymbolFile/Breakpad/unwind-via-stack-cfi.test (1189 of 2333)
PASS: lldb-unit :: Utility/./UtilityTests/DataExtractorTest.GetCStrEmpty (1190 of 2333)
PASS: lldb-api :: commands/expression/import-std-module/retry-with-std-module/TestRetryWithStdModule.py (1191 of 2333)
PASS: lldb-unit :: Expression/./ExpressionTests/CppModuleConfigurationTest.MissingLibCpp (1192 of 2333)
PASS: lldb-api :: python_api/sbplatform/TestSBPlatform.py (1193 of 2333)
PASS: lldb-shell :: ObjectFile/ELF/base-address.yaml (1194 of 2333)
PASS: lldb-shell :: ObjectFile/MachO/lc_version_min.yaml (1195 of 2333)
UNSUPPORTED: lldb-shell :: Register/x86-64-xmm16-write.test (1196 of 2333)
PASS: lldb-unit :: Utility/./UtilityTests/NameMatchesTest.Contains (1197 of 2333)
PASS: lldb-unit :: Utility/./UtilityTests/OptionsWithRawTest.MultiWordSuffix (1198 of 2333)
PASS: lldb-unit :: Process/gdb-remote/./ProcessGdbRemoteTests/GDBRemoteCommunicationTest.ReadPacket_checksum (1199 of 2333)
PASS: lldb-api :: functionalities/reproducers/fs-case-sensitivity/TestReproducerFSCaseSensitivity.py (1200 of 2333)
PASS: lldb-api :: functionalities/breakpoint/cpp/TestCPPBreakpointLocations.py (1201 of 2333)
PASS: lldb-unit :: Host/./HostTests/SocketTests/SocketTest.UDPConnect/ipv6 (1202 of 2333)
PASS: lldb-api :: commands/target/stop-hook/enable/TestTargetStopHookEnable.py (1203 of 2333)
PASS: lldb-unit :: Utility/./UtilityTests/StreamTest.PutCharWhitespace (1204 of 2333)
PASS: lldb-api :: commands/platform/basic/TestPlatformPython.py (1205 of 2333)
PASS: lldb-unit :: Process/gdb-remote/./ProcessGdbRemoteTests/GDBRemoteCommunicationClientTest.WriteRegisterNoSuffix (1206 of 2333)
PASS: lldb-unit :: Host/./HostTests/SocketTests/SocketTest.UDPGetConnectURI/ipv6 (1207 of 2333)
PASS: lldb-shell :: SymbolFile/symbol-binding.test (1208 of 2333)
PASS: lldb-api :: lang/objc/real-definition/TestRealDefinition.py (1209 of 2333)
PASS: lldb-unit :: Utility/./UtilityTests/DataExtractorTest.GetCStrUnterminated (1210 of 2333)
PASS: lldb-api :: lang/cpp/gmodules/TestWithModuleDebugging.py (1211 of 2333)
PASS: lldb-api :: tools/lldb-vscode/breakpoint-events/TestVSCode_breakpointEvents.py (1212 of 2333)
UNSUPPORTED: lldb-api :: tools/lldb-vscode/disconnect/TestVSCode_disconnect.py (1213 of 2333)
PASS: lldb-unit :: Utility/./UtilityTests/RangeTest.ContainsAddrInvalid (1214 of 2333)
PASS: lldb-api :: types/TestCharTypeExpr.py (1215 of 2333)
PASS: lldb-unit :: Target/./TargetTests/PathMappingListTest.AbsoluteTests (1216 of 2333)
PASS: lldb-unit :: Utility/./UtilityTests/RegularExpression.CopyAssignment (1217 of 2333)
PASS: lldb-shell :: SymbolFile/DWARF/x86/compilercontext.ll (1218 of 2333)
PASS: lldb-unit :: Utility/./UtilityTests/ArgsTest.ReplaceArgumentAtIndexFarOutOfRange (1219 of 2333)
PASS: lldb-shell :: Register/x86-multithread-write.test (1220 of 2333)
PASS: lldb-api :: functionalities/tail_call_frames/ambiguous_tail_call_seq1/TestAmbiguousTailCallSeq1.py (1221 of 2333)
PASS: lldb-unit :: Utility/./UtilityTests/StringExtractorTest.GetU32LittleEndian (1222 of 2333)
PASS: lldb-api :: lang/cpp/dynamic-value/TestCppValueCast.py (1223 of 2333)
PASS: lldb-unit :: Utility/./UtilityTests/AnsiTerminal.Twice (1224 of 2333)
PASS: lldb-unit :: Utility/./UtilityTests/AnsiTerminal.AtStart (1225 of 2333)
PASS: lldb-shell :: SymbolFile/DWARF/x86/find-method-local-struct.cpp (1226 of 2333)
PASS: lldb-api :: functionalities/jitloader_gdb/TestJITLoaderGDB.py (1227 of 2333)
PASS: lldb-shell :: SymbolFile/NativePDB/nested-types.cpp (1228 of 2333)
PASS: lldb-unit :: Target/./TargetTests/ExecutionContextTest.GetByteOrder (1229 of 2333)
PASS: lldb-shell :: Reproducer/Functionalities/TestExpressionEvaluation.test (1230 of 2333)
PASS: lldb-unit :: debugserver/./debugserverTests/RNBSocket.LoopBackListenIPv6 (1231 of 2333)
PASS: lldb-unit :: Utility/./UtilityTests/UriParserTest.BracketedHostnamePort (1232 of 2333)
PASS: lldb-shell :: Breakpoint/debug_rnglistx_rlex.test (1233 of 2333)
PASS: lldb-api :: commands/watchpoints/multiple_threads/TestWatchpointMultipleThreads.py (1234 of 2333)
PASS: lldb-unit :: Thread/./ThreadTests/ThreadTest.GetPrivateStopInfo (1235 of 2333)
PASS: lldb-api :: functionalities/tail_call_frames/disambiguate_paths_to_common_sink/TestDisambiguatePathsToCommonSink.py (1236 of 2333)
PASS: lldb-unit :: Host/./HostTests/HostInfoTest.GetAugmentedArchSpec (1237 of 2333)
PASS: lldb-api :: lang/c/unicode/TestUnicodeSymbols.py (1238 of 2333)
PASS: lldb-api :: tools/lldb-server/commandline/TestStubSetSID.py (1239 of 2333)
PASS: lldb-unit :: Utility/./UtilityTests/FileSpecTest.RemoveLastPathComponent (1240 of 2333)
UNSUPPORTED: lldb-api :: functionalities/darwin_log/filter/exact_match/activity-chain/TestDarwinLogFilterMatchActivityChain.py (1241 of 2333)
PASS: lldb-api :: commands/expression/no-deadlock/TestExprDoesntBlock.py (1242 of 2333)
PASS: lldb-api :: lang/objc/objc-struct-return/TestObjCStructReturn.py (1243 of 2333)
PASS: lldb-shell :: Quit/TestQuitExitCode-30.test (1244 of 2333)
PASS: lldb-api :: functionalities/data-formatter/data-formatter-stl/libcxx/iterator/TestDataFormatterLibccIterator.py (1245 of 2333)
PASS: lldb-shell :: SymbolFile/DWARF/x86/debug_ranges-missing-section.s (1246 of 2333)
PASS: lldb-unit :: Process/minidump/./LLDBMinidumpTests/MinidumpParserTest.GetMemoryRegionInfoFromMemoryList (1247 of 2333)
PASS: lldb-api :: sanity/TestModuleCacheSanity.py (1248 of 2333)
PASS: lldb-unit :: Utility/./UtilityTests/StringListTest.AppendListCStringArrayEmpty (1249 of 2333)
PASS: lldb-shell :: Minidump/disassemble-no-module.yaml (1250 of 2333)
PASS: lldb-unit :: SymbolFile/DWARF/./SymbolFileDWARFTests/SymbolFileDWARFTests.TestAbbrevInvalidNULLTag (1251 of 2333)
PASS: lldb-shell :: ObjectFile/wasm/basic.yaml (1252 of 2333)
PASS: lldb-unit :: Utility/./UtilityTests/CompletionRequest.TryCompleteCurrentArgBad (1253 of 2333)
PASS: lldb-unit :: Signals/./SignalsTests/UnixSignalsTest.VersionChange (1254 of 2333)
PASS: lldb-unit :: SymbolFile/DWARF/./SymbolFileDWARFTests/SymbolFileDWARFTests.ParseArangesNonzeroSegmentSize (1255 of 2333)
PASS: lldb-unit :: Utility/./UtilityTests/VMRange.ContainsRange (1256 of 2333)
PASS: lldb-unit :: Utility/./UtilityTests/StringExtractorTest.GetNameColonValueNoColon (1257 of 2333)
PASS: lldb-unit :: Host/./HostTests/SocketTests/SocketTest.DecodeHostAndPort/ipv6 (1258 of 2333)
PASS: lldb-api :: functionalities/data-formatter/data-formatter-stl/libcxx/atomic/TestLibCxxAtomic.py (1259 of 2333)
PASS: lldb-unit :: Host/./HostTests/SocketTests/SocketTest.TCPListen0ConnectAccept/ipv4 (1260 of 2333)
PASS: lldb-api :: functionalities/postmortem/netbsd-core/TestNetBSDCore.py (1261 of 2333)
PASS: lldb-unit :: Symbol/./SymbolTests/TestTypeSystemClang.GetExeModuleWhenMissingSymbolFile (1262 of 2333)
PASS: lldb-unit :: Utility/./UtilityTests/DeserializerTest.HasData (1263 of 2333)
XFAIL: lldb-shell :: Register/x86-fp-write.test (1264 of 2333)
PASS: lldb-api :: functionalities/data-formatter/var-in-aggregate-misuse/TestVarInAggregateMisuse.py (1265 of 2333)
PASS: lldb-api :: functionalities/thread/concurrent_events/TestConcurrentBreakpointDelayBreakpointOneSignal.py (1266 of 2333)
PASS: lldb-unit :: Utility/./UtilityTests/DataExtractorTest.GetDoubleUnaligned (1267 of 2333)
PASS: lldb-unit :: Utility/./UtilityTests/BinaryStreamTest.PutULEB128SixBytes (1268 of 2333)
PASS: lldb-api :: commands/watchpoints/watchpoint_disable/TestWatchpointDisable.py (1269 of 2333)
UNSUPPORTED: lldb-shell :: Register/arm-fp-read.test (1270 of 2333)
PASS: lldb-unit :: UnwindAssembly/x86/./UnwindAssemblyx86Tests/Testx86AssemblyInspectionEngine.TestPush0 (1271 of 2333)
PASS: lldb-api :: lang/cpp/subst_template_type_param/TestSubstTemplateTypeParam.py (1272 of 2333)
PASS: lldb-unit :: Target/./TargetTests/StackFrameRecognizerTest.NullModuleRegex (1273 of 2333)
PASS: lldb-shell :: ObjectFile/PECOFF/basic-info-arm64.yaml (1274 of 2333)
PASS: lldb-unit :: Utility/./UtilityTests/LogChannelTest.List (1275 of 2333)
PASS: lldb-shell :: SymbolFile/DWARF/x86/dwarf5-index-is-used.cpp (1276 of 2333)
PASS: lldb-unit :: ScriptInterpreter/Python/./ScriptInterpreterPythonTests/PythonDataObjectsTest.TestScript (1277 of 2333)
PASS: lldb-api :: commands/apropos/with-process/TestAproposWithProcess.py (1278 of 2333)
PASS: lldb-api :: python_api/process/io/TestProcessIO.py (1279 of 2333)
PASS: lldb-unit :: Utility/./UtilityTests/ProcessInstanceInfo.Dump (1280 of 2333)
PASS: lldb-unit :: UnwindAssembly/x86/./UnwindAssemblyx86Tests/Testx86AssemblyInspectionEngine.TestPopR15 (1281 of 2333)
UNSUPPORTED: lldb-api :: functionalities/process_save_core/TestProcessSaveCore.py (1282 of 2333)
PASS: lldb-api :: lang/objc/modules-cache/TestClangModulesCache.py (1283 of 2333)
PASS: lldb-unit :: ScriptInterpreter/Python/./ScriptInterpreterPythonTests/PythonDataObjectsTest.TestGlobalNameResolutionNoDot (1284 of 2333)
PASS: lldb-shell :: SymbolFile/DWARF/x86/inline-function-address-shared.test (1285 of 2333)
PASS: lldb-shell :: ObjectFile/Breakpad/discontiguous-sections.test (1286 of 2333)
PASS: lldb-unit :: Utility/./UtilityTests/StringExtractorTest.GetNameColonValueContainsColon (1287 of 2333)
PASS: lldb-unit :: Utility/./UtilityTests/ArchSpecTest.TripleComponentsWereSpecified (1288 of 2333)
PASS: lldb-api :: macosx/lc-note/firmware-corefile/TestFirmwareCorefiles.py (1289 of 2333)
PASS: lldb-api :: lang/c/local_variables/TestLocalVariables.py (1290 of 2333)
PASS: lldb-unit :: Utility/./UtilityTests/StreamTest.PutStringAsRawHex8 (1291 of 2333)
PASS: lldb-shell :: SymbolFile/DWARF/x86/debug-types-address-ranges.s (1292 of 2333)
UNSUPPORTED: lldb-api :: tools/lldb-server/vCont-threads/TestGdbRemote_vContThreads.py (1293 of 2333)
UNSUPPORTED: lldb-api :: functionalities/ptr_refs/TestPtrRefs.py (1294 of 2333)
PASS: lldb-unit :: Utility/./UtilityTests/StringExtractorTest.GetHexBytes_OddPair (1295 of 2333)
PASS: lldb-unit :: Utility/./UtilityTests/ScalarTest.RightShiftOperator (1296 of 2333)
PASS: lldb-unit :: UnwindAssembly/x86/./UnwindAssemblyx86Tests/Testx86AssemblyInspectionEngine.TestStackRealign8BitDisp_i386 (1297 of 2333)
PASS: lldb-unit :: Utility/./UtilityTests/RangeTest.Clear (1298 of 2333)
PASS: lldb-unit :: Core/./LLDBCoreTests/RichManglingContextTest.IPDRealloc (1299 of 2333)
PASS: lldb-api :: lang/c/stepping/TestStepAndBreakpoints.py (1300 of 2333)
UNSUPPORTED: lldb-shell :: ScriptInterpreter/Lua/lua-python.test (1301 of 2333)
PASS: lldb-shell :: Commands/command-image-lookup.yaml (1302 of 2333)
PASS: lldb-shell :: Register/Core/x86-64-freebsd-addr.test (1303 of 2333)
PASS: lldb-unit :: Utility/./UtilityTests/RangeTest.Union (1304 of 2333)
PASS: lldb-unit :: API/./APITests/SBCommandInterpreterTest.SingleWordCommand (1305 of 2333)
PASS: lldb-shell :: Register/Core/x86-64-linux-gp.test (1306 of 2333)
PASS: lldb-unit :: Utility/./UtilityTests/StatusTest.ErrorCodeConstructor (1307 of 2333)
PASS: lldb-shell :: Breakpoint/debug_rnglist_offset_pair.test (1308 of 2333)
PASS: lldb-unit :: ObjectFile/PECOFF/./ObjectFilePECOFFTests/PECallFrameInfoTest.Basic_eh (1309 of 2333)
UNSUPPORTED: lldb-shell :: Register/aarch64-gp-read.test (1310 of 2333)
PASS: lldb-shell :: Breakpoint/debug_addrx.test (1311 of 2333)
PASS: lldb-api :: commands/expression/call-function/TestCallBuiltinFunction.py (1312 of 2333)
PASS: lldb-shell :: ScriptInterpreter/None/import_module.test (1313 of 2333)
PASS: lldb-api :: lang/c/find_struct_type/TestFindStructTypes.py (1314 of 2333)
PASS: lldb-unit :: UnwindAssembly/x86/./UnwindAssemblyx86Tests/Testx86AssemblyInspectionEngine.TestPopESI (1315 of 2333)
PASS: lldb-unit :: Utility/./UtilityTests/StringLexerTest.AdvanceIf (1316 of 2333)
PASS: lldb-unit :: Language/Highlighting/./HighlighterTests/HighlighterTest.DefaultHighlighterWithCursor (1317 of 2333)
UNSUPPORTED: lldb-api :: functionalities/darwin_log/filter/exact_match/message/TestDarwinLogFilterMatchMessage.py (1318 of 2333)
PASS: lldb-unit :: Utility/./UtilityTests/ScalarTest.APIntConstructor (1319 of 2333)
PASS: lldb-unit :: Expression/./ExpressionTests/ClangExpressionDeclMapTest.TestUnknownIdentifierLookup (1320 of 2333)
PASS: lldb-unit :: Utility/./UtilityTests/TimerTest.CategoryTimesNested (1321 of 2333)
PASS: lldb-unit :: Utility/./UtilityTests/RegisterValueTest.GetScalarValue (1322 of 2333)
PASS: lldb-api :: functionalities/reproducers/attach/TestReproducerAttach.py (1323 of 2333)
PASS: lldb-shell :: Commands/command-breakpoint-col.test (1324 of 2333)
PASS: lldb-unit :: Language/Highlighting/./HighlighterTests/HighlighterTest.HighlighterSelectionPath (1325 of 2333)
PASS: lldb-unit :: Language/Highlighting/./HighlighterTests/HighlighterTest.ClangCursorPosAfterOtherToken (1326 of 2333)
PASS: lldb-api :: lang/cpp/exceptions/TestCPPExceptionBreakpoints.py (1327 of 2333)
UNSUPPORTED: lldb-api :: functionalities/breakpoint/breakpoint_in_delayslot/TestAvoidBreakpointInDelaySlot.py (1328 of 2333)
PASS: lldb-api :: functionalities/breakpoint/step_over_breakpoint/TestStepOverBreakpoint.py (1329 of 2333)
PASS: lldb-api :: lang/objc/rdar-11355592/TestRdar11355592.py (1330 of 2333)
PASS: lldb-unit :: Symbol/./SymbolTests/TestClangASTImporter.RecordLayout (1331 of 2333)
PASS: lldb-api :: lang/cpp/covariant-return-types/TestCovariantReturnTypes.py (1332 of 2333)
XFAIL: lldb-shell :: Expr/nodefaultlib.cpp (1333 of 2333)
PASS: lldb-api :: tools/lldb-vscode/console/TestVSCode_redirection_to_console.py (1334 of 2333)
PASS: lldb-api :: tools/lldb-server/inferior-crash/TestGdbRemoteSegFault.py (1335 of 2333)
PASS: lldb-api :: lang/c/stepping/TestThreadStepInAvoidRegexp.py (1336 of 2333)
UNSUPPORTED: lldb-api :: functionalities/thread/create_during_step/TestCreateDuringStep.py (1337 of 2333)
PASS: lldb-unit :: ObjectFile/ELF/./ObjectFileELFTests/ObjectFileELFTest.SectionsResolveConsistently (1338 of 2333)
PASS: lldb-api :: functionalities/thread/jump/TestThreadJump.py (1339 of 2333)
PASS: lldb-api :: commands/command/script/import/TestImport.py (1340 of 2333)
PASS: lldb-unit :: Utility/./UtilityTests/ScalarTest.Scalar_512 (1341 of 2333)
PASS: lldb-shell :: SymbolFile/DWARF/x86/dwarf5_locations.s (1342 of 2333)
PASS: lldb-unit :: SymbolFile/NativePDB/./SymbolFileNativePDBTests/PDBFPOProgramToDWARFExpressionTests.InvalidOpUnary (1343 of 2333)
UNSUPPORTED: lldb-api :: functionalities/thread/concurrent_events/TestConcurrentManySignals.py (1344 of 2333)
PASS: lldb-unit :: Process/gdb-remote/./ProcessGdbRemoteTests/GDBRemoteCommunicationClientTest.SyncThreadState (1345 of 2333)
UNSUPPORTED: lldb-api :: functionalities/thread/break_after_join/TestBreakAfterJoin.py (1346 of 2333)
PASS: lldb-api :: functionalities/data-formatter/nsdictionarysynth/TestNSDictionarySynthetic.py (1347 of 2333)
PASS: lldb-api :: lang/objc/objc-foundation-dictionary-empty/TestNSDictionary0.py (1348 of 2333)
UNSUPPORTED: lldb-api :: commands/watchpoints/variable_out_of_scope/TestWatchedVarHitWhenInScope.py (1349 of 2333)
PASS: lldb-unit :: Process/gdb-remote/./ProcessGdbRemoteTests/PortMapTest.FreePortForProcess (1350 of 2333)
PASS: lldb-shell :: SymbolFile/DWARF/x86/find-qualified-variable.cpp (1351 of 2333)
PASS: lldb-unit :: Utility/./UtilityTests/PassiveReplayTest.InstrumentedFoo (1352 of 2333)
PASS: lldb-shell :: Driver/TestProcessAttach.test (1353 of 2333)
PASS: lldb-unit :: Host/./HostTests/Host.GetEnvironment (1354 of 2333)
PASS: lldb-api :: python_api/lldbutil/TestSwigVersion.py (1355 of 2333)
PASS: lldb-unit :: Utility/./UtilityTests/ListenerTest.GetEventWait (1356 of 2333)
PASS: lldb-unit :: Utility/./UtilityTests/ArgsTest.TestAppendArg (1357 of 2333)
PASS: lldb-api :: commands/expression/completion/TestExprCompletion.py (1358 of 2333)
PASS: lldb-api :: commands/watchpoints/step_over_watchpoint/TestStepOverWatchpoint.py (1359 of 2333)
PASS: lldb-api :: functionalities/thread/crash_during_step/TestCrashDuringStep.py (1360 of 2333)
PASS: lldb-unit :: Symbol/./SymbolTests/TestClangASTImporter.MetadataPropagation (1361 of 2333)
PASS: lldb-unit :: UnwindAssembly/x86/./UnwindAssemblyx86Tests/Testx86AssemblyInspectionEngine.TestPushR15 (1362 of 2333)
PASS: lldb-unit :: Utility/./UtilityTests/StreamTest.PutBytesAsRawHex8ToBigEndian (1363 of 2333)
PASS: lldb-shell :: SymbolFile/DWARF/x86/gnu-style-compression.cpp (1364 of 2333)
PASS: lldb-api :: lang/cpp/default-template-args/TestDefaultTemplateArgs.py (1365 of 2333)
PASS: lldb-api :: functionalities/inferior-crashing/recursive-inferior/TestRecursiveInferior.py (1366 of 2333)
PASS: lldb-unit :: Host/./HostTests/SocketTests/SocketTest.TCPListen0ConnectAccept/ipv6 (1367 of 2333)
PASS: lldb-api :: python_api/frame/get-variables/TestGetVariables.py (1368 of 2333)
PASS: lldb-unit :: Expression/./ExpressionTests/DWARFExpression.DW_OP_const (1369 of 2333)
PASS: lldb-shell :: ObjectFile/wasm/stripped-debug-sections.yaml (1370 of 2333)
PASS: lldb-api :: functionalities/data-formatter/stringprinter/TestStringPrinter.py (1371 of 2333)
PASS: lldb-unit :: DataFormatter/./LLDBFormatterTests/TypeMatcherTests.RegexMatchPart (1372 of 2333)
UNSUPPORTED: lldb-api :: functionalities/darwin_log/filter/regex/subsystem/TestDarwinLogFilterRegexSubsystem.py (1373 of 2333)
UNSUPPORTED: lldb-api :: linux/aarch64/mte_memory_region/TestAArch64LinuxMTEMemoryRegion.py (1374 of 2333)
PASS: lldb-unit :: UnwindAssembly/x86/./UnwindAssemblyx86Tests/Testx86AssemblyInspectionEngine.Test32BitOnlyInstruction (1375 of 2333)
PASS: lldb-api :: types/TestRecursiveTypes.py (1376 of 2333)
PASS: lldb-shell :: ExecControl/StopHook/stop-hook.test (1377 of 2333)
PASS: lldb-unit :: Host/./HostTests/MainLoopTest.TerminatesImmediately (1378 of 2333)
PASS: lldb-unit :: Host/./HostTests/SocketTests/SocketTest.TCPGetConnectURI/ipv4 (1379 of 2333)
PASS: lldb-unit :: Utility/./UtilityTests/XcodeSDKTest.MergeTest (1380 of 2333)
PASS: lldb-unit :: UnwindAssembly/x86/./UnwindAssemblyx86Tests/Testx86AssemblyInspectionEngine.TestPopRBP (1381 of 2333)
PASS: lldb-api :: commands/expression/test/TestExprs2.py (1382 of 2333)
XFAIL: lldb-shell :: Register/x86-mm-xmm-write.test (1383 of 2333)
PASS: lldb-unit :: Core/./LLDBCoreTests/SourceLocationSpecTest.Equal (1384 of 2333)
PASS: lldb-api :: functionalities/dynamic_value_child_count/TestDynamicValueChildCount.py (1385 of 2333)
PASS: lldb-api :: commands/expression/function_template_specialization_temp_args/TestFunctionTemplateSpecializationTempArgs.py (1386 of 2333)
PASS: lldb-shell :: Heap/heap-cstr.test (1387 of 2333)
PASS: lldb-api :: commands/expression/expr-in-syscall/TestExpressionInSyscall.py (1388 of 2333)
PASS: lldb-unit :: Symbol/./SymbolTests/TestTypeSystemClang.TestGetTypeClassDeclType (1389 of 2333)
PASS: lldb-unit :: Utility/./UtilityTests/RecordReplayTest.InvalidSequence (1390 of 2333)
PASS: lldb-unit :: Utility/./UtilityTests/StreamTeeTest.SetStreamAtIndexOutOfBounds (1391 of 2333)
PASS: lldb-api :: types/TestIntegerType.py (1392 of 2333)
PASS: lldb-api :: lang/objc/foundation/TestRuntimeTypes.py (1393 of 2333)
PASS: lldb-unit :: Utility/./UtilityTests/StringListTest.JoinSingle (1394 of 2333)
PASS: lldb-api :: macosx/version_zero/TestGetVersionZeroVersion.py (1395 of 2333)
PASS: lldb-unit :: Utility/./UtilityTests/StreamTest.PutULEB128 (1396 of 2333)
PASS: lldb-unit :: SymbolFile/NativePDB/./SymbolFileNativePDBTests/PDBFPOProgramToDWARFExpressionTests.UnresolvedDependentCyclicRegisterAssignmentReference (1397 of 2333)
PASS: lldb-unit :: Utility/./UtilityTests/PassiveReplayTest.InstrumentedFooInvalid (1398 of 2333)
PASS: lldb-api :: functionalities/gdb_remote_client/TestHaltFails.py (1399 of 2333)
PASS: lldb-unit :: Utility/./UtilityTests/RangeTest.EqualInvalid (1400 of 2333)
PASS: lldb-unit :: Host/./HostTests/SocketTests/SocketTest.DomainListenConnectAccept/ipv6 (1401 of 2333)
UNSUPPORTED: lldb-shell :: Register/x86-ymm-write.test (1402 of 2333)
PASS: lldb-unit :: tools/lldb-server/tests/./LLDBServerTests/StandardStartupTest.TestStopReplyContainsThreadPcs (1403 of 2333)
PASS: lldb-unit :: Utility/./UtilityTests/StringListTest.JoinNonSpace (1404 of 2333)
PASS: lldb-api :: lang/objc/objc-dyn-sbtype/TestObjCDynamicSBType.py (1405 of 2333)
PASS: lldb-api :: functionalities/breakpoint/cpp_exception/TestCPPExceptionBreakpoint.py (1406 of 2333)
UNSUPPORTED: lldb-api :: functionalities/darwin_log/basic/TestDarwinLogBasic.py (1407 of 2333)
PASS: lldb-unit :: Utility/./UtilityTests/StringListTest.InsertStringAtIndexStdString (1408 of 2333)
PASS: lldb-unit :: Symbol/./SymbolTests/TestTypeSystemClang.TestOwningModule (1409 of 2333)
PASS: lldb-unit :: Utility/./UtilityTests/StringLexerTest.Peek (1410 of 2333)
PASS: lldb-api :: python_api/lldbutil/iter/TestRegistersIterator.py (1411 of 2333)
PASS: lldb-unit :: SymbolFile/NativePDB/./SymbolFileNativePDBTests/PDBFPOProgramToDWARFExpressionTests.InvalidAssignmentMultiple (1412 of 2333)
PASS: lldb-unit :: Utility/./UtilityTests/StreamTest.PutPtr (1413 of 2333)
PASS: lldb-api :: commands/watchpoints/watchpoint_commands/command/TestWatchpointCommandPython.py (1414 of 2333)
PASS: lldb-unit :: Utility/./UtilityTests/FileSpecTest.PrependPathComponent (1415 of 2333)
UNSUPPORTED: lldb-shell :: BuildScript/toolchain-msvc.test (1416 of 2333)
PASS: lldb-api :: functionalities/data-formatter/data-formatter-script/TestDataFormatterScript.py (1417 of 2333)
PASS: lldb-shell :: SymbolFile/NativePDB/load-pdb.cpp (1418 of 2333)
PASS: lldb-unit :: Process/minidump/./LLDBMinidumpTests/MinidumpParserTest.GetPid (1419 of 2333)
PASS: lldb-shell :: Minidump/dump-all.test (1420 of 2333)
PASS: lldb-unit :: Host/./HostTests/ConnectionFileDescriptorTest.TCPGetURIv6 (1421 of 2333)
PASS: lldb-api :: lang/cpp/this_class_type_mixing/TestThisClassTypeMixing.py (1422 of 2333)
PASS: lldb-unit :: Utility/./UtilityTests/CompletionRequest.TryCompleteCurrentArgMode (1423 of 2333)
PASS: lldb-api :: lang/cpp/function_refs/TestFunctionRefs.py (1424 of 2333)
PASS: lldb-unit :: Utility/./UtilityTests/ArgsTest.EscapeLLDBCommandArgument (1425 of 2333)
PASS: lldb-api :: commands/expression/rdar44436068/Test128BitsInteger.py (1426 of 2333)
PASS: lldb-unit :: Utility/./UtilityTests/FileSpecTest.FileAndDirectoryComponents (1427 of 2333)
PASS: lldb-unit :: Expression/./ExpressionTests/DWARFExpression.DW_OP_unknown (1428 of 2333)
UNSUPPORTED: lldb-api :: functionalities/tsan/thread_numbers/TestTsanThreadNumbers.py (1429 of 2333)
PASS: lldb-shell :: Breakpoint/split-dwarf5-debug-stroffsets.test (1430 of 2333)
PASS: lldb-unit :: Utility/./UtilityTests/Flags.AllSet (1431 of 2333)
PASS: lldb-unit :: Symbol/./SymbolTests/TestClangASTImporter.CompleteFwdDeclWithOtherOrigin (1432 of 2333)
PASS: lldb-unit :: Process/minidump/./LLDBMinidumpTests/MinidumpParserTest.MinidumpDuplicateModuleMappedSecondHigh (1433 of 2333)
PASS: lldb-unit :: Core/./LLDBCoreTests/DumpDataExtractorTest.FormatCharArray (1434 of 2333)
PASS: lldb-api :: functionalities/tail_call_frames/thread_step_out_message/TestArtificialFrameStepOutMessage.py (1435 of 2333)
PASS: lldb-api :: commands/watchpoints/watchpoint_size/TestWatchpointSizes.py (1436 of 2333)
PASS: lldb-api :: commands/expression/persistent_types/TestNestedPersistentTypes.py (1437 of 2333)
PASS: lldb-api :: commands/expression/codegen-crash-typedefdecl-not-in_declcontext/TestCodegenCrashTypedefDeclNotInDeclContext.py (1438 of 2333)
PASS: lldb-api :: python_api/value/empty_class/TestValueAPIEmptyClass.py (1439 of 2333)
PASS: lldb-unit :: Utility/./UtilityTests/FileSpecTest.FormatFileSpec (1440 of 2333)
PASS: lldb-api :: functionalities/load_lazy/TestLoadUsingLazyBind.py (1441 of 2333)
PASS: lldb-unit :: Utility/./UtilityTests/OptionsWithRawTest.ArgsButNoDelimiter (1442 of 2333)
PASS: lldb-api :: tools/lldb-server/TestGdbRemoteAttachOrWait.py (1443 of 2333)
PASS: lldb-unit :: Utility/./UtilityTests/Flags.GetBitSize (1444 of 2333)
PASS: lldb-shell :: SymbolFile/DWARF/x86/DW_AT_data_bit_offset-DW_OP_stack_value.s (1445 of 2333)
PASS: lldb-api :: lang/c/local_types/TestUseClosestType.py (1446 of 2333)
PASS: lldb-unit :: UnwindAssembly/x86/./UnwindAssemblyx86Tests/Testx86AssemblyInspectionEngine.TestSimplex86_64Augmented (1447 of 2333)
PASS: lldb-unit :: Utility/./UtilityTests/ArchSpecTest.Compatibility (1448 of 2333)
UNSUPPORTED: lldb-api :: iohandler/completion/TestIOHandlerCompletion.py (1449 of 2333)
PASS: lldb-unit :: Utility/./UtilityTests/SharedCluster.ClusterManager (1450 of 2333)
UNSUPPORTED: lldb-shell :: Register/x86-zmm-write.test (1451 of 2333)
PASS: lldb-api :: lang/cpp/bool/TestCPPBool.py (1452 of 2333)
UNSUPPORTED: lldb-api :: functionalities/tsan/global_location/TestTsanGlobalLocation.py (1453 of 2333)
PASS: lldb-api :: functionalities/process_crash_info/TestProcessCrashInfo.py (1454 of 2333)
PASS: lldb-api :: commands/expression/namespace_local_var_same_name_obj_c/TestNamespaceLocalVarSameNameObjC.py (1455 of 2333)
PASS: lldb-api :: functionalities/data-formatter/data-formatter-objc/TestDataFormatterObjCCF.py (1456 of 2333)
PASS: lldb-unit :: Utility/./UtilityTests/StringListTest.PopBack (1457 of 2333)
PASS: lldb-shell :: Settings/TestStopCommandSourceOnError.test (1458 of 2333)
PASS: lldb-api :: functionalities/data-formatter/array_typedef/TestArrayTypedef.py (1459 of 2333)
UNSUPPORTED: lldb-api :: iohandler/autosuggestion/TestAutosuggestion.py (1460 of 2333)
PASS: lldb-unit :: SymbolFile/DWARF/./SymbolFileDWARFTests/SymbolFileDWARFTests.TestAbbrevOutOfOrder (1461 of 2333)
PASS: lldb-api :: functionalities/data-formatter/data-formatter-stl/libcxx/shared_ptr/TestDataFormatterLibcxxSharedPtr.py (1462 of 2333)
PASS: lldb-unit :: Utility/./UtilityTests/ArgsTest.TestTrailingBackslash (1463 of 2333)
PASS: lldb-unit :: Utility/./UtilityTests/StreamTest.AddressRangeInvalidRange (1464 of 2333)
PASS: lldb-unit :: tools/lldb-server/tests/./LLDBServerTests/TestBase.LaunchModePreservesEnvironment (1465 of 2333)
PASS: lldb-api :: functionalities/thread/concurrent_events/TestConcurrentManyWatchpoints.py (1466 of 2333)
PASS: lldb-api :: functionalities/postmortem/elf-core/gcore/TestGCore.py (1467 of 2333)
PASS: lldb-unit :: Utility/./UtilityTests/StringExtractorTest.GetHexBytes_OddPair2 (1468 of 2333)
PASS: lldb-api :: functionalities/data-formatter/data-formatter-stl/libcxx/vector/TestDataFormatterLibcxxVector.py (1469 of 2333)
PASS: lldb-api :: commands/expression/import_builtin_fileid/TestImportBuiltinFileID.py (1470 of 2333)
PASS: lldb-unit :: Interpreter/./InterpreterTests/OptionArgParserTest.toBoolean (1471 of 2333)
PASS: lldb-unit :: Symbol/./SymbolTests/TestClangASTImporter.CopyDeclTagDecl (1472 of 2333)
PASS: lldb-api :: functionalities/source-map/TestTargetSourceMap.py (1473 of 2333)
PASS: lldb-shell :: Commands/command-disassemble-process.yaml (1474 of 2333)
PASS: lldb-shell :: ObjectFile/ELF/duplicate-section.yaml (1475 of 2333)
PASS: lldb-unit :: Utility/./UtilityTests/SerializationRountripTest.SerializeDeserializeCStringNull (1476 of 2333)
PASS: lldb-api :: functionalities/rerun/TestRerun.py (1477 of 2333)
PASS: lldb-api :: tools/lldb-server/TestLldbGdbServer.py (1478 of 2333)
PASS: lldb-unit :: Utility/./UtilityTests/RangeTest.SlideZero (1479 of 2333)
PASS: lldb-shell :: Reproducer/Functionalities/TestDataFormatter.test (1480 of 2333)
PASS: lldb-shell :: Reproducer/TestMultipleTargets.test (1481 of 2333)
PASS: lldb-shell :: Breakpoint/dummy-target.test (1482 of 2333)
PASS: lldb-unit :: UnwindAssembly/x86/./UnwindAssemblyx86Tests/Testx86AssemblyInspectionEngine.Testi386IgnoredRegisters (1483 of 2333)
PASS: lldb-unit :: Utility/./UtilityTests/BinaryStreamTest.PutULEB128FourBytes (1484 of 2333)
PASS: lldb-api :: python_api/name_lookup/TestNameLookup.py (1485 of 2333)
PASS: lldb-shell :: SymbolFile/DWARF/x86/dwarf5-implicit-const.s (1486 of 2333)
PASS: lldb-api :: functionalities/gdb_remote_client/TestWriteMemory.py (1487 of 2333)
PASS: lldb-unit :: Utility/./UtilityTests/StreamTeeTest.SetStreamAtIndexOverwrite (1488 of 2333)
PASS: lldb-api :: functionalities/data-formatter/typedef_array/TestTypedefArray.py (1489 of 2333)
PASS: lldb-api :: source-manager/TestSourceManager.py (1490 of 2333)
UNSUPPORTED: lldb-api :: commands/gui/basic/TestGuiBasic.py (1491 of 2333)
PASS: lldb-shell :: ObjectFile/PECOFF/section-types.yaml (1492 of 2333)
PASS: lldb-unit :: Utility/./UtilityTests/ScalarTest.SetValueFromData (1493 of 2333)
PASS: lldb-unit :: Utility/./UtilityTests/StringExtractorTest.GetHexBytesAvail_Partial (1494 of 2333)
PASS: lldb-unit :: Utility/./UtilityTests/ArgsTest.BareSingleQuote (1495 of 2333)
PASS: lldb-unit :: debugserver/./debugserverTests/JSON.Parse (1496 of 2333)
PASS: lldb-shell :: Driver/TestCore.test (1497 of 2333)
UNSUPPORTED: lldb-shell :: SymbolFile/DWARF/debug-types-expressions.test (1498 of 2333)
PASS: lldb-api :: tools/lldb-vscode/coreFile/TestVSCode_coreFile.py (1499 of 2333)
PASS: lldb-unit :: Utility/./UtilityTests/RangeTest.NotEqualInvalid (1500 of 2333)
PASS: lldb-unit :: Process/minidump/./LLDBMinidumpTests/MinidumpParserTest.GetMemoryRegionInfo (1501 of 2333)
PASS: lldb-shell :: SymbolFile/Breakpad/stack-cfi-parsing.test (1502 of 2333)
PASS: lldb-unit :: Language/Highlighting/./HighlighterTests/HighlighterTest.ClangCursorPosBeforeOtherToken (1503 of 2333)
PASS: lldb-shell :: SymbolFile/DWARF/x86/find-basic-function.cpp (1504 of 2333)
UNSUPPORTED: lldb-shell :: ScriptInterpreter/Lua/bindings.test (1505 of 2333)
PASS: lldb-api :: commands/expression/completion-in-lambda-and-unnamed-class/TestCompletionInLambdaAndUnnamedClass.py (1506 of 2333)
PASS: lldb-unit :: Process/gdb-remote/./ProcessGdbRemoteTests/GDBRemoteCommunicationClientTest.SaveRestoreRegistersNoSuffix (1507 of 2333)
PASS: lldb-unit :: Utility/./UtilityTests/UUIDTest.SetFromStringRef (1508 of 2333)
PASS: lldb-unit :: Platform/./LLDBPlatformTests/PlatformDarwinTest.FindComponentInPath (1509 of 2333)
PASS: lldb-api :: functionalities/testid/TestTestId.py (1510 of 2333)
PASS: lldb-unit :: Symbol/./SymbolTests/TestTypeSystemClang.TestDisplayNameEmpty (1511 of 2333)
UNSUPPORTED: lldb-api :: macosx/simulator/TestSimulatorPlatform.py (1512 of 2333)
PASS: lldb-unit :: Utility/./UtilityTests/StreamTeeTest.AppendStream (1513 of 2333)
PASS: lldb-unit :: SymbolFile/DWARF/./SymbolFileDWARFTests/DWARFASTParserClangTests.EnsureAllDIEsInDeclContextHaveBeenParsedParsesOnlyMatchingEntries (1514 of 2333)
PASS: lldb-api :: functionalities/breakpoint/breakpoint_locations/TestBreakpointLocations.py (1515 of 2333)
PASS: lldb-unit :: Editline/./EditlineTests/EditlineTestFixture.EditlineReceivesMultiLineText (1516 of 2333)
PASS: lldb-api :: functionalities/breakpoint/source_regexp/TestSourceRegexBreakpoints.py (1517 of 2333)
PASS: lldb-unit :: Utility/./UtilityTests/StreamTest.Indent (1518 of 2333)
PASS: lldb-unit :: Process/Utility/./ProcessUtilityTests/ProcSMapTests/LinuxProcSMapsTestFixture.ParseSMapRegions/2 (1519 of 2333)
PASS: lldb-unit :: Utility/./UtilityTests/FileSpecTest.Equal (1520 of 2333)
PASS: lldb-unit :: Utility/./UtilityTests/UUIDTest.Validity (1521 of 2333)
PASS: lldb-api :: lang/c/forward/TestForwardDeclaration.py (1522 of 2333)
PASS: lldb-unit :: Utility/./UtilityTests/StringExtractorTest.GetHexBytes_FullString (1523 of 2333)
PASS: lldb-api :: functionalities/type_get_module/TestTypeGetModule.py (1524 of 2333)
PASS: lldb-api :: functionalities/thread/backtrace_all/TestBacktraceAll.py (1525 of 2333)
PASS: lldb-unit :: UnwindAssembly/x86/./UnwindAssemblyx86Tests/Testx86AssemblyInspectionEngine.TestPushRBP (1526 of 2333)
PASS: lldb-unit :: Process/Utility/./ProcessUtilityTests/ProcMapTests/LinuxProcMapsTestFixture.ParseMapRegions/6 (1527 of 2333)
PASS: lldb-api :: functionalities/history/TestHistoryRecall.py (1528 of 2333)
PASS: lldb-shell :: Settings/TestSettingsSet.test (1529 of 2333)
PASS: lldb-api :: lang/objc/forward-decl/TestForwardDecl.py (1530 of 2333)
PASS: lldb-api :: functionalities/signal/raise/TestRaise.py (1531 of 2333)
PASS: lldb-unit :: ScriptInterpreter/Python/./ScriptInterpreterPythonTests/PythonDataObjectsTest.TestResetting (1532 of 2333)
PASS: lldb-unit :: Utility/./UtilityTests/StringExtractorTest.GetHexU8_InvalidHex_NoEof (1533 of 2333)
PASS: lldb-unit :: ScriptInterpreter/Python/./ScriptInterpreterPythonTests/PythonDataObjectsTest.TestPythonCallableInvoke (1534 of 2333)
PASS: lldb-api :: functionalities/target_var/TestTargetVar.py (1535 of 2333)
PASS: lldb-api :: lang/cpp/auto/TestCPPAuto.py (1536 of 2333)
UNSUPPORTED: lldb-api :: commands/trace/TestTraceDumpInstructions.py (1537 of 2333)
PASS: lldb-shell :: SymbolFile/DWARF/x86/debug-types-dwarf5.s (1538 of 2333)
PASS: lldb-api :: commands/disassemble/basic/TestDisassembleBreakpoint.py (1539 of 2333)
PASS: lldb-unit :: Host/./HostTests/NativeProcessProtocolTest.ReadCStringFromMemory (1540 of 2333)
PASS: lldb-api :: functionalities/inferior-crashing/recursive-inferior/TestRecursiveInferiorStep.py (1541 of 2333)
PASS: lldb-unit :: Host/./HostTests/MainLoopTest.DetectsEOF (1542 of 2333)
PASS: lldb-shell :: SymbolFile/NativePDB/ast-types.cpp (1543 of 2333)
PASS: lldb-api :: lang/cpp/bitfields/TestCppBitfields.py (1544 of 2333)
PASS: lldb-api :: functionalities/gdb_remote_client/TestPlatformClient.py (1545 of 2333)
PASS: lldb-api :: functionalities/inline-stepping/TestInlineStepping.py (1546 of 2333)
PASS: lldb-api :: lang/mixed/TestMixedLanguages.py (1547 of 2333)
PASS: lldb-api :: lang/objc/radar-9691614/TestObjCMethodReturningBOOL.py (1548 of 2333)
PASS: lldb-api :: driver/batch_mode/TestBatchMode.py (1549 of 2333)
PASS: lldb-unit :: Expression/./ExpressionTests/CppModuleConfigurationTest.UnrelatedLibrary (1550 of 2333)
PASS: lldb-api :: commands/expression/import-std-module/unique_ptr/TestUniquePtrFromStdModule.py (1551 of 2333)
PASS: lldb-api :: functionalities/data-formatter/data-formatter-synthval/TestDataFormatterSynthVal.py (1552 of 2333)
PASS: lldb-api :: lang/cpp/extern_c/TestExternCSymbols.py (1553 of 2333)
PASS: lldb-unit :: Process/gdb-remote/./ProcessGdbRemoteTests/GDBRemoteClientBaseTest.SendContinueDelegateStructuredDataReceipt (1554 of 2333)
PASS: lldb-api :: commands/expression/po_verbosity/TestPoVerbosity.py (1555 of 2333)
PASS: lldb-api :: lang/c/unions/TestUnionMembers.py (1556 of 2333)
PASS: lldb-unit :: ObjectFile/Breakpad/./ObjectFileBreakpadTests/FuncRecord.parse (1557 of 2333)
PASS: lldb-api :: commands/platform/sdk/TestPlatformSDK.py (1558 of 2333)
PASS: lldb-api :: functionalities/thread/state_after_expression/TestStateAfterExpression.py (1559 of 2333)
PASS: lldb-api :: functionalities/show_location/TestShowLocationDwarf5.py (1560 of 2333)
PASS: lldb-unit :: Utility/./UtilityTests/RangeTest.ContainsEndInclusive (1561 of 2333)
PASS: lldb-unit :: Process/gdb-remote/./ProcessGdbRemoteTests/GDBRemoteCommunicationClientTest.GetQOffsets (1562 of 2333)
PASS: lldb-unit :: Symbol/./SymbolTests/Type.GetTypeScopeAndBasename (1563 of 2333)
PASS: lldb-api :: commands/breakpoint/command/list/TestBreakpointCommandList.py (1564 of 2333)
PASS: lldb-unit :: Target/./TargetTests/ExecutionContextTest.GetByteOrderProcess (1565 of 2333)
PASS: lldb-shell :: Driver/TestPositionalArgs.test (1566 of 2333)
PASS: lldb-api :: functionalities/tail_call_frames/thread_step_out_or_return/TestSteppingOutWithArtificialFrames.py (1567 of 2333)
PASS: lldb-api :: commands/command/script/TestCommandScript.py (1568 of 2333)
PASS: lldb-api :: commands/frame/diagnose/inheritance/TestDiagnoseInheritance.py (1569 of 2333)
PASS: lldb-unit :: Utility/./UtilityTests/StringListTest.GetMaxStringLengthIncreasingSize (1570 of 2333)
PASS: lldb-shell :: Minidump/no-process-id.yaml (1571 of 2333)
PASS: lldb-unit :: Process/minidump/./LLDBMinidumpTests/MinidumpParserTest.FindMemoryRange (1572 of 2333)
PASS: lldb-unit :: Interpreter/./InterpreterTests/CompletionTest.DirCompletionUsername (1573 of 2333)
PASS: lldb-api :: lang/cpp/global_operators/TestCppGlobalOperators.py (1574 of 2333)
PASS: lldb-shell :: Register/Core/x86-32-linux-addr.test (1575 of 2333)
PASS: lldb-unit :: Core/./LLDBCoreTests/MangledTest.ResultForValidName (1576 of 2333)
PASS: lldb-api :: commands/log/invalid-args/TestInvalidArgsLog.py (1577 of 2333)
UNSUPPORTED: lldb-shell :: SymbolFile/PDB/type-quals.test (1578 of 2333)
PASS: lldb-unit :: Core/./LLDBCoreTests/CommunicationTest.SynchronizeWhileClosing (1579 of 2333)
PASS: lldb-unit :: Utility/./UtilityTests/StringListTest.ForRangeEmpty (1580 of 2333)
PASS: lldb-api :: terminal/TestSTTYBeforeAndAfter.py (1581 of 2333)
UNSUPPORTED: lldb-api :: terminal/TestEditline.py (1582 of 2333)
UNSUPPORTED: lldb-shell :: ScriptInterpreter/Lua/breakpoint_function_callback.test (1583 of 2333)
PASS: lldb-unit :: Expression/./ExpressionTests/DiagnosticManagerTest.PutStringMultiple (1584 of 2333)
PASS: lldb-api :: functionalities/find-line-entry/TestFindLineEntry.py (1585 of 2333)
PASS: lldb-api :: lang/cpp/nested-class-other-compilation-unit/TestNestedClassWithParentInAnotherCU.py (1586 of 2333)
UNSUPPORTED: lldb-api :: functionalities/darwin_log/filter/exact_match/category/TestDarwinLogFilterMatchCategory.py (1587 of 2333)
UNSUPPORTED: lldb-shell :: Register/x86-64-ymm16-write.test (1588 of 2333)
PASS: lldb-shell :: SymbolFile/Breakpad/line-table-edgecases.test (1589 of 2333)
UNSUPPORTED: lldb-api :: functionalities/darwin_log/format/TestDarwinLogMessageFormat.py (1590 of 2333)
PASS: lldb-unit :: Utility/./UtilityTests/StreamTest.PutHex32ByteOrderLittle (1591 of 2333)
PASS: lldb-unit :: Symbol/./SymbolTests/LineEntryTest.GetSameLineContiguousAddressRangeNestedInline (1592 of 2333)
PASS: lldb-unit :: Utility/./UtilityTests/StringListTest.LongestCommonPrefixNoPrefix (1593 of 2333)
PASS: lldb-unit :: Utility/./UtilityTests/UriParserTest.BadPort2 (1594 of 2333)
PASS: lldb-shell :: SymbolFile/DWARF/x86/debug_rnglists-dwo.s (1595 of 2333)
PASS: lldb-unit :: Process/minidump/./LLDBMinidumpTests/MinidumpParserTest.GetThreadContext_x86_64 (1596 of 2333)
PASS: lldb-api :: commands/expression/options/TestExprOptions.py (1597 of 2333)
PASS: lldb-unit :: Language/CPlusPlus/./LanguageCPlusPlusTests/CPlusPlusLanguage.FindAlternateFunctionManglings (1598 of 2333)
PASS: lldb-unit :: Utility/./UtilityTests/StringListTest.SetSize (1599 of 2333)
PASS: lldb-unit :: Expression/./ExpressionTests/CppModuleConfigurationTest.LinuxLocalLibCpp (1600 of 2333)
PASS: lldb-unit :: Utility/./UtilityTests/StringExtractorTest.GetHexU8_Exact (1601 of 2333)
PASS: lldb-api :: functionalities/thread/concurrent_events/TestConcurrentSignalDelayWatch.py (1602 of 2333)
PASS: lldb-api :: functionalities/thread/concurrent_events/TestConcurrentNWatchNBreak.py (1603 of 2333)
PASS: lldb-api :: commands/expression/result_numbering/TestResultNumbering.py (1604 of 2333)
PASS: lldb-unit :: SymbolFile/DWARF/./SymbolFileDWARFTests/SymbolFileDWARFTests.ParseAranges (1605 of 2333)
PASS: lldb-unit :: Utility/./UtilityTests/StreamTest.AddressRangeEmptyRange (1606 of 2333)
PASS: lldb-unit :: Platform/./LLDBPlatformTests/PlatformDarwinTest.TestParseVersionBuildDir (1607 of 2333)
PASS: lldb-api :: lang/cpp/unicode-literals/TestUnicodeLiterals.py (1608 of 2333)
PASS: lldb-api :: functionalities/data-formatter/nssetsynth/TestNSSetSynthetic.py (1609 of 2333)
PASS: lldb-api :: lang/cpp/global_variables/TestCPPGlobalVariables.py (1610 of 2333)
PASS: lldb-unit :: Utility/./UtilityTests/OptionsWithRawTest.LeadingSpaceArgs (1611 of 2333)
PASS: lldb-api :: commands/source/info/TestSourceInfo.py (1612 of 2333)
PASS: lldb-shell :: Expr/TestIRMemoryMap.test (1613 of 2333)
PASS: lldb-shell :: Subprocess/fork-follow-parent-wp.test (1614 of 2333)
PASS: lldb-unit :: Utility/./UtilityTests/BinaryStreamTest.PutSLEB128SixBytes (1615 of 2333)
PASS: lldb-api :: commands/expression/fixits/TestFixIts.py (1616 of 2333)
PASS: lldb-unit :: SymbolFile/DWARF/./SymbolFileDWARFTests/SymbolFileDWARFTests.TestAbbrevValidAttrNullForm (1617 of 2333)
PASS: lldb-api :: functionalities/data-formatter/data-formatter-stl/libcxx/optional/TestDataFormatterLibcxxOptional.py (1618 of 2333)
PASS: lldb-shell :: ObjectFile/wasm/unified-debug-sections.yaml (1619 of 2333)
PASS: lldb-api :: functionalities/gdb_remote_client/TestArmRegisterDefinition.py (1620 of 2333)
UNSUPPORTED: lldb-shell :: Register/x86-64-ymm16-read.test (1621 of 2333)
PASS: lldb-unit :: Utility/./UtilityTests/UriParserTest.BracketedHostnameWithPortIPv4 (1622 of 2333)
PASS: lldb-api :: lang/objc/objc-new-syntax/TestObjCNewSyntaxArray.py (1623 of 2333)
PASS: lldb-unit :: Utility/./UtilityTests/RangeDataVector.FindEntryIndexesThatContain_Overlap (1624 of 2333)
PASS: lldb-shell :: SymbolFile/DWARF/x86/parallel-indexing-stress.s (1625 of 2333)
PASS: lldb-unit :: Target/./TargetTests/ExecutionContextTest.GetByteOrderTarget (1626 of 2333)
PASS: lldb-api :: lang/objc/exceptions/TestObjCExceptions.py (1627 of 2333)
PASS: lldb-unit :: Host/./HostTests/SocketTests/SocketTest.TCPGetAddress/ipv4 (1628 of 2333)
PASS: lldb-api :: lang/c/record_decl_in_expr/TestRecordDeclInExpr.py (1629 of 2333)
PASS: lldb-unit :: UnwindAssembly/x86/./UnwindAssemblyx86Tests/Testx86AssemblyInspectionEngine.TestPopEBX (1630 of 2333)
PASS: lldb-unit :: Host/./HostTests/HostInfoTest.GetHostname (1631 of 2333)
PASS: lldb-api :: python_api/exprpath_synthetic/TestExprPathSynthetic.py (1632 of 2333)
PASS: lldb-unit :: Utility/./UtilityTests/IndexToObjectTest.ObjectForIndex (1633 of 2333)
PASS: lldb-unit :: Utility/./UtilityTests/UriParserTest.TypicalPortPathIPv6 (1634 of 2333)
PASS: lldb-shell :: SymbolFile/DWARF/x86/find-basic-variable.cpp (1635 of 2333)
PASS: lldb-unit :: Utility/./UtilityTests/LogChannelTest.EnableOptions (1636 of 2333)
PASS: lldb-shell :: Reproducer/Modules/TestModuleCXX.test (1637 of 2333)
PASS: lldb-unit :: ScriptInterpreter/Python/./ScriptInterpreterPythonTests/PythonDataObjectsTest.TestPythonBytes (1638 of 2333)
PASS: lldb-api :: functionalities/breakpoint/breakpoint_ids/TestBreakpointIDs.py (1639 of 2333)
PASS: lldb-unit :: Utility/./UtilityTests/RangeTest.Slide (1640 of 2333)
PASS: lldb-unit :: Utility/./UtilityTests/CompletionRequest.TestCompletionOwnership (1641 of 2333)
PASS: lldb-api :: tools/lldb-vscode/breakpoint/TestVSCode_setFunctionBreakpoints.py (1642 of 2333)
PASS: lldb-unit :: Utility/./UtilityTests/RecordReplayTest.InstrumentedBar (1643 of 2333)
PASS: lldb-api :: functionalities/thread/concurrent_events/TestConcurrentCrashWithWatchpointBreakpointSignal.py (1644 of 2333)
PASS: lldb-unit :: Utility/./UtilityTests/RecordReplayTest.ValidSequence (1645 of 2333)
PASS: lldb-shell :: SymbolFile/DWARF/x86/find-variable-file.cpp (1646 of 2333)
UNSUPPORTED: lldb-shell :: Register/x86-db-read.test (1647 of 2333)
PASS: lldb-api :: commands/expression/calculator_mode/TestCalculatorMode.py (1648 of 2333)
PASS: lldb-api :: api/multiple-debuggers/TestMultipleDebuggers.py (1649 of 2333)
PASS: lldb-api :: functionalities/breakpoint/address_breakpoints/TestAddressBreakpoints.py (1650 of 2333)
PASS: lldb-unit :: Utility/./UtilityTests/RecordReplayTest.InstrumentedBarPtr (1651 of 2333)
PASS: lldb-unit :: Utility/./UtilityTests/StreamTeeTest.Write (1652 of 2333)
PASS: lldb-unit :: Utility/./UtilityTests/LogChannelTest.Enable (1653 of 2333)
PASS: lldb-api :: functionalities/gdb_remote_client/TestIOSSimulator.py (1654 of 2333)
PASS: lldb-api :: functionalities/thread/create_after_attach/TestCreateAfterAttach.py (1655 of 2333)
PASS: lldb-unit :: Process/gdb-remote/./ProcessGdbRemoteTests/GDBRemoteClientBaseTest.SendContinueAndInterrupt2PacketBug (1656 of 2333)
PASS: lldb-unit :: Interpreter/./InterpreterTests/CompletionTest.DirCompletionAbsolute (1657 of 2333)
PASS: lldb-shell :: ObjectFile/ELF/PT_LOAD-overlap-PT_INTERP.yaml (1658 of 2333)
PASS: lldb-unit :: Symbol/./SymbolTests/TestTypeSystemClang.TestBuiltinTypeForEncodingAndBitSize (1659 of 2333)
PASS: lldb-unit :: Utility/./UtilityTests/ArgsTest.TestSingleQuotedArgWithSpace (1660 of 2333)
PASS: lldb-api :: commands/expression/radar_9531204/TestPrintfAfterUp.py (1661 of 2333)
PASS: lldb-api :: commands/expression/weak_symbols/TestWeakSymbols.py (1662 of 2333)
PASS: lldb-unit :: Symbol/./SymbolTests/TestTypeSystemClang.TestConvertAccessTypeToAccessSpecifier (1663 of 2333)
PASS: lldb-api :: functionalities/thread/concurrent_events/TestConcurrentCrashWithWatchpoint.py (1664 of 2333)
PASS: lldb-shell :: Reproducer/TestVersionCheck.test (1665 of 2333)
PASS: lldb-api :: lang/objc/modules-compile-error/TestModulesCompileError.py (1666 of 2333)
PASS: lldb-unit :: Process/Utility/./ProcessUtilityTests/RegisterContext_x86Test.AbridgedToFullTagWord (1667 of 2333)
PASS: lldb-unit :: Utility/./UtilityTests/AnsiTerminal.Unknown (1668 of 2333)
PASS: lldb-api :: macosx/macCatalyst/TestMacCatalyst.py (1669 of 2333)
PASS: lldb-api :: api/command-return-object/TestSBCommandReturnObject.py (1670 of 2333)
PASS: lldb-unit :: Utility/./UtilityTests/ScalarTest.CastOperations (1671 of 2333)
PASS: lldb-shell :: Reproducer/TestPythonImport.test (1672 of 2333)
PASS: lldb-unit :: Interpreter/./InterpreterTests/CompletionTest.FileCompletionAbsolute (1673 of 2333)
PASS: lldb-unit :: Process/Utility/./ProcessUtilityTests/ProcMapTests/LinuxProcMapsTestFixture.ParseMapRegions/3 (1674 of 2333)
UNSUPPORTED: lldb-api :: commands/watchpoints/multi_watchpoint_slots/TestWatchpointMultipleSlots.py (1675 of 2333)
PASS: lldb-shell :: SymbolFile/DWARF/x86/dwarf5-split.s (1676 of 2333)
PASS: lldb-api :: lang/objc/hidden-ivars/TestHiddenIvars.py (1677 of 2333)
PASS: lldb-api :: python_api/get-value-32bit-int/TestGetValue32BitInt.py (1678 of 2333)
PASS: lldb-api :: commands/quit/TestQuit.py (1679 of 2333)
PASS: lldb-unit :: Symbol/./SymbolTests/TestTypeSystemClang.TestNotDeletingUserCopyCstrDueToMoveCStr (1680 of 2333)
PASS: lldb-api :: functionalities/gdb_remote_client/TestRestartBug.py (1681 of 2333)
PASS: lldb-shell :: Reproducer/TestDSYM.test (1682 of 2333)
PASS: lldb-unit :: UnwindAssembly/x86/./UnwindAssemblyx86Tests/Testx86AssemblyInspectionEngine.TestPushEAX (1683 of 2333)
PASS: lldb-unit :: Process/Utility/./ProcessUtilityTests/RegisterContext_x86Test.FullToAbridgedTagWord (1684 of 2333)
PASS: lldb-api :: commands/expression/pr35310/TestExprsBug35310.py (1685 of 2333)
PASS: lldb-unit :: Expression/./ExpressionTests/DWARFExpression.DW_OP_convert (1686 of 2333)
PASS: lldb-unit :: Host/./HostTests/FileSystemTest.Exists (1687 of 2333)
UNSUPPORTED: lldb-shell :: Register/aarch64-fp-read.test (1688 of 2333)
PASS: lldb-unit :: Utility/./UtilityTests/StringExtractorTest.GetHexU8_Underflow2 (1689 of 2333)
PASS: lldb-unit :: UnwindAssembly/x86/./UnwindAssemblyx86Tests/Testx86AssemblyInspectionEngine.TestPushECX (1690 of 2333)
UNSUPPORTED: lldb-api :: commands/register/register/intel_xtended_registers/mpx_bound_violation/TestBoundViolation.py (1691 of 2333)
PASS: lldb-api :: lang/cpp/diamond/TestDiamond.py (1692 of 2333)
PASS: lldb-unit :: Utility/./UtilityTests/StatusTest.ErrorConstructor (1693 of 2333)
PASS: lldb-unit :: Interpreter/./InterpreterTests/OptionValueString.DeepCopy (1694 of 2333)
PASS: lldb-shell :: SymbolFile/NativePDB/function-types-calling-conv.cpp (1695 of 2333)
PASS: lldb-unit :: Utility/./UtilityTests/TimerTest.CategoryTimes (1696 of 2333)
PASS: lldb-api :: commands/expression/import-std-module/missing-module-sources/TestStdModuleSourcesMissing.py (1697 of 2333)
PASS: lldb-unit :: Core/./LLDBCoreTests/FormatEntityTest.DefinitionConstructionNameTypeData (1698 of 2333)
UNSUPPORTED: lldb-shell :: SymbolFile/PDB/function-level-linking.test (1699 of 2333)
PASS: lldb-shell :: ScriptInterpreter/Python/Crashlog/text.test (1700 of 2333)
PASS: lldb-unit :: Interpreter/./InterpreterTests/OptionValueArgs.DeepCopy (1701 of 2333)
UNSUPPORTED: lldb-api :: functionalities/gdb_remote_client/TestAArch64XMLRegOffsets.py (1702 of 2333)
PASS: lldb-unit :: Utility/./UtilityTests/RangeTest.Equal (1703 of 2333)
PASS: lldb-api :: functionalities/breakpoint/objc/TestObjCBreakpoints.py (1704 of 2333)
UNSUPPORTED: lldb-shell :: ScriptInterpreter/Lua/partial_statements.test (1705 of 2333)
PASS: lldb-unit :: UnwindAssembly/x86/./UnwindAssemblyx86Tests/Testx86AssemblyInspectionEngine.TestPopR12 (1706 of 2333)
PASS: lldb-api :: functionalities/scripted_process/TestScriptedProcess.py (1707 of 2333)
PASS: lldb-unit :: Utility/./UtilityTests/StringListTest.ShiftMove (1708 of 2333)
UNSUPPORTED: lldb-api :: functionalities/data-formatter/data-formatter-stl/libstdcpp/iterator/TestDataFormatterStdIterator.py (1709 of 2333)
PASS: lldb-unit :: Process/gdb-remote/./ProcessGdbRemoteTests/PortMapTest.Constructors (1710 of 2333)
PASS: lldb-shell :: Register/Core/x86-64-netbsd-addr.test (1711 of 2333)
PASS: lldb-unit :: Utility/./UtilityTests/DataExtractorTest.GetMaxS64 (1712 of 2333)
PASS: lldb-shell :: Process/TestEnvironment.test (1713 of 2333)
PASS: lldb-unit :: Utility/./UtilityTests/GeneratorTest.Create (1714 of 2333)
PASS: lldb-api :: commands/expression/import-std-module/vector/TestVectorFromStdModule.py (1715 of 2333)
PASS: lldb-shell :: SymbolFile/DWARF/x86/find-basic-namespace.cpp (1716 of 2333)
PASS: lldb-shell :: ScriptInterpreter/None/none.test (1717 of 2333)
PASS: lldb-unit :: Utility/./UtilityTests/SubsystemRAIITest.SubsystemWithErrorFailure (1718 of 2333)
XFAIL: lldb-shell :: Register/x86-64-fp-read.test (1719 of 2333)
PASS: lldb-unit :: Utility/./UtilityTests/SubsystemRAIITest.SubsystemWithErrorSuccess (1720 of 2333)
UNSUPPORTED: lldb-api :: functionalities/tsan/basic/TestTsanBasic.py (1721 of 2333)
PASS: lldb-unit :: Utility/./UtilityTests/FileSpecTest.Match (1722 of 2333)
XFAIL: lldb-shell :: SymbolFile/DWARF/find-type-in-function.cpp (1723 of 2333)
PASS: lldb-api :: functionalities/archives/TestBSDArchives.py (1724 of 2333)
PASS: lldb-api :: functionalities/type_completion/TestTypeCompletion.py (1725 of 2333)
PASS: lldb-unit :: Utility/./UtilityTests/XcodeSDKTest.SDKSupportsSwift (1726 of 2333)
PASS: lldb-api :: functionalities/gdb_remote_client/TestGDBRemoteDiskFileCompletion.py (1727 of 2333)
PASS: lldb-api :: functionalities/target_var/no_vars/TestTargetVarNoVars.py (1728 of 2333)
PASS: lldb-api :: functionalities/postmortem/minidump-new/TestMiniDumpNew.py (1729 of 2333)
PASS: lldb-unit :: Utility/./UtilityTests/VMRange.Reset (1730 of 2333)
PASS: lldb-unit :: Host/./HostTests/MainLoopTest.UnmonitoredSignal (1731 of 2333)
PASS: lldb-unit :: Utility/./UtilityTests/UriParserTest.SchemeHostSeparator2 (1732 of 2333)
PASS: lldb-unit :: Expression/./ExpressionTests/DiagnosticManagerTest.AppendMessageSubsequentDiags (1733 of 2333)
UNSUPPORTED: lldb-api :: commands/register/register/aarch64_sve_registers/rw_access_dynamic_resize/TestSVEThreadedDynamic.py (1734 of 2333)
PASS: lldb-api :: commands/expression/anonymous-struct/TestCallUserAnonTypedef.py (1735 of 2333)
PASS: lldb-api :: commands/platform/file/close/TestPlatformFileClose.py (1736 of 2333)
PASS: lldb-api :: functionalities/data-formatter/frameformat_smallstruct/TestFrameFormatSmallStruct.py (1737 of 2333)
PASS: lldb-unit :: Utility/./UtilityTests/StatusTest.ErrorConversion (1738 of 2333)
PASS: lldb-shell :: Register/Core/x86-64-freebsd-fp.test (1739 of 2333)
PASS: lldb-shell :: ObjectFile/MachO/subsections.yaml (1740 of 2333)
PASS: lldb-unit :: ScriptInterpreter/Python/./ScriptInterpreterPythonTests/PythonDataObjectsTest.TestPythonStringToStructuredString (1741 of 2333)
PASS: lldb-unit :: Target/./TargetTests/RemoteAwarePlatformTest.TestResolveExecutabelOnClientByPlatform (1742 of 2333)
PASS: lldb-api :: functionalities/thread/concurrent_events/TestConcurrentSignalNWatchNBreak.py (1743 of 2333)
PASS: lldb-api :: lang/objc/foundation/TestSymbolTable.py (1744 of 2333)
PASS: lldb-api :: lang/objc/rdar-10967107/TestRdar10967107.py (1745 of 2333)
PASS: lldb-unit :: Utility/./UtilityTests/ArchSpecTest.TestSetTriple (1746 of 2333)
PASS: lldb-unit :: Utility/./UtilityTests/CompletionRequest.TryCompleteCurrentArgGood (1747 of 2333)
PASS: lldb-api :: functionalities/dlopen_other_executable/TestDlopenOtherExecutable.py (1748 of 2333)
PASS: lldb-shell :: Commands/CommandScriptImmediateOutput/CommandScriptImmediateOutputFile.test (1749 of 2333)
PASS: lldb-api :: lang/cpp/template-arguments/TestCppTemplateArguments.py (1750 of 2333)
PASS: lldb-unit :: Utility/./UtilityTests/ScalarTest.Promotion (1751 of 2333)
PASS: lldb-api :: python_api/objc_type/TestObjCType.py (1752 of 2333)
PASS: lldb-unit :: Core/./LLDBCoreTests/DumpDataExtractorTest.ItemByteSizeErrors (1753 of 2333)
PASS: lldb-shell :: Settings/TestFrameFormatMangling.test (1754 of 2333)
PASS: lldb-unit :: Utility/./UtilityTests/StringListTest.JoinMultiCharSeparator (1755 of 2333)
PASS: lldb-unit :: Host/./HostTests/NativeProcessProtocolTest.ReadCStringFromMemory_MaxSize (1756 of 2333)
PASS: lldb-unit :: Symbol/./SymbolTests/TestTypeSystemClang.TestGetBasicTypeFromName (1757 of 2333)
UNSUPPORTED: lldb-api :: benchmarks/stepping/TestSteppingSpeed.py (1758 of 2333)
PASS: lldb-unit :: Utility/./UtilityTests/OptionsWithRawTest.EmptySuffix (1759 of 2333)
PASS: lldb-shell :: Driver/TestHelp.test (1760 of 2333)
PASS: lldb-api :: macosx/find-dsym/bundle-with-dot-in-filename/TestBundleWithDotInFilename.py (1761 of 2333)
PASS: lldb-shell :: Reproducer/Functionalities/TestImageList.test (1762 of 2333)
PASS: lldb-api :: functionalities/breakpoint/hardware_breakpoints/require_hw_breakpoints/TestRequireHWBreakpoints.py (1763 of 2333)
UNSUPPORTED: lldb-api :: lang/cpp/function-template-parameter-pack/TestFunctionTemplateParameterPack.py (1764 of 2333)
PASS: lldb-unit :: Utility/./UtilityTests/Flags.Reset (1765 of 2333)
PASS: lldb-api :: functionalities/data-formatter/data-formatter-stl/libcxx/tuple/TestDataFormatterLibcxxTuple.py (1766 of 2333)
PASS: lldb-shell :: SymbolFile/DWARF/x86/subprogram_ranges.test (1767 of 2333)
PASS: lldb-unit :: Process/minidump/./LLDBMinidumpTests/MinidumpParserTest.MinidumpDuplicateModuleMinAddress (1768 of 2333)
PASS: lldb-unit :: Utility/./UtilityTests/BinaryStreamTest.PutSLEB128FiveBytes (1769 of 2333)
UNSUPPORTED: lldb-shell :: Register/x86-64-zmm-write.test (1770 of 2333)
PASS: lldb-api :: lang/c/modules/TestCModules.py (1771 of 2333)
PASS: lldb-shell :: ObjectFile/MachO/lc_build_version_notools.yaml (1772 of 2333)
PASS: lldb-unit :: Utility/./UtilityTests/BinaryStreamTest.PutULEB128FiveBytes (1773 of 2333)
PASS: lldb-unit :: Host/./HostTests/FileSystemTest.Resolve (1774 of 2333)
UNSUPPORTED: lldb-shell :: Unwind/eh-frame-small-fde.test (1775 of 2333)
UNSUPPORTED: lldb-shell :: Register/x86-gp-read.test (1776 of 2333)
PASS: lldb-shell :: Reproducer/TestCrash.test (1777 of 2333)
PASS: lldb-unit :: Utility/./UtilityTests/StringExtractorTest.InitMisc (1778 of 2333)
PASS: lldb-unit :: ScriptInterpreter/Python/./ScriptInterpreterPythonTests/PythonDataObjectsTest.TestPythonListValueEquality (1779 of 2333)
PASS: lldb-shell :: SymbolFile/DWARF/x86/debug_ranges_and_rnglists.test (1780 of 2333)
PASS: lldb-unit :: Utility/./UtilityTests/EventTest.DumpEventDataBytes (1781 of 2333)
PASS: lldb-api :: tools/lldb-server/TestGdbRemoteHostInfo.py (1782 of 2333)
PASS: lldb-api :: lang/objc/modules-app-update/TestClangModulesAppUpdate.py (1783 of 2333)
PASS: lldb-api :: lang/objcxx/cpp_keywords_enabled/TestObjCppKeywordsEnabled.py (1784 of 2333)
PASS: lldb-api :: lang/cpp/call-function/TestCallCPPFunction.py (1785 of 2333)
PASS: lldb-shell :: SymbolFile/DWARF/DW_AT_range-DW_FORM_sec_offset.s (1786 of 2333)
PASS: lldb-unit :: Utility/./UtilityTests/ArgsTest.TestMultipleArgs (1787 of 2333)
PASS: lldb-unit :: Utility/./UtilityTests/StreamTest.PutMaxHex64ByteOrderLittle (1788 of 2333)
PASS: lldb-api :: lang/cpp/stl/TestSTL.py (1789 of 2333)
UNSUPPORTED: lldb-shell :: ScriptInterpreter/Lua/io.test (1790 of 2333)
UNSUPPORTED: lldb-shell :: SymbolFile/PDB/ast-restore.test (1791 of 2333)
PASS: lldb-api :: commands/expression/ir-interpreter-phi-nodes/TestIRInterpreterPHINodes.py (1792 of 2333)
PASS: lldb-api :: lang/cpp/stl/TestStdCXXDisassembly.py (1793 of 2333)
PASS: lldb-shell :: SymbolFile/DWARF/x86/debug-line-basic.s (1794 of 2333)
UNSUPPORTED: lldb-shell :: ScriptInterpreter/Lua/nested_sessions.test (1795 of 2333)
PASS: lldb-unit :: Language/Highlighting/./HighlighterTests/HighlighterTest.ClangComments (1796 of 2333)
PASS: lldb-api :: commands/expression/import-std-module/list-dbg-info-content/TestDbgInfoContentListFromStdModule.py (1797 of 2333)
PASS: lldb-api :: lang/cpp/dynamic-value-same-basename/TestDynamicValueSameBase.py (1798 of 2333)
PASS: lldb-unit :: Utility/./UtilityTests/FileSpecTest.Yaml (1799 of 2333)
PASS: lldb-shell :: Breakpoint/jit-loader_rtdyld_elf.test (1800 of 2333)
PASS: lldb-api :: lang/objc/self/TestObjCSelf.py (1801 of 2333)
PASS: lldb-api :: functionalities/data-formatter/data-formatter-stl/libcxx/list/loop/TestDataFormatterLibcxxListLoop.py (1802 of 2333)
PASS: lldb-api :: python_api/process/read-mem-cstring/TestReadMemCString.py (1803 of 2333)
PASS: lldb-api :: python_api/frame/TestFrames.py (1804 of 2333)
PASS: lldb-unit :: Utility/./UtilityTests/StringExtractorTest.DecodeHexU8_Exact (1805 of 2333)
PASS: lldb-api :: functionalities/limit-debug-info/TestLimitDebugInfo.py (1806 of 2333)
UNSUPPORTED: lldb-api :: iohandler/resize/TestIOHandlerResize.py (1807 of 2333)
PASS: lldb-shell :: ObjectFile/PECOFF/sections-names.yaml (1808 of 2333)
PASS: lldb-shell :: SymbolFile/DWARF/dwo-relative-path.s (1809 of 2333)
PASS: lldb-api :: functionalities/object-file/TestImageListMultiArchitecture.py (1810 of 2333)
PASS: lldb-api :: functionalities/breakpoint/breakpoint_language/TestBreakpointLanguage.py (1811 of 2333)
PASS: lldb-api :: functionalities/memory/read/TestMemoryRead.py (1812 of 2333)
PASS: lldb-api :: python_api/value/TestValueAPI.py (1813 of 2333)
UNSUPPORTED: lldb-api :: functionalities/asan/TestMemoryHistory.py (1814 of 2333)
PASS: lldb-api :: commands/expression/import-std-module/sysroot/TestStdModuleSysroot.py (1815 of 2333)
PASS: lldb-unit :: UnwindAssembly/x86/./UnwindAssemblyx86Tests/Testx86AssemblyInspectionEngine.TestLEAVE (1816 of 2333)
PASS: lldb-api :: lang/cpp/operator-overload/TestOperatorOverload.py (1817 of 2333)
PASS: lldb-unit :: Utility/./UtilityTests/StreamTeeTest.Constructor1Stream (1818 of 2333)
PASS: lldb-shell :: SymbolFile/NativePDB/ast-methods.cpp (1819 of 2333)
PASS: lldb-unit :: Process/Utility/./ProcessUtilityTests/ProcSMapTests/LinuxProcSMapsTestFixture.ParseSMapRegions/5 (1820 of 2333)
PASS: lldb-unit :: Utility/./UtilityTests/DataExtractorTest.GetFloatUnaligned (1821 of 2333)
PASS: lldb-api :: python_api/file_handle/TestFileHandle.py (1822 of 2333)
PASS: lldb-unit :: Host/./HostTests/NativeProcessProtocolTest.SetBreakpointFailWrite (1823 of 2333)
UNSUPPORTED: lldb-shell :: ScriptInterpreter/Lua/convenience_variables.test (1824 of 2333)
PASS: lldb-unit :: Host/./HostTests/HostInfoTest.GetXcodeSDK (1825 of 2333)
PASS: lldb-unit :: Utility/./UtilityTests/StringExtractorTest.GetHexU8_Extra (1826 of 2333)
PASS: lldb-api :: lang/cpp/scope/TestCppScope.py (1827 of 2333)
PASS: lldb-unit :: Utility/./UtilityTests/AnsiTerminal.AtEnd (1828 of 2333)
PASS: lldb-api :: functionalities/thread/concurrent_events/TestConcurrentTwoBreakpointsOneWatchpoint.py (1829 of 2333)
PASS: lldb-shell :: Settings/TestEchoCommands.test (1830 of 2333)
UNSUPPORTED: lldb-api :: benchmarks/libcxxlist/TestBenchmarkLibcxxList.py (1831 of 2333)
PASS: lldb-unit :: Utility/./UtilityTests/FileSpecTest.OperatorBool (1832 of 2333)
PASS: lldb-unit :: Utility/./UtilityTests/BroadcasterTest.EventTypeHasListeners (1833 of 2333)
PASS: lldb-unit :: Process/gdb-remote/./ProcessGdbRemoteTests/GDBRemoteClientBaseTest.SendPacketAndReceiveResponseWithOutputSupport (1834 of 2333)
PASS: lldb-shell :: Driver/TestTarget.test (1835 of 2333)
PASS: lldb-unit :: Utility/./UtilityTests/LogChannelEnabledTest.LogThread (1836 of 2333)
PASS: lldb-shell :: SymbolFile/DWARF/clang-ast-from-dwarf-unamed-and-anon-structs.cpp (1837 of 2333)
PASS: lldb-api :: commands/expression/cast_int_to_anonymous_enum/TestCastIntToAnonymousEnum.py (1838 of 2333)
PASS: lldb-shell :: SymbolFile/DWARF/x86/dwo-type-in-main-file.s (1839 of 2333)
PASS: lldb-shell :: SymbolFile/Breakpad/symtab.test (1840 of 2333)
PASS: lldb-api :: functionalities/inferior-crashing/TestInferiorCrashing.py (1841 of 2333)
PASS: lldb-unit :: Core/./LLDBCoreTests/StreamCallbackTest.Callback (1842 of 2333)
PASS: lldb-unit :: Utility/./UtilityTests/Flags.IsClear (1843 of 2333)
PASS: lldb-unit :: Symbol/./SymbolTests/PostfixExpression.ToDWARF (1844 of 2333)
PASS: lldb-shell :: Settings/TestModuleCacheSanity.test (1845 of 2333)
PASS: lldb-unit :: Utility/./UtilityTests/StreamTest.AddressEmptyPrefix (1846 of 2333)
PASS: lldb-unit :: Utility/./UtilityTests/StringExtractorTest.GetHexBytesAvail_OddPair (1847 of 2333)
PASS: lldb-unit :: Process/Utility/./ProcessUtilityTests/ProcMapTests/LinuxProcMapsTestFixture.ParseMapRegions/5 (1848 of 2333)
PASS: lldb-unit :: Symbol/./SymbolTests/DWARFCallFrameInfoTest.Basic_eh (1849 of 2333)
PASS: lldb-api :: lang/objc/direct-dispatch-step/TestObjCDirectDispatchStepping.py (1850 of 2333)
PASS: lldb-unit :: Utility/./UtilityTests/StreamTest.PutCharNull (1851 of 2333)
PASS: lldb-api :: python_api/watchpoint/TestSetWatchpoint.py (1852 of 2333)
PASS: lldb-unit :: Signals/./SignalsTests/UnixSignalsTest.GetFilteredSignals (1853 of 2333)
PASS: lldb-unit :: ObjectFile/PECOFF/./ObjectFilePECOFFTests/PECallFrameInfoTest.Chained_eh (1854 of 2333)
PASS: lldb-api :: commands/expression/dollar-in-variable/TestDollarInVariable.py (1855 of 2333)
PASS: lldb-unit :: Utility/./UtilityTests/StreamTest.SetIndentLevel (1856 of 2333)
PASS: lldb-api :: lang/objc/foundation/TestObjCMethodsNSArray.py (1857 of 2333)
PASS: lldb-api :: lang/cpp/gmodules-templates/TestGModules.py (1858 of 2333)
UNSUPPORTED: lldb-api :: commands/register/register/intel_xtended_registers/TestMPXRegisters.py (1859 of 2333)
UNSUPPORTED: lldb-api :: linux/add-symbols/TestTargetSymbolsAddCommand.py (1860 of 2333)
PASS: lldb-unit :: Utility/./UtilityTests/StringExtractorTest.GetNameColonValueNoSemicolon (1861 of 2333)
PASS: lldb-shell :: SymbolFile/DWARF/x86/dwarf5-partial-index.cpp (1862 of 2333)
PASS: lldb-api :: functionalities/breakpoint/auto_continue/TestBreakpointAutoContinue.py (1863 of 2333)
PASS: lldb-api :: lang/c/complex/TestComplexC99.py (1864 of 2333)
PASS: lldb-shell :: Register/Core/x86-64-linux-fp.test (1865 of 2333)
PASS: lldb-shell :: ObjectFile/ELF/PT_TLS-overlap-PT_LOAD.yaml (1866 of 2333)
PASS: lldb-unit :: Utility/./UtilityTests/NameMatchesTest.Ignore (1867 of 2333)
PASS: lldb-unit :: Symbol/./SymbolTests/TestTypeSystemClang.TestGetBasicTypeFromEnum (1868 of 2333)
PASS: lldb-api :: lang/cpp/template/TestTemplateArgs.py (1869 of 2333)
PASS: lldb-api :: lang/cpp/namespace_definitions/TestNamespaceDefinitions.py (1870 of 2333)
UNSUPPORTED: lldb-api :: functionalities/breakpoint/hardware_breakpoints/write_memory_with_hw_breakpoint/TestWriteMemoryWithHWBreakpoint.py (1871 of 2333)
PASS: lldb-api :: functionalities/breakpoint/move_nearest/TestMoveNearest.py (1872 of 2333)
PASS: lldb-api :: tools/lldb-vscode/runInTerminal/TestVSCode_runInTerminal.py (1873 of 2333)
PASS: lldb-shell :: Driver/TestConvenienceVariables.test (1874 of 2333)
PASS: lldb-shell :: SymbolFile/DWARF/x86/split-dwarf-inlining.cpp (1875 of 2333)
PASS: lldb-unit :: ObjectFile/Breakpad/./ObjectFileBreakpadTests/StackWinRecord.parse (1876 of 2333)
PASS: lldb-api :: functionalities/thread/concurrent_events/TestConcurrentTwoWatchpointsOneSignal.py (1877 of 2333)
PASS: lldb-shell :: Driver/TestUseColor.test (1878 of 2333)
PASS: lldb-api :: commands/session/history/TestSessionHistory.py (1879 of 2333)
FAIL: lldb-shell :: Host/TestCustomShell.test (1880 of 2333)
******************** TEST 'lldb-shell :: Host/TestCustomShell.test' FAILED ********************
Script:
--
: 'RUN: at line 8';   /Users/buildslave/jenkins/workspace/lldb-cmake-sanitized/lldb-build/bin/clang --target=specify-a-target-or-use-a-_host-substitution --target=x86_64-apple-darwin19.5.0 -isysroot /Applications/Xcode.app/Contents/Developer/Platforms/MacOSX.platform/Developer/SDKs/MacOSX.sdk -fmodules-cache-path=/Users/buildslave/jenkins/workspace/lldb-cmake-sanitized/lldb-build/lldb-test-build.noindex/module-cache-clang/lldb-shell /Users/buildslave/jenkins/workspace/lldb-cmake-sanitized/llvm-project/lldb/test/Shell/Host/Inputs/simple.c -g -o /Users/buildslave/jenkins/workspace/lldb-cmake-sanitized/lldb-build/tools/lldb/test/Shell/Host/Output/TestCustomShell.test.tmp.out
: 'RUN: at line 9';   SHELL=bogus not /Users/buildslave/jenkins/workspace/lldb-cmake-sanitized/lldb-build/bin/lldb --no-lldbinit -S /Users/buildslave/jenkins/workspace/lldb-cmake-sanitized/lldb-build/tools/lldb/test/Shell/lit-lldb-init /Users/buildslave/jenkins/workspace/lldb-cmake-sanitized/lldb-build/tools/lldb/test/Shell/Host/Output/TestCustomShell.test.tmp.out -b -o 'run' 2>&1 | /Users/buildslave/jenkins/workspace/lldb-cmake-sanitized/lldb-build/bin/FileCheck /Users/buildslave/jenkins/workspace/lldb-cmake-sanitized/llvm-project/lldb/test/Shell/Host/TestCustomShell.test --check-prefix ERROR
: 'RUN: at line 10';   env -i /Users/buildslave/jenkins/workspace/lldb-cmake-sanitized/lldb-build/bin/lldb --no-lldbinit -S /Users/buildslave/jenkins/workspace/lldb-cmake-sanitized/lldb-build/tools/lldb/test/Shell/lit-lldb-init /Users/buildslave/jenkins/workspace/lldb-cmake-sanitized/lldb-build/tools/lldb/test/Shell/Host/Output/TestCustomShell.test.tmp.out -b -o 'run' 2>&1 | /Users/buildslave/jenkins/workspace/lldb-cmake-sanitized/lldb-build/bin/FileCheck /Users/buildslave/jenkins/workspace/lldb-cmake-sanitized/llvm-project/lldb/test/Shell/Host/TestCustomShell.test
--
Exit Code: 1

Hide Details

Command Output (stderr): -- clang-13: warning: argument unused during compilation: '-fmodules-cache-path=/Users/buildslave/jenkins/workspace/lldb-cmake-sanitized/lldb-build/lldb-test-build.noindex/module-cache-clang/lldb-shell' [-Wunused-command-line-argument] /Users/buildslave/jenkins/workspace/lldb-cmake-sanitized/llvm-project/lldb/test/Shell/Host/TestCustomShell.test:12:10: error: ERROR: expected string not found in input # ERROR: error: shell expansion failed ^ <stdin>:1:1: note: scanning from here (lldb) command source -s 0 '/Users/buildslave/jenkins/workspace/lldb-cmake-sanitized/lldb-build/tools/lldb/test/Shell/lit-lldb-init' ^ <stdin>:10:38: note: possible intended match here (lldb) settings set target.detach-on-error false ^

Hide Details

Input file: <stdin> Check file: /Users/buildslave/jenkins/workspace/lldb-cmake-sanitized/llvm-project/lldb/test/Shell/Host/TestCustomShell.test

Hide Details

-dump-input=help explains the following input dump.

Hide Details

Input was: <<<<<< 1: (lldb) command source -s 0 '/Users/buildslave/jenkins/workspace/lldb-cmake-sanitized/lldb-build/tools/lldb/test/Shell/lit-lldb-init' check:12'0 X~~~~~~~~~~~~~~~~~~~~~~~~~~~~~~~~~~~~~~~~~~~~~~~~~~~~~~~~~~~~~~~~~~~~~~~~~~~~~~~~~~~~~~~~~~~~~~~~~~~~~~~~~~~~~~~~~~~~~~~~~~~~~~~~~~~~ error: no match found 2: Executing commands in '/Users/buildslave/jenkins/workspace/lldb-cmake-sanitized/lldb-build/tools/lldb/test/Shell/lit-lldb-init'. check:12'0 ~~~~~~~~~~~~~~~~~~~~~~~~~~~~~~~~~~~~~~~~~~~~~~~~~~~~~~~~~~~~~~~~~~~~~~~~~~~~~~~~~~~~~~~~~~~~~~~~~~~~~~~~~~~~~~~~~~~~~~~~~~~~~~~~~ 3: (lldb) # LLDB init file for the LIT tests. check:12'0 ~~~~~~~~~~~~~~~~~~~~~~~~~~~~~~~~~~~~~~~~~~~ 4: (lldb) settings set symbols.enable-external-lookup false check:12'0 ~~~~~~~~~~~~~~~~~~~~~~~~~~~~~~~~~~~~~~~~~~~~~~~~~~~~~~~~~ 5: (lldb) settings set plugin.process.gdb-remote.packet-timeout 60 check:12'0 ~~~~~~~~~~~~~~~~~~~~~~~~~~~~~~~~~~~~~~~~~~~~~~~~~~~~~~~~~~~~~~~~ 6: (lldb) settings set interpreter.echo-comment-commands false check:12'0 ~~~~~~~~~~~~~~~~~~~~~~~~~~~~~~~~~~~~~~~~~~~~~~~~~~~~~~~~~~~~ 7: (lldb) settings set symbols.clang-modules-cache-path "/Users/buildslave/jenkins/workspace/lldb-cmake-sanitized/lldb-build/lldb-test-build.noindex/module-cache-lldb" check:12'0 ~~~~~~~~~~~~~~~~~~~~~~~~~~~~~~~~~~~~~~~~~~~~~~~~~~~~~~~~~~~~~~~~~~~~~~~~~~~~~~~~~~~~~~~~~~~~~~~~~~~~~~~~~~~~~~~~~~~~~~~~~~~~~~~~~~~~~~~~~~~~~~~~~~~~~~~~~~~~~~~~~~~~~ 8: (lldb) settings set target.auto-apply-fixits false check:12'0 ~~~~~~~~~~~~~~~~~~~~~~~~~~~~~~~~~~~~~~~~~~~~~~~~~~~ 9: (lldb) settings set target.inherit-tcc true check:12'0 ~~~~~~~~~~~~~~~~~~~~~~~~~~~~~~~~~~~~~~~~~~~~ 10: (lldb) settings set target.detach-on-error false check:12'0 ~~~~~~~~~~~~~~~~~~~~~~~~~~~~~~~~~~~~~~~~~~~~~~~~~ check:12'1 ? possible intended match 11: (lldb) target create "/Users/buildslave/jenkins/workspace/lldb-cmake-sanitized/lldb-build/tools/lldb/test/Shell/Host/Output/TestCustomShell.test.tmp.out" check:12'0 ~~~~~~~~~~~~~~~~~~~~~~~~~~~~~~~~~~~~~~~~~~~~~~~~~~~~~~~~~~~~~~~~~~~~~~~~~~~~~~~~~~~~~~~~~~~~~~~~~~~~~~~~~~~~~~~~~~~~~~~~~~~~~~~~~~~~~~~~~~~~~~~~~~~~~~~~~~ 12: Current executable set to '/Users/buildslave/jenkins/workspace/lldb-cmake-sanitized/lldb-build/tools/lldb/test/Shell/Host/Output/TestCustomShell.test.tmp.out' (x86_64). check:12'0 ~~~~~~~~~~~~~~~~~~~~~~~~~~~~~~~~~~~~~~~~~~~~~~~~~~~~~~~~~~~~~~~~~~~~~~~~~~~~~~~~~~~~~~~~~~~~~~~~~~~~~~~~~~~~~~~~~~~~~~~~~~~~~~~~~~~~~~~~~~~~~~~~~~~~~~~~~~~~~~~~~~~~~~~~~ 13: (lldb) run check:12'0 ~~~~~~~~~~~ 14: Process 54711 exited with status = 0 (0x00000000) check:12'0 ~~~~~~~~~~~~~~~~~~~~~~~~~~~~~~~~~~~~~~~~~~~~~~~~~~ 15: Process 54711 launched: '/Users/buildslave/jenkins/workspace/lldb-cmake-sanitized/lldb-build/tools/lldb/test/Shell/Host/Output/TestCustomShell.test.tmp.out' (x86_64) check:12'0 ~~~~~~~~~~~~~~~~~~~~~~~~~~~~~~~~~~~~~~~~~~~~~~~~~~~~~~~~~~~~~~~~~~~~~~~~~~~~~~~~~~~~~~~~~~~~~~~~~~~~~~~~~~~~~~~~~~~~~~~~~~~~~~~~~~~~~~~~~~~~~~~~~~~~~~~~~~~~~~~~~~~~~~ >>>>>>

Hide Details

--

Hide Details

******************** PASS: lldb-unit :: Language/Highlighting/./HighlighterTests/HighlighterTest.ClangCursorOutOfBounds (1881 of 2333) UNSUPPORTED: lldb-api :: benchmarks/turnaround/TestCompileRunToBreakpointTurnaround.py (1882 of 2333) PASS: lldb-unit :: Symbol/./SymbolTests/TestScratchTypeSystemClang.InferSubASTFromLangOpts (1883 of 2333) PASS: lldb-api :: functionalities/stats_api/TestStatisticsAPI.py (1884 of 2333) PASS: lldb-api :: functionalities/lazy-loading/TestLazyLoading.py (1885 of 2333) PASS: lldb-api :: functionalities/data-formatter/data-formatter-objc/TestDataFormatterObjCNSBundle.py (1886 of 2333) PASS: lldb-shell :: Driver/LocalLLDBInit.test (1887 of 2333) PASS: lldb-unit :: Target/./TargetTests/PathMappingListTest.RemapRoot (1888 of 2333) UNSUPPORTED: lldb-shell :: SymbolFile/PDB/enums-layout.test (1889 of 2333) UNSUPPORTED: lldb-api :: benchmarks/startup/TestStartupDelays.py (1890 of 2333) PASS: lldb-unit :: ScriptInterpreter/Python/./ScriptInterpreterPythonTests/PythonDataObjectsTest.TestExtractingUInt64ThroughStructuredData (1891 of 2333) PASS: lldb-api :: functionalities/thread/concurrent_events/TestConcurrentBreakpointOneDelayBreakpointThreads.py (1892 of 2333) UNSUPPORTED: lldb-shell :: SymbolFile/PDB/variables.test (1893 of 2333) PASS: lldb-unit :: ScriptInterpreter/Python/./ScriptInterpreterPythonTests/PythonDataObjectsTest.TestPythonIntegerToStructuredInteger (1894 of 2333) PASS: lldb-unit :: Core/./LLDBCoreTests/FormatEntityTest.DefinitionConstructionNameAndType (1895 of 2333) PASS: lldb-unit :: Utility/./UtilityTests/LogChannelEnabledTest.LLDB_LOG_ERROR (1896 of 2333) PASS: lldb-api :: lang/objc/objc-new-syntax/TestObjCNewSyntaxDictionary.py (1897 of 2333) PASS: lldb-api :: tools/lldb-vscode/evaluate/TestVSCode_evaluate.py (1898 of 2333) PASS: lldb-shell :: Minidump/Windows/find-module.test (1899 of 2333) PASS: lldb-unit :: Utility/./UtilityTests/AnsiTerminal.WhiteSpace (1900 of 2333) PASS: lldb-api :: macosx/builtin-debugtrap/TestBuiltinDebugTrap.py (1901 of 2333) PASS: lldb-unit :: ScriptInterpreter/Python/./ScriptInterpreterPythonTests/PythonDataObjectsTest.TestPythonBoolean (1902 of 2333) PASS: lldb-shell :: Minidump/fb-dump.test (1903 of 2333) PASS: lldb-api :: lang/cpp/chained-calls/TestCppChainedCalls.py (1904 of 2333) PASS: lldb-unit :: Process/gdb-remote/./ProcessGdbRemoteTests/GDBRemoteCommunicationClientTest.ReadRegister (1905 of 2333) PASS: lldb-unit :: ScriptInterpreter/Python/./ScriptInterpreterPythonTests/PythonDataObjectsTest.TestBorrowedReferences (1906 of 2333) PASS: lldb-api :: commands/expression/import-std-module/pair/TestPairFromStdModule.py (1907 of 2333) PASS: lldb-api :: commands/version/TestVersion.py (1908 of 2333) PASS: lldb-api :: tools/lldb-vscode/stackTrace/TestVSCode_stackTrace.py (1909 of 2333) PASS: lldb-unit :: Utility/./UtilityTests/StringExtractorTest.GetNameColonValueSuccess (1910 of 2333) PASS: lldb-unit :: ScriptInterpreter/Python/./ScriptInterpreterPythonTests/PythonDataObjectsTest.TestPythonTupleSize (1911 of 2333) PASS: lldb-unit :: UnwindAssembly/x86/./UnwindAssemblyx86Tests/Testx86AssemblyInspectionEngine.TestMovRSPtoRBP (1912 of 2333) PASS: lldb-unit :: Core/./LLDBCoreTests/DumpDataExtractorTest.BaseAddress (1913 of 2333) UNSUPPORTED: lldb-shell :: ScriptInterpreter/Lua/lua.test (1914 of 2333) UNSUPPORTED: lldb-api :: commands/trace/TestTraceStartStop.py (1915 of 2333) UNSUPPORTED: lldb-shell :: SymbolFile/dissassemble-entry-point.s (1916 of 2333) PASS: lldb-unit :: UnwindAssembly/x86/./UnwindAssemblyx86Tests/Testx86AssemblyInspectionEngine.TestCALLNextInsn (1917 of 2333) PASS: lldb-unit :: Symbol/./SymbolTests/TestTypeSystemClang.TestFunctionTemplateInRecordConstruction (1918 of 2333) PASS: lldb-api :: lang/c/set_values/TestSetValues.py (1919 of 2333) PASS: lldb-shell :: Settings/TestSettingsWrite.test (1920 of 2333) UNSUPPORTED: lldb-shell :: Unwind/basic-block-sections.test (1921 of 2333) XFAIL: lldb-shell :: Unwind/prefer-debug-over-eh-frame.test (1922 of 2333) PASS: lldb-unit :: Symbol/./SymbolTests/TestTypeSystemClang.TestUnifyAccessSpecifiers (1923 of 2333) PASS: lldb-unit :: UnwindAssembly/x86/./UnwindAssemblyx86Tests/Testx86AssemblyInspectionEngine.TestPopEDI (1924 of 2333) PASS: lldb-unit :: Utility/./UtilityTests/Flags.Test (1925 of 2333) PASS: lldb-shell :: ObjectFile/wasm/embedded-debug-sections.yaml (1926 of 2333) PASS: lldb-api :: types/TestShortTypeExpr.py (1927 of 2333) PASS: lldb-api :: commands/help/TestHelp.py (1928 of 2333) PASS: lldb-api :: functionalities/gdb_remote_client/TestPartialGPacket.py (1929 of 2333) PASS: lldb-shell :: Driver/TestSingleQuote.test (1930 of 2333) PASS: lldb-unit :: Utility/./UtilityTests/ScalarTest.TruncOrExtendTo (1931 of 2333) PASS: lldb-api :: lang/cpp/class_static/TestStaticVariables.py (1932 of 2333) PASS: lldb-api :: tools/lldb-server/TestGdbRemoteRegisterState.py (1933 of 2333) PASS: lldb-unit :: Symbol/./SymbolTests/TestTypeSystemClang.TemplateArguments (1934 of 2333) PASS: lldb-unit :: Symbol/./SymbolTests/TestClangASTImporter.MetadataPropagationIndirectImport (1935 of 2333) PASS: lldb-api :: functionalities/inferior-assert/TestInferiorAssert.py (1936 of 2333) PASS: lldb-api :: functionalities/thread/concurrent_events/TestConcurrentTwoWatchpointThreads.py (1937 of 2333) PASS: lldb-api :: python_api/formatters/TestFormattersSBAPI.py (1938 of 2333) PASS: lldb-unit :: API/./APITests/SBCommandInterpreterTest.MultiWordCommand (1939 of 2333) PASS: lldb-shell :: Register/Core/x86-32-freebsd-gp.test (1940 of 2333) PASS: lldb-api :: lang/cpp/dereferencing_references/TestCPPDereferencingReferences.py (1941 of 2333) PASS: lldb-shell :: SymbolFile/NativePDB/ast-functions.cpp (1942 of 2333) UNSUPPORTED: lldb-api :: commands/expression/completion-crash-invalid-iterator/TestInvalidIteratorCompletionCrash.py (1943 of 2333) UNSUPPORTED: lldb-shell :: ObjectFile/ELF/minidebuginfo-no-lzma.yaml (1944 of 2333) PASS: lldb-api :: functionalities/data-formatter/boolreference/TestFormattersBoolRefPtr.py (1945 of 2333) PASS: lldb-shell :: lldb-server/TestErrorMessages.test (1946 of 2333) PASS: lldb-api :: functionalities/plugins/python_os_plugin/stepping_plugin_threads/TestOSPluginStepping.py (1947 of 2333) PASS: lldb-unit :: UnwindAssembly/x86/./UnwindAssemblyx86Tests/Testx86AssemblyInspectionEngine.TestSimplei386ugmented (1948 of 2333) PASS: lldb-api :: commands/target/auto-install-main-executable/TestAutoInstallMainExecutable.py (1949 of 2333) PASS: lldb-unit :: Core/./LLDBCoreTests/ModuleSpecTest.TestCOFFFile (1950 of 2333) PASS: lldb-unit :: Utility/./UtilityTests/StructuredDataTest.StringDump (1951 of 2333) UNSUPPORTED: lldb-shell :: SymbolFile/PDB/func-symbols.test (1952 of 2333) PASS: lldb-shell :: ScriptInterpreter/Python/eof.test (1953 of 2333) PASS: lldb-unit :: Utility/./UtilityTests/StreamTest.AddressPrefix (1954 of 2333) PASS: lldb-shell :: SymbolFile/DWARF/x86/debug-names-compressed.cpp (1955 of 2333) PASS: lldb-shell :: ObjectFile/ELF/section-types.yaml (1956 of 2333) PASS: lldb-unit :: Expression/./ExpressionTests/DWARFExpressionMockProcessTest.DW_OP_deref (1957 of 2333) PASS: lldb-api :: functionalities/thread/exit_during_expression/TestExitDuringExpression.py (1958 of 2333) PASS: lldb-api :: lang/objcxx/class-name-clash/TestNameClash.py (1959 of 2333) PASS: lldb-api :: python_api/section/TestSectionAPI.py (1960 of 2333) XFAIL: lldb-shell :: Register/x86-64-fp-write.test (1961 of 2333) PASS: lldb-api :: lang/cpp/pointer_to_member_type_depending_on_parent_size/TestPointerToMemberTypeDependingOnParentSize.py (1962 of 2333) PASS: lldb-api :: functionalities/thread/concurrent_events/TestConcurrentSignalWatchBreak.py (1963 of 2333) PASS: lldb-api :: functionalities/gdb_remote_client/TestProcessConnect.py (1964 of 2333) PASS: lldb-unit :: Utility/./UtilityTests/RangeTest.ContainsAddr (1965 of 2333) PASS: lldb-unit :: Utility/./UtilityTests/OptionsWithRawTest.QuotedSuffix (1966 of 2333) PASS: lldb-unit :: Utility/./UtilityTests/DataExtractorTest.GetFloat (1967 of 2333) PASS: lldb-api :: commands/expression/two-files/TestObjCTypeQueryFromOtherCompileUnit.py (1968 of 2333) PASS: lldb-api :: functionalities/thread/concurrent_events/TestConcurrentTwoWatchpointsOneBreakpoint.py (1969 of 2333) PASS: lldb-unit :: Utility/./UtilityTests/Predicate.WaitForValueNotEqualTo (1970 of 2333) PASS: lldb-unit :: Process/Utility/./ProcessUtilityTests/ProcMapTests/LinuxProcMapsTestFixture.ParseMapRegions/7 (1971 of 2333) PASS: lldb-unit :: Utility/./UtilityTests/FileSpecTest.EqualDotsWindows (1972 of 2333) PASS: lldb-api :: lang/cpp/namespace/TestNamespace.py (1973 of 2333) PASS: lldb-api :: commands/watchpoints/watchpoint_commands/condition/TestWatchpointConditionCmd.py (1974 of 2333) PASS: lldb-unit :: Utility/./UtilityTests/StringExtractorTest.GetU32BigEndian (1975 of 2333) PASS: lldb-unit :: Utility/./UtilityTests/StreamTest.PutHex32ByteOrderBig (1976 of 2333) PASS: lldb-unit :: Utility/./UtilityTests/ArgsTest.StringListConstructor (1977 of 2333) PASS: lldb-api :: functionalities/data-formatter/data-formatter-python-synth/TestDataFormatterPythonSynth.py (1978 of 2333) PASS: lldb-api :: functionalities/postmortem/minidump/TestMiniDump.py (1979 of 2333) PASS: lldb-unit :: UnwindAssembly/x86/./UnwindAssemblyx86Tests/Testx86AssemblyInspectionEngine.TestPushRBPWithREX (1980 of 2333) PASS: lldb-unit :: debugserver/./debugserverTests/RNBSocket.AnyListen (1981 of 2333) PASS: lldb-unit :: SymbolFile/DWARF/./SymbolFileDWARFTests/DWARFUnitTest.NullUnitDie (1982 of 2333) PASS: lldb-unit :: UnwindAssembly/x86/./UnwindAssemblyx86Tests/Testx86AssemblyInspectionEngine.TestStackRealign32BitDisp_x86_64 (1983 of 2333) PASS: lldb-unit :: Process/minidump/./LLDBMinidumpTests/MinidumpParserTest.GetArchitecture (1984 of 2333) PASS: lldb-unit :: Utility/./UtilityTests/RangeTest.ClearWithStarAddress (1985 of 2333) UNSUPPORTED: lldb-shell :: SymbolFile/target-symbols-add-unwind.test (1986 of 2333) PASS: lldb-api :: lang/objc/foundation/TestConstStrings.py (1987 of 2333) PASS: lldb-api :: commands/platform/basic/TestPlatformCommand.py (1988 of 2333) PASS: lldb-unit :: Core/./LLDBCoreTests/SourceLocationSpecTest.FileLineColumnComponents (1989 of 2333) PASS: lldb-api :: lang/objc/objc-new-syntax/TestObjCNewSyntaxLiteral.py (1990 of 2333) PASS: lldb-unit :: Utility/./UtilityTests/BinaryStreamTest.PutSLEB128SevenBytes (1991 of 2333) PASS: lldb-api :: commands/watchpoints/watchpoint_on_vectors/TestValueOfVectorVariable.py (1992 of 2333) PASS: lldb-api :: functionalities/postmortem/wow64_minidump/TestWow64MiniDump.py (1993 of 2333) PASS: lldb-api :: functionalities/target-new-solib-notifications/TestModuleLoadedNotifys.py (1994 of 2333) PASS: lldb-api :: python_api/lldbutil/iter/TestLLDBIterator.py (1995 of 2333) PASS: lldb-unit :: Expression/./ExpressionTests/DWARFExpression.DW_OP_implicit_value (1996 of 2333) PASS: lldb-unit :: UnwindAssembly/x86/./UnwindAssemblyx86Tests/Testx86AssemblyInspectionEngine.Test32bitFramelessSmallStackFrame (1997 of 2333) UNSUPPORTED: lldb-shell :: BuildScript/toolchain-clang-cl.test (1998 of 2333) PASS: lldb-unit :: ScriptInterpreter/Python/./ScriptInterpreterPythonTests/PythonDataObjectsTest.TestPythonDictionaryValueEquality (1999 of 2333) PASS: lldb-api :: commands/expression/import-std-module/stack/TestStackFromStdModule.py (2000 of 2333) PASS: lldb-shell :: Process/Optimization.test (2001 of 2333) PASS: lldb-unit :: Utility/./UtilityTests/StreamTest.AddressRange (2002 of 2333) PASS: lldb-api :: functionalities/process_group/TestChangeProcessGroup.py (2003 of 2333) PASS: lldb-api :: functionalities/data-formatter/data-formatter-objc/cmtime/TestDataFormatterCMTime.py (2004 of 2333) PASS: lldb-api :: functionalities/postmortem/elf-core/TestLinuxCore.py (2005 of 2333) PASS: lldb-api :: lang/objc/objc-static-method/TestObjCStaticMethod.py (2006 of 2333) PASS: lldb-api :: lang/cpp/non-type-template-param/TestCppNonTypeTemplateParam.py (2007 of 2333) PASS: lldb-unit :: Process/gdb-remote/./ProcessGdbRemoteTests/GDBRemoteCommunicationClientTest.TestPacketSpeedJSON (2008 of 2333) PASS: lldb-api :: python_api/sbtype_typeclass/TestSBTypeTypeClass.py (2009 of 2333) PASS: lldb-shell :: BuildScript/toolchain-clang.test (2010 of 2333) PASS: lldb-api :: functionalities/breakpoint/dummy_target_breakpoints/TestBreakpointsWithNoTargets.py (2011 of 2333) PASS: lldb-api :: linux/builtin_trap/TestBuiltinTrap.py (2012 of 2333) PASS: lldb-unit :: Utility/./UtilityTests/StringLexerTest.Next (2013 of 2333) UNSUPPORTED: lldb-api :: lang/objc/rdar-12408181/TestRdar12408181.py (2014 of 2333) PASS: lldb-shell :: Register/Core/x86-32-freebsd-addr.test (2015 of 2333) PASS: lldb-api :: functionalities/fat_archives/TestFatArchives.py (2016 of 2333) PASS: lldb-api :: api/multiple-targets/TestMultipleTargets.py (2017 of 2333) PASS: lldb-unit :: Host/./HostTests/FileActionTest.Open (2018 of 2333) PASS: lldb-unit :: ScriptInterpreter/Python/./ScriptInterpreterPythonTests/PythonDataObjectsTest.TestPythonStringToStr (2019 of 2333) PASS: lldb-unit :: DataFormatter/./LLDBFormatterTests/StringPrinterTests.CxxUTF8 (2020 of 2333) PASS: lldb-api :: commands/command/invalid-args/TestInvalidArgsCommand.py (2021 of 2333) PASS: lldb-unit :: Process/minidump/./LLDBMinidumpTests/MinidumpParserTest.MinidumpDuplicateModuleSeparateCode (2022 of 2333) PASS: lldb-shell :: Minidump/memory-region.yaml (2023 of 2333) PASS: lldb-api :: lang/objc/objc-stepping/TestObjCStepping.py (2024 of 2333) PASS: lldb-unit :: Utility/./UtilityTests/StringListTest.ForRange (2025 of 2333) PASS: lldb-unit :: Expression/./ExpressionTests/DiagnosticManagerTest.AppendMessageNoDiag (2026 of 2333) PASS: lldb-unit :: Process/minidump/./LLDBMinidumpTests/MinidumpParserTest.GetMemoryRegionInfoLinuxMapsError (2027 of 2333) PASS: lldb-unit :: Symbol/./SymbolTests/TestClangASTImporter.DeportDeclTagDecl (2028 of 2333) PASS: lldb-api :: functionalities/thread/concurrent_events/TestConcurrentTwoWatchpointsOneDelayBreakpoint.py (2029 of 2333) PASS: lldb-unit :: Utility/./UtilityTests/ArgsTest.ReplaceArgumentAtIndexLonger (2030 of 2333) PASS: lldb-unit :: Process/gdb-remote/./ProcessGdbRemoteTests/GDBRemoteClientBaseTest.SendContinueAndLateInterrupt (2031 of 2333) UNSUPPORTED: lldb-api :: tools/lldb-server/TestGdbRemoteModuleInfo.py (2032 of 2333) PASS: lldb-unit :: ScriptInterpreter/Python/./ScriptInterpreterPythonTests/PythonDataObjectsTest.TestPythonTupleInitializerList (2033 of 2333) PASS: lldb-api :: commands/expression/radar_8638051/Test8638051.py (2034 of 2333) PASS: lldb-unit :: Host/./HostTests/File.GetStreamFromDescriptor (2035 of 2333) UNSUPPORTED: lldb-api :: tools/lldb-server/registers-target-xml-reading/TestGdbRemoteTargetXmlPacket.py (2036 of 2333) PASS: lldb-shell :: Register/Core/x86-32-linux-gp.test (2037 of 2333) PASS: lldb-shell :: ObjectFile/ELF/many-sections.s (2038 of 2333) PASS: lldb-unit :: SymbolFile/NativePDB/./SymbolFileNativePDBTests/PDBFPOProgramToDWARFExpressionTests.SingleAssignmentRegisterRef (2039 of 2333) PASS: lldb-api :: macosx/DBGSourcePathRemapping/TestDSYMSourcePathRemapping.py (2040 of 2333) PASS: lldb-api :: functionalities/data-formatter/pyobjsynthprovider/TestPyObjSynthProvider.py (2041 of 2333) PASS: lldb-unit :: Language/Highlighting/./HighlighterTests/HighlighterTest.Keywords (2042 of 2333) PASS: lldb-api :: commands/frame/recognizer/TestFrameRecognizer.py (2043 of 2333) PASS: lldb-unit :: UnwindAssembly/x86/./UnwindAssemblyx86Tests/Testx86AssemblyInspectionEngine.TestPopR13 (2044 of 2333) PASS: lldb-unit :: Process/gdb-remote/./ProcessGdbRemoteTests/GDBRemoteCommunicationClientTest.WriteRegister (2045 of 2333) PASS: lldb-unit :: Utility/./UtilityTests/EnvironmentTest.EnvpConversion (2046 of 2333) PASS: lldb-shell :: SymbolFile/DWARF/x86/find-variable-dwo.cpp (2047 of 2333) PASS: lldb-unit :: Utility/./UtilityTests/XcodeSDKTest.SDKSupportsModules (2048 of 2333) PASS: lldb-unit :: Utility/./UtilityTests/UriParserTest.Empty (2049 of 2333) PASS: lldb-unit :: Utility/./UtilityTests/StringListTest.JoinEmpty (2050 of 2333) PASS: lldb-api :: functionalities/thread/exit_during_break/TestExitDuringBreak.py (2051 of 2333) PASS: lldb-api :: commands/process/signal/TestProcessSignal.py (2052 of 2333) UNSUPPORTED: lldb-shell :: Register/x86-zmm-read.test (2053 of 2333) PASS: lldb-api :: lang/cpp/const_this/TestConstThis.py (2054 of 2333) PASS: lldb-api :: lang/cpp/breakpoint-commands/TestCPPBreakpointCommands.py (2055 of 2333) PASS: lldb-api :: python_api/symbol-context/two-files/TestSymbolContextTwoFiles.py (2056 of 2333) PASS: lldb-api :: commands/gui/invalid-args/TestInvalidArgsGui.py (2057 of 2333) PASS: lldb-api :: types/TestDoubleTypesExpr.py (2058 of 2333) UNSUPPORTED: lldb-shell :: ScriptInterpreter/Lua/breakpoint_callback.test (2059 of 2333) PASS: lldb-unit :: SymbolFile/DWARF/./SymbolFileDWARFTests/SymbolFileDWARFTests.TestAbbrevOrder1Start5 (2060 of 2333) PASS: lldb-unit :: UnwindAssembly/x86/./UnwindAssemblyx86Tests/Testx86AssemblyInspectionEngine.TestAddRSP (2061 of 2333) PASS: lldb-api :: commands/frame/diagnose/array/TestArray.py (2062 of 2333) PASS: lldb-shell :: Reproducer/TestDump.test (2063 of 2333) PASS: lldb-unit :: Language/Highlighting/./HighlighterTests/HighlighterTest.ClangTrailingBackslashMissingNewLine (2064 of 2333) PASS: lldb-shell :: ObjectFile/Breakpad/sections.test (2065 of 2333) PASS: lldb-unit :: Language/Highlighting/./HighlighterTests/HighlighterTest.ClangBraces (2066 of 2333) PASS: lldb-unit :: UnwindAssembly/x86/./UnwindAssemblyx86Tests/Testx86AssemblyInspectionEngine.TestReturnDetect (2067 of 2333) PASS: lldb-api :: functionalities/data-formatter/data-formatter-objc/TestDataFormatterObjCPlain.py (2068 of 2333) PASS: lldb-unit :: Core/./LLDBCoreTests/ModuleSpecTest.TestELFFile (2069 of 2333) PASS: lldb-api :: commands/expression/regression-access-function-template-in-record/TestRegressionAccessFunctionTemplateInRecord.py (2070 of 2333) PASS: lldb-api :: functionalities/breakpoint/serialize/TestBreakpointSerialization.py (2071 of 2333) PASS: lldb-api :: commands/register/register/register_command/TestRegisters.py (2072 of 2333) PASS: lldb-unit :: Utility/./UtilityTests/RangeTest.NotEqual (2073 of 2333) PASS: lldb-unit :: Process/gdb-remote/./ProcessGdbRemoteTests/GDBRemoteClientBaseTest.SendContinueAndInterrupt (2074 of 2333) PASS: lldb-unit :: Utility/./UtilityTests/RecordReplayTest.InstrumentedFooSameThis (2075 of 2333) PASS: lldb-unit :: ObjectFile/Breakpad/./ObjectFileBreakpadTests/ModuleRecord.parse (2076 of 2333) PASS: lldb-unit :: Process/gdb-remote/./ProcessGdbRemoteTests/GDBRemoteCommunicationClientTest.GetModulesInfo_UUID20 (2077 of 2333) PASS: lldb-unit :: Utility/./UtilityTests/UUIDTest.RelationalOperators (2078 of 2333) PASS: lldb-shell :: ScriptInterpreter/Python/Crashlog/parser_text.test (2079 of 2333) PASS: lldb-api :: commands/target/stop-hook/delete/TestTargetStopHookDelete.py (2080 of 2333) PASS: lldb-api :: commands/expression/char/TestExprsChar.py (2081 of 2333) PASS: lldb-shell :: Unwind/trap_frame_sym_ctx.test (2082 of 2333) PASS: lldb-unit :: Utility/./UtilityTests/StringLexerTest.PutBack (2083 of 2333) PASS: lldb-api :: python_api/lldbutil/process/TestPrintStackTraces.py (2084 of 2333) PASS: lldb-unit :: Utility/./UtilityTests/ListenerTest.GetEventImmediate (2085 of 2333) UNSUPPORTED: lldb-shell :: SymbolFile/NativePDB/local-variables.cpp (2086 of 2333) UNSUPPORTED: lldb-api :: commands/register/register/aarch64_dynamic_regset/TestArm64DynamicRegsets.py (2087 of 2333) PASS: lldb-unit :: SymbolFile/DWARF/./SymbolFileDWARFTests/DWARFUnitTest.MissingSentinel (2088 of 2333) PASS: lldb-unit :: Utility/./UtilityTests/UserIDResolver.GetGroupName (2089 of 2333) PASS: lldb-unit :: Utility/./UtilityTests/VMRange.IsValid (2090 of 2333) PASS: lldb-shell :: SymbolFile/DWARF/x86/debug_aranges-empty-section.s (2091 of 2333) UNSUPPORTED: lldb-api :: tools/lldb-server/libraries-svr4/TestGdbRemoteLibrariesSvr4Support.py (2092 of 2333) PASS: lldb-unit :: Utility/./UtilityTests/PassiveReplayTest.InstrumentedBarRef (2093 of 2333) PASS: lldb-unit :: Symbol/./SymbolTests/TestClangASTImporter.MetadataPropagationAfterCopying (2094 of 2333) PASS: lldb-api :: lang/c/strings/TestCStrings.py (2095 of 2333) PASS: lldb-api :: functionalities/thread/concurrent_events/TestConcurrentSignalBreak.py (2096 of 2333) PASS: lldb-unit :: Utility/./UtilityTests/SerializationRountripTest.SerializeDeserializeObjectReference (2097 of 2333) UNSUPPORTED: lldb-api :: functionalities/thread/multi_break/TestMultipleBreakpoints.py (2098 of 2333) UNSUPPORTED: lldb-api :: commands/expression/multiline-completion/TestMultilineCompletion.py (2099 of 2333) PASS: lldb-api :: functionalities/tail_call_frames/cross_object/TestCrossObjectTailCalls.py (2100 of 2333) PASS: lldb-unit :: Process/Utility/./ProcessUtilityTests/ProcMapTests/LinuxProcMapsTestFixture.ParseMapRegions/0 (2101 of 2333) PASS: lldb-unit :: ScriptInterpreter/Python/./ScriptInterpreterPythonTests/PythonDataObjectsTest.TestPythonTupleToStructuredList (2102 of 2333) PASS: lldb-api :: types/TestShortType.py (2103 of 2333) PASS: lldb-api :: functionalities/data-formatter/data-formatter-cpp/TestDataFormatterCpp.py (2104 of 2333) PASS: lldb-api :: functionalities/data-formatter/vector-types/TestVectorTypesFormatting.py (2105 of 2333) PASS: lldb-shell :: SymbolFile/NativePDB/global-classes.cpp (2106 of 2333) PASS: lldb-api :: functionalities/multiword-commands/TestMultiWordCommands.py (2107 of 2333) PASS: lldb-unit :: Process/minidump/./LLDBMinidumpTests/MinidumpParserTest.GetMemoryRegionInfoLinuxMaps (2108 of 2333) PASS: lldb-unit :: Utility/./UtilityTests/ConstStringTest.FromMidOfBufferStringRef (2109 of 2333) UNSUPPORTED: lldb-api :: functionalities/breakpoint/breakpoint_callback_command_source/TestBreakpointCallbackCommandSource.py (2110 of 2333) PASS: lldb-shell :: SymbolFile/DWARF/x86/dwarf5-debug_line-file-index.s (2111 of 2333) PASS: lldb-api :: functionalities/memory-region/TestMemoryRegion.py (2112 of 2333) PASS: lldb-unit :: ObjectFile/Breakpad/./ObjectFileBreakpadTests/FileRecord.parse (2113 of 2333) PASS: lldb-unit :: Utility/./UtilityTests/PassiveReplayTest.InstrumentedBar (2114 of 2333) PASS: lldb-unit :: Utility/./UtilityTests/StreamTest.PutChar (2115 of 2333) PASS: lldb-api :: functionalities/thread/concurrent_events/TestConcurrentDelayedCrashWithBreakpointSignal.py (2116 of 2333) PASS: lldb-unit :: Utility/./UtilityTests/StreamTest.PutRawBytesToLittleEndian (2117 of 2333) PASS: lldb-unit :: Utility/./UtilityTests/RangeTest.LessThanInvalid (2118 of 2333) PASS: lldb-api :: functionalities/data-formatter/data-formatter-stl/libcxx/list/TestDataFormatterLibcxxList.py (2119 of 2333) PASS: lldb-api :: functionalities/non-overlapping-index-variable-i/TestIndexVariable.py (2120 of 2333) PASS: lldb-unit :: Language/Highlighting/./HighlighterTests/HighlighterTest.ClangCommas (2121 of 2333) PASS: lldb-api :: lang/c/anonymous/TestAnonymous.py (2122 of 2333) PASS: lldb-shell :: Reproducer/TestFileRepro.test (2123 of 2333) PASS: lldb-unit :: ObjectFile/PECOFF/./ObjectFilePECOFFTests/PECallFrameInfoTest.Frame_reg_eh (2124 of 2333) PASS: lldb-api :: functionalities/completion/TestCompletion.py (2125 of 2333) UNSUPPORTED: lldb-shell :: Subprocess/clone-follow-parent.test (2126 of 2333) PASS: lldb-api :: commands/command/script_alias/TestCommandScriptAlias.py (2127 of 2333) PASS: lldb-unit :: Utility/./UtilityTests/LogTest.Register (2128 of 2333) PASS: lldb-api :: functionalities/breakpoint/breakpoint_ignore_count/TestBreakpointIgnoreCount.py (2129 of 2333) PASS: lldb-api :: commands/frame/diagnose/dereference-this/TestDiagnoseDereferenceThis.py (2130 of 2333) PASS: lldb-unit :: Utility/./UtilityTests/StringListTest.AppendStringCString (2131 of 2333) PASS: lldb-unit :: Utility/./UtilityTests/AnsiTerminal.Empty (2132 of 2333) PASS: lldb-shell :: ObjectFile/ELF/minidebuginfo-find-symbols.yaml (2133 of 2333) PASS: lldb-unit :: ScriptInterpreter/Python/./ScriptInterpreterPythonTests/PythonDataObjectsTest.TestCallable (2134 of 2333) PASS: lldb-api :: commands/session/save/TestSessionSave.py (2135 of 2333) PASS: lldb-unit :: DataFormatter/./LLDBFormatterTests/TypeMatcherTests.RegexName (2136 of 2333) PASS: lldb-shell :: Register/Core/x86-64-netbsd-fp.test (2137 of 2333) UNSUPPORTED: lldb-api :: linux/thread/create_during_instruction_step/TestCreateDuringInstructionStep.py (2138 of 2333) PASS: lldb-api :: python_api/disassemble-raw-data/TestDisassembleRawData.py (2139 of 2333) PASS: lldb-unit :: Utility/./UtilityTests/SubsystemRAIITest.NormalSubsystem (2140 of 2333) UNSUPPORTED: lldb-api :: macosx/posix_spawn/TestLaunchProcessPosixSpawn.py (2141 of 2333) PASS: lldb-api :: functionalities/data-formatter/data-formatter-stl/libcxx/bitset/TestDataFormatterLibcxxBitset.py (2142 of 2333) PASS: lldb-shell :: ObjectFile/PECOFF/basic-info.yaml (2143 of 2333) PASS: lldb-unit :: Process/Utility/./ProcessUtilityTests/ProcSMapTests/LinuxProcSMapsTestFixture.ParseSMapRegions/0 (2144 of 2333) PASS: lldb-unit :: Utility/./UtilityTests/StringExtractorTest.DecodeHexU8_Underflow (2145 of 2333) PASS: lldb-unit :: ScriptInterpreter/Python/./ScriptInterpreterPythonTests/PythonDataObjectsTest.TestPythonDictionaryManipulation (2146 of 2333) PASS: lldb-unit :: Utility/./UtilityTests/StreamTeeTest.Assignment (2147 of 2333) PASS: lldb-api :: functionalities/data-formatter/data-formatter-objc/TestDataFormatterObjCNSData.py (2148 of 2333) PASS: lldb-unit :: Expression/./ExpressionTests/DWARFExpression.DW_OP_pick (2149 of 2333) PASS: lldb-unit :: tools/lldb-server/tests/./LLDBServerTests/TestBase.DebugserverEnv (2150 of 2333) PASS: lldb-unit :: Utility/./UtilityTests/StringLexerTest.HasAtLeast (2151 of 2333) PASS: lldb-api :: lang/c/bitfields/TestBitfields.py (2152 of 2333) PASS: lldb-api :: functionalities/backticks/TestBackticksWithoutATarget.py (2153 of 2333) PASS: lldb-unit :: Utility/./UtilityTests/VMRange.Comparison (2154 of 2333) PASS: lldb-api :: commands/expression/import-std-module/queue/TestQueueFromStdModule.py (2155 of 2333) UNSUPPORTED: lldb-shell :: SymbolFile/PDB/typedefs.test (2156 of 2333) PASS: lldb-api :: functionalities/memory/cache/TestMemoryCache.py (2157 of 2333) PASS: lldb-api :: functionalities/data-formatter/data-formatter-synth/TestDataFormatterSynth.py (2158 of 2333) PASS: lldb-unit :: Utility/./UtilityTests/SerializationRountripTest.SerializeDeserializePod (2159 of 2333) PASS: lldb-shell :: SymbolFile/DWARF/x86/DW_AT_location-DW_AT_const_value.s (2160 of 2333) UNSUPPORTED: lldb-shell :: Watchpoint/netbsd-nouserdbregs.test (2161 of 2333) PASS: lldb-unit :: Language/Highlighting/./HighlighterTests/HighlighterTest.DefaultHighlighterWithCursorOutOfBounds (2162 of 2333) PASS: lldb-unit :: Utility/./UtilityTests/OptionsWithRawTest.WhitespaceInput (2163 of 2333) PASS: lldb-api :: functionalities/multidebugger_commands/TestMultipleDebuggersCommands.py (2164 of 2333) PASS: lldb-api :: functionalities/data-formatter/nsarraysynth/TestNSArraySynthetic.py (2165 of 2333) PASS: lldb-unit :: Utility/./UtilityTests/SerializationRountripTest.SerializeDeserializeCStringArrayNullptrElem (2166 of 2333) PASS: lldb-unit :: Utility/./UtilityTests/StringListTest.SplitIntoLines (2167 of 2333) PASS: lldb-unit :: Expression/./ExpressionTests/DiagnosticManagerTest.GetStringMultiline (2168 of 2333) PASS: lldb-unit :: Utility/./UtilityTests/AnsiTerminal.KnownPrefix (2169 of 2333) PASS: lldb-api :: lang/objc/objc-ivar-offsets/TestObjCIvarOffsets.py (2170 of 2333) PASS: lldb-shell :: SymbolFile/DWARF/x86/static_scope.s (2171 of 2333) PASS: lldb-api :: sanity/TestSettingSkipping.py (2172 of 2333) PASS: lldb-api :: lang/c/register_variables/TestRegisterVariables.py (2173 of 2333) UNSUPPORTED: lldb-api :: functionalities/data-formatter/data-formatter-stl/libstdcpp/vector/TestDataFormatterStdVector.py (2174 of 2333) PASS: lldb-unit :: UnwindAssembly/x86/./UnwindAssemblyx86Tests/Testx86AssemblyInspectionEngine.TestPushExtended (2175 of 2333) PASS: lldb-unit :: debugserver/./debugserverTests/RNBSocket.LoopBackListenIPv4 (2176 of 2333) PASS: lldb-unit :: Language/Highlighting/./HighlighterTests/HighlighterTest.ClangPreserveNewLine (2177 of 2333) PASS: lldb-unit :: Expression/./ExpressionTests/CppModuleConfigurationTest.MissingUsrInclude (2178 of 2333) PASS: lldb-api :: macosx/debugserver-exit-code/TestDebugServerExitCode.py (2179 of 2333) PASS: lldb-unit :: DataFormatter/./LLDBFormatterTests/TypeMatcherTests.GetMatchStringExactName (2180 of 2333) PASS: lldb-api :: functionalities/breakpoint/breakpoint_names/TestBreakpointNames.py (2181 of 2333) PASS: lldb-shell :: Quit/TestQuitExitCodeImplicit0.test (2182 of 2333) PASS: lldb-api :: macosx/nslog/TestDarwinNSLogOutput.py (2183 of 2333) PASS: lldb-api :: lang/c/offsetof/TestOffsetof.py (2184 of 2333) PASS: lldb-api :: iohandler/resize/TestIOHandlerResizeNoEditline.py (2185 of 2333) PASS: lldb-unit :: Utility/./UtilityTests/StringListTest.InsertStringAtIndexMove (2186 of 2333) PASS: lldb-unit :: Process/Utility/./ProcessUtilityTests/ProcMapTests/LinuxProcMapsTestFixture.ParseMapRegions/8 (2187 of 2333) PASS: lldb-unit :: Symbol/./SymbolTests/TestTypeSystemClang.TestIsClangType (2188 of 2333) PASS: lldb-api :: functionalities/thread/concurrent_events/TestConcurrentSignalWatch.py (2189 of 2333) PASS: lldb-unit :: Utility/./UtilityTests/FileSpecTest.CopyByAppendingPathComponent (2190 of 2333) UNSUPPORTED: lldb-shell :: Subprocess/vfork-follow-parent-wp.test (2191 of 2333) PASS: lldb-shell :: SymbolFile/DWARF/x86/dwp-debug-types.s (2192 of 2333) PASS: lldb-shell :: Settings/TestLineMarkerColor.test (2193 of 2333) PASS: lldb-unit :: Expression/./ExpressionTests/ClangHostTest.MacOSX (2194 of 2333) PASS: lldb-unit :: Process/Utility/./ProcessUtilityTests/ProcSMapTests/LinuxProcSMapsTestFixture.ParseSMapRegions/4 (2195 of 2333) PASS: lldb-shell :: Register/x86-multithread-read.test (2196 of 2333) PASS: lldb-unit :: Process/gdb-remote/./ProcessGdbRemoteTests/GDBRemoteClientBaseTest.SendContinueAndAsyncPacket (2197 of 2333) PASS: lldb-api :: functionalities/data-formatter/data-formatter-advanced/TestDataFormatterAdv.py (2198 of 2333) PASS: lldb-api :: commands/expression/import-std-module/unique_ptr-dbg-info-content/TestUniquePtrDbgInfoContent.py (2199 of 2333) PASS: lldb-api :: commands/expression/import-std-module/non-module-type-separation/TestNonModuleTypeSeparation.py (2200 of 2333) PASS: lldb-api :: functionalities/gdb_remote_client/TestThreadSelectionBug.py (2201 of 2333) PASS: lldb-api :: functionalities/data-formatter/data-formatter-stl/libcxx/string/TestDataFormatterLibcxxString.py (2202 of 2333) PASS: lldb-unit :: Utility/./UtilityTests/ArgsTest.GetShellSafeArgument (2203 of 2333) PASS: lldb-api :: lang/objc/objc-super/TestObjCSuper.py (2204 of 2333) PASS: lldb-api :: python_api/thread/TestThreadAPI.py (2205 of 2333) PASS: lldb-api :: lang/objc/foundation/TestObjectDescriptionAPI.py (2206 of 2333) PASS: lldb-api :: functionalities/avoids-fd-leak/TestFdLeak.py (2207 of 2333) PASS: lldb-unit :: Utility/./UtilityTests/ArchSpecTest.MergeFrom (2208 of 2333) PASS: lldb-api :: lang/c/blocks/TestBlocks.py (2209 of 2333) PASS: lldb-unit :: Utility/./UtilityTests/StringListTest.ShiftCString (2210 of 2333) PASS: lldb-shell :: Settings/TestDisassemblyFormat.test (2211 of 2333) PASS: lldb-unit :: DataFormatter/./LLDBFormatterTests/TypeMatcherTests.CreatedBySameMatchStringExactNamePrefixes (2212 of 2333) PASS: lldb-api :: functionalities/data-formatter/type_summary_list_arg/TestTypeSummaryListArg.py (2213 of 2333) PASS: lldb-unit :: Utility/./UtilityTests/TildeExpressionResolver.ResolveFullPath (2214 of 2333) PASS: lldb-api :: types/TestFloatTypesExpr.py (2215 of 2333) PASS: lldb-api :: python_api/module_section/TestModuleAndSection.py (2216 of 2333) PASS: lldb-unit :: Utility/./UtilityTests/SerializationRountripTest.SerializeDeserializeCString (2217 of 2333) PASS: lldb-unit :: Symbol/./SymbolTests/SymbolsTest.TerminateLocateExecutableSymbolFileForUnknownExecutableAndUnknownSymbolFile (2218 of 2333) PASS: lldb-unit :: UnwindAssembly/x86/./UnwindAssemblyx86Tests/Testx86AssemblyInspectionEngine.Test32bitFramelessBigStackFrame (2219 of 2333) PASS: lldb-unit :: Utility/./UtilityTests/UriParserTest.BracketedHostname (2220 of 2333) PASS: lldb-shell :: ObjectFile/PECOFF/invalid-export-table.yaml (2221 of 2333) PASS: lldb-unit :: Symbol/./SymbolTests/TestTypeSystemClang.TestDeletingImplicitCopyCstrDueToMoveCStr (2222 of 2333) PASS: lldb-unit :: Core/./LLDBCoreTests/DumpDataExtractorTest.MultiLine (2223 of 2333) PASS: lldb-shell :: SymbolFile/DWARF/x86/dir-separator-no-comp-dir-relative-name.s (2224 of 2333) PASS: lldb-api :: lang/objc/unicode-string/TestUnicodeString.py (2225 of 2333) UNSUPPORTED: lldb-api :: functionalities/data-formatter/data-formatter-stl/libstdcpp/unique_ptr/TestDataFormatterStdUniquePtr.py (2226 of 2333) PASS: lldb-unit :: Language/CPlusPlus/./LanguageCPlusPlusTests/CPlusPlusLanguage.ExtractContextAndIdentifier (2227 of 2333) PASS: lldb-api :: commands/expression/call-throws/TestCallThatThrows.py (2228 of 2333) PASS: lldb-shell :: ScriptInterpreter/Python/fail_breakpoint_oneline.test (2229 of 2333) UNSUPPORTED: lldb-api :: commands/expression/macros/TestMacros.py (2230 of 2333) PASS: lldb-api :: lang/cpp/typedef/TestCppTypedef.py (2231 of 2333) PASS: lldb-api :: functionalities/data-formatter/data-formatter-objc/TestDataFormatterObjCKVO.py (2232 of 2333) PASS: lldb-unit :: Utility/./UtilityTests/OptionsWithRawTest.UnterminatedQuote (2233 of 2333) PASS: lldb-api :: functionalities/thread/concurrent_events/TestConcurrentWatchBreak.py (2234 of 2333) PASS: lldb-unit :: Utility/./UtilityTests/StreamTest.PutCString (2235 of 2333) PASS: lldb-api :: macosx/lc-note/kern-ver-str/TestKernVerStrLCNOTE.py (2236 of 2333) PASS: lldb-unit :: Utility/./UtilityTests/Flags.AnySet (2237 of 2333) PASS: lldb-api :: lang/cpp/limit-debug-info/TestWithLimitDebugInfo.py (2238 of 2333) PASS: lldb-unit :: Utility/./UtilityTests/ConstStringTest.CompareConstString (2239 of 2333) PASS: lldb-unit :: Symbol/./SymbolTests/SymbolsTest.LocateExecutableSymbolFileForUnknownExecutableAndMissingSymbolFile (2240 of 2333) PASS: lldb-unit :: Utility/./UtilityTests/OptionsWithRawTest.SingleWordSuffix (2241 of 2333) PASS: lldb-unit :: Host/./HostTests/MainLoopTest.TwoSignalCallbacks (2242 of 2333) PASS: lldb-api :: lang/cpp/enum_types/TestCPP11EnumTypes.py (2243 of 2333) PASS: lldb-api :: tools/lldb-vscode/breakpoint/TestVSCode_setBreakpoints.py (2244 of 2333) PASS: lldb-api :: macosx/universal/TestUniversal.py (2245 of 2333) PASS: lldb-unit :: API/./APITests/SBStructuredDataTest.NullImpl (2246 of 2333) PASS: lldb-shell :: Breakpoint/jit-loader_jitlink_elf.test (2247 of 2333) UNSUPPORTED: lldb-shell :: ScriptInterpreter/Lua/independent_state.test (2248 of 2333) PASS: lldb-api :: functionalities/gdb_remote_client/TestNoWatchpointSupportInfo.py (2249 of 2333) PASS: lldb-unit :: Utility/./UtilityTests/UserIDResolver.GetUserName (2250 of 2333) PASS: lldb-unit :: Language/CPlusPlus/./LanguageCPlusPlusTests/CPlusPlusLanguage.MethodNameParsing (2251 of 2333) PASS: lldb-unit :: Symbol/./SymbolTests/TestTypeSystemClang.TestGetTypeClassTypeOfExpr (2252 of 2333) UNSUPPORTED: lldb-shell :: Subprocess/clone-follow-parent-wp.test (2253 of 2333) PASS: lldb-unit :: Utility/./UtilityTests/RangeTest.SetRangeBase (2254 of 2333) PASS: lldb-shell :: SymbolFile/DWARF/x86/dir-separator-windows.s (2255 of 2333) PASS: lldb-unit :: Signals/./SignalsTests/UnixSignalsTest.GetInfo (2256 of 2333) PASS: lldb-api :: test_utils/TestPExpectTest.py (2257 of 2333) PASS: lldb-unit :: Core/./LLDBCoreTests/MangledTest.NameIndexes_FindFunctionSymbols (2258 of 2333) PASS: lldb-unit :: Utility/./UtilityTests/OptionsWithRawTest.EmptySuffixSingleWhitespace (2259 of 2333) PASS: lldb-api :: functionalities/data-formatter/data-formatter-proper-plurals/TestFormattersOneIsSingular.py (2260 of 2333) PASS: lldb-shell :: SymbolFile/DWARF/anon_class_w_and_wo_export_symbols.ll (2261 of 2333) PASS: lldb-unit :: Language/Highlighting/./HighlighterTests/HighlighterTest.ClangScalarLiterals (2262 of 2333) PASS: lldb-unit :: Utility/./UtilityTests/VASprintfTest.EncodingError (2263 of 2333) PASS: lldb-unit :: Utility/./UtilityTests/StringExtractorTest.GetHexBytesAvail_FullString (2264 of 2333) PASS: lldb-shell :: Commands/command-stop-hook-output.test (2265 of 2333) PASS: lldb-unit :: Utility/./UtilityTests/ProcessInstanceInfo.Yaml (2266 of 2333) PASS: lldb-shell :: BuildScript/script-args.test (2267 of 2333) PASS: lldb-unit :: Utility/./UtilityTests/StringListTest.InsertStringAtIndexEnd (2268 of 2333) UNSUPPORTED: lldb-shell :: SymbolFile/DWARF/x86/dwarf5-line-strp.s (2269 of 2333) PASS: lldb-unit :: Expression/./ExpressionTests/CppModuleConfigurationTest.AmbiguousLibCpp (2270 of 2333) UNSUPPORTED: lldb-api :: tools/intel-features/intel-pt/test/TestIntelPTSimpleBinary.py (2271 of 2333) PASS: lldb-api :: lang/c/inlines/TestRedefinitionsInInlines.py (2272 of 2333) UNSUPPORTED: lldb-api :: tools/lldb-vscode/completions/TestVSCode_completions.py (2273 of 2333) PASS: lldb-shell :: ObjectFile/ELF/build-id-case.yaml (2274 of 2333) PASS: lldb-unit :: Host/./HostTests/SocketTests/SocketTest.TCPGetAddress/ipv6 (2275 of 2333) PASS: lldb-unit :: Utility/./UtilityTests/StreamTest.AddressSuffix (2276 of 2333) PASS: lldb-api :: functionalities/data-formatter/user-format-vs-summary/TestUserFormatVsSummary.py (2277 of 2333) PASS: lldb-unit :: Utility/./UtilityTests/StringListTest.RemoveBlankLines (2278 of 2333) PASS: lldb-api :: functionalities/data-formatter/data-formatter-objc/TestDataFormatterObjCNSURL.py (2279 of 2333) PASS: lldb-unit :: Utility/./UtilityTests/StreamTest.AddressRangeSize (2280 of 2333) PASS: lldb-unit :: Expression/./ExpressionTests/DiagnosticManagerTest.HasFixits (2281 of 2333) PASS: lldb-shell :: Breakpoint/debug_rnglist_rlestartend.test (2282 of 2333) PASS: lldb-shell :: SymbolFile/NativePDB/function-types-builtins.cpp (2283 of 2333) UNSUPPORTED: lldb-api :: functionalities/data-formatter/data-formatter-stl/libstdcpp/smart_ptr/TestDataFormatterStdSmartPtr.py (2284 of 2333) PASS: lldb-shell :: ObjectFile/ELF/riscv-arch.yaml (2285 of 2333) PASS: lldb-unit :: Breakpoint/./LLDBBreakpointTests/BreakpointIDTest.StringIsBreakpointName (2286 of 2333) PASS: lldb-api :: functionalities/breakpoint/comp_dir_symlink/TestCompDirSymLink.py (2287 of 2333) PASS: lldb-unit :: Utility/./UtilityTests/AnsiTerminal.Incomplete (2288 of 2333) PASS: lldb-unit :: Utility/./UtilityTests/ArgsTest.TestQuotedTrailingBackslash (2289 of 2333) PASS: lldb-unit :: Utility/./UtilityTests/BinaryStreamTest.PutSLEB128NineBytes (2290 of 2333) PASS: lldb-unit :: Utility/./UtilityTests/StreamTeeTest.Constructor2Streams (2291 of 2333) XFAIL: lldb-shell :: Register/x86-64-write.test (2292 of 2333) PASS: lldb-api :: tools/lldb-vscode/console/TestVSCode_console.py (2293 of 2333) PASS: lldb-unit :: Utility/./UtilityTests/NameMatchesTest.StartsWith (2294 of 2333) PASS: lldb-shell :: ObjectFile/ELF/basic-info.yaml (2295 of 2333) PASS: lldb-shell :: Register/x86-64-ymm-read.test (2296 of 2333) PASS: lldb-unit :: Utility/./UtilityTests/VMRange.Ordering (2297 of 2333) PASS: lldb-api :: commands/expression/test/TestExprs.py (2298 of 2333) PASS: lldb-unit :: SymbolFile/NativePDB/./SymbolFileNativePDBTests/PDBFPOProgramToDWARFExpressionTests.UnsupportedRASearch (2299 of 2333) PASS: lldb-shell :: SymbolFile/Breakpad/unwind-via-stack-win.test (2300 of 2333) PASS: lldb-unit :: Utility/./UtilityTests/DataExtractorTest.GetMaxU64 (2301 of 2333) PASS: lldb-shell :: Driver/TestCommands.test (2302 of 2333) PASS: lldb-api :: python_api/sblaunchinfo/TestSBLaunchInfo.py (2303 of 2333) PASS: lldb-unit :: Utility/./UtilityTests/ArgsTest.TestArgv (2304 of 2333) PASS: lldb-api :: macosx/duplicate-archive-members/TestDuplicateMembers.py (2305 of 2333) PASS: lldb-unit :: Utility/./UtilityTests/StringExtractorTest.GetHexU8_Underflow (2306 of 2333) PASS: lldb-unit :: Process/minidump/./LLDBMinidumpTests/RegisterContextMinidump.ConvertMinidumpContext_x86_32 (2307 of 2333) PASS: lldb-unit :: ScriptInterpreter/Python/./ScriptInterpreterPythonTests/PythonDataObjectsTest.TestPythonByteArray (2308 of 2333) PASS: lldb-api :: commands/expression/import-std-module/vector-bool/TestVectorBoolFromStdModule.py (2309 of 2333) PASS: lldb-unit :: Utility/./UtilityTests/NameMatchesTest.EndsWith (2310 of 2333) PASS: lldb-api :: functionalities/data-formatter/data-formatter-objc/nsindexpath/TestDataFormatterNSIndexPath.py (2311 of 2333) PASS: lldb-api :: functionalities/postmortem/minidump-new/TestMiniDumpUUID.py (2312 of 2333) PASS: lldb-unit :: Utility/./UtilityTests/TimeoutTest.Construction (2313 of 2333) PASS: lldb-unit :: Interpreter/./InterpreterTests/OptionArgParserTest.toChar (2314 of 2333) PASS: lldb-unit :: Process/minidump/./LLDBMinidumpTests/RegisterContextMinidump.CheckRegisterContextMinidump_ARM (2315 of 2333) PASS: lldb-unit :: Process/minidump/./LLDBMinidumpTests/MinidumpParserTest.GetFilteredModuleList (2316 of 2333) PASS: lldb-api :: python_api/watchpoint/condition/TestWatchpointConditionAPI.py (2317 of 2333) PASS: lldb-api :: commands/expression/completion-crash-incomplete-record/TestCompletionCrashIncompleteRecord.py (2318 of 2333) PASS: lldb-api :: commands/expression/ignore-artificial-constructors/TestIgnoreArtificialConstructors.py (2319 of 2333) PASS: lldb-shell :: SymbolFile/NativePDB/globals-fundamental.cpp (2320 of 2333) PASS: lldb-unit :: Symbol/./SymbolTests/LineEntryTest.GetSameLineContiguousAddressRangeNoInlines (2321 of 2333) PASS: lldb-unit :: Expression/./ExpressionTests/DiagnosticManagerTest.GetStringBasic (2322 of 2333) UNSUPPORTED: lldb-api :: functionalities/data-formatter/data-formatter-stl/libstdcpp/list/TestDataFormatterStdList.py (2323 of 2333) PASS: lldb-api :: functionalities/data-formatter/data-formatter-skip-summary/TestDataFormatterSkipSummary.py (2324 of 2333) PASS: lldb-unit :: Utility/./UtilityTests/RegularExpression.Valid (2325 of 2333) PASS: lldb-api :: lang/cpp/struct_with_keyword_name/TestStructWithKeywordName.py (2326 of 2333) PASS: lldb-api :: lang/c/const_variables/TestConstVariables.py (2327 of 2333) PASS: lldb-api :: functionalities/data-formatter/data-formatter-stl/libcxx/unique_ptr/TestDataFormatterLibcxxUniquePtr.py (2328 of 2333) PASS: lldb-api :: functionalities/pointer_num_children/TestPointerNumChildren.py (2329 of 2333) PASS: lldb-unit :: UnwindAssembly/x86/./UnwindAssemblyx86Tests/Testx86AssemblyInspectionEngine.TestAddESP (2330 of 2333) PASS: lldb-shell :: SymbolFile/NativePDB/s_constant.cpp (2331 of 2333) PASS: lldb-api :: functionalities/data-formatter/data-formatter-stl/libcxx/multiset/TestDataFormatterLibcxxMultiSet.py (2332 of 2333) PASS: lldb-api :: api/multithreaded/TestMultithreaded.py (2333 of 2333) Slowest Tests: -------------------------------------------------------------------------- 407.03s: lldb-api :: tools/lldb-server/TestLldbGdbServer.py 241.95s: lldb-api :: api/multithreaded/TestMultithreaded.py 126.69s: lldb-api :: functionalities/completion/TestCompletion.py 113.14s: lldb-api :: lang/objc/exceptions/TestObjCExceptions.py 108.91s: lldb-api :: lang/objc/hidden-ivars/TestHiddenIvars.py 107.08s: lldb-api :: lang/objc/foundation/TestObjCMethods.py 104.76s: lldb-api :: lang/cpp/namespace/TestNamespaceLookup.py 104.76s: lldb-api :: types/TestLongTypesExpr.py 103.93s: lldb-api :: lang/objc/objc-new-syntax/TestObjCNewSyntaxLiteral.py 93.32s: lldb-api :: lang/objc/real-definition/TestRealDefinition.py 91.51s: lldb-api :: functionalities/gdb_remote_client/TestWasm.py 80.41s: lldb-api :: commands/expression/import-std-module/stack/TestStackFromStdModule.py 80.29s: lldb-api :: commands/expression/import-std-module/queue/TestQueueFromStdModule.py 78.29s: lldb-api :: lang/objc/objc-new-syntax/TestObjCNewSyntaxDictionary.py 76.39s: lldb-api :: lang/objc/objc-new-syntax/TestObjCNewSyntaxArray.py 75.13s: lldb-api :: tools/lldb-server/TestGdbRemoteThreadsInStopReply.py 69.12s: lldb-api :: python_api/target/TestTargetAPI.py 68.77s: lldb-api :: commands/settings/TestSettings.py 66.06s: lldb-api :: functionalities/data-formatter/compactvectors/TestCompactVectors.py 64.19s: lldb-api :: types/TestIntegerTypeExpr.py

Hide Details

Tests Times: -------------------------------------------------------------------------- [ Range ] :: [ Percentage ] :: [ Count ] -------------------------------------------------------------------------- [400s,420s) :: [ ] :: [ 1/2333] [380s,400s) :: [ ] :: [ 0/2333] [360s,380s) :: [ ] :: [ 0/2333] [340s,360s) :: [ ] :: [ 0/2333] [320s,340s) :: [ ] :: [ 0/2333] [300s,320s) :: [ ] :: [ 0/2333] [280s,300s) :: [ ] :: [ 0/2333] [260s,280s) :: [ ] :: [ 0/2333] [240s,260s) :: [ ] :: [ 1/2333] [220s,240s) :: [ ] :: [ 0/2333] [200s,220s) :: [ ] :: [ 0/2333] [180s,200s) :: [ ] :: [ 0/2333] [160s,180s) :: [ ] :: [ 0/2333] [140s,160s) :: [ ] :: [ 0/2333] [120s,140s) :: [ ] :: [ 1/2333] [100s,120s) :: [ ] :: [ 6/2333] [ 80s,100s) :: [ ] :: [ 5/2333] [ 60s, 80s) :: [ ] :: [ 12/2333] [ 40s, 60s) :: [ ] :: [ 38/2333] [ 20s, 40s) :: [** ] :: [ 143/2333] [ 0s, 20s) :: [************************************ ] :: [2126/2333] -------------------------------------------------------------------------- ******************** Failed Tests (1): lldb-shell :: Host/TestCustomShell.test

Hide Details

Hide Details

Testing Time: 3516.30s Unsupported : 208 Passed : 2114 Expectedly Failed: 10 Failed : 1 FAILED: tools/lldb/test/CMakeFiles/check-lldb cd /Users/buildslave/jenkins/workspace/lldb-cmake-sanitized/lldb-build/tools/lldb/test && /usr/local/Frameworks/Python.framework/Versions/3.7/bin/python3.7 /Users/buildslave/jenkins/workspace/lldb-cmake-sanitized/lldb-build/./bin/llvm-lit -v --time-tests --shuffle --xunit-xml-output=/Users/buildslave/jenkins/workspace/lldb-cmake-sanitized/test/results.xml -v -j 4 --timeout 1200 /Users/buildslave/jenkins/workspace/lldb-cmake-sanitized/lldb-build/tools/lldb/test ninja: build stopped: subcommand failed. Command failed: Command '['/usr/bin/env', 'TERM=vt100', '/usr/local/bin/ninja', '-v', 'check-lldb']' returned non-zero exit status 1. Command: ['/usr/bin/env', 'TERM=vt100', '/usr/local/bin/ninja', '-v', 'check-lldb'] [Pipeline] } [Pipeline] // timeout [Pipeline] } [Pipeline] // stage [Pipeline] stage [Pipeline] { (Declarative: Post Actions) [Pipeline] scanForIssues [Clang (LLVM based)] Sleeping for 5 seconds due to JENKINS-32191... [Clang (LLVM based)] Parsing console log (workspace: '/Users/buildslave/jenkins/workspace/lldb-cmake-sanitized') [Clang (LLVM based)] Successfully parsed console log [Clang (LLVM based)] -> found 5 issues (skipped 1 duplicate) [Clang (LLVM based)] Post processing issues on 'green-dragon-23' with source code encoding 'UTF-8' [Clang (LLVM based)] Creating SCM blamer to obtain author and commit information for affected files [Clang (LLVM based)] -> No blamer installed yet. You need to install the 'git-forensics' plugin to enable blaming for Git. [Clang (LLVM based)] Resolving file names for all issues in source directory '/Users/buildslave/jenkins/workspace/lldb-cmake-sanitized' [Clang (LLVM based)] -> resolved paths in source directory (5 found, 0 not found) [Clang (LLVM based)] Resolving module names from module definitions (build.xml, pom.xml, or Manifest.mf files) [Clang (LLVM based)] -> resolved module names for 5 issues [Clang (LLVM based)] Resolving package names (or namespaces) by parsing the affected files [Clang (LLVM based)] -> resolved package names of 5 affected files [Clang (LLVM based)] No filter has been set, publishing all 5 issues [Clang (LLVM based)] Creating fingerprints for all affected code blocks to track issues over different builds [Clang (LLVM based)] -> created fingerprints for 5 issues (skipped 0 issues) [Clang (LLVM based)] Copying affected files to Jenkins' build folder '/Users/Shared/Jenkins/Home/jobs/lldb-cmake-sanitized/builds/1880/files-with-issues' [Clang (LLVM based)] -> 5 copied, 0 not in workspace, 0 not-found, 0 with I/O error [Clang (LLVM based)] Repository miner is not configured, skipping repository mining [Pipeline] junit Recording test results [Checks API] No suitable checks publisher found. [Pipeline] } [Pipeline] // stage [Pipeline] } [Pipeline] // withEnv [Pipeline] } [Pipeline] // node [Pipeline] End of Pipeline ERROR: script returned exit code 1 Finished: FAILURE