FailedConsole Output

Skipping 783 KB.. Full Log
iate (1020 of 2339)
UNSUPPORTED: lldb-api :: linux/aarch64/mte_memory_region/TestAArch64LinuxMTEMemoryRegion.py (1021 of 2339)
PASS: lldb-unit :: Language/Highlighting/./HighlighterTests/HighlighterTest.ClangPreserveNewLine (1022 of 2339)
PASS: lldb-shell :: ObjectFile/PECOFF/export-dllfunc.yaml (1023 of 2339)
PASS: lldb-shell :: SymbolFile/DWARF/DW_AT_range-DW_FORM_sec_offset.s (1024 of 2339)
PASS: lldb-unit :: Process/minidump/./LLDBMinidumpTests/MinidumpParserTest.GetArchitectureWindows (1025 of 2339)
UNSUPPORTED: lldb-api :: functionalities/tsan/thread_numbers/TestTsanThreadNumbers.py (1026 of 2339)
PASS: lldb-api :: macosx/dyld-trie-symbols/TestDyldTrieSymbols.py (1027 of 2339)
PASS: lldb-unit :: Symbol/./SymbolTests/TestTypeSystemClang.TestDeletingImplicitCopyCstrDueToMoveCStr (1028 of 2339)
PASS: lldb-api :: functionalities/breakpoint/serialize/TestBreakpointSerialization.py (1029 of 2339)
UNSUPPORTED: lldb-shell :: Register/arm-gp-read.test (1030 of 2339)
PASS: lldb-api :: commands/command/invalid-args/TestInvalidArgsCommand.py (1031 of 2339)
PASS: lldb-unit :: Editline/./EditlineTests/EditlineTestFixture.EditlineReceivesSingleLineText (1032 of 2339)
PASS: lldb-shell :: SymbolFile/DWARF/x86/DW_OP_piece-smaller-than-struct.s (1033 of 2339)
UNSUPPORTED: lldb-api :: tools/lldb-server/TestGdbRemoteCompletion.py (1034 of 2339)
UNSUPPORTED: lldb-shell :: SymbolFile/NativePDB/stack_unwinding01.cpp (1035 of 2339)
PASS: lldb-unit :: Utility/./UtilityTests/ScalarTest.Getters (1036 of 2339)
PASS: lldb-unit :: Utility/./UtilityTests/ArgsTest.TestQuotedUnknownEscape (1037 of 2339)
UNSUPPORTED: lldb-api :: python_api/event/TestEvents.py (1038 of 2339)
UNSUPPORTED: lldb-api :: commands/register/register/aarch64_sve_registers/rw_access_dynamic_resize/TestSVEThreadedDynamic.py (1039 of 2339)
PASS: lldb-api :: functionalities/breakpoint/breakpoint_names/TestBreakpointNames.py (1040 of 2339)
PASS: lldb-unit :: Utility/./UtilityTests/StreamTest.AddressEmptyPrefix (1041 of 2339)
PASS: lldb-api :: lang/c/record_decl_in_expr/TestRecordDeclInExpr.py (1042 of 2339)
PASS: lldb-api :: lang/cpp/struct_with_keyword_name/TestStructWithKeywordName.py (1043 of 2339)
PASS: lldb-unit :: Symbol/./SymbolTests/TestTypeSystemClang.TestGetBasicTypeFromEnum (1044 of 2339)
PASS: lldb-api :: commands/expression/static-initializers/TestStaticInitializers.py (1045 of 2339)
PASS: lldb-api :: python_api/sbplatform/TestSBPlatform.py (1046 of 2339)
PASS: lldb-unit :: Utility/./UtilityTests/SerializationRountripTest.SerializeDeserializeObjectPointer (1047 of 2339)
PASS: lldb-unit :: Utility/./UtilityTests/StreamTest.PutHex8 (1048 of 2339)
PASS: lldb-unit :: ScriptInterpreter/Python/./ScriptInterpreterPythonTests/PythonDataObjectsTest.TestPythonByteArray (1049 of 2339)
PASS: lldb-api :: python_api/lldbutil/process/TestPrintStackTraces.py (1050 of 2339)
PASS: lldb-shell :: Driver/TestProcessAttach.test (1051 of 2339)
PASS: lldb-unit :: Host/./HostTests/MainLoopTest.DetectsEOF (1052 of 2339)
PASS: lldb-unit :: Utility/./UtilityTests/UUIDTest.SetFromStringRef (1053 of 2339)
PASS: lldb-unit :: Expression/./ExpressionTests/CppModuleConfigurationTest.Linux (1054 of 2339)
PASS: lldb-unit :: Utility/./UtilityTests/ScalarTest.Comparison (1055 of 2339)
PASS: lldb-unit :: ScriptInterpreter/Python/./ScriptInterpreterPythonTests/PythonDataObjectsTest.TestPythonInteger (1056 of 2339)
PASS: lldb-unit :: Utility/./UtilityTests/StringListTest.ShiftMove (1057 of 2339)
PASS: lldb-shell :: Commands/command-source.test (1058 of 2339)
PASS: lldb-api :: python_api/name_lookup/TestNameLookup.py (1059 of 2339)
PASS: lldb-unit :: ObjectFile/Breakpad/./ObjectFileBreakpadTests/StackCFIRecord.parse (1060 of 2339)
PASS: lldb-shell :: ObjectFile/Breakpad/discontiguous-sections.test (1061 of 2339)
PASS: lldb-unit :: Utility/./UtilityTests/ScalarTest.SetValueFromData (1062 of 2339)
PASS: lldb-unit :: Utility/./UtilityTests/ScalarTest.Promotion (1063 of 2339)
FAIL: lldb-api :: tools/lldb-vscode/breakpoint/TestVSCode_setFunctionBreakpoints.py (1064 of 2339)
******************** TEST 'lldb-api :: tools/lldb-vscode/breakpoint/TestVSCode_setFunctionBreakpoints.py' FAILED ********************
Script:
--
/Users/buildslave/jenkins/workspace/lldb-cmake-sanitized/lldb-build/lldb-test-build.noindex/copied-python /Users/buildslave/jenkins/workspace/lldb-cmake-sanitized/llvm-project/lldb/test/API/dotest.py -u CXXFLAGS -u CFLAGS --codesign-identity lldb_codesign --arch x86_64 --build-dir /Users/buildslave/jenkins/workspace/lldb-cmake-sanitized/lldb-build/lldb-test-build.noindex -t --env TERM=vt100 --env LLVM_LIBS_DIR=/Users/buildslave/jenkins/workspace/lldb-cmake-sanitized/lldb-build/./lib --inferior-env ASAN_OPTIONS=detect_stack_use_after_return=1 --inferior-env DYLD_INSERT_LIBRARIES=/Users/buildslave/jenkins/workspace/lldb-cmake-sanitized/host-compiler/lib/clang/13.0.99/lib/darwin/libclang_rt.asan_osx_dynamic.dylib --arch x86_64 --build-dir /Users/buildslave/jenkins/workspace/lldb-cmake-sanitized/lldb-build/lldb-test-build.noindex --lldb-module-cache-dir /Users/buildslave/jenkins/workspace/lldb-cmake-sanitized/lldb-build/lldb-test-build.noindex/module-cache-lldb/lldb-api --clang-module-cache-dir /Users/buildslave/jenkins/workspace/lldb-cmake-sanitized/lldb-build/lldb-test-build.noindex/module-cache-clang/lldb-api --executable /Users/buildslave/jenkins/workspace/lldb-cmake-sanitized/lldb-build/./bin/lldb --compiler /Users/buildslave/jenkins/workspace/lldb-cmake-sanitized/lldb-build/./bin/clang --dsymutil /Users/buildslave/jenkins/workspace/lldb-cmake-sanitized/lldb-build/./bin/dsymutil --llvm-tools-dir /Users/buildslave/jenkins/workspace/lldb-cmake-sanitized/lldb-build/./bin --lldb-libs-dir /Users/buildslave/jenkins/workspace/lldb-cmake-sanitized/lldb-build/./lib /Users/buildslave/jenkins/workspace/lldb-cmake-sanitized/llvm-project/lldb/test/API/tools/lldb-vscode/breakpoint -p TestVSCode_setFunctionBreakpoints.py
--
Exit Code: 1

Command Output (stdout):
--
lldb version 13.0.99 (http://labmaster3.local/git/llvm-project.git revision 30c9d68ad93af7f420f6d01f91adf12ff36254a0)
  clang revision 30c9d68ad93af7f420f6d01f91adf12ff36254a0
  llvm revision 30c9d68ad93af7f420f6d01f91adf12ff36254a0
Skipping the following test categories: ['darwin-log', 'libstdcxx', 'dwo', 'llgs', 'fork']

--
Command Output (stderr):
--
Change dir to: /Users/buildslave/jenkins/workspace/lldb-cmake-sanitized/llvm-project/lldb/test/API/tools/lldb-vscode/breakpoint
runCmd: settings clear -all
output: 

runCmd: settings set symbols.enable-external-lookup false
output: 

runCmd: settings set target.inherit-tcc true
output: 

runCmd: settings set target.detach-on-error false
output: 

runCmd: settings set target.auto-apply-fixits false
output: 

runCmd: settings set plugin.process.gdb-remote.packet-timeout 60
output: 

runCmd: settings set symbols.clang-modules-cache-path "/Users/buildslave/jenkins/workspace/lldb-cmake-sanitized/lldb-build/lldb-test-build.noindex/module-cache-lldb/lldb-api"
output: 

runCmd: settings set use-color false
output: 

runCmd: setting set target.prefer-dynamic-value no-dynamic-values
output: 

runCmd: settings set target.env-vars ASAN_OPTIONS=detect_stack_use_after_return=1 DYLD_INSERT_LIBRARIES=/Users/buildslave/jenkins/workspace/lldb-cmake-sanitized/host-compiler/lib/clang/13.0.99/lib/darwin/libclang_rt.asan_osx_dynamic.dylib
output: 

Adding tearDown hook:         def cleanup():
            if disconnectAutomatically:
                self.vscode.request_disconnect(terminateDebuggee=True)
            self.vscode.terminate()


FAIL: LLDB (/Users/buildslave/jenkins/workspace/lldb-cmake-sanitized/lldb-build/bin/clang-x86_64) :: test_functionality (TestVSCode_setFunctionBreakpoints.TestVSCode_setFunctionBreakpoints)
Executing tearDown hook:         def cleanup():
            if disconnectAutomatically:
                self.vscode.request_disconnect(terminateDebuggee=True)
            self.vscode.terminate()


CLEANUP ERROR: LLDB (/Users/buildslave/jenkins/workspace/lldb-cmake-sanitized/lldb-build/bin/clang-x86_64) :: test_functionality (TestVSCode_setFunctionBreakpoints.TestVSCode_setFunctionBreakpoints)
Traceback (most recent call last):
  File "/Users/buildslave/jenkins/workspace/lldb-cmake-sanitized/llvm-project/lldb/third_party/Python/module/unittest2/unittest2/case.py", line 386, in run
    self.tearDown()
  File "/Users/buildslave/jenkins/workspace/lldb-cmake-sanitized/llvm-project/lldb/packages/Python/lldbsuite/test/lldbtest.py", line 2095, in tearDown
    Base.tearDown(self)
  File "/Users/buildslave/jenkins/workspace/lldb-cmake-sanitized/llvm-project/lldb/packages/Python/lldbsuite/test/lldbtest.py", line 1065, in tearDown
    hook()  # try the plain call and hope it works
  File "/Users/buildslave/jenkins/workspace/lldb-cmake-sanitized/llvm-project/lldb/packages/Python/lldbsuite/test/tools/lldb-vscode/lldbvscode_testcase.py", line 294, in cleanup
    self.vscode.request_disconnect(terminateDebuggee=True)
  File "/Users/buildslave/jenkins/workspace/lldb-cmake-sanitized/llvm-project/lldb/packages/Python/lldbsuite/test/tools/lldb-vscode/vscode.py", line 578, in request_disconnect
    return self.send_recv(command_dict)
  File "/Users/buildslave/jenkins/workspace/lldb-cmake-sanitized/llvm-project/lldb/packages/Python/lldbsuite/test/tools/lldb-vscode/vscode.py", line 303, in send_recv
    self.send_packet(command)
  File "/Users/buildslave/jenkins/workspace/lldb-cmake-sanitized/llvm-project/lldb/packages/Python/lldbsuite/test/tools/lldb-vscode/vscode.py", line 259, in send_packet
    self.send.flush()
BrokenPipeError: [Errno 32] Broken pipe

runCmd: settings clear -all
output: 

runCmd: settings set symbols.enable-external-lookup false
output: 

runCmd: settings set target.inherit-tcc true
output: 

runCmd: settings set target.detach-on-error false
output: 

runCmd: settings set target.auto-apply-fixits false
output: 

runCmd: settings set plugin.process.gdb-remote.packet-timeout 60
output: 

runCmd: settings set symbols.clang-modules-cache-path "/Users/buildslave/jenkins/workspace/lldb-cmake-sanitized/lldb-build/lldb-test-build.noindex/module-cache-lldb/lldb-api"
output: 

runCmd: settings set use-color false
output: 

runCmd: setting set target.prefer-dynamic-value no-dynamic-values
output: 

runCmd: settings set target.env-vars ASAN_OPTIONS=detect_stack_use_after_return=1 DYLD_INSERT_LIBRARIES=/Users/buildslave/jenkins/workspace/lldb-cmake-sanitized/host-compiler/lib/clang/13.0.99/lib/darwin/libclang_rt.asan_osx_dynamic.dylib
output: 

Adding tearDown hook:         def cleanup():
            if disconnectAutomatically:
                self.vscode.request_disconnect(terminateDebuggee=True)
            self.vscode.terminate()


Executing tearDown hook:         def cleanup():
            if disconnectAutomatically:
                self.vscode.request_disconnect(terminateDebuggee=True)
            self.vscode.terminate()


PASS: LLDB (/Users/buildslave/jenkins/workspace/lldb-cmake-sanitized/lldb-build/bin/clang-x86_64) :: test_set_and_clear (TestVSCode_setFunctionBreakpoints.TestVSCode_setFunctionBreakpoints)
Restore dir to: /Users/buildslave/jenkins/workspace/lldb-cmake-sanitized/lldb-build/tools/lldb/test
======================================================================
FAIL: test_functionality (TestVSCode_setFunctionBreakpoints.TestVSCode_setFunctionBreakpoints)
   Tests hitting breakpoints and the functionality of a single
----------------------------------------------------------------------
Traceback (most recent call last):
  File "/Users/buildslave/jenkins/workspace/lldb-cmake-sanitized/llvm-project/lldb/test/API/tools/lldb-vscode/breakpoint/TestVSCode_setFunctionBreakpoints.py", line 139, in test_functionality
    self.continue_to_breakpoints(breakpoint_ids)
  File "/Users/buildslave/jenkins/workspace/lldb-cmake-sanitized/llvm-project/lldb/packages/Python/lldbsuite/test/tools/lldb-vscode/lldbvscode_testcase.py", line 233, in continue_to_breakpoints
    self.verify_breakpoint_hit(breakpoint_ids)
  File "/Users/buildslave/jenkins/workspace/lldb-cmake-sanitized/llvm-project/lldb/packages/Python/lldbsuite/test/tools/lldb-vscode/lldbvscode_testcase.py", line 92, in verify_breakpoint_hit
    self.assertTrue(False, "breakpoint not hit")
AssertionError: False is not True : breakpoint not hit
Config=x86_64-/Users/buildslave/jenkins/workspace/lldb-cmake-sanitized/lldb-build/bin/clang
----------------------------------------------------------------------
Ran 2 tests in 7.868s

RESULT: FAILED (1 passes, 1 failures, 0 errors, 0 skipped, 0 expected failures, 0 unexpected successes)

--

********************
PASS: lldb-unit :: ScriptInterpreter/Python/./ScriptInterpreterPythonTests/PythonDataObjectsTest.TestPythonStringToStructuredString (1065 of 2339)
PASS: lldb-shell :: SymbolFile/symbol-binding.test (1066 of 2339)
PASS: lldb-api :: macosx/thread_suspend/TestInternalThreadSuspension.py (1067 of 2339)
PASS: lldb-unit :: Language/Highlighting/./HighlighterTests/HighlighterTest.ClangTrailingBackslashWithWhitespace (1068 of 2339)
PASS: lldb-api :: functionalities/gdb_remote_client/TestNoWatchpointSupportInfo.py (1069 of 2339)
PASS: lldb-unit :: UnwindAssembly/x86/./UnwindAssemblyx86Tests/Testx86AssemblyInspectionEngine.TestSimple32bitFrameFunction (1070 of 2339)
PASS: lldb-unit :: Utility/./UtilityTests/UriParserTest.BracketedHostnameWithPortIPv4 (1071 of 2339)
PASS: lldb-unit :: Utility/./UtilityTests/StringExtractorTest.GetHexBytes_FullString (1072 of 2339)
PASS: lldb-shell :: SymbolFile/DWARF/x86/dwarf5-partial-index.cpp (1073 of 2339)
PASS: lldb-api :: python_api/lldbutil/TestSwigVersion.py (1074 of 2339)
PASS: lldb-shell :: Expr/TestIRMemoryMap.test (1075 of 2339)
PASS: lldb-unit :: Utility/./UtilityTests/BinaryStreamTest.PutSLEB128TwoBytes (1076 of 2339)
PASS: lldb-unit :: Language/Highlighting/./HighlighterTests/HighlighterTest.ClangStringLiterals (1077 of 2339)
PASS: lldb-api :: lang/objc/objc++/TestObjCXX.py (1078 of 2339)
PASS: lldb-api :: python_api/file_handle/TestFileHandle.py (1079 of 2339)
UNSUPPORTED: lldb-api :: tools/lldb-server/vCont-threads/TestGdbRemote_vContThreads.py (1080 of 2339)
UNSUPPORTED: lldb-api :: commands/gui/breakpoints/TestGuiBreakpoints.py (1081 of 2339)
PASS: lldb-api :: commands/expression/import-std-module/no-std-module/TestMissingStdModule.py (1082 of 2339)
PASS: lldb-api :: lang/cpp/class_static/TestStaticVariables.py (1083 of 2339)
PASS: lldb-api :: functionalities/completion/TestCompletion.py (1084 of 2339)
PASS: lldb-api :: functionalities/breakpoint/cpp_exception/TestCPPExceptionBreakpoint.py (1085 of 2339)
PASS: lldb-api :: lang/objc/print-obj/TestPrintObj.py (1086 of 2339)
UNSUPPORTED: lldb-api :: lang/cpp/function-template-parameter-pack/TestFunctionTemplateParameterPack.py (1087 of 2339)
PASS: lldb-unit :: ObjectFile/PECOFF/./ObjectFilePECOFFTests/PECallFrameInfoTest.Basic_eh (1088 of 2339)
PASS: lldb-api :: functionalities/breakpoint/scripted_bkpt/TestScriptedResolver.py (1089 of 2339)
PASS: lldb-api :: macosx/load-kext/TestLoadKext.py (1090 of 2339)
PASS: lldb-unit :: Utility/./UtilityTests/LogTest.Unregister (1091 of 2339)
PASS: lldb-api :: functionalities/gdb_remote_client/TestRecognizeBreakpoint.py (1092 of 2339)
PASS: lldb-shell :: SymbolFile/NativePDB/break-by-function.cpp (1093 of 2339)
PASS: lldb-unit :: Core/./LLDBCoreTests/MangledTest.ResultForValidName (1094 of 2339)
PASS: lldb-unit :: Utility/./UtilityTests/AnsiTerminal.Incomplete (1095 of 2339)
PASS: lldb-unit :: Core/./LLDBCoreTests/UniqueCStringMap.NoDefaultConstructor (1096 of 2339)
PASS: lldb-unit :: Utility/./UtilityTests/StreamTest.QuotedCString (1097 of 2339)
PASS: lldb-api :: python_api/section/TestSectionAPI.py (1098 of 2339)
PASS: lldb-api :: lang/cpp/break-on-initializers/TestBreakOnCPP11Initializers.py (1099 of 2339)
UNSUPPORTED: lldb-api :: functionalities/gdb_remote_client/TestQemuAArch64TargetXml.py (1100 of 2339)
PASS: lldb-shell :: ObjectFile/ELF/basic-info.yaml (1101 of 2339)
PASS: lldb-api :: functionalities/data-formatter/data-formatter-objc/TestDataFormatterObjNSException.py (1102 of 2339)
PASS: lldb-unit :: Utility/./UtilityTests/UriParserTest.BracketedHostname (1103 of 2339)
PASS: lldb-unit :: Process/minidump/./LLDBMinidumpTests/MinidumpParserTest.GetThreadsAndGetThreadContext (1104 of 2339)
UNSUPPORTED: lldb-api :: iohandler/unicode/TestUnicode.py (1105 of 2339)
PASS: lldb-unit :: Core/./LLDBCoreTests/SourceFileCache.FindSourceFileFound (1106 of 2339)
PASS: lldb-shell :: SymbolFile/Breakpad/unwind-via-stack-win.test (1107 of 2339)
PASS: lldb-api :: commands/target/create-deps/TestTargetCreateDeps.py (1108 of 2339)
UNSUPPORTED: lldb-shell :: SymbolFile/NativePDB/ast-functions-msvc.cpp (1109 of 2339)
PASS: lldb-unit :: Utility/./UtilityTests/ArchSpecTest.TestSetTriple (1110 of 2339)
PASS: lldb-shell :: SymbolFile/DWARF/x86/array-sizes.s (1111 of 2339)
PASS: lldb-unit :: Utility/./UtilityTests/ArgsTest.StringListConstructor (1112 of 2339)
PASS: lldb-unit :: Utility/./UtilityTests/StreamTest.AddressNoSuffix (1113 of 2339)
PASS: lldb-unit :: Language/Highlighting/./HighlighterTests/HighlighterTest.HighlighterSelectionPath (1114 of 2339)
PASS: lldb-unit :: Utility/./UtilityTests/EnvironmentTest.EnvpConversion (1115 of 2339)
UNSUPPORTED: lldb-shell :: Register/x86-64-zmm-read.test (1116 of 2339)
PASS: lldb-api :: lang/c/find_struct_type/TestFindStructTypes.py (1117 of 2339)
PASS: lldb-shell :: Host/TestCustomShell.test (1118 of 2339)
PASS: lldb-unit :: Language/Highlighting/./HighlighterTests/HighlighterTest.ClangCursorOutOfBounds (1119 of 2339)
PASS: lldb-unit :: Symbol/./SymbolTests/TestTypeSystemClang.TestFunctionTemplateInRecordConstruction (1120 of 2339)
PASS: lldb-api :: commands/session/history/TestSessionHistory.py (1121 of 2339)
PASS: lldb-api :: functionalities/thread/concurrent_events/TestConcurrentDelaySignalWatch.py (1122 of 2339)
PASS: lldb-api :: lang/objc/blocks/TestObjCIvarsInBlocks.py (1123 of 2339)
PASS: lldb-unit :: Host/./HostTests/SocketTests/SocketTest.DecodeHostAndPort/ipv6 (1124 of 2339)
UNSUPPORTED: lldb-api :: tools/lldb-server/libraries-svr4/TestGdbRemoteLibrariesSvr4Support.py (1125 of 2339)
UNSUPPORTED: lldb-shell :: SymbolFile/DWARF/x86/dwarf5-line-strp.s (1126 of 2339)
PASS: lldb-api :: python_api/watchpoint/watchlocation/TestSetWatchlocation.py (1127 of 2339)
PASS: lldb-unit :: Utility/./UtilityTests/Flags.AllClear (1128 of 2339)
PASS: lldb-shell :: SymbolFile/DWARF/x86/find-variable-file.cpp (1129 of 2339)
PASS: lldb-unit :: Utility/./UtilityTests/VASprintfTest.BufferResize (1130 of 2339)
PASS: lldb-api :: macosx/DBGSourcePathRemapping/TestDSYMSourcePathRemapping.py (1131 of 2339)
PASS: lldb-unit :: ScriptInterpreter/Python/./ScriptInterpreterPythonTests/PythonDataObjectsTest.TestScript (1132 of 2339)
PASS: lldb-unit :: Utility/./UtilityTests/SubsystemRAIITest.NormalSubsystem (1133 of 2339)
PASS: lldb-api :: commands/expression/dollar-in-variable/TestDollarInVariable.py (1134 of 2339)
PASS: lldb-api :: commands/watchpoints/watchpoint_commands/command/TestWatchpointCommandPython.py (1135 of 2339)
PASS: lldb-unit :: Utility/./UtilityTests/LogTest.Register (1136 of 2339)
PASS: lldb-api :: types/TestCharTypeExpr.py (1137 of 2339)
PASS: lldb-unit :: Utility/./UtilityTests/RangeTest.SizeTypes (1138 of 2339)
PASS: lldb-unit :: Utility/./UtilityTests/DataExtractorTest.GetCStrAtNullOffset (1139 of 2339)
PASS: lldb-api :: lang/c/unicode/TestUnicodeSymbols.py (1140 of 2339)
PASS: lldb-shell :: SymbolFile/DWARF/x86/debug_rnglists-dwo.s (1141 of 2339)
PASS: lldb-shell :: Settings/TestFrameFormatMangling.test (1142 of 2339)
PASS: lldb-api :: functionalities/data-formatter/data-formatter-ptr-to-array/TestPtrToArrayFormatting.py (1143 of 2339)
PASS: lldb-api :: functionalities/gdb_remote_client/TestqOffsets.py (1144 of 2339)
PASS: lldb-shell :: SymbolFile/DWARF/x86/DW_AT_location-DW_AT_const_value.s (1145 of 2339)
PASS: lldb-api :: functionalities/data-formatter/data-formatter-synth/TestDataFormatterSynth.py (1146 of 2339)
PASS: lldb-unit :: Process/gdb-remote/./ProcessGdbRemoteTests/GDBRemoteCommunicationClientTest.GetModulesInfo (1147 of 2339)
PASS: lldb-shell :: SymbolFile/DWARF/x86/split-dwarf-inlining.cpp (1148 of 2339)
PASS: lldb-api :: commands/expression/call-function/TestCallStdStringFunction.py (1149 of 2339)
UNSUPPORTED: lldb-api :: functionalities/darwin_log/filter/exact_match/subsystem/TestDarwinLogFilterMatchSubsystem.py (1150 of 2339)
PASS: lldb-shell :: ObjectFile/PECOFF/basic-info.yaml (1151 of 2339)
PASS: lldb-unit :: Utility/./UtilityTests/ArchSpecTest.TestParseMachCPUDashSubtypeTripleExtra (1152 of 2339)
PASS: lldb-api :: functionalities/gdb_remote_client/TestWriteMemory.py (1153 of 2339)
PASS: lldb-shell :: ObjectFile/ELF/section-types.yaml (1154 of 2339)
PASS: lldb-unit :: Symbol/./SymbolTests/TestTypeSystemClang.TestGetEnumIntegerTypeBasicTypes (1155 of 2339)
UNSUPPORTED: lldb-api :: lang/objc/objc-dynamic-value/TestObjCDynamicValue.py (1156 of 2339)
PASS: lldb-shell :: ObjectFile/ELF/PT_LOAD.yaml (1157 of 2339)
PASS: lldb-api :: macosx/function-starts/TestFunctionStarts.py (1158 of 2339)
PASS: lldb-unit :: Platform/./LLDBPlatformTests/PlatformDarwinTest.TestParseVersionBuildDir (1159 of 2339)
PASS: lldb-unit :: Utility/./UtilityTests/RangeTest.DefaultConstructor (1160 of 2339)
PASS: lldb-unit :: Utility/./UtilityTests/LogChannelTest.EnableOptions (1161 of 2339)
PASS: lldb-shell :: SymbolFile/DWARF/x86/subprogram_ranges.test (1162 of 2339)
PASS: lldb-unit :: UnwindAssembly/x86/./UnwindAssemblyx86Tests/Testx86AssemblyInspectionEngine.Test32bitFramelessSmallStackFrame (1163 of 2339)
PASS: lldb-shell :: Subprocess/vfork-follow-parent.test (1164 of 2339)
PASS: lldb-unit :: Host/./HostTests/File.GetWaitableHandleFileno (1165 of 2339)
PASS: lldb-api :: python_api/process/read-mem-cstring/TestReadMemCString.py (1166 of 2339)
PASS: lldb-unit :: Expression/./ExpressionTests/CppModuleConfigurationTest.AmbiguousCLib (1167 of 2339)
PASS: lldb-unit :: Utility/./UtilityTests/BinaryStreamTest.PutSLEB128One (1168 of 2339)
PASS: lldb-unit :: Utility/./UtilityTests/ArgsTest.TestQuotedTrailingBackslash (1169 of 2339)
PASS: lldb-api :: lang/cpp/inlines/TestInlines.py (1170 of 2339)
PASS: lldb-unit :: Utility/./UtilityTests/ArgsTest.TestInsertArg (1171 of 2339)
PASS: lldb-shell :: SymbolFile/DWARF/x86/DW_AT_const_value-bitfields.s (1172 of 2339)
UNSUPPORTED: lldb-api :: functionalities/data-formatter/data-formatter-stl/libstdcpp/tuple/TestDataFormatterStdTuple.py (1173 of 2339)
PASS: lldb-shell :: SymbolFile/DWARF/x86/find-qualified-variable.cpp (1174 of 2339)
PASS: lldb-api :: functionalities/process_crash_info/TestProcessCrashInfo.py (1175 of 2339)
PASS: lldb-unit :: debugserver/./debugserverTests/RNBSocket.AnyListen (1176 of 2339)
PASS: lldb-api :: python_api/frame/get-variables/TestGetVariables.py (1177 of 2339)
PASS: lldb-api :: commands/thread/select/TestThreadSelect.py (1178 of 2339)
UNSUPPORTED: lldb-api :: functionalities/darwin_log/filter/regex/subsystem/TestDarwinLogFilterRegexSubsystem.py (1179 of 2339)
PASS: lldb-unit :: SymbolFile/DWARF/./SymbolFileDWARFTests/SymbolFileDWARFTests.TestAbbrevValidAttrNullForm (1180 of 2339)
PASS: lldb-unit :: Platform/Android/./AdbClientTests/AdbClientTest.CreateByDeviceId (1181 of 2339)
UNSUPPORTED: lldb-api :: functionalities/darwin_log/format/TestDarwinLogMessageFormat.py (1182 of 2339)
PASS: lldb-api :: tools/lldb-server/TestGdbRemoteAttach.py (1183 of 2339)
PASS: lldb-unit :: Utility/./UtilityTests/BinaryStreamTest.PutULEB128ThreeBytes (1184 of 2339)
PASS: lldb-api :: lang/objc/modules-app-update/TestClangModulesAppUpdate.py (1185 of 2339)
PASS: lldb-unit :: Utility/./UtilityTests/RangeTest.ContainsAddr (1186 of 2339)
PASS: lldb-api :: lang/cpp/subst_template_type_param/TestSubstTemplateTypeParam.py (1187 of 2339)
PASS: lldb-shell :: SymbolFile/DWARF/x86/dwp-separate-debug-file.cpp (1188 of 2339)
PASS: lldb-unit :: Expression/./ExpressionTests/CppModuleConfigurationTest.IgnoreLibStdCpp (1189 of 2339)
PASS: lldb-shell :: SymbolFile/DWARF/x86/find-basic-variable.cpp (1190 of 2339)
PASS: lldb-unit :: Process/minidump/./LLDBMinidumpTests/MinidumpParserTest.InvalidMinidump (1191 of 2339)
PASS: lldb-api :: lang/cpp/reference-to-outer-type/TestCppReferenceToOuterClass.py (1192 of 2339)
PASS: lldb-api :: functionalities/memory/read/TestMemoryRead.py (1193 of 2339)
PASS: lldb-api :: functionalities/data-formatter/summary-string-onfail/Test-rdar-9974002.py (1194 of 2339)
PASS: lldb-api :: functionalities/inline-stepping/TestInlineStepping.py (1195 of 2339)
PASS: lldb-shell :: ObjectFile/ELF/section-permissions.yaml (1196 of 2339)
PASS: lldb-unit :: Utility/./UtilityTests/ProcessInstanceInfo.DumpTable_invalidUID (1197 of 2339)
PASS: lldb-api :: functionalities/gdb_remote_client/TestGDBRemoteLoad.py (1198 of 2339)
PASS: lldb-unit :: Utility/./UtilityTests/RangeDataVector.FindEntryIndexesThatContain_Overlap (1199 of 2339)
PASS: lldb-api :: lang/objcxx/hide-runtime-values/TestObjCXXHideRuntimeValues.py (1200 of 2339)
PASS: lldb-api :: commands/expression/import-std-module/empty-module/TestEmptyStdModule.py (1201 of 2339)
PASS: lldb-unit :: Symbol/./SymbolTests/TestTypeSystemClang.TestGetEnumIntegerTypeInvalid (1202 of 2339)
PASS: lldb-shell :: ObjectFile/ELF/PT_LOAD-overlap-section.yaml (1203 of 2339)
PASS: lldb-api :: functionalities/source-map/TestTargetSourceMap.py (1204 of 2339)
PASS: lldb-unit :: debugserver/./debugserverTests/RNBSocket.LoopBackConnectIPv4 (1205 of 2339)
UNSUPPORTED: lldb-api :: functionalities/data-formatter/data-formatter-stl/libstdcpp/string/TestDataFormatterStdString.py (1206 of 2339)
PASS: lldb-shell :: Breakpoint/split-dwarf-5-addrbase.test (1207 of 2339)
PASS: lldb-api :: python_api/sbtype_typeclass/TestSBTypeTypeClass.py (1208 of 2339)
PASS: lldb-api :: functionalities/abbreviation/TestAbbreviations.py (1209 of 2339)
PASS: lldb-unit :: Utility/./UtilityTests/RangeTest.Constructor (1210 of 2339)
PASS: lldb-unit :: Process/Utility/./ProcessUtilityTests/ProcMapTests/LinuxProcMapsTestFixture.ParseMapRegions/8 (1211 of 2339)
PASS: lldb-unit :: Utility/./UtilityTests/BinaryStreamTest.PutSLEB128FourBytes (1212 of 2339)
PASS: lldb-api :: functionalities/recursion/TestValueObjectRecursion.py (1213 of 2339)
PASS: lldb-shell :: SymbolFile/DWARF/x86/parallel-indexing-stress.s (1214 of 2339)
PASS: lldb-unit :: ScriptInterpreter/Python/./ScriptInterpreterPythonTests/PythonDataObjectsTest.TestPythonBoolean (1215 of 2339)
PASS: lldb-shell :: ObjectFile/ELF/riscv-arch.yaml (1216 of 2339)
PASS: lldb-shell :: ObjectFile/PECOFF/basic-info-arm64.yaml (1217 of 2339)
FAIL: lldb-api :: tools/lldb-vscode/evaluate/TestVSCode_evaluate.py (1218 of 2339)
******************** TEST 'lldb-api :: tools/lldb-vscode/evaluate/TestVSCode_evaluate.py' FAILED ********************
Script:
--
/Users/buildslave/jenkins/workspace/lldb-cmake-sanitized/lldb-build/lldb-test-build.noindex/copied-python /Users/buildslave/jenkins/workspace/lldb-cmake-sanitized/llvm-project/lldb/test/API/dotest.py -u CXXFLAGS -u CFLAGS --codesign-identity lldb_codesign --arch x86_64 --build-dir /Users/buildslave/jenkins/workspace/lldb-cmake-sanitized/lldb-build/lldb-test-build.noindex -t --env TERM=vt100 --env LLVM_LIBS_DIR=/Users/buildslave/jenkins/workspace/lldb-cmake-sanitized/lldb-build/./lib --inferior-env ASAN_OPTIONS=detect_stack_use_after_return=1 --inferior-env DYLD_INSERT_LIBRARIES=/Users/buildslave/jenkins/workspace/lldb-cmake-sanitized/host-compiler/lib/clang/13.0.99/lib/darwin/libclang_rt.asan_osx_dynamic.dylib --arch x86_64 --build-dir /Users/buildslave/jenkins/workspace/lldb-cmake-sanitized/lldb-build/lldb-test-build.noindex --lldb-module-cache-dir /Users/buildslave/jenkins/workspace/lldb-cmake-sanitized/lldb-build/lldb-test-build.noindex/module-cache-lldb/lldb-api --clang-module-cache-dir /Users/buildslave/jenkins/workspace/lldb-cmake-sanitized/lldb-build/lldb-test-build.noindex/module-cache-clang/lldb-api --executable /Users/buildslave/jenkins/workspace/lldb-cmake-sanitized/lldb-build/./bin/lldb --compiler /Users/buildslave/jenkins/workspace/lldb-cmake-sanitized/lldb-build/./bin/clang --dsymutil /Users/buildslave/jenkins/workspace/lldb-cmake-sanitized/lldb-build/./bin/dsymutil --llvm-tools-dir /Users/buildslave/jenkins/workspace/lldb-cmake-sanitized/lldb-build/./bin --lldb-libs-dir /Users/buildslave/jenkins/workspace/lldb-cmake-sanitized/lldb-build/./lib /Users/buildslave/jenkins/workspace/lldb-cmake-sanitized/llvm-project/lldb/test/API/tools/lldb-vscode/evaluate -p TestVSCode_evaluate.py
--
Exit Code: 1

Command Output (stdout):
--
lldb version 13.0.99 (http://labmaster3.local/git/llvm-project.git revision 30c9d68ad93af7f420f6d01f91adf12ff36254a0)
  clang revision 30c9d68ad93af7f420f6d01f91adf12ff36254a0
  llvm revision 30c9d68ad93af7f420f6d01f91adf12ff36254a0
Skipping the following test categories: ['darwin-log', 'libstdcxx', 'dwo', 'llgs', 'fork']

--
Command Output (stderr):
--
Change dir to: /Users/buildslave/jenkins/workspace/lldb-cmake-sanitized/llvm-project/lldb/test/API/tools/lldb-vscode/evaluate
runCmd: settings clear -all
output: 

runCmd: settings set symbols.enable-external-lookup false
output: 

runCmd: settings set target.inherit-tcc true
output: 

runCmd: settings set target.detach-on-error false
output: 

runCmd: settings set target.auto-apply-fixits false
output: 

runCmd: settings set plugin.process.gdb-remote.packet-timeout 60
output: 

runCmd: settings set symbols.clang-modules-cache-path "/Users/buildslave/jenkins/workspace/lldb-cmake-sanitized/lldb-build/lldb-test-build.noindex/module-cache-lldb/lldb-api"
output: 

runCmd: settings set use-color false
output: 

runCmd: setting set target.prefer-dynamic-value no-dynamic-values
output: 

runCmd: settings set target.env-vars ASAN_OPTIONS=detect_stack_use_after_return=1 DYLD_INSERT_LIBRARIES=/Users/buildslave/jenkins/workspace/lldb-cmake-sanitized/host-compiler/lib/clang/13.0.99/lib/darwin/libclang_rt.asan_osx_dynamic.dylib
output: 

Adding tearDown hook:         def cleanup():
            if disconnectAutomatically:
                self.vscode.request_disconnect(terminateDebuggee=True)
            self.vscode.terminate()


FAIL: LLDB (/Users/buildslave/jenkins/workspace/lldb-cmake-sanitized/lldb-build/bin/clang-x86_64) :: test_generic_evaluate_expressions (TestVSCode_evaluate.TestVSCode_variables)
Executing tearDown hook:         def cleanup():
            if disconnectAutomatically:
                self.vscode.request_disconnect(terminateDebuggee=True)
            self.vscode.terminate()


CLEANUP ERROR: LLDB (/Users/buildslave/jenkins/workspace/lldb-cmake-sanitized/lldb-build/bin/clang-x86_64) :: test_generic_evaluate_expressions (TestVSCode_evaluate.TestVSCode_variables)
Traceback (most recent call last):
  File "/Users/buildslave/jenkins/workspace/lldb-cmake-sanitized/llvm-project/lldb/third_party/Python/module/unittest2/unittest2/case.py", line 386, in run
    self.tearDown()
  File "/Users/buildslave/jenkins/workspace/lldb-cmake-sanitized/llvm-project/lldb/packages/Python/lldbsuite/test/lldbtest.py", line 2095, in tearDown
    Base.tearDown(self)
  File "/Users/buildslave/jenkins/workspace/lldb-cmake-sanitized/llvm-project/lldb/packages/Python/lldbsuite/test/lldbtest.py", line 1065, in tearDown
    hook()  # try the plain call and hope it works
  File "/Users/buildslave/jenkins/workspace/lldb-cmake-sanitized/llvm-project/lldb/packages/Python/lldbsuite/test/tools/lldb-vscode/lldbvscode_testcase.py", line 294, in cleanup
    self.vscode.request_disconnect(terminateDebuggee=True)
  File "/Users/buildslave/jenkins/workspace/lldb-cmake-sanitized/llvm-project/lldb/packages/Python/lldbsuite/test/tools/lldb-vscode/vscode.py", line 578, in request_disconnect
    return self.send_recv(command_dict)
  File "/Users/buildslave/jenkins/workspace/lldb-cmake-sanitized/llvm-project/lldb/packages/Python/lldbsuite/test/tools/lldb-vscode/vscode.py", line 303, in send_recv
    self.send_packet(command)
  File "/Users/buildslave/jenkins/workspace/lldb-cmake-sanitized/llvm-project/lldb/packages/Python/lldbsuite/test/tools/lldb-vscode/vscode.py", line 259, in send_packet
    self.send.flush()
BrokenPipeError: [Errno 32] Broken pipe

runCmd: settings clear -all
output: 

runCmd: settings set symbols.enable-external-lookup false
output: 

runCmd: settings set target.inherit-tcc true
output: 

runCmd: settings set target.detach-on-error false
output: 

runCmd: settings set target.auto-apply-fixits false
output: 

runCmd: settings set plugin.process.gdb-remote.packet-timeout 60
output: 

runCmd: settings set symbols.clang-modules-cache-path "/Users/buildslave/jenkins/workspace/lldb-cmake-sanitized/lldb-build/lldb-test-build.noindex/module-cache-lldb/lldb-api"
output: 

runCmd: settings set use-color false
output: 

runCmd: setting set target.prefer-dynamic-value no-dynamic-values
output: 

runCmd: settings set target.env-vars ASAN_OPTIONS=detect_stack_use_after_return=1 DYLD_INSERT_LIBRARIES=/Users/buildslave/jenkins/workspace/lldb-cmake-sanitized/host-compiler/lib/clang/13.0.99/lib/darwin/libclang_rt.asan_osx_dynamic.dylib
output: 

Adding tearDown hook:         def cleanup():
            if disconnectAutomatically:
                self.vscode.request_disconnect(terminateDebuggee=True)
            self.vscode.terminate()


Executing tearDown hook:         def cleanup():
            if disconnectAutomatically:
                self.vscode.request_disconnect(terminateDebuggee=True)
            self.vscode.terminate()


PASS: LLDB (/Users/buildslave/jenkins/workspace/lldb-cmake-sanitized/lldb-build/bin/clang-x86_64) :: test_hover_evaluate_expressions (TestVSCode_evaluate.TestVSCode_variables)
runCmd: settings clear -all
output: 

runCmd: settings set symbols.enable-external-lookup false
output: 

runCmd: settings set target.inherit-tcc true
output: 

runCmd: settings set target.detach-on-error false
output: 

runCmd: settings set target.auto-apply-fixits false
output: 

runCmd: settings set plugin.process.gdb-remote.packet-timeout 60
output: 

runCmd: settings set symbols.clang-modules-cache-path "/Users/buildslave/jenkins/workspace/lldb-cmake-sanitized/lldb-build/lldb-test-build.noindex/module-cache-lldb/lldb-api"
output: 

runCmd: settings set use-color false
output: 

runCmd: setting set target.prefer-dynamic-value no-dynamic-values
output: 

runCmd: settings set target.env-vars ASAN_OPTIONS=detect_stack_use_after_return=1 DYLD_INSERT_LIBRARIES=/Users/buildslave/jenkins/workspace/lldb-cmake-sanitized/host-compiler/lib/clang/13.0.99/lib/darwin/libclang_rt.asan_osx_dynamic.dylib
output: 

Adding tearDown hook:         def cleanup():
            if disconnectAutomatically:
                self.vscode.request_disconnect(terminateDebuggee=True)
            self.vscode.terminate()


FAIL: LLDB (/Users/buildslave/jenkins/workspace/lldb-cmake-sanitized/lldb-build/bin/clang-x86_64) :: test_repl_evaluate_expressions (TestVSCode_evaluate.TestVSCode_variables)
Executing tearDown hook:         def cleanup():
            if disconnectAutomatically:
                self.vscode.request_disconnect(terminateDebuggee=True)
            self.vscode.terminate()


CLEANUP ERROR: LLDB (/Users/buildslave/jenkins/workspace/lldb-cmake-sanitized/lldb-build/bin/clang-x86_64) :: test_repl_evaluate_expressions (TestVSCode_evaluate.TestVSCode_variables)
Traceback (most recent call last):
  File "/Users/buildslave/jenkins/workspace/lldb-cmake-sanitized/llvm-project/lldb/third_party/Python/module/unittest2/unittest2/case.py", line 386, in run
    self.tearDown()
  File "/Users/buildslave/jenkins/workspace/lldb-cmake-sanitized/llvm-project/lldb/packages/Python/lldbsuite/test/lldbtest.py", line 2095, in tearDown
    Base.tearDown(self)
  File "/Users/buildslave/jenkins/workspace/lldb-cmake-sanitized/llvm-project/lldb/packages/Python/lldbsuite/test/lldbtest.py", line 1065, in tearDown
    hook()  # try the plain call and hope it works
  File "/Users/buildslave/jenkins/workspace/lldb-cmake-sanitized/llvm-project/lldb/packages/Python/lldbsuite/test/tools/lldb-vscode/lldbvscode_testcase.py", line 294, in cleanup
    self.vscode.request_disconnect(terminateDebuggee=True)
  File "/Users/buildslave/jenkins/workspace/lldb-cmake-sanitized/llvm-project/lldb/packages/Python/lldbsuite/test/tools/lldb-vscode/vscode.py", line 578, in request_disconnect
    return self.send_recv(command_dict)
  File "/Users/buildslave/jenkins/workspace/lldb-cmake-sanitized/llvm-project/lldb/packages/Python/lldbsuite/test/tools/lldb-vscode/vscode.py", line 303, in send_recv
    self.send_packet(command)
  File "/Users/buildslave/jenkins/workspace/lldb-cmake-sanitized/llvm-project/lldb/packages/Python/lldbsuite/test/tools/lldb-vscode/vscode.py", line 259, in send_packet
    self.send.flush()
BrokenPipeError: [Errno 32] Broken pipe

runCmd: settings clear -all
output: 

runCmd: settings set symbols.enable-external-lookup false
output: 

runCmd: settings set target.inherit-tcc true
output: 

runCmd: settings set target.detach-on-error false
output: 

runCmd: settings set target.auto-apply-fixits false
output: 

runCmd: settings set plugin.process.gdb-remote.packet-timeout 60
output: 

runCmd: settings set symbols.clang-modules-cache-path "/Users/buildslave/jenkins/workspace/lldb-cmake-sanitized/lldb-build/lldb-test-build.noindex/module-cache-lldb/lldb-api"
output: 

runCmd: settings set use-color false
output: 

runCmd: setting set target.prefer-dynamic-value no-dynamic-values
output: 

runCmd: settings set target.env-vars ASAN_OPTIONS=detect_stack_use_after_return=1 DYLD_INSERT_LIBRARIES=/Users/buildslave/jenkins/workspace/lldb-cmake-sanitized/host-compiler/lib/clang/13.0.99/lib/darwin/libclang_rt.asan_osx_dynamic.dylib
output: 

Adding tearDown hook:         def cleanup():
            if disconnectAutomatically:
                self.vscode.request_disconnect(terminateDebuggee=True)
            self.vscode.terminate()


FAIL: LLDB (/Users/buildslave/jenkins/workspace/lldb-cmake-sanitized/lldb-build/bin/clang-x86_64) :: test_watch_evaluate_expressions (TestVSCode_evaluate.TestVSCode_variables)
Executing tearDown hook:         def cleanup():
            if disconnectAutomatically:
                self.vscode.request_disconnect(terminateDebuggee=True)
            self.vscode.terminate()


CLEANUP ERROR: LLDB (/Users/buildslave/jenkins/workspace/lldb-cmake-sanitized/lldb-build/bin/clang-x86_64) :: test_watch_evaluate_expressions (TestVSCode_evaluate.TestVSCode_variables)
Traceback (most recent call last):
  File "/Users/buildslave/jenkins/workspace/lldb-cmake-sanitized/llvm-project/lldb/third_party/Python/module/unittest2/unittest2/case.py", line 386, in run
    self.tearDown()
  File "/Users/buildslave/jenkins/workspace/lldb-cmake-sanitized/llvm-project/lldb/packages/Python/lldbsuite/test/lldbtest.py", line 2095, in tearDown
    Base.tearDown(self)
  File "/Users/buildslave/jenkins/workspace/lldb-cmake-sanitized/llvm-project/lldb/packages/Python/lldbsuite/test/lldbtest.py", line 1065, in tearDown
    hook()  # try the plain call and hope it works
  File "/Users/buildslave/jenkins/workspace/lldb-cmake-sanitized/llvm-project/lldb/packages/Python/lldbsuite/test/tools/lldb-vscode/lldbvscode_testcase.py", line 294, in cleanup
    self.vscode.request_disconnect(terminateDebuggee=True)
  File "/Users/buildslave/jenkins/workspace/lldb-cmake-sanitized/llvm-project/lldb/packages/Python/lldbsuite/test/tools/lldb-vscode/vscode.py", line 578, in request_disconnect
    return self.send_recv(command_dict)
  File "/Users/buildslave/jenkins/workspace/lldb-cmake-sanitized/llvm-project/lldb/packages/Python/lldbsuite/test/tools/lldb-vscode/vscode.py", line 303, in send_recv
    self.send_packet(command)
  File "/Users/buildslave/jenkins/workspace/lldb-cmake-sanitized/llvm-project/lldb/packages/Python/lldbsuite/test/tools/lldb-vscode/vscode.py", line 259, in send_packet
    self.send.flush()
BrokenPipeError: [Errno 32] Broken pipe

Restore dir to: /Users/buildslave/jenkins/workspace/lldb-cmake-sanitized/lldb-build/tools/lldb/test
======================================================================
ERROR: test_generic_evaluate_expressions (TestVSCode_evaluate.TestVSCode_variables)
----------------------------------------------------------------------
Traceback (most recent call last):
  File "/Users/buildslave/jenkins/workspace/lldb-cmake-sanitized/llvm-project/lldb/test/API/tools/lldb-vscode/evaluate/TestVSCode_evaluate.py", line 157, in test_generic_evaluate_expressions
    self.run_test_evaluate_expressions()
  File "/Users/buildslave/jenkins/workspace/lldb-cmake-sanitized/llvm-project/lldb/test/API/tools/lldb-vscode/evaluate/TestVSCode_evaluate.py", line 60, in run_test_evaluate_expressions
    self.assertEvaluateFailure("var") # local variable of a_function
  File "/Users/buildslave/jenkins/workspace/lldb-cmake-sanitized/llvm-project/lldb/test/API/tools/lldb-vscode/evaluate/TestVSCode_evaluate.py", line 24, in assertEvaluateFailure
    self.vscode.request_evaluate(expression, context=self.context)['body'])
  File "/Users/buildslave/jenkins/workspace/lldb-cmake-sanitized/llvm-project/lldb/packages/Python/lldbsuite/test/tools/lldb-vscode/vscode.py", line 595, in request_evaluate
    return self.send_recv(command_dict)
  File "/Users/buildslave/jenkins/workspace/lldb-cmake-sanitized/llvm-project/lldb/packages/Python/lldbsuite/test/tools/lldb-vscode/vscode.py", line 309, in send_recv
    raise ValueError(desc)
ValueError: no response for "evaluate"
Config=x86_64-/Users/buildslave/jenkins/workspace/lldb-cmake-sanitized/lldb-build/bin/clang
======================================================================
ERROR: test_repl_evaluate_expressions (TestVSCode_evaluate.TestVSCode_variables)
----------------------------------------------------------------------
Traceback (most recent call last):
  File "/Users/buildslave/jenkins/workspace/lldb-cmake-sanitized/llvm-project/lldb/test/API/tools/lldb-vscode/evaluate/TestVSCode_evaluate.py", line 163, in test_repl_evaluate_expressions
    self.run_test_evaluate_expressions("repl")
  File "/Users/buildslave/jenkins/workspace/lldb-cmake-sanitized/llvm-project/lldb/test/API/tools/lldb-vscode/evaluate/TestVSCode_evaluate.py", line 60, in run_test_evaluate_expressions
    self.assertEvaluateFailure("var") # local variable of a_function
  File "/Users/buildslave/jenkins/workspace/lldb-cmake-sanitized/llvm-project/lldb/test/API/tools/lldb-vscode/evaluate/TestVSCode_evaluate.py", line 24, in assertEvaluateFailure
    self.vscode.request_evaluate(expression, context=self.context)['body'])
  File "/Users/buildslave/jenkins/workspace/lldb-cmake-sanitized/llvm-project/lldb/packages/Python/lldbsuite/test/tools/lldb-vscode/vscode.py", line 595, in request_evaluate
    return self.send_recv(command_dict)
  File "/Users/buildslave/jenkins/workspace/lldb-cmake-sanitized/llvm-project/lldb/packages/Python/lldbsuite/test/tools/lldb-vscode/vscode.py", line 309, in send_recv
    raise ValueError(desc)
ValueError: no response for "evaluate"
Config=x86_64-/Users/buildslave/jenkins/workspace/lldb-cmake-sanitized/lldb-build/bin/clang
======================================================================
ERROR: test_watch_evaluate_expressions (TestVSCode_evaluate.TestVSCode_variables)
----------------------------------------------------------------------
Traceback (most recent call last):
  File "/Users/buildslave/jenkins/workspace/lldb-cmake-sanitized/llvm-project/lldb/test/API/tools/lldb-vscode/evaluate/TestVSCode_evaluate.py", line 169, in test_watch_evaluate_expressions
    self.run_test_evaluate_expressions("watch")
  File "/Users/buildslave/jenkins/workspace/lldb-cmake-sanitized/llvm-project/lldb/test/API/tools/lldb-vscode/evaluate/TestVSCode_evaluate.py", line 60, in run_test_evaluate_expressions
    self.assertEvaluateFailure("var") # local variable of a_function
  File "/Users/buildslave/jenkins/workspace/lldb-cmake-sanitized/llvm-project/lldb/test/API/tools/lldb-vscode/evaluate/TestVSCode_evaluate.py", line 24, in assertEvaluateFailure
    self.vscode.request_evaluate(expression, context=self.context)['body'])
  File "/Users/buildslave/jenkins/workspace/lldb-cmake-sanitized/llvm-project/lldb/packages/Python/lldbsuite/test/tools/lldb-vscode/vscode.py", line 595, in request_evaluate
    return self.send_recv(command_dict)
  File "/Users/buildslave/jenkins/workspace/lldb-cmake-sanitized/llvm-project/lldb/packages/Python/lldbsuite/test/tools/lldb-vscode/vscode.py", line 309, in send_recv
    raise ValueError(desc)
ValueError: no response for "evaluate"
Config=x86_64-/Users/buildslave/jenkins/workspace/lldb-cmake-sanitized/lldb-build/bin/clang
----------------------------------------------------------------------
Ran 4 tests in 33.344s

RESULT: FAILED (1 passes, 0 failures, 3 errors, 0 skipped, 0 expected failures, 0 unexpected successes)

--

********************
PASS: lldb-api :: functionalities/gdb_remote_client/TestRegDefinitionInParts.py (1219 of 2339)
PASS: lldb-shell :: ObjectFile/ELF/PT_TLS-overlap-PT_LOAD.yaml (1220 of 2339)
PASS: lldb-api :: functionalities/postmortem/minidump-new/TestMiniDumpNew.py (1221 of 2339)
PASS: lldb-api :: lang/cpp/symbols/TestSymbols.py (1222 of 2339)
PASS: lldb-api :: commands/expression/diagnostics/TestExprDiagnostics.py (1223 of 2339)
PASS: lldb-api :: lang/cpp/enum_types/TestCPP11EnumTypes.py (1224 of 2339)
PASS: lldb-unit :: ScriptInterpreter/Python/./ScriptInterpreterPythonTests/PythonDataObjectsTest.TestExceptions (1225 of 2339)
PASS: lldb-api :: tools/lldb-server/TestAppleSimulatorOSType.py (1226 of 2339)
PASS: lldb-api :: functionalities/unwind/noreturn/TestNoreturnUnwind.py (1227 of 2339)
PASS: lldb-api :: commands/platform/sdk/TestPlatformSDK.py (1228 of 2339)
PASS: lldb-unit :: Process/Utility/./ProcessUtilityTests/ProcMapTests/LinuxProcMapsTestFixture.ParseMapRegions/2 (1229 of 2339)
PASS: lldb-shell :: SymbolFile/Breakpad/line-table-discontinuous-file-ids.test (1230 of 2339)
PASS: lldb-api :: functionalities/thread/concurrent_events/TestConcurrentTwoBreakpointsOneDelaySignal.py (1231 of 2339)
PASS: lldb-shell :: Heap/heap-cstr.test (1232 of 2339)
PASS: lldb-api :: tools/lldb-vscode/launch/TestVSCode_launch.py (1233 of 2339)
PASS: lldb-unit :: Utility/./UtilityTests/VMRange.Clear (1234 of 2339)
PASS: lldb-unit :: Utility/./UtilityTests/FileSpecTest.RemoveLastPathComponent (1235 of 2339)
PASS: lldb-unit :: UnwindAssembly/x86/./UnwindAssemblyx86Tests/Testx86AssemblyInspectionEngine.TestPopR14 (1236 of 2339)
PASS: lldb-unit :: Utility/./UtilityTests/CompletionRequest.FakeLastArg (1237 of 2339)
PASS: lldb-api :: lang/cpp/unique-types/TestUniqueTypes.py (1238 of 2339)
PASS: lldb-shell :: Commands/command-backtrace-parser-2.test (1239 of 2339)
PASS: lldb-api :: lang/c/register_variables/TestRegisterVariables.py (1240 of 2339)
PASS: lldb-api :: commands/expression/class_template_specialization_empty_pack/TestClassTemplateSpecializationParametersHandling.py (1241 of 2339)
PASS: lldb-unit :: Utility/./UtilityTests/ScalarTest.LongLongAssigmentOperator (1242 of 2339)
UNSUPPORTED: lldb-shell :: SymbolFile/PDB/calling-conventions.test (1243 of 2339)
PASS: lldb-unit :: UnwindAssembly/x86/./UnwindAssemblyx86Tests/Testx86AssemblyInspectionEngine.TestCALLNextInsn (1244 of 2339)
PASS: lldb-unit :: Utility/./UtilityTests/XcodeSDKTest.FindXcodeContentsDirectoryInPath (1245 of 2339)
PASS: lldb-unit :: Utility/./UtilityTests/RegularExpression.Empty (1246 of 2339)
PASS: lldb-api :: lang/cpp/this/TestCPPThis.py (1247 of 2339)
UNSUPPORTED: lldb-shell :: ObjectFile/ELF/minidebuginfo-no-lzma.yaml (1248 of 2339)
PASS: lldb-unit :: Utility/./UtilityTests/ArgsTest.TestTrailingBackslash (1249 of 2339)
PASS: lldb-api :: tools/lldb-server/TestGdbRemoteAttachWait.py (1250 of 2339)
PASS: lldb-unit :: Utility/./UtilityTests/StringExtractorTest.DecodeHexU8_Underflow2 (1251 of 2339)
PASS: lldb-api :: lang/c/offsetof/TestOffsetof.py (1252 of 2339)
PASS: lldb-api :: lang/objc/foundation/TestObjCMethodsString.py (1253 of 2339)
PASS: lldb-unit :: ObjectFile/MachO/./ObjectFileMachOTests/ObjectFileMachOTest.ModuleFromSharedCacheInfo (1254 of 2339)
PASS: lldb-api :: functionalities/backticks/TestBackticksWithoutATarget.py (1255 of 2339)
PASS: lldb-api :: types/TestDoubleTypesExpr.py (1256 of 2339)
PASS: lldb-api :: functionalities/thread/num_threads/TestNumThreads.py (1257 of 2339)
PASS: lldb-shell :: SymbolFile/DWARF/x86/DW_TAG_basic_type_DW_ATE_UTF_nonC.ll (1258 of 2339)
PASS: lldb-api :: python_api/sbdata/TestSBData.py (1259 of 2339)
PASS: lldb-api :: functionalities/plugins/command_plugin/TestPluginCommands.py (1260 of 2339)
PASS: lldb-unit :: ScriptInterpreter/Python/./ScriptInterpreterPythonTests/PythonDataObjectsTest.TestObjectAttributes (1261 of 2339)
PASS: lldb-unit :: Language/Highlighting/./HighlighterTests/HighlighterTest.ClangCommas (1262 of 2339)
UNSUPPORTED: lldb-api :: macosx/simulator/TestSimulatorPlatform.py (1263 of 2339)
PASS: lldb-unit :: Utility/./UtilityTests/StreamTest.PutSLEB128 (1264 of 2339)
PASS: lldb-unit :: Process/minidump/./LLDBMinidumpTests/MinidumpParserTest.FindMemoryRange (1265 of 2339)
UNSUPPORTED: lldb-api :: benchmarks/libcxxlist/TestBenchmarkLibcxxList.py (1266 of 2339)
PASS: lldb-api :: lang/objc/foundation/TestSymbolTable.py (1267 of 2339)
PASS: lldb-unit :: Target/./TargetTests/ExecutionContextTest.GetByteOrder (1268 of 2339)
PASS: lldb-unit :: Utility/./UtilityTests/StringExtractorTest.DecodeHexU8_Extra (1269 of 2339)
PASS: lldb-unit :: UnwindAssembly/x86/./UnwindAssemblyx86Tests/Testx86AssemblyInspectionEngine.TestPushESI (1270 of 2339)
PASS: lldb-api :: functionalities/postmortem/elf-core/gcore/TestGCore.py (1271 of 2339)
UNSUPPORTED: lldb-api :: functionalities/breakpoint/breakpoint_callback_command_source/TestBreakpointCallbackCommandSource.py (1272 of 2339)
PASS: lldb-unit :: Utility/./UtilityTests/StringLexerTest.HasAtLeast (1273 of 2339)
PASS: lldb-api :: functionalities/jitloader_gdb/TestJITLoaderGDB.py (1274 of 2339)
UNSUPPORTED: lldb-shell :: Register/aarch64-gp-read.test (1275 of 2339)
PASS: lldb-unit :: ScriptInterpreter/Python/./ScriptInterpreterPythonTests/PythonDataObjectsTest.TestResetting (1276 of 2339)
PASS: lldb-api :: functionalities/breakpoint/comp_dir_symlink/TestCompDirSymLink.py (1277 of 2339)
PASS: lldb-api :: macosx/find-dsym/deep-bundle/TestDeepBundle.py (1278 of 2339)
PASS: lldb-unit :: Utility/./UtilityTests/StatusTest.ErrorConstructor (1279 of 2339)
PASS: lldb-unit :: Expression/./ExpressionTests/CppModuleConfigurationTest.Xcode (1280 of 2339)
PASS: lldb-unit :: Utility/./UtilityTests/FileSpecTest.FormatFileSpec (1281 of 2339)
PASS: lldb-shell :: Register/x86-multithread-read.test (1282 of 2339)
PASS: lldb-api :: functionalities/data-formatter/data-formatter-stl/libcxx/multimap/TestDataFormatterLibccMultiMap.py (1283 of 2339)
PASS: lldb-api :: lang/objc/unicode-string/TestUnicodeString.py (1284 of 2339)
PASS: lldb-unit :: Utility/./UtilityTests/ArgsTest.TestArgv (1285 of 2339)
PASS: lldb-unit :: Utility/./UtilityTests/ConstStringTest.CompareConstString (1286 of 2339)
PASS: lldb-api :: functionalities/thread/concurrent_events/TestConcurrentCrashWithWatchpoint.py (1287 of 2339)
PASS: lldb-api :: lang/cpp/elaborated-types/TestElaboratedTypes.py (1288 of 2339)
PASS: lldb-api :: commands/platform/file/read/TestPlatformFileRead.py (1289 of 2339)
PASS: lldb-unit :: Symbol/./SymbolTests/LineEntryTest.GetSameLineContiguousAddressRangeOneInline (1290 of 2339)
PASS: lldb-unit :: ObjectFile/Breakpad/./ObjectFileBreakpadTests/ModuleRecord.parse (1291 of 2339)
PASS: lldb-unit :: UnwindAssembly/x86/./UnwindAssemblyx86Tests/Testx86AssemblyInspectionEngine.TestSimplei386ugmented (1292 of 2339)
PASS: lldb-unit :: Expression/./ExpressionTests/DiagnosticManagerTest.AppendMessageNoDiag (1293 of 2339)
PASS: lldb-api :: functionalities/tail_call_frames/disambiguate_paths_to_common_sink/TestDisambiguatePathsToCommonSink.py (1294 of 2339)
PASS: lldb-unit :: Utility/./UtilityTests/FileSpecTest.PrependPathComponent (1295 of 2339)
PASS: lldb-unit :: Utility/./UtilityTests/BinaryStreamTest.PutULEB128One (1296 of 2339)
UNSUPPORTED: lldb-api :: benchmarks/startup/TestStartupDelays.py (1297 of 2339)
PASS: lldb-unit :: Utility/./UtilityTests/ArgsTest.ReplaceArgumentAtIndexEqual (1298 of 2339)
PASS: lldb-api :: commands/expression/radar_9673664/TestExprHelpExamples.py (1299 of 2339)
PASS: lldb-shell :: SymbolFile/DWARF/x86/debug_loc.s (1300 of 2339)
PASS: lldb-api :: python_api/class_members/TestSBTypeClassMembers.py (1301 of 2339)
PASS: lldb-api :: functionalities/unwind/zeroth_frame/TestZerothFrame.py (1302 of 2339)
PASS: lldb-unit :: Symbol/./SymbolTests/TestClangASTImporter.DeportTypeTagDecl (1303 of 2339)
PASS: lldb-shell :: SymbolFile/DWARF/x86/module-ownership.mm (1304 of 2339)
PASS: lldb-api :: tools/lldb-vscode/module/TestVSCode_module.py (1305 of 2339)
PASS: lldb-unit :: Host/./HostTests/NativeProcessProtocolTest.ReadMemoryWithoutTrap (1306 of 2339)
PASS: lldb-unit :: Utility/./UtilityTests/FileSpecTest.EqualDotsPosixRoot (1307 of 2339)
PASS: lldb-unit :: Utility/./UtilityTests/RangeDataVector.CustomSort (1308 of 2339)
PASS: lldb-unit :: Utility/./UtilityTests/StringExtractorTest.GetNameColonValueSuccess (1309 of 2339)
PASS: lldb-api :: commands/expression/rdar44436068/Test128BitsInteger.py (1310 of 2339)
PASS: lldb-api :: lang/objc/objc-new-syntax/TestObjCNewSyntaxDictionary.py (1311 of 2339)
PASS: lldb-api :: lang/objc/hidden-ivars/TestHiddenIvars.py (1312 of 2339)
PASS: lldb-api :: tools/lldb-server/TestGdbRemoteProcessInfo.py (1313 of 2339)
PASS: lldb-api :: functionalities/data-formatter/typedef_array/TestTypedefArray.py (1314 of 2339)
UNSUPPORTED: lldb-api :: commands/watchpoints/hello_watchlocation/TestWatchLocation.py (1315 of 2339)
PASS: lldb-api :: functionalities/thread/concurrent_events/TestConcurrentTwoBreakpointThreads.py (1316 of 2339)
PASS: lldb-unit :: SymbolFile/DWARF/./SymbolFileDWARFTests/SymbolFileDWARFTests.TestAbbrevOutOfOrder (1317 of 2339)
PASS: lldb-api :: functionalities/data-formatter/data-formatter-stl/libcxx/deque/TestDataFormatterLibcxxDeque.py (1318 of 2339)
PASS: lldb-unit :: Utility/./UtilityTests/UserIDResolver.GetUserName (1319 of 2339)
PASS: lldb-unit :: Symbol/./SymbolTests/TestCreateClassTemplateDecl.FindExistingTemplates (1320 of 2339)
UNSUPPORTED: lldb-api :: functionalities/gdb_remote_client/TestAArch64XMLRegOffsets.py (1321 of 2339)
PASS: lldb-unit :: Utility/./UtilityTests/UriParserTest.BadPort2 (1322 of 2339)
PASS: lldb-api :: functionalities/gdb_remote_client/TestPartialGPacket.py (1323 of 2339)
PASS: lldb-unit :: Expression/./ExpressionTests/DiagnosticManagerTest.GetStringSeverityLabels (1324 of 2339)
PASS: lldb-unit :: Language/Highlighting/./HighlighterTests/HighlighterTest.ClangComments (1325 of 2339)
PASS: lldb-api :: functionalities/breakpoint/breakpoint_by_file_colon_line/TestBreakpointByFileColonLine.py (1326 of 2339)
PASS: lldb-api :: commands/process/attach/attach_denied/TestAttachDenied.py (1327 of 2339)
PASS: lldb-shell :: BuildScript/toolchain-clang.test (1328 of 2339)
PASS: lldb-api :: lang/objc/foundation/TestObjectDescriptionAPI.py (1329 of 2339)
PASS: lldb-unit :: Utility/./UtilityTests/UUIDTest.StringConverion (1330 of 2339)
PASS: lldb-shell :: ObjectFile/wasm/basic.yaml (1331 of 2339)
PASS: lldb-unit :: Utility/./UtilityTests/UriParserTest.PortOverflow (1332 of 2339)
PASS: lldb-unit :: Target/./TargetTests/StackFrameRecognizerTest.NullModuleRegex (1333 of 2339)
PASS: lldb-api :: lang/cpp/static_methods/TestCPPStaticMethods.py (1334 of 2339)
UNSUPPORTED: lldb-shell :: Register/aarch64-fp-read.test (1335 of 2339)
PASS: lldb-api :: functionalities/data-formatter/data-formatter-stl/libcxx/map/TestDataFormatterLibccMap.py (1336 of 2339)
PASS: lldb-shell :: BuildScript/compiler-full-path.test (1337 of 2339)
PASS: lldb-api :: lang/c/complex_int/TestComplexInt.py (1338 of 2339)
XFAIL: lldb-shell :: Register/x86-64-ymm-write.test (1339 of 2339)
PASS: lldb-shell :: Reproducer/TestSynchronous.test (1340 of 2339)
PASS: lldb-api :: commands/version/TestVersion.py (1341 of 2339)
PASS: lldb-unit :: DataFormatter/./LLDBFormatterTests/TypeMatcherTests.GetMatchStringRegex (1342 of 2339)
PASS: lldb-unit :: Utility/./UtilityTests/ArgsTest.DoubleQuotedItem (1343 of 2339)
PASS: lldb-shell :: SymbolFile/DWARF/x86/DW_AT_data_bit_offset-DW_OP_stack_value.s (1344 of 2339)
PASS: lldb-unit :: Utility/./UtilityTests/DataExtractorTest.GetCStrUnterminated (1345 of 2339)
PASS: lldb-api :: functionalities/var_path/TestVarPath.py (1346 of 2339)
PASS: lldb-unit :: Process/minidump/./LLDBMinidumpTests/MinidumpParserTest.GetLinuxProcStatus (1347 of 2339)
UNSUPPORTED: lldb-api :: commands/watchpoints/variable_out_of_scope/TestWatchedVarHitWhenInScope.py (1348 of 2339)
PASS: lldb-unit :: Process/Utility/./ProcessUtilityTests/ProcMapTests/LinuxProcMapsTestFixture.ParseMapRegions/6 (1349 of 2339)
UNSUPPORTED: lldb-api :: functionalities/breakpoint/hardware_breakpoints/hardware_breakpoint_on_multiple_threads/TestHWBreakMultiThread.py (1350 of 2339)
PASS: lldb-unit :: Utility/./UtilityTests/PassiveReplayTest.InstrumentedBarPtr (1351 of 2339)
PASS: lldb-unit :: Utility/./UtilityTests/BinaryStreamTest.PutULEB128Zero (1352 of 2339)
PASS: lldb-shell :: Reproducer/TestPythonImport.test (1353 of 2339)
PASS: lldb-unit :: Process/gdb-remote/./ProcessGdbRemoteTests/GDBRemoteClientBaseTest.SendContinueAndAsyncSignal (1354 of 2339)
PASS: lldb-unit :: Utility/./UtilityTests/StringListTest.CopyListSingle (1355 of 2339)
PASS: lldb-unit :: Utility/./UtilityTests/StringExtractorTest.GetNameColonValueNoColon (1356 of 2339)
PASS: lldb-unit :: Utility/./UtilityTests/StringListTest.SetSize (1357 of 2339)
PASS: lldb-unit :: Utility/./UtilityTests/StringExtractorTest.GetNameColonValueNoSemicolon (1358 of 2339)
PASS: lldb-unit :: Symbol/./SymbolTests/PostfixExpression.ParseOneExpression (1359 of 2339)
PASS: lldb-api :: commands/target/basic/TestTargetCommand.py (1360 of 2339)
PASS: lldb-unit :: Host/./HostTests/SocketTests/SocketTest.TCPListen0ConnectAccept/ipv4 (1361 of 2339)
PASS: lldb-unit :: Process/gdb-remote/./ProcessGdbRemoteTests/GDBRemoteCommunicationClientTest.SendTraceSupportedPacket (1362 of 2339)
PASS: lldb-api :: commands/command/script_alias/TestCommandScriptAlias.py (1363 of 2339)
PASS: lldb-api :: commands/expression/context-object-objc/TestContextObjectObjc.py (1364 of 2339)
PASS: lldb-api :: lang/c/struct_types/TestStructTypes.py (1365 of 2339)
PASS: lldb-unit :: Utility/./UtilityTests/ArgsTest.ReplaceArgumentAtIndexShort (1366 of 2339)
PASS: lldb-unit :: Process/gdb-remote/./ProcessGdbRemoteTests/GDBRemoteCommunicationClientTest.ReadRegister (1367 of 2339)
PASS: lldb-unit :: Host/./HostTests/FileSystemTest.GetPermissions (1368 of 2339)
UNSUPPORTED: lldb-api :: commands/register/register/intel_xtended_registers/TestMPXRegisters.py (1369 of 2339)
PASS: lldb-api :: functionalities/data-formatter/data-formatter-objc/TestDataFormatterObjCKVO.py (1370 of 2339)
PASS: lldb-unit :: Utility/./UtilityTests/StreamTeeTest.AppendStream (1371 of 2339)
PASS: lldb-shell :: Minidump/no-process-id.yaml (1372 of 2339)
PASS: lldb-api :: functionalities/data-formatter/data-formatter-stl/libcxx/variant/TestDataFormatterLibcxxVariant.py (1373 of 2339)
PASS: lldb-api :: lang/cpp/rvalue-references/TestRvalueReferences.py (1374 of 2339)
PASS: lldb-api :: commands/command/script/TestCommandScript.py (1375 of 2339)
PASS: lldb-api :: functionalities/data-formatter/data-formatter-objc/TestDataFormatterObjCNSURL.py (1376 of 2339)
PASS: lldb-unit :: UnwindAssembly/x86/./UnwindAssemblyx86Tests/Testx86AssemblyInspectionEngine.TestPopRBX (1377 of 2339)
PASS: lldb-api :: commands/process/signal/TestProcessSignal.py (1378 of 2339)
PASS: lldb-unit :: Process/minidump/./LLDBMinidumpTests/MinidumpParserTest.GetMemoryRegionInfoLinuxMaps (1379 of 2339)
PASS: lldb-api :: lang/cpp/class-template-type-parameter-pack/TestClassTemplateTypeParameterPack.py (1380 of 2339)
PASS: lldb-unit :: Utility/./UtilityTests/StringExtractorTest.GetHexBytes (1381 of 2339)
PASS: lldb-unit :: Process/Utility/./ProcessUtilityTests/ProcSMapTests/LinuxProcSMapsTestFixture.ParseSMapRegions/6 (1382 of 2339)
PASS: lldb-api :: lang/cpp/static_members/TestCPPStaticMembers.py (1383 of 2339)
PASS: lldb-unit :: Utility/./UtilityTests/CompletionRequest.DuplicateFiltering (1384 of 2339)
PASS: lldb-api :: lang/cpp/virtual-overload/TestVirtualOverload.py (1385 of 2339)
PASS: lldb-shell :: Quit/TestQuitExitCodeHex0.test (1386 of 2339)
PASS: lldb-shell :: Reproducer/TestProcessList.test (1387 of 2339)
PASS: lldb-api :: commands/frame/diagnose/dereference-this/TestDiagnoseDereferenceThis.py (1388 of 2339)
PASS: lldb-shell :: Watchpoint/SetErrorCases.test (1389 of 2339)
PASS: lldb-unit :: Language/Highlighting/./HighlighterTests/HighlighterTest.ClangBraces (1390 of 2339)
PASS: lldb-unit :: Process/gdb-remote/./ProcessGdbRemoteTests/GDBRemoteCommunicationClientTest.GetModulesInfoInvalidResponse (1391 of 2339)
PASS: lldb-api :: commands/target/select/TestTargetSelect.py (1392 of 2339)
UNSUPPORTED: lldb-api :: linux/add-symbols/TestTargetSymbolsAddCommand.py (1393 of 2339)
PASS: lldb-shell :: Unwind/trap_frame_sym_ctx.test (1394 of 2339)
PASS: lldb-shell :: Driver/TestPositionalArgs.test (1395 of 2339)
PASS: lldb-api :: macosx/duplicate-archive-members/TestDuplicateMembers.py (1396 of 2339)
PASS: lldb-unit :: Host/./HostTests/SocketTests/SocketTest.TCPListen0ConnectAccept/ipv6 (1397 of 2339)
PASS: lldb-unit :: Utility/./UtilityTests/OptionsWithRawTest.EmptySuffixSingleWhitespace (1398 of 2339)
PASS: lldb-unit :: Core/./LLDBCoreTests/SourceLocationSpecTest.Equal (1399 of 2339)
PASS: lldb-unit :: Utility/./UtilityTests/UUIDTest.RelationalOperators (1400 of 2339)
PASS: lldb-api :: functionalities/data-formatter/data-formatter-stl/libcxx/unordered/TestDataFormatterUnordered.py (1401 of 2339)
PASS: lldb-api :: functionalities/data-formatter/stringprinter/TestStringPrinter.py (1402 of 2339)
PASS: lldb-shell :: Reproducer/TestFinalize.test (1403 of 2339)
PASS: lldb-unit :: Expression/./ExpressionTests/CppModuleConfigurationTest.Sysroot (1404 of 2339)
PASS: lldb-api :: lang/c/stepping/TestThreadStepInAvoidRegexp.py (1405 of 2339)
PASS: lldb-unit :: UnwindAssembly/x86/./UnwindAssemblyx86Tests/Testx86AssemblyInspectionEngine.TestPopRBPWithREX (1406 of 2339)
UNSUPPORTED: lldb-api :: commands/trace/multiple-threads/TestTraceStartStopMultipleThreads.py (1407 of 2339)
PASS: lldb-api :: commands/expression/calculator_mode/TestCalculatorMode.py (1408 of 2339)
PASS: lldb-unit :: Host/./HostTests/File.GetStreamFromDescriptor (1409 of 2339)
PASS: lldb-api :: functionalities/data-formatter/data-formatter-stl/libcxx/atomic/TestLibCxxAtomic.py (1410 of 2339)
UNSUPPORTED: lldb-api :: tools/lldb-server/TestGdbRemoteModuleInfo.py (1411 of 2339)
PASS: lldb-unit :: Process/gdb-remote/./ProcessGdbRemoteTests/GDBRemoteCommunicationClientTest.WriteRegister (1412 of 2339)
PASS: lldb-api :: commands/reproducer/invalid-args/TestInvalidArgsReproducer.py (1413 of 2339)
PASS: lldb-unit :: Host/./HostTests/ProcessLaunchInfoTest.Constructor (1414 of 2339)
PASS: lldb-unit :: Utility/./UtilityTests/LogChannelTest.Disable (1415 of 2339)
PASS: lldb-api :: lang/cpp/class-template-non-type-parameter-pack/TestClassTemplateNonTypeParameterPack.py (1416 of 2339)
PASS: lldb-api :: macosx/universal/TestUniversal.py (1417 of 2339)
PASS: lldb-api :: commands/expression/ignore-artificial-constructors/TestIgnoreArtificialConstructors.py (1418 of 2339)
PASS: lldb-unit :: Utility/./UtilityTests/Predicate.WaitForValueNotEqualTo (1419 of 2339)
PASS: lldb-unit :: Utility/./UtilityTests/ArchSpecTest.TestParseMachCPUDashSubtypeTripleSimple (1420 of 2339)
PASS: lldb-shell :: Register/Core/x86-64-netbsd-fp.test (1421 of 2339)
PASS: lldb-api :: lang/cpp/this_class_type_mixing/TestThisClassTypeMixing.py (1422 of 2339)
PASS: lldb-unit :: Utility/./UtilityTests/StringListTest.Assignment (1423 of 2339)
PASS: lldb-unit :: ScriptInterpreter/Python/./ScriptInterpreterPythonTests/PythonDataObjectsTest.TestPythonStringToStr (1424 of 2339)
PASS: lldb-api :: functionalities/thread/concurrent_events/TestConcurrentTwoBreakpointsOneWatchpoint.py (1425 of 2339)
PASS: lldb-unit :: UnwindAssembly/x86/./UnwindAssemblyx86Tests/Testx86AssemblyInspectionEngine.TestPushECX (1426 of 2339)
PASS: lldb-unit :: Process/gdb-remote/./ProcessGdbRemoteTests/GDBRemoteCommunicationClientTest.GetMemoryRegionInfoInvalidResponse (1427 of 2339)
PASS: lldb-api :: lang/cpp/namespace_definitions/TestNamespaceDefinitions.py (1428 of 2339)
PASS: lldb-api :: functionalities/data-formatter/data-formatter-stl/libcxx/list/loop/TestDataFormatterLibcxxListLoop.py (1429 of 2339)
PASS: lldb-api :: functionalities/data-formatter/setvaluefromcstring/TestSetValueFromCString.py (1430 of 2339)
PASS: lldb-unit :: Process/minidump/./LLDBMinidumpTests/MinidumpParserTest.MinidumpDuplicateModuleMappedSecondHigh (1431 of 2339)
PASS: lldb-unit :: UnwindAssembly/x86/./UnwindAssemblyx86Tests/Testx86AssemblyInspectionEngine.TestPushR12 (1432 of 2339)
PASS: lldb-api :: source-manager/TestSourceManager.py (1433 of 2339)
PASS: lldb-unit :: Utility/./UtilityTests/SerializationRountripTest.SerializeDeserializePodPointers (1434 of 2339)
PASS: lldb-unit :: Utility/./UtilityTests/OptionsWithRawTest.UnterminatedQuote (1435 of 2339)
PASS: lldb-unit :: Utility/./UtilityTests/UriParserTest.SchemeHostSeparator2 (1436 of 2339)
PASS: lldb-api :: types/TestFloatTypes.py (1437 of 2339)
PASS: lldb-api :: lang/c/anonymous/TestAnonymous.py (1438 of 2339)
PASS: lldb-unit :: Utility/./UtilityTests/StreamTest.PutStringAsRawHex8 (1439 of 2339)
PASS: lldb-api :: functionalities/unwind/sigtramp/TestSigtrampUnwind.py (1440 of 2339)
PASS: lldb-unit :: Core/./LLDBCoreTests/SourceLocationSpecTest.Compare (1441 of 2339)
PASS: lldb-api :: functionalities/breakpoint/consecutive_breakpoints/TestConsecutiveBreakpoints.py (1442 of 2339)
PASS: lldb-unit :: Utility/./UtilityTests/VMRange.ContainsAddr (1443 of 2339)
PASS: lldb-shell :: SymbolFile/DWARF/x86/find-function-regex.cpp (1444 of 2339)
PASS: lldb-api :: lang/objc/objc-static-method/TestObjCStaticMethod.py (1445 of 2339)
PASS: lldb-unit :: Process/gdb-remote/./ProcessGdbRemoteTests/GDBRemoteClientBaseTest.SendContinueAndLateInterrupt (1446 of 2339)
PASS: lldb-api :: functionalities/value_md5_crash/TestValueMD5Crash.py (1447 of 2339)
PASS: lldb-api :: tools/lldb-vscode/attach/TestVSCode_attach.py (1448 of 2339)
PASS: lldb-unit :: Utility/./UtilityTests/StringExtractorTest.GetHexBytes_Partial (1449 of 2339)
PASS: lldb-api :: commands/expression/formatters/TestFormatters.py (1450 of 2339)
PASS: lldb-api :: commands/apropos/basic/TestApropos.py (1451 of 2339)
PASS: lldb-api :: python_api/signals/TestSignalsAPI.py (1452 of 2339)
PASS: lldb-unit :: Process/gdb-remote/./ProcessGdbRemoteTests/GDBRemoteCommunicationServerTest.SendErrorResponse_ErrorList (1453 of 2339)
PASS: lldb-shell :: SymbolFile/NativePDB/globals-fundamental.cpp (1454 of 2339)
PASS: lldb-api :: lang/cpp/diamond/TestDiamond.py (1455 of 2339)
PASS: lldb-unit :: Symbol/./SymbolTests/TestTypeSystemClang.TestNotDeletingUserCopyCstrDueToMoveCStr (1456 of 2339)
PASS: lldb-unit :: ScriptInterpreter/Python/./ScriptInterpreterPythonTests/PythonDataObjectsTest.TestPythonTupleInitializerList (1457 of 2339)
PASS: lldb-api :: lang/c/function_types/TestFunctionTypes.py (1458 of 2339)
PASS: lldb-unit :: UnwindAssembly/x86/./UnwindAssemblyx86Tests/Testx86AssemblyInspectionEngine.TestPopRBP (1459 of 2339)
PASS: lldb-unit :: Utility/./UtilityTests/BinaryStreamTest.PutULEB128MaxValue (1460 of 2339)
PASS: lldb-shell :: SymbolFile/DWARF/x86/dwp.s (1461 of 2339)
PASS: lldb-api :: python_api/lldbutil/iter/TestLLDBIterator.py (1462 of 2339)
PASS: lldb-unit :: Process/gdb-remote/./ProcessGdbRemoteTests/GDBRemoteClientBaseTest.SendContinueAndInterrupt (1463 of 2339)
PASS: lldb-shell :: SymbolFile/Breakpad/unwind-via-raSearch.test (1464 of 2339)
PASS: lldb-shell :: Breakpoint/breakpoint-command.test (1465 of 2339)
UNSUPPORTED: lldb-shell :: BuildScript/toolchain-msvc.test (1466 of 2339)
PASS: lldb-shell :: Quit/TestQuitExitCodeTooManyArgs.test (1467 of 2339)
PASS: lldb-api :: lang/objcxx/objcxx-ivar-vector/TestIvarVector.py (1468 of 2339)
PASS: lldb-api :: tools/lldb-server/TestGdbRemoteExpeditedRegisters.py (1469 of 2339)
PASS: lldb-unit :: debugserver/./debugserverTests/RNBSocket.LoopBackListenIPv6 (1470 of 2339)
PASS: lldb-unit :: Process/minidump/./LLDBMinidumpTests/MinidumpParserTest.FindMemoryRangeWithFullMemoryMinidump (1471 of 2339)
PASS: lldb-api :: lang/objc/foundation/TestObjCMethodsNSArray.py (1472 of 2339)
PASS: lldb-api :: lang/objc/foundation/TestRuntimeTypes.py (1473 of 2339)
PASS: lldb-api :: lang/cpp/accelerator-table/TestCPPAccelerator.py (1474 of 2339)
PASS: lldb-api :: commands/expression/import-std-module/forward_decl_from_module/TestForwardDeclFromStdModule.py (1475 of 2339)
PASS: lldb-api :: lang/objc/modules-cache/TestClangModulesCache.py (1476 of 2339)
PASS: lldb-unit :: Utility/./UtilityTests/ScalarTest.GetBytes (1477 of 2339)
PASS: lldb-unit :: DataFormatter/./LLDBFormatterTests/StringPrinterTests.SwiftUTF8 (1478 of 2339)
PASS: lldb-unit :: Host/./HostTests/PipeTest.CreateWithUniqueName (1479 of 2339)
PASS: lldb-shell :: ObjectFile/ELF/minidebuginfo-find-symbols.yaml (1480 of 2339)
UNSUPPORTED: lldb-api :: benchmarks/stepping/TestSteppingSpeed.py (1481 of 2339)
PASS: lldb-shell :: ObjectFile/ELF/PT_LOAD-overlap-PT_INTERP.yaml (1482 of 2339)
PASS: lldb-unit :: Utility/./UtilityTests/ProcessInstanceInfo.Yaml (1483 of 2339)
PASS: lldb-unit :: API/./APITests/SBCommandInterpreterTest.SingleWordCommand (1484 of 2339)
PASS: lldb-api :: functionalities/lazy-loading/TestLazyLoading.py (1485 of 2339)
PASS: lldb-api :: functionalities/dead-strip/TestDeadStrip.py (1486 of 2339)
PASS: lldb-unit :: Host/./HostTests/ConnectionFileDescriptorTest.TCPGetURIv6 (1487 of 2339)
PASS: lldb-api :: commands/expression/import-std-module/retry-with-std-module/TestRetryWithStdModule.py (1488 of 2339)
UNSUPPORTED: lldb-api :: functionalities/unwind/standard/TestStandardUnwind.py (1489 of 2339)
PASS: lldb-api :: functionalities/thread/concurrent_events/TestConcurrentDelayedCrashWithBreakpointSignal.py (1490 of 2339)
PASS: lldb-api :: lang/cpp/call-function/TestCallCPPFunction.py (1491 of 2339)
UNSUPPORTED: lldb-shell :: ScriptInterpreter/Lua/watchpoint_callback.test (1492 of 2339)
PASS: lldb-api :: functionalities/data-formatter/data-formatter-stl/libcxx/vector/TestDataFormatterLibcxxVector.py (1493 of 2339)
PASS: lldb-unit :: ObjectFile/ELF/./ObjectFileELFTests/ObjectFileELFTest.GetSymtab_NoSymEntryPointArmThumbAddressClass (1494 of 2339)
PASS: lldb-api :: functionalities/dlopen_other_executable/TestDlopenOtherExecutable.py (1495 of 2339)
PASS: lldb-api :: sanity/TestModuleCacheSanity.py (1496 of 2339)
PASS: lldb-api :: commands/expression/completion-in-lambda-and-unnamed-class/TestCompletionInLambdaAndUnnamedClass.py (1497 of 2339)
PASS: lldb-unit :: Utility/./UtilityTests/OptionsWithRawTest.WhitespaceSuffix (1498 of 2339)
PASS: lldb-api :: functionalities/stop-on-sharedlibrary-load/TestStopOnSharedlibraryEvents.py (1499 of 2339)
PASS: lldb-unit :: Utility/./UtilityTests/TimerTest.CategoryTimesStats (1500 of 2339)
PASS: lldb-api :: functionalities/testid/TestTestId.py (1501 of 2339)
PASS: lldb-shell :: ObjectFile/ELF/gnu-debuglink.yaml (1502 of 2339)
PASS: lldb-api :: api/command-return-object/TestSBCommandReturnObject.py (1503 of 2339)
PASS: lldb-unit :: Symbol/./SymbolTests/SymbolsTest.TerminateLocateExecutableSymbolFileForUnknownExecutableAndUnknownSymbolFile (1504 of 2339)
PASS: lldb-unit :: ScriptInterpreter/Python/./ScriptInterpreterPythonTests/PythonDataObjectsTest.TestPythonDictionaryToStructuredDictionary (1505 of 2339)
PASS: lldb-unit :: Utility/./UtilityTests/StreamTest.ChangingByteOrder (1506 of 2339)
PASS: lldb-unit :: Symbol/./SymbolTests/PostfixExpression.ToDWARF (1507 of 2339)
PASS: lldb-unit :: Utility/./UtilityTests/FileSpecTest.OperatorBool (1508 of 2339)
PASS: lldb-shell :: ObjectFile/MachO/lc_version_min.yaml (1509 of 2339)
PASS: lldb-shell :: ObjectFile/ELF/section-types-edgecases.yaml (1510 of 2339)
PASS: lldb-unit :: Utility/./UtilityTests/ProcessInstanceInfo.Dump (1511 of 2339)
PASS: lldb-api :: lang/objc/orderedset/TestOrderedSet.py (1512 of 2339)
PASS: lldb-unit :: Utility/./UtilityTests/BinaryStreamTest.PutULEB128TwoBytes (1513 of 2339)
PASS: lldb-api :: tools/lldb-server/commandline/TestGdbRemoteConnection.py (1514 of 2339)
PASS: lldb-api :: lang/objc/objc-ivar-stripped/TestObjCIvarStripped.py (1515 of 2339)
PASS: lldb-shell :: ObjectFile/PECOFF/section-types.yaml (1516 of 2339)
PASS: lldb-unit :: DataFormatter/./LLDBFormatterTests/TypeMatcherTests.ExactName (1517 of 2339)
PASS: lldb-unit :: UnwindAssembly/x86/./UnwindAssemblyx86Tests/Testx86AssemblyInspectionEngine.TestSimple64bitFrameFunction (1518 of 2339)
PASS: lldb-unit :: Expression/./ExpressionTests/ClangExpressionDeclMapTest.TestPersistentDeclLookup (1519 of 2339)
PASS: lldb-unit :: Utility/./UtilityTests/StringListTest.CopyList (1520 of 2339)
PASS: lldb-unit :: Process/minidump/./LLDBMinidumpTests/MinidumpParserTest.GetThreadContext_x86_32_wow64 (1521 of 2339)
PASS: lldb-api :: commands/expression/fixits/TestFixIts.py (1522 of 2339)
PASS: lldb-api :: commands/expression/call-throws/TestCallThatThrows.py (1523 of 2339)
PASS: lldb-api :: lang/objc/foundation/TestObjCMethodsNSError.py (1524 of 2339)
PASS: lldb-api :: functionalities/optimized_code/TestNoASanExceptionAfterEvalOP_piece.py (1525 of 2339)
PASS: lldb-unit :: Utility/./UtilityTests/FileSpecTest.GetPath (1526 of 2339)
PASS: lldb-shell :: Driver/TestError.test (1527 of 2339)
PASS: lldb-api :: functionalities/data-formatter/nsarraysynth/TestNSArraySynthetic.py (1528 of 2339)
PASS: lldb-api :: macosx/save_crashlog/TestSaveCrashlog.py (1529 of 2339)
PASS: lldb-unit :: Utility/./UtilityTests/StringExtractorTest.GetHexU8_Extra (1530 of 2339)
PASS: lldb-unit :: DataFormatter/./LLDBFormatterTests/StringPrinterTests.CxxASCII (1531 of 2339)
PASS: lldb-unit :: ObjectFile/Breakpad/./ObjectFileBreakpadTests/PublicRecord.parse (1532 of 2339)
PASS: lldb-unit :: Utility/./UtilityTests/DataExtractorTest.GetFloat (1533 of 2339)
PASS: lldb-unit :: Symbol/./SymbolTests/Type.GetTypeScopeAndBasename (1534 of 2339)
PASS: lldb-api :: functionalities/inferior-crashing/TestInferiorCrashingStep.py (1535 of 2339)
PASS: lldb-unit :: SymbolFile/DWARF/./SymbolFileDWARFTests/SymbolFileDWARFTests.TestAbbrevInvalidNULLTag (1536 of 2339)
PASS: lldb-unit :: Expression/./ExpressionTests/DiagnosticManagerTest.HasFixits (1537 of 2339)
PASS: lldb-unit :: Utility/./UtilityTests/UriParserTest.MinimalPath (1538 of 2339)
PASS: lldb-api :: functionalities/breakpoint/debugbreak/TestDebugBreak.py (1539 of 2339)
UNSUPPORTED: lldb-shell :: SymbolFile/target-symbols-add-unwind.test (1540 of 2339)
PASS: lldb-unit :: Symbol/./SymbolTests/DWARFCallFrameInfoTest.Basic_eh (1541 of 2339)
UNSUPPORTED: lldb-api :: functionalities/darwin_log/source/debug/TestDarwinLogSourceDebug.py (1542 of 2339)
PASS: lldb-api :: functionalities/gdb_remote_client/TestProcessConnect.py (1543 of 2339)
PASS: lldb-unit :: Utility/./UtilityTests/StatusTest.ErrorConversion (1544 of 2339)
UNSUPPORTED: lldb-shell :: Unwind/basic-block-sections.test (1545 of 2339)
PASS: lldb-shell :: Driver/TestUseColor.test (1546 of 2339)
PASS: lldb-api :: types/TestShortTypeExpr.py (1547 of 2339)
PASS: lldb-unit :: Symbol/./SymbolTests/TestTypeSystemClang.TestRecordHasFields (1548 of 2339)
PASS: lldb-shell :: ObjectFile/ELF/avr-basic-info.yaml (1549 of 2339)
PASS: lldb-api :: functionalities/data-formatter/data-formatter-smart-array/TestDataFormatterSmartArray.py (1550 of 2339)
PASS: lldb-shell :: Reproducer/TestWorkingDir.test (1551 of 2339)
PASS: lldb-api :: macosx/safe-to-func-call/TestSafeFuncCalls.py (1552 of 2339)
PASS: lldb-api :: functionalities/thread/concurrent_events/TestConcurrentCrashWithSignal.py (1553 of 2339)
PASS: lldb-api :: lang/cpp/limit-debug-info/TestWithLimitDebugInfo.py (1554 of 2339)
PASS: lldb-unit :: Utility/./UtilityTests/StreamTest.PutHex16ByteOrderBig (1555 of 2339)
PASS: lldb-unit :: Utility/./UtilityTests/ReproducerTest.SetCapture (1556 of 2339)
XFAIL: lldb-shell :: Register/x86-fp-write.test (1557 of 2339)
PASS: lldb-unit :: Symbol/./SymbolTests/TestClangASTImporter.DeportDeclTagDecl (1558 of 2339)
UNSUPPORTED: lldb-api :: tools/lldb-vscode/completions/TestVSCode_completions.py (1559 of 2339)
UNSUPPORTED: lldb-shell :: ScriptInterpreter/Lua/convenience_variables.test (1560 of 2339)
PASS: lldb-api :: lang/c/global_variables/TestGlobalVariables.py (1561 of 2339)
PASS: lldb-unit :: Utility/./UtilityTests/StringExtractorGDBRemoteTest.GetPidTidMultipleValues (1562 of 2339)
PASS: lldb-api :: functionalities/postmortem/elf-core/thread_crash/TestLinuxCoreThreads.py (1563 of 2339)
PASS: lldb-unit :: Utility/./UtilityTests/ArgsTest.TestOverwriteArgs (1564 of 2339)
PASS: lldb-api :: tools/lldb-vscode/step/TestVSCode_step.py (1565 of 2339)
PASS: lldb-unit :: Host/./HostTests/SocketTests/SocketTest.UDPGetConnectURI/ipv4 (1566 of 2339)
UNSUPPORTED: lldb-shell :: Register/x86-gp-read.test (1567 of 2339)
PASS: lldb-api :: commands/statistics/basic/TestStats.py (1568 of 2339)
PASS: lldb-unit :: Process/Utility/./ProcessUtilityTests/ProcSMapTests/LinuxProcSMapsTestFixture.ParseSMapRegions/4 (1569 of 2339)
UNSUPPORTED: lldb-api :: linux/mix-dwo-and-regular-objects/TestMixedDwarfBinary.py (1570 of 2339)
PASS: lldb-api :: functionalities/tail_call_frames/thread_step_out_message/TestArtificialFrameStepOutMessage.py (1571 of 2339)
PASS: lldb-shell :: Register/Core/x86-64-freebsd-addr.test (1572 of 2339)
PASS: lldb-api :: commands/disassemble/basic/TestFrameDisassemble.py (1573 of 2339)
PASS: lldb-unit :: Expression/./ExpressionTests/ClangExpressionDeclMapTest.TestUnknownIdentifierLookup (1574 of 2339)
UNSUPPORTED: lldb-shell :: ScriptInterpreter/Lua/lua.test (1575 of 2339)
PASS: lldb-unit :: Utility/./UtilityTests/ScalarTest.TruncOrExtendTo (1576 of 2339)
PASS: lldb-unit :: Utility/./UtilityTests/ConstStringTest.MangledCounterpart (1577 of 2339)
PASS: lldb-api :: lang/c/set_values/TestSetValues.py (1578 of 2339)
PASS: lldb-api :: functionalities/data-formatter/data-formatter-synthtype/TestDataFormatterSynthType.py (1579 of 2339)
UNSUPPORTED: lldb-shell :: SymbolFile/PDB/variables.test (1580 of 2339)
PASS: lldb-unit :: Language/Highlighting/./HighlighterTests/HighlighterTest.ClangCursorPosInOtherToken (1581 of 2339)
PASS: lldb-unit :: Utility/./UtilityTests/RangeTest.Equal (1582 of 2339)
PASS: lldb-api :: functionalities/type_completion/TestTypeCompletion.py (1583 of 2339)
PASS: lldb-api :: lang/cpp/frame-var-anon-unions/TestFrameVariableAnonymousUnions.py (1584 of 2339)
PASS: lldb-unit :: Utility/./UtilityTests/AnsiTerminal.WhiteSpace (1585 of 2339)
PASS: lldb-unit :: Symbol/./SymbolTests/TestTypeSystemClang.TestConvertAccessTypeToAccessSpecifier (1586 of 2339)
PASS: lldb-shell :: ExecControl/StopHook/stop-hook.test (1587 of 2339)
PASS: lldb-unit :: Symbol/./SymbolTests/TestClangASTImporter.MetadataPropagationAfterCopying (1588 of 2339)
PASS: lldb-api :: functionalities/data-formatter/data-formatter-stl/libstdcpp/unique_ptr/invalid/TestDataFormatterInvalidStdUniquePtr.py (1589 of 2339)
PASS: lldb-api :: functionalities/inferior-crashing/recursive-inferior/TestRecursiveInferiorStep.py (1590 of 2339)
PASS: lldb-api :: commands/expression/import-std-module/shared_ptr-dbg-info-content/TestSharedPtrDbgInfoContentFromStdModule.py (1591 of 2339)
PASS: lldb-unit :: tools/lldb-server/tests/./LLDBServerTests/StandardStartupTest.TestStopReplyContainsThreadPcs (1592 of 2339)
PASS: lldb-api :: assert_messages_test/TestAssertMessages.py (1593 of 2339)
PASS: lldb-shell :: SymbolFile/DWARF/x86/debug_loclists-dwo.s (1594 of 2339)
PASS: lldb-unit :: SymbolFile/DWARF/./SymbolFileDWARFTests/SymbolFileDWARFTests.TestAbilitiesForDWARF (1595 of 2339)
PASS: lldb-unit :: Language/Highlighting/./HighlighterTests/HighlighterTest.ClangCursorPosBeforeOtherToken (1596 of 2339)
PASS: lldb-shell :: ObjectFile/ELF/many-sections.s (1597 of 2339)
PASS: lldb-unit :: Symbol/./SymbolTests/TestClangASTImporter.MetadataPropagationIndirectImport (1598 of 2339)
PASS: lldb-api :: lang/cpp/global_variables/TestCPPGlobalVariables.py (1599 of 2339)
PASS: lldb-api :: commands/expression/radar_8638051/Test8638051.py (1600 of 2339)
PASS: lldb-unit :: Utility/./UtilityTests/StringExtractorTest.GetHexBytesAvail_OddPair2 (1601 of 2339)
PASS: lldb-api :: lang/cpp/keywords_enabled/TestCppKeywordsEnabled.py (1602 of 2339)
PASS: lldb-api :: lang/cpp/nested-class-other-compilation-unit/TestNestedClassWithParentInAnotherCU.py (1603 of 2339)
PASS: lldb-api :: commands/watchpoints/watchpoint_commands/condition/TestWatchpointConditionCmd.py (1604 of 2339)
PASS: lldb-unit :: Utility/./UtilityTests/StreamTest.ShiftOperatorPtr (1605 of 2339)
PASS: lldb-api :: lang/cpp/namespace_conflicts/TestNamespaceConflicts.py (1606 of 2339)
PASS: lldb-unit :: SymbolFile/NativePDB/./SymbolFileNativePDBTests/PDBFPOProgramToDWARFExpressionTests.UnresolvedCyclicRegisterAssignmentReference (1607 of 2339)
PASS: lldb-api :: functionalities/data-formatter/parray/TestPrintArray.py (1608 of 2339)
PASS: lldb-shell :: SymbolFile/NativePDB/load-pdb.cpp (1609 of 2339)
PASS: lldb-unit :: Utility/./UtilityTests/TimeoutTest.Format (1610 of 2339)
PASS: lldb-unit :: Symbol/./SymbolTests/DWARFCallFrameInfoTest.Basic_dwarf4 (1611 of 2339)
PASS: lldb-shell :: ObjectFile/ELF/section-overlap.yaml (1612 of 2339)
PASS: lldb-api :: lang/c/local_types/TestUseClosestType.py (1613 of 2339)
PASS: lldb-shell :: SymbolFile/DWARF/x86/DW_AT_low_pc-addrx.s (1614 of 2339)
PASS: lldb-shell :: Driver/TestCore.test (1615 of 2339)
PASS: lldb-unit :: Target/./TargetTests/ModuleCacheTest.GetAndPutUuidExists (1616 of 2339)
PASS: lldb-api :: commands/expression/import-std-module/pair/TestPairFromStdModule.py (1617 of 2339)
PASS: lldb-api :: tools/lldb-server/register-reading/TestGdbRemoteGPacket.py (1618 of 2339)
PASS: lldb-shell :: ObjectFile/PECOFF/sections-names.yaml (1619 of 2339)
PASS: lldb-api :: functionalities/thread/state_after_expression/TestStateAfterExpression.py (1620 of 2339)
PASS: lldb-api :: macosx/find-dsym/bundle-with-dot-in-filename/TestBundleWithDotInFilename.py (1621 of 2339)
PASS: lldb-api :: lang/objc/rdar-10967107/TestRdar10967107.py (1622 of 2339)
PASS: lldb-api :: lang/cpp/template/TestTemplateArgs.py (1623 of 2339)
PASS: lldb-api :: functionalities/thread/concurrent_events/TestConcurrentTwoWatchpointsOneSignal.py (1624 of 2339)
PASS: lldb-unit :: Utility/./UtilityTests/StreamTeeTest.Flush (1625 of 2339)
PASS: lldb-unit :: UnwindAssembly/x86/./UnwindAssemblyx86Tests/Testx86AssemblyInspectionEngine.TestStackRealign32BitDisp_x86_64 (1626 of 2339)
PASS: lldb-unit :: Symbol/./SymbolTests/TestScratchTypeSystemClang.InferSubASTFromLangOpts (1627 of 2339)
PASS: lldb-unit :: Host/./HostTests/Host.GetEnvironment (1628 of 2339)
UNSUPPORTED: lldb-shell :: SymbolFile/NativePDB/local-variables.cpp (1629 of 2339)
UNSUPPORTED: lldb-api :: functionalities/data-formatter/data-formatter-stl/libstdcpp/list/TestDataFormatterStdList.py (1630 of 2339)
PASS: lldb-unit :: Utility/./UtilityTests/BinaryStreamTest.PutULEB128FiveBytes (1631 of 2339)
PASS: lldb-api :: lang/cpp/const_this/TestConstThis.py (1632 of 2339)
PASS: lldb-unit :: DataFormatter/./LLDBFormatterTests/FormatManagerTests.CompatibleLangs (1633 of 2339)
PASS: lldb-api :: lang/cpp/template-specialization-type/TestTemplateSpecializationType.py (1634 of 2339)
UNSUPPORTED: lldb-api :: macosx/macCatalystAppMacOSFramework/TestMacCatalystAppWithMacOSFramework.py (1635 of 2339)
PASS: lldb-unit :: Platform/./LLDBPlatformTests/PlatformAppleSimulatorTest.TestSimHasSimEnvionament (1636 of 2339)
PASS: lldb-api :: functionalities/stats_api/TestStatisticsAPI.py (1637 of 2339)
PASS: lldb-api :: python_api/watchpoint/watchlocation/TestTargetWatchAddress.py (1638 of 2339)
PASS: lldb-api :: linux/builtin_trap/TestBuiltinTrap.py (1639 of 2339)
PASS: lldb-unit :: Interpreter/./InterpreterTests/TestProperties.DeepCopy (1640 of 2339)
PASS: lldb-unit :: Target/./TargetTests/PathMappingListTest.RemapRoot (1641 of 2339)
PASS: lldb-unit :: Host/./HostTests/MainLoopTest.Signal (1642 of 2339)
PASS: lldb-unit :: Symbol/./SymbolTests/TestTypeSystemClang.OnlyPackName (1643 of 2339)
PASS: lldb-api :: lang/c/blocks/TestBlocks.py (1644 of 2339)
PASS: lldb-api :: functionalities/target-new-solib-notifications/TestModuleLoadedNotifys.py (1645 of 2339)
UNSUPPORTED: lldb-api :: functionalities/ubsan/basic/TestUbsanBasic.py (1646 of 2339)
PASS: lldb-unit :: Symbol/./SymbolTests/LineEntryTest.GetSameLineContiguousAddressRangeNoInlines (1647 of 2339)
PASS: lldb-unit :: Symbol/./SymbolTests/TestClangASTImporter.CopyTypeTagDecl (1648 of 2339)
PASS: lldb-api :: commands/expression/import-std-module/forward_list/TestForwardListFromStdModule.py (1649 of 2339)
PASS: lldb-api :: tools/lldb-server/TestGdbRemoteThreadsInStopReply.py (1650 of 2339)
PASS: lldb-api :: lang/objcxx/cxx-bridged-po/TestObjCXXBridgedPO.py (1651 of 2339)
PASS: lldb-api :: commands/expression/persistent_types/TestNestedPersistentTypes.py (1652 of 2339)
PASS: lldb-unit :: ScriptInterpreter/Python/./ScriptInterpreterPythonTests/PythonDataObjectsTest.TestGlobalNameResolutionWithDot (1653 of 2339)
UNSUPPORTED: lldb-api :: functionalities/longjmp/TestLongjmp.py (1654 of 2339)
PASS: lldb-unit :: Process/minidump/./LLDBMinidumpTests/MinidumpParserTest.GetPid (1655 of 2339)
PASS: lldb-unit :: Utility/./UtilityTests/RegularExpression.CopyAssignment (1656 of 2339)
PASS: lldb-unit :: Utility/./UtilityTests/ListenerTest.GetEventWait (1657 of 2339)
PASS: lldb-api :: python_api/module_section/TestModuleAndSection.py (1658 of 2339)
PASS: lldb-api :: commands/frame/diagnose/complicated-expression/TestComplicatedExpression.py (1659 of 2339)
PASS: lldb-unit :: Interpreter/./InterpreterTests/CompletionTest.DirCompletionAbsolute (1660 of 2339)
PASS: lldb-api :: lang/cpp/modules-import/TestCXXModulesImport.py (1661 of 2339)
PASS: lldb-shell :: Minidump/dump-all.test (1662 of 2339)
PASS: lldb-unit :: Utility/./UtilityTests/TimerTest.CategoryTimes2 (1663 of 2339)
PASS: lldb-api :: functionalities/thread/step_out/TestThreadStepOut.py (1664 of 2339)
PASS: lldb-api :: lang/objc/variadic_methods/TestVariadicMethods.py (1665 of 2339)
PASS: lldb-unit :: Process/minidump/./LLDBMinidumpTests/MinidumpParserTest.GetMiscInfoWindows (1666 of 2339)
PASS: lldb-unit :: UnwindAssembly/x86/./UnwindAssemblyx86Tests/Testx86AssemblyInspectionEngine.TestPushRBP (1667 of 2339)
PASS: lldb-api :: commands/process/launch-with-shellexpand/TestLaunchWithShellExpand.py (1668 of 2339)
PASS: lldb-api :: lang/c/step-target/TestStepTarget.py (1669 of 2339)
PASS: lldb-shell :: ObjectFile/ELF/short-build-id.yaml (1670 of 2339)
PASS: lldb-api :: commands/disassemble/basic/TestDisassembleBreakpoint.py (1671 of 2339)
PASS: lldb-unit :: Host/./HostTests/SocketTests/SocketTest.TCPGetConnectURI/ipv6 (1672 of 2339)
PASS: lldb-unit :: Symbol/./SymbolTests/TestClangASTImporter.ImportInvalidType (1673 of 2339)
PASS: lldb-api :: functionalities/archives/TestBSDArchives.py (1674 of 2339)
PASS: lldb-unit :: Utility/./UtilityTests/StringExtractorTest.GetNameColonValueContainsColon (1675 of 2339)
PASS: lldb-api :: python_api/breakpoint/TestBreakpointAPI.py (1676 of 2339)
PASS: lldb-shell :: Reproducer/Modules/TestModuleCXX.test (1677 of 2339)
PASS: lldb-unit :: Signals/./SignalsTests/UnixSignalsTest.GetInfo (1678 of 2339)
PASS: lldb-shell :: ObjectFile/MachO/lc_build_version.yaml (1679 of 2339)
PASS: lldb-shell :: ScriptInterpreter/Python/Crashlog/parser_text.test (1680 of 2339)
PASS: lldb-api :: python_api/debugger/TestDebuggerAPI.py (1681 of 2339)
PASS: lldb-unit :: Target/./TargetTests/MemoryRegionInfoTest.Formatv (1682 of 2339)
PASS: lldb-api :: types/TestFloatTypesExpr.py (1683 of 2339)
PASS: lldb-api :: lang/c/shared_lib_stripped_symbols/TestSharedLibStrippedSymbols.py (1684 of 2339)
PASS: lldb-shell :: Commands/command-disassemble-process.yaml (1685 of 2339)
PASS: lldb-unit :: SymbolFile/NativePDB/./SymbolFileNativePDBTests/PDBFPOProgramToDWARFExpressionTests.InvalidAssignmentMultiple (1686 of 2339)
PASS: lldb-unit :: Host/./HostTests/FileSystemTest.OpenErrno (1687 of 2339)
PASS: lldb-shell :: Reproducer/TestGDBRemoteRepro.test (1688 of 2339)
PASS: lldb-unit :: SymbolFile/NativePDB/./SymbolFileNativePDBTests/PDBFPOProgramToDWARFExpressionTests.UnknownOp (1689 of 2339)
UNSUPPORTED: lldb-api :: commands/expression/multiline-completion/TestMultilineCompletion.py (1690 of 2339)
PASS: lldb-unit :: UnwindAssembly/x86/./UnwindAssemblyx86Tests/Testx86AssemblyInspectionEngine.TestMovRSPtoRBP (1691 of 2339)
PASS: lldb-shell :: SymbolFile/DWARF/x86/debug-types-dwarf5.s (1692 of 2339)
PASS: lldb-unit :: Utility/./UtilityTests/StreamTest.PutRawBytesToMixedEndian (1693 of 2339)
PASS: lldb-api :: functionalities/thread/backtrace_limit/TestBacktraceLimit.py (1694 of 2339)
PASS: lldb-unit :: Symbol/./SymbolTests/TestTypeSystemClang.GetExeModuleWhenMissingSymbolFile (1695 of 2339)
PASS: lldb-unit :: Utility/./UtilityTests/StringExtractorTest.GetHexU8_Underflow (1696 of 2339)
PASS: lldb-shell :: lldb-server/TestGdbserverPort.test (1697 of 2339)
PASS: lldb-unit :: ObjectFile/ELF/./ObjectFileELFTests/ObjectFileELFTest.GetModuleSpecifications_EarlySectionHeaders (1698 of 2339)
UNSUPPORTED: lldb-api :: iohandler/resize/TestIOHandlerResize.py (1699 of 2339)
PASS: lldb-unit :: Utility/./UtilityTests/StreamTest.ShiftOperatorChars (1700 of 2339)
PASS: lldb-unit :: Utility/./UtilityTests/ScalarTest.SetValueFromCString (1701 of 2339)
PASS: lldb-unit :: Expression/./ExpressionTests/DWARFExpression.DW_OP_unknown (1702 of 2339)
PASS: lldb-unit :: Utility/./UtilityTests/VMRange.Ordering (1703 of 2339)
PASS: lldb-api :: commands/platform/basic/TestPlatformPython.py (1704 of 2339)
PASS: lldb-unit :: Utility/./UtilityTests/BinaryStreamTest.PutSLEB128MaxValue (1705 of 2339)
PASS: lldb-api :: functionalities/data-formatter/data-formatter-stl/libcxx/multiset/TestDataFormatterLibcxxMultiSet.py (1706 of 2339)
PASS: lldb-unit :: Utility/./UtilityTests/AnsiTerminal.Empty (1707 of 2339)
PASS: lldb-api :: tools/lldb-vscode/breakpoint/TestVSCode_setExceptionBreakpoints.py (1708 of 2339)
PASS: lldb-api :: functionalities/thread/concurrent_events/TestConcurrentWatchBreakDelay.py (1709 of 2339)
PASS: lldb-unit :: Host/./HostTests/SocketTests/SocketTest.TCPListen0GetPort/ipv4 (1710 of 2339)
PASS: lldb-shell :: Process/UnsupportedLanguage.test (1711 of 2339)
UNSUPPORTED: lldb-api :: functionalities/darwin_log/filter/exact_match/activity/TestDarwinLogFilterMatchActivity.py (1712 of 2339)
PASS: lldb-shell :: Expr/TestMultilineExpr.test (1713 of 2339)
PASS: lldb-api :: functionalities/thread/concurrent_events/TestConcurrentManyWatchpoints.py (1714 of 2339)
PASS: lldb-shell :: ObjectFile/wasm/embedded-debug-sections.yaml (1715 of 2339)
PASS: lldb-api :: functionalities/data-formatter/ostypeformatting/TestFormattersOsType.py (1716 of 2339)
PASS: lldb-unit :: Utility/./UtilityTests/ArgsTest.AppendArguments (1717 of 2339)
PASS: lldb-unit :: Utility/./UtilityTests/ScalarTest.Division (1718 of 2339)
PASS: lldb-unit :: Utility/./UtilityTests/StringListTest.LongestCommonPrefixNoPrefix (1719 of 2339)
PASS: lldb-unit :: Utility/./UtilityTests/ScalarTest.ExtractBitfield (1720 of 2339)
PASS: lldb-shell :: Minidump/memory-region.yaml (1721 of 2339)
PASS: lldb-api :: lang/objc/objc-runtime-ivars/TestRuntimeIvars.py (1722 of 2339)
PASS: lldb-api :: commands/expression/radar_9531204/TestPrintfAfterUp.py (1723 of 2339)
PASS: lldb-unit :: Language/Highlighting/./HighlighterTests/HighlighterTest.HighlighterSelectionType (1724 of 2339)
PASS: lldb-unit :: Host/./HostTests/MainLoopTest.UnmonitoredSignal (1725 of 2339)
PASS: lldb-unit :: Symbol/./SymbolTests/DWARFCallFrameInfoTest.Basic_dwarf3 (1726 of 2339)
PASS: lldb-api :: python_api/lldbutil/frame/TestFrameUtils.py (1727 of 2339)
PASS: lldb-api :: functionalities/data-formatter/synthcapping/TestSyntheticCapping.py (1728 of 2339)
PASS: lldb-unit :: Utility/./UtilityTests/RegularExpression.Match (1729 of 2339)
PASS: lldb-shell :: Driver/TestNoUseColor.test (1730 of 2339)
UNSUPPORTED: lldb-shell :: SymbolFile/DWARF/debug-types-expressions.test (1731 of 2339)
PASS: lldb-shell :: SymbolFile/DWARF/clang-ast-from-dwarf-unamed-and-anon-structs.cpp (1732 of 2339)
PASS: lldb-api :: commands/breakpoint/set/func-regex/TestBreakpointRegexError.py (1733 of 2339)
PASS: lldb-api :: commands/platform/file/close/TestPlatformFileClose.py (1734 of 2339)
PASS: lldb-shell :: SymbolFile/DWARF/x86/DW_AT_const_value.s (1735 of 2339)
PASS: lldb-api :: commands/settings/quoting/TestQuoting.py (1736 of 2339)
UNSUPPORTED: lldb-api :: commands/platform/connect/TestPlatformConnect.py (1737 of 2339)
UNSUPPORTED: lldb-api :: functionalities/exec/TestExec.py (1738 of 2339)
PASS: lldb-api :: tools/lldb-server/thread-name/TestGdbRemoteThreadName.py (1739 of 2339)
PASS: lldb-unit :: Utility/./UtilityTests/StringExtractorTest.GetHexU8_Exact_NoEof (1740 of 2339)
PASS: lldb-api :: functionalities/thread/concurrent_events/TestConcurrentCrashWithWatchpointBreakpointSignal.py (1741 of 2339)
PASS: lldb-unit :: Utility/./UtilityTests/LogChannelEnabledTest.LogVerboseThread (1742 of 2339)
PASS: lldb-api :: python_api/frame/TestFrames.py (1743 of 2339)
PASS: lldb-unit :: UnwindAssembly/x86/./UnwindAssemblyx86Tests/Testx86AssemblyInspectionEngine.TestPushRBX (1744 of 2339)
PASS: lldb-api :: commands/target/modules/search-paths/insert/TestTargetModulesSearchpathsInsert.py (1745 of 2339)
PASS: lldb-shell :: SymbolFile/DWARF/x86/debug-types-address-ranges.s (1746 of 2339)
UNSUPPORTED: lldb-api :: functionalities/darwin_log/filter/regex/activity-chain/TestDarwinLogFilterRegexActivityChain.py (1747 of 2339)
PASS: lldb-api :: lang/cpp/thread_local/TestThreadLocal.py (1748 of 2339)
PASS: lldb-unit :: Utility/./UtilityTests/StreamTeeTest.Assignment (1749 of 2339)
PASS: lldb-unit :: Utility/./UtilityTests/BinaryStreamTest.PutSLEB128SevenBytes (1750 of 2339)
PASS: lldb-unit :: Expression/./ExpressionTests/CppModuleConfigurationTest.UnrelatedLibrary (1751 of 2339)
UNSUPPORTED: lldb-api :: tools/lldb-server/registers-target-xml-reading/TestGdbRemoteTargetXmlPacket.py (1752 of 2339)
PASS: lldb-unit :: Host/./HostTests/FileSystemTest.EmptyTest (1753 of 2339)
PASS: lldb-api :: functionalities/breakpoint/breakpoint_locations/TestBreakpointLocations.py (1754 of 2339)
PASS: lldb-api :: functionalities/mtc/simple/TestMTCSimple.py (1755 of 2339)
PASS: lldb-shell :: Reproducer/TestDebugSymbols.test (1756 of 2339)
PASS: lldb-unit :: Host/./HostTests/SocketTests/SocketTest.DomainListenConnectAccept/ipv6 (1757 of 2339)
PASS: lldb-unit :: Utility/./UtilityTests/StringListTest.ForRange (1758 of 2339)
PASS: lldb-unit :: Utility/./UtilityTests/BinaryStreamTest.PutSLEB128OneByte (1759 of 2339)
PASS: lldb-unit :: Utility/./UtilityTests/StringLexerTest.GetUnlexed (1760 of 2339)
PASS: lldb-api :: functionalities/breakpoint/breakpoint_command/TestBreakpointCommandsFromPython.py (1761 of 2339)
PASS: lldb-unit :: Utility/./UtilityTests/SerializationRountripTest.SerializeDeserializePod (1762 of 2339)
PASS: lldb-api :: functionalities/inferior-changed/TestInferiorChanged.py (1763 of 2339)
PASS: lldb-api :: python_api/sbvalue_persist/TestSBValuePersist.py (1764 of 2339)
PASS: lldb-api :: api/check_public_api_headers/TestPublicAPIHeaders.py (1765 of 2339)
PASS: lldb-api :: python_api/function_symbol/TestSymbolAPI.py (1766 of 2339)
PASS: lldb-unit :: Symbol/./SymbolTests/TestTypeSystemClang.TestGetTypeClassNested (1767 of 2339)
PASS: lldb-unit :: ScriptInterpreter/Python/./ScriptInterpreterPythonTests/PythonDataObjectsTest.TestInstanceNameResolutionNoDot (1768 of 2339)
UNSUPPORTED: lldb-api :: functionalities/thread/create_during_step/TestCreateDuringStep.py (1769 of 2339)
PASS: lldb-unit :: Utility/./UtilityTests/StreamTest.PutHex64ByteOrderLittle (1770 of 2339)
PASS: lldb-shell :: Unwind/thread-step-out-ret-addr-check.test (1771 of 2339)
PASS: lldb-api :: functionalities/gdb_remote_client/TestMultiprocess.py (1772 of 2339)
PASS: lldb-shell :: SymbolFile/DWARF/x86/dir-separator-no-comp-dir.s (1773 of 2339)
PASS: lldb-unit :: Utility/./UtilityTests/CompletionRequest.Constructor (1774 of 2339)
PASS: lldb-shell :: Commands/command-backtrace-parser-1.test (1775 of 2339)
PASS: lldb-unit :: Utility/./UtilityTests/GeneratorTest.Create (1776 of 2339)
PASS: lldb-unit :: UnwindAssembly/x86/./UnwindAssemblyx86Tests/Testx86AssemblyInspectionEngine.Test64bitFramelessBigStackFrame (1777 of 2339)
PASS: lldb-shell :: SymbolFile/DWARF/x86/limit-debug-info.s (1778 of 2339)
PASS: lldb-shell :: ObjectFile/ELF/netbsd-core-amd64.test (1779 of 2339)
PASS: lldb-api :: functionalities/data-formatter/data-formatter-stl/libcxx/vbool/TestDataFormatterLibcxxVBool.py (1780 of 2339)
PASS: lldb-api :: lang/objc/objc-foundation-dictionary-empty/TestNSDictionary0.py (1781 of 2339)
PASS: lldb-api :: lang/c/conflicting-symbol/TestConflictingSymbol.py (1782 of 2339)
PASS: lldb-shell :: SymbolFile/DWARF/x86/DW_AT_decl_file-DW_AT_specification-crosscu.s (1783 of 2339)
PASS: lldb-unit :: Language/Highlighting/./HighlighterTests/HighlighterTest.ClangSquareBrackets (1784 of 2339)
PASS: lldb-unit :: Utility/./UtilityTests/Flags.Test (1785 of 2339)
PASS: lldb-api :: functionalities/gdb_remote_client/TestGDBRemoteClient.py (1786 of 2339)
PASS: lldb-api :: functionalities/data-formatter/type_summary_list_script/TestTypeSummaryListScript.py (1787 of 2339)
PASS: lldb-unit :: Utility/./UtilityTests/Flags.AnyClear (1788 of 2339)
PASS: lldb-api :: python_api/objc_type/TestObjCType.py (1789 of 2339)
PASS: lldb-unit :: UnwindAssembly/x86/./UnwindAssemblyx86Tests/Testx86AssemblyInspectionEngine.Testi386IgnoredRegisters (1790 of 2339)
PASS: lldb-shell :: Register/Core/x86-32-freebsd-fp.test (1791 of 2339)
PASS: lldb-api :: macosx/queues/TestQueues.py (1792 of 2339)
PASS: lldb-api :: commands/help/TestHelp.py (1793 of 2339)
UNSUPPORTED: lldb-api :: functionalities/tsan/basic/TestTsanBasic.py (1794 of 2339)
PASS: lldb-api :: functionalities/breakpoint/source_regexp/TestSourceRegexBreakpoints.py (1795 of 2339)
PASS: lldb-api :: lang/c/local_variables/TestLocalVariables.py (1796 of 2339)
PASS: lldb-api :: python_api/sbvalue_const_addrof/TestSBValueConstAddrOf.py (1797 of 2339)
PASS: lldb-shell :: SymbolFile/DWARF/x86/debug-names-compressed.cpp (1798 of 2339)
PASS: lldb-unit :: Host/./HostTests/MainLoopTest.TerminatesImmediately (1799 of 2339)
PASS: lldb-unit :: Core/./LLDBCoreTests/DumpDataExtractorTest.NullStream (1800 of 2339)
PASS: lldb-shell :: SymbolFile/DWARF/x86/compilercontext.ll (1801 of 2339)
UNSUPPORTED: lldb-shell :: ScriptInterpreter/Lua/breakpoint_callback.test (1802 of 2339)
PASS: lldb-api :: functionalities/gdb_remote_client/TestArmRegisterDefinition.py (1803 of 2339)
PASS: lldb-unit :: Utility/./UtilityTests/CompletionRequest.DuplicateFilteringWithComments (1804 of 2339)
PASS: lldb-unit :: Utility/./UtilityTests/Flags.AllSet (1805 of 2339)
PASS: lldb-shell :: SymbolFile/DWARF/x86/debug-types-dwo-cross-reference.cpp (1806 of 2339)
UNSUPPORTED: lldb-shell :: Unwind/eh-frame-small-fde.test (1807 of 2339)
PASS: lldb-api :: lang/c/bitfields/TestBitfields.py (1808 of 2339)
PASS: lldb-unit :: Utility/./UtilityTests/LogChannelTest.Enable (1809 of 2339)
UNSUPPORTED: lldb-api :: functionalities/ubsan/user-expression/TestUbsanUserExpression.py (1810 of 2339)
PASS: lldb-unit :: Utility/./UtilityTests/FileSpecTest.EqualSeparator (1811 of 2339)
PASS: lldb-unit :: ScriptInterpreter/Python/./ScriptInterpreterPythonTests/PythonDataObjectsTest.TestCallable (1812 of 2339)
PASS: lldb-unit :: UnwindAssembly/x86/./UnwindAssemblyx86Tests/Testx86AssemblyInspectionEngine.TestPushR13 (1813 of 2339)
PASS: lldb-unit :: UnwindAssembly/x86/./UnwindAssemblyx86Tests/Testx86AssemblyInspectionEngine.TestPushR15 (1814 of 2339)
PASS: lldb-unit :: Utility/./UtilityTests/StringListTest.AppendStringCString (1815 of 2339)
PASS: lldb-shell :: SymbolFile/NativePDB/ast-methods.cpp (1816 of 2339)
PASS: lldb-unit :: Language/CPlusPlus/./LanguageCPlusPlusTests/CPlusPlusLanguage.CPlusPlusNameParser (1817 of 2339)
PASS: lldb-shell :: ScriptInterpreter/None/none.test (1818 of 2339)
PASS: lldb-api :: functionalities/thread/concurrent_events/TestConcurrentCrashWithBreak.py (1819 of 2339)
UNSUPPORTED: lldb-shell :: Watchpoint/netbsd-nouserdbregs.test (1820 of 2339)
UNSUPPORTED: lldb-api :: commands/gui/basicdebug/TestGuiBasicDebug.py (1821 of 2339)
PASS: lldb-api :: python_api/disassemble-raw-data/TestDisassembleRawData.py (1822 of 2339)
UNSUPPORTED: lldb-api :: linux/thread/create_during_instruction_step/TestCreateDuringInstructionStep.py (1823 of 2339)
PASS: lldb-unit :: Utility/./UtilityTests/StreamTest.PutNHex8 (1824 of 2339)
PASS: lldb-shell :: Register/Core/x86-64-netbsd-gp.test (1825 of 2339)
PASS: lldb-api :: lang/c/strings/TestCStrings.py (1826 of 2339)
PASS: lldb-api :: commands/breakpoint/command/list/TestBreakpointCommandList.py (1827 of 2339)
PASS: lldb-unit :: ScriptInterpreter/Python/./ScriptInterpreterPythonTests/PythonDataObjectsTest.TestPythonDictionaryValueEquality (1828 of 2339)
UNSUPPORTED: lldb-api :: benchmarks/libcxxmap/TestBenchmarkLibcxxMap.py (1829 of 2339)
PASS: lldb-unit :: Utility/./UtilityTests/ProcessInstanceInfo.DumpTable (1830 of 2339)
PASS: lldb-api :: functionalities/process_group/TestChangeProcessGroup.py (1831 of 2339)
PASS: lldb-unit :: Utility/./UtilityTests/EnvironmentTest.EnvpConstruction (1832 of 2339)
PASS: lldb-api :: commands/target/dump-symtab-demangle/TestDumpSymtabDemangle.py (1833 of 2339)
PASS: lldb-unit :: Process/gdb-remote/./ProcessGdbRemoteTests/GDBRemoteClientBaseTest.SendContinueDelegateStructuredDataReceipt (1834 of 2339)
PASS: lldb-api :: lang/objc/rdar-11355592/TestRdar11355592.py (1835 of 2339)
PASS: lldb-unit :: Utility/./UtilityTests/StreamTeeTest.Constructor1Stream (1836 of 2339)
PASS: lldb-api :: functionalities/data-formatter/data-formatter-objc/TestDataFormatterObjCNSBundle.py (1837 of 2339)
PASS: lldb-api :: commands/watchpoints/watchpoint_set_command/TestWatchLocationWithWatchSet.py (1838 of 2339)
PASS: lldb-api :: functionalities/breakpoint/breakpoint_hit_count/TestBreakpointHitCount.py (1839 of 2339)
PASS: lldb-unit :: Utility/./UtilityTests/ArgsTest.ReplaceArgumentAtIndexFarOutOfRange (1840 of 2339)
UNSUPPORTED: lldb-shell :: BuildScript/toolchain-clang-cl.test (1841 of 2339)
PASS: lldb-api :: lang/objc/foundation/TestObjCMethods.py (1842 of 2339)
PASS: lldb-unit :: Utility/./UtilityTests/StringListTest.DefaultConstructor (1843 of 2339)
PASS: lldb-api :: lang/cpp/multiple-inheritance/TestCppMultipleInheritance.py (1844 of 2339)
PASS: lldb-shell :: Breakpoint/debug_addrx.test (1845 of 2339)
PASS: lldb-shell :: Breakpoint/single-file-split-dwarf.test (1846 of 2339)
PASS: lldb-unit :: Expression/./ExpressionTests/DiagnosticManagerTest.PutStringSeverities (1847 of 2339)
UNSUPPORTED: lldb-api :: lang/objc/ptr_refs/TestPtrRefsObjC.py (1848 of 2339)
PASS: lldb-shell :: SymbolFile/NativePDB/function-types-builtins.cpp (1849 of 2339)
PASS: lldb-shell :: Quit/TestQuitExitCodeImplicit0.test (1850 of 2339)
PASS: lldb-unit :: UnwindAssembly/x86/./UnwindAssemblyx86Tests/Testx86AssemblyInspectionEngine.TestSpillRegToStackViaMOVx86_64 (1851 of 2339)
XFAIL: lldb-shell :: Register/x86-64-write.test (1852 of 2339)
PASS: lldb-unit :: UnwindAssembly/x86/./UnwindAssemblyx86Tests/Testx86AssemblyInspectionEngine.TestLEAVE (1853 of 2339)
PASS: lldb-shell :: Settings/TestLineMarkerColor.test (1854 of 2339)
PASS: lldb-shell :: Error/assert.test (1855 of 2339)
UNSUPPORTED: lldb-api :: functionalities/data-formatter/data-formatter-stl/libstdcpp/vector/TestDataFormatterStdVector.py (1856 of 2339)
PASS: lldb-shell :: SymbolFile/Breakpad/symtab.test (1857 of 2339)
PASS: lldb-shell :: SymbolFile/Breakpad/stack-cfi-parsing.test (1858 of 2339)
PASS: lldb-unit :: Editline/./EditlineTests/EditlineTestFixture.EditlineReceivesMultiLineText (1859 of 2339)
PASS: lldb-unit :: Target/./TargetTests/ExecutionContextTest.GetByteOrderTarget (1860 of 2339)
PASS: lldb-unit :: Utility/./UtilityTests/StreamTest.PutChar (1861 of 2339)
PASS: lldb-api :: python_api/findvalue_duplist/TestSBFrameFindValue.py (1862 of 2339)
PASS: lldb-shell :: Settings/TestEchoCommands.test (1863 of 2339)
PASS: lldb-api :: lang/cpp/exceptions/TestCPPExceptionBreakpoints.py (1864 of 2339)
PASS: lldb-api :: functionalities/data-formatter/data-formatter-enum-format/TestDataFormatterEnumFormat.py (1865 of 2339)
PASS: lldb-shell :: Reproducer/TestDiscard.test (1866 of 2339)
PASS: lldb-unit :: Utility/./UtilityTests/ArgsTest.GetQuotedCommandString (1867 of 2339)
UNSUPPORTED: lldb-shell :: Process/Windows/exception_access_violation.cpp (1868 of 2339)
PASS: lldb-shell :: Quit/TestQuitExitCode0.test (1869 of 2339)
PASS: lldb-unit :: Utility/./UtilityTests/StreamTeeTest.CopyConstructor (1870 of 2339)
PASS: lldb-unit :: Utility/./UtilityTests/UUIDTest.Validity (1871 of 2339)
PASS: lldb-unit :: Utility/./UtilityTests/ConstStringTest.format_provider (1872 of 2339)
PASS: lldb-api :: tools/lldb-server/TestGdbRemoteKill.py (1873 of 2339)
PASS: lldb-unit :: Process/gdb-remote/./ProcessGdbRemoteTests/GDBRemoteCommunicationClientTest.SaveRestoreRegistersNoSuffix (1874 of 2339)
PASS: lldb-unit :: Utility/./UtilityTests/RecordReplayTest.InstrumentedBarRef (1875 of 2339)
PASS: lldb-api :: functionalities/data-formatter/pyobjsynthprovider/TestPyObjSynthProvider.py (1876 of 2339)
PASS: lldb-api :: lang/objcxx/class-name-clash/TestNameClash.py (1877 of 2339)
UNSUPPORTED: lldb-api :: commands/register/register/intel_xtended_registers/mpx_bound_violation/TestBoundViolation.py (1878 of 2339)
PASS: lldb-unit :: Utility/./UtilityTests/UserIDResolver.GetGroupName (1879 of 2339)
UNSUPPORTED: lldb-api :: functionalities/tsan/global_location/TestTsanGlobalLocation.py (1880 of 2339)
PASS: lldb-unit :: Utility/./UtilityTests/ScalarTest.Scalar_512 (1881 of 2339)
PASS: lldb-api :: python_api/watchpoint/condition/TestWatchpointConditionAPI.py (1882 of 2339)
PASS: lldb-unit :: Process/gdb-remote/./ProcessGdbRemoteTests/GDBRemoteCommunicationClientTest.GetMemoryRegionInfo (1883 of 2339)
PASS: lldb-unit :: Utility/./UtilityTests/RangeDataVector.FindEntryThatContains_Overlap (1884 of 2339)
PASS: lldb-shell :: Commands/command-disassemble.s (1885 of 2339)
PASS: lldb-api :: lang/cpp/trivial_abi/TestTrivialABI.py (1886 of 2339)
PASS: lldb-unit :: Utility/./UtilityTests/FileSpecTest.GuessPathStyle (1887 of 2339)
PASS: lldb-unit :: Core/./LLDBCoreTests/MangledTest.ResultForBlockInvocation (1888 of 2339)
PASS: lldb-unit :: ObjectFile/Breakpad/./ObjectFileBreakpadTests/Record.classify (1889 of 2339)
PASS: lldb-api :: functionalities/data-formatter/data-formatter-proper-plurals/TestFormattersOneIsSingular.py (1890 of 2339)
PASS: lldb-unit :: Utility/./UtilityTests/UriParserTest.LongPath (1891 of 2339)
UNSUPPORTED: lldb-api :: commands/expression/multiline-navigation/TestMultilineNavigation.py (1892 of 2339)
PASS: lldb-api :: functionalities/thread/concurrent_events/TestConcurrentWatchpointWithDelayWatchpointThreads.py (1893 of 2339)
PASS: lldb-unit :: Symbol/./SymbolTests/TestClangASTImporter.RecordLayout (1894 of 2339)
PASS: lldb-unit :: ObjectFile/PECOFF/./ObjectFilePECOFFTests/PECallFrameInfoTest.Frame_reg_eh (1895 of 2339)
PASS: lldb-api :: functionalities/data-formatter/data-formatter-objc/nsstring/TestDataFormatterNSString.py (1896 of 2339)
PASS: lldb-api :: functionalities/limit-debug-info/TestLimitDebugInfo.py (1897 of 2339)
PASS: lldb-unit :: Utility/./UtilityTests/StreamTeeTest.SetStreamAtIndexOutOfBounds (1898 of 2339)
PASS: lldb-api :: functionalities/target_var/TestTargetVar.py (1899 of 2339)
PASS: lldb-api :: tools/lldb-server/TestGdbRemoteAttachOrWait.py (1900 of 2339)
PASS: lldb-api :: functionalities/thread/exit_during_break/TestExitDuringBreak.py (1901 of 2339)
PASS: lldb-shell :: ObjectFile/ELF/aarch64-relocations.yaml (1902 of 2339)
PASS: lldb-unit :: Target/./TargetTests/MCBasedABI.MapRegisterName (1903 of 2339)
PASS: lldb-unit :: Utility/./UtilityTests/UriParserTest.BadPort (1904 of 2339)
PASS: lldb-api :: functionalities/thread/concurrent_events/TestConcurrentBreakpointOneDelayBreakpointThreads.py (1905 of 2339)
PASS: lldb-api :: terminal/TestSTTYBeforeAndAfter.py (1906 of 2339)
PASS: lldb-api :: commands/expression/import-std-module/vector/TestVectorFromStdModule.py (1907 of 2339)
PASS: lldb-unit :: Process/Utility/./ProcessUtilityTests/ProcSMapTests/LinuxProcSMapsTestFixture.ParseSMapRegions/5 (1908 of 2339)
PASS: lldb-unit :: Core/./LLDBCoreTests/SourceFileCache.FindSourceFileNotFound (1909 of 2339)
PASS: lldb-api :: commands/target/auto-install-main-executable/TestAutoInstallMainExecutable.py (1910 of 2339)
PASS: lldb-api :: lang/c/inlines/TestRedefinitionsInInlines.py (1911 of 2339)
PASS: lldb-shell :: Register/Core/x86-32-linux-gp.test (1912 of 2339)
PASS: lldb-shell :: Driver/TestRepl.test (1913 of 2339)
PASS: lldb-api :: functionalities/thread/thread_specific_break/TestThreadSpecificBreakpoint.py (1914 of 2339)
PASS: lldb-unit :: SymbolFile/DWARF/./SymbolFileDWARFTests/DWARFUnitTest.MissingSentinel (1915 of 2339)
UNSUPPORTED: lldb-shell :: SymbolFile/DWARF/x86/DW_TAG_GNU_call_site-DW_AT_low_pc.s (1916 of 2339)
PASS: lldb-unit :: Language/Highlighting/./HighlighterTests/HighlighterTest.ClangIdentifiers (1917 of 2339)
PASS: lldb-unit :: Utility/./UtilityTests/StringExtractorTest.GetHexBytes_Underflow (1918 of 2339)
PASS: lldb-shell :: SymbolFile/Breakpad/unwind-via-stack-cfi.test (1919 of 2339)
PASS: lldb-unit :: Host/./HostTests/SocketTests/SocketTest.TCPGetConnectURI/ipv4 (1920 of 2339)
PASS: lldb-unit :: Utility/./UtilityTests/StringExtractorTest.GetHexU8_Exact (1921 of 2339)
PASS: lldb-api :: python_api/value/linked_list/TestValueAPILinkedList.py (1922 of 2339)
PASS: lldb-unit :: Utility/./UtilityTests/VASprintfTest.EncodingError (1923 of 2339)
UNSUPPORTED: lldb-api :: functionalities/asan/TestMemoryHistory.py (1924 of 2339)
PASS: lldb-unit :: Utility/./UtilityTests/ScalarTest.ComparisonFloat (1925 of 2339)
PASS: lldb-unit :: Utility/./UtilityTests/RecordReplayTest.InstrumentedBar (1926 of 2339)
UNSUPPORTED: lldb-api :: tools/lldb-server/TestGdbRemoteFork.py (1927 of 2339)
PASS: lldb-unit :: Utility/./UtilityTests/ArgsTest.TestSingleArgWithQuotedSpace (1928 of 2339)
PASS: lldb-unit :: debugserver/./debugserverTests/JSON.Parse (1929 of 2339)
PASS: lldb-shell :: ScriptInterpreter/Python/Crashlog/parser_json.test (1930 of 2339)
PASS: lldb-api :: tools/lldb-vscode/stackTrace/TestVSCode_stackTrace.py (1931 of 2339)
PASS: lldb-unit :: Utility/./UtilityTests/StreamTest.AddressRangeSize (1932 of 2339)
PASS: lldb-api :: functionalities/gdb_remote_client/TestIOSSimulator.py (1933 of 2339)
PASS: lldb-unit :: Utility/./UtilityTests/StreamTest.PutMaxHex64ByteOrderLittle (1934 of 2339)
UNSUPPORTED: lldb-shell :: Register/x86-64-zmm-write.test (1935 of 2339)
UNSUPPORTED: lldb-api :: functionalities/breakpoint/hardware_breakpoints/write_memory_with_hw_breakpoint/TestWriteMemoryWithHWBreakpoint.py (1936 of 2339)
PASS: lldb-unit :: Host/./HostTests/NativeProcessProtocolTest.SetBreakpointFailVerify (1937 of 2339)
PASS: lldb-api :: commands/expression/import-std-module/deque-dbg-info-content/TestDbgInfoContentDequeFromStdModule.py (1938 of 2339)
PASS: lldb-shell :: Register/x86-64-gp-read.test (1939 of 2339)
PASS: lldb-unit :: Utility/./UtilityTests/RecordReplayTest.InvalidSequence (1940 of 2339)
PASS: lldb-shell :: Register/x86-64-read.test (1941 of 2339)
PASS: lldb-api :: commands/expression/context-object/TestContextObject.py (1942 of 2339)
PASS: lldb-shell :: SymbolFile/DWARF/x86/debug-types-signature-loop.s (1943 of 2339)
PASS: lldb-unit :: Host/./HostTests/SocketTests/SocketTest.DomainGetConnectURI/ipv6 (1944 of 2339)
PASS: lldb-unit :: Utility/./UtilityTests/RangeTest.NotEqualInvalid (1945 of 2339)
PASS: lldb-unit :: Utility/./UtilityTests/DataExtractorTest.GetSLEB128_bit63 (1946 of 2339)
PASS: lldb-unit :: Utility/./UtilityTests/StreamTest.PutHex32ByteOrderLittle (1947 of 2339)
PASS: lldb-unit :: Utility/./UtilityTests/StringListTest.Clear (1948 of 2339)
PASS: lldb-shell :: SymbolFile/DWARF/x86/dwarf5_tu_index_abbrev_offset.s (1949 of 2339)
PASS: lldb-api :: functionalities/data-formatter/synthupdate/TestSyntheticFilterRecompute.py (1950 of 2339)
PASS: lldb-unit :: Utility/./UtilityTests/StringListTest.PopBack (1951 of 2339)
PASS: lldb-unit :: Utility/./UtilityTests/StreamTest.PutMaxHex64ByteOrderBig (1952 of 2339)
PASS: lldb-unit :: Process/minidump/./LLDBMinidumpTests/MinidumpParserTest.GetMiscInfo_no_stream (1953 of 2339)
PASS: lldb-api :: functionalities/plugins/python_os_plugin/stepping_plugin_threads/TestOSPluginStepping.py (1954 of 2339)
PASS: lldb-unit :: Host/./HostTests/HostInfoTest.GetXcodeSDK (1955 of 2339)
PASS: lldb-unit :: Core/./LLDBCoreTests/CommunicationTest.SynchronizeWhileClosing (1956 of 2339)
PASS: lldb-unit :: Target/./TargetTests/ExecutionContextTest.GetByteOrderProcess (1957 of 2339)
PASS: lldb-api :: functionalities/tail_call_frames/ambiguous_tail_call_seq1/TestAmbiguousTailCallSeq1.py (1958 of 2339)
UNSUPPORTED: lldb-api :: functionalities/data-formatter/data-formatter-stl/libstdcpp/smart_ptr/TestDataFormatterStdSmartPtr.py (1959 of 2339)
PASS: lldb-shell :: SymbolFile/DWARF/x86/dwarf5-implicit-const.s (1960 of 2339)
PASS: lldb-api :: commands/frame/diagnose/bad-reference/TestBadReference.py (1961 of 2339)
PASS: lldb-unit :: Language/CPlusPlus/./LanguageCPlusPlusTests/CPlusPlusLanguage.FindAlternateFunctionManglings (1962 of 2339)
PASS: lldb-api :: python_api/watchpoint/TestWatchpointIter.py (1963 of 2339)
PASS: lldb-unit :: Utility/./UtilityTests/StateTest.Formatv (1964 of 2339)
PASS: lldb-unit :: Host/./HostTests/SocketTests/SocketTest.UDPGetConnectURI/ipv6 (1965 of 2339)
PASS: lldb-api :: functionalities/inferior-crashing/TestInferiorCrashing.py (1966 of 2339)
PASS: lldb-api :: functionalities/wrong_commands/TestWrongCommands.py (1967 of 2339)
PASS: lldb-shell :: SymbolFile/Breakpad/line-table-missing-file.test (1968 of 2339)
PASS: lldb-unit :: Utility/./UtilityTests/StreamTest.Indent (1969 of 2339)
PASS: lldb-unit :: Utility/./UtilityTests/StringExtractorTest.GetHexU8_InvalidHex (1970 of 2339)
UNSUPPORTED: lldb-api :: functionalities/darwin_log/filter/regex/activity/TestDarwinLogFilterRegexActivity.py (1971 of 2339)
PASS: lldb-unit :: Utility/./UtilityTests/StreamTest.AddressSize (1972 of 2339)
PASS: lldb-unit :: Core/./LLDBCoreTests/FormatEntityTest.DefinitionConstructionNameTypeChildren (1973 of 2339)
PASS: lldb-api :: lang/cpp/typedef/TestCppTypedef.py (1974 of 2339)
PASS: lldb-api :: commands/watchpoints/watchpoint_count/TestWatchpointCount.py (1975 of 2339)
PASS: lldb-unit :: Symbol/./SymbolTests/Type.CompilerContextPattern (1976 of 2339)
PASS: lldb-unit :: Utility/./UtilityTests/StringListTest.AppendStringMove (1977 of 2339)
PASS: lldb-unit :: Utility/./UtilityTests/StringExtractorTest.InitMisc (1978 of 2339)
PASS: lldb-api :: functionalities/data-formatter/boolreference/TestFormattersBoolRefPtr.py (1979 of 2339)
PASS: lldb-unit :: SymbolFile/DWARF/./SymbolFileDWARFTests/SymbolFileDWARFTests.ParseArangesIgnoreEmpty (1980 of 2339)
PASS: lldb-unit :: Symbol/./SymbolTests/TestClangASTImporter.CanImportInvalidType (1981 of 2339)
PASS: lldb-unit :: Symbol/./SymbolTests/TestCreateClassTemplateDecl.FindExistingTemplatesWithParameterPack (1982 of 2339)
PASS: lldb-unit :: Host/./HostTests/NativeProcessProtocolTest.ReadCStringFromMemory (1983 of 2339)
PASS: lldb-shell :: Minidump/fb-dump.test (1984 of 2339)
PASS: lldb-shell :: Process/Optimization.test (1985 of 2339)
PASS: lldb-unit :: Host/./HostTests/MainLoopTest.ReadObject (1986 of 2339)
PASS: lldb-shell :: ObjectFile/ELF/base-address.yaml (1987 of 2339)
PASS: lldb-api :: lang/cpp/dynamic-value/TestDynamicValue.py (1988 of 2339)
UNSUPPORTED: lldb-api :: arm/breakpoint-thumb-codesection/TestBreakpointThumbCodesection.py (1989 of 2339)
PASS: lldb-unit :: Interpreter/./InterpreterTests/OptionValueArgs.DeepCopy (1990 of 2339)
UNSUPPORTED: lldb-shell :: SymbolFile/PDB/vbases.test (1991 of 2339)
PASS: lldb-unit :: Process/gdb-remote/./ProcessGdbRemoteTests/GDBRemoteCommunicationServerTest.SendErrorResponse_Status (1992 of 2339)
PASS: lldb-unit :: Utility/./UtilityTests/UriParserTest.Minimal (1993 of 2339)
PASS: lldb-shell :: SymbolFile/NativePDB/function-types-calling-conv.cpp (1994 of 2339)
PASS: lldb-shell :: Quit/TestQuitExitCodeHexA.test (1995 of 2339)
PASS: lldb-unit :: Symbol/./SymbolTests/TestClangASTImporter.MetadataPropagation (1996 of 2339)
UNSUPPORTED: lldb-api :: linux/sepdebugsymlink/TestTargetSymbolsSepDebugSymlink.py (1997 of 2339)
PASS: lldb-unit :: Utility/./UtilityTests/SerializationRountripTest.SerializeDeserializePodReferences (1998 of 2339)
PASS: lldb-api :: functionalities/deleted-executable/TestDeletedExecutable.py (1999 of 2339)
UNSUPPORTED: lldb-api :: arm/breakpoint-it/TestBreakpointIt.py (2000 of 2339)
PASS: lldb-shell :: SymbolFile/DWARF/x86/dwarf5-atomic.s (2001 of 2339)
PASS: lldb-unit :: Utility/./UtilityTests/NameMatchesTest.EndsWith (2002 of 2339)
PASS: lldb-api :: tools/lldb-vscode/coreFile/TestVSCode_coreFile.py (2003 of 2339)
XFAIL: lldb-shell :: SymbolFile/DWARF/find-type-in-function.cpp (2004 of 2339)
PASS: lldb-unit :: Utility/./UtilityTests/ArgsTest.ReplaceArgumentAtIndexLonger (2005 of 2339)
PASS: lldb-api :: commands/expression/import-std-module/queue/TestQueueFromStdModule.py (2006 of 2339)
PASS: lldb-api :: functionalities/plugins/python_os_plugin/TestPythonOSPlugin.py (2007 of 2339)
PASS: lldb-unit :: Utility/./UtilityTests/StringListTest.RemoveBlankLines (2008 of 2339)
PASS: lldb-unit :: ScriptInterpreter/Python/./ScriptInterpreterPythonTests/PythonDataObjectsTest.TestPythonListValueEquality (2009 of 2339)
PASS: lldb-unit :: Utility/./UtilityTests/Flags.IsClear (2010 of 2339)
PASS: lldb-api :: commands/platform/basic/TestPlatformCommand.py (2011 of 2339)
PASS: lldb-unit :: Utility/./UtilityTests/StringListTest.CopyListEmpty (2012 of 2339)
PASS: lldb-api :: commands/watchpoints/hello_watchpoint/TestMyFirstWatchpoint.py (2013 of 2339)
PASS: lldb-unit :: Utility/./UtilityTests/CompletionRequest.TryCompleteCurrentArgGood (2014 of 2339)
PASS: lldb-api :: functionalities/thread/concurrent_events/TestConcurrentBreakpointsDelayedBreakpointOneWatchpoint.py (2015 of 2339)
PASS: lldb-api :: python_api/get-value-32bit-int/TestGetValue32BitInt.py (2016 of 2339)
PASS: lldb-api :: lang/objc/cpp_keyword_identifiers/TestCppKeywordsAsObjCIdentifiers.py (2017 of 2339)
PASS: lldb-api :: macosx/profile_vrs_detach/TestDetachVrsProfile.py (2018 of 2339)
PASS: lldb-unit :: Utility/./UtilityTests/BinaryStreamTest.PutULEB128SevenBytes (2019 of 2339)
PASS: lldb-shell :: ScriptInterpreter/Python/Crashlog/json.test (2020 of 2339)
PASS: lldb-unit :: Utility/./UtilityTests/StreamTest.AddressPrefix (2021 of 2339)
PASS: lldb-unit :: ScriptInterpreter/Python/./ScriptInterpreterPythonTests/PythonDataObjectsTest.TestRun (2022 of 2339)
PASS: lldb-unit :: Expression/./ExpressionTests/DiagnosticManagerTest.AppendMessageSubsequentDiags (2023 of 2339)
PASS: lldb-unit :: Utility/./UtilityTests/AnsiTerminal.Twice (2024 of 2339)
PASS: lldb-api :: lang/objc/objc-stepping/TestObjCStepping.py (2025 of 2339)
UNSUPPORTED: lldb-api :: lang/objc/modules-update/TestClangModulesUpdate.py (2026 of 2339)
PASS: lldb-shell :: Settings/TestFrameFormatNoColor.test (2027 of 2339)
PASS: lldb-shell :: Minidump/Windows/find-module.test (2028 of 2339)
PASS: lldb-shell :: BuildScript/modes.test (2029 of 2339)
UNSUPPORTED: lldb-shell :: Register/x86-64-xmm16-read.test (2030 of 2339)
PASS: lldb-shell :: Commands/command-thread-select.test (2031 of 2339)
PASS: lldb-api :: commands/expression/import-std-module/deque-basic/TestDequeFromStdModule.py (2032 of 2339)
PASS: lldb-unit :: Language/CLanguages/./LanguageCLanguagesTests/CLanguages.LookupCLanguagesByLanguageType (2033 of 2339)
PASS: lldb-api :: functionalities/data-formatter/data-formatter-cpp/TestDataFormatterCpp.py (2034 of 2339)
PASS: lldb-unit :: SymbolFile/NativePDB/./SymbolFileNativePDBTests/PDBFPOProgramToDWARFExpressionTests.MultipleIndependentAssignments (2035 of 2339)
PASS: lldb-api :: api/multiple-targets/TestMultipleTargets.py (2036 of 2339)
PASS: lldb-api :: lang/objcxx/objc-builtin-types/TestObjCBuiltinTypes.py (2037 of 2339)
UNSUPPORTED: lldb-shell :: SymbolFile/Breakpad/stack-cfi-arm.yaml (2038 of 2339)
PASS: lldb-unit :: Core/./LLDBCoreTests/MangledTest.NameIndexes_FindFunctionSymbols (2039 of 2339)
PASS: lldb-unit :: Utility/./UtilityTests/StreamTest.AddressRangeEmptyRange (2040 of 2339)
PASS: lldb-api :: sample_test/TestSampleInlineTest.py (2041 of 2339)
PASS: lldb-unit :: Utility/./UtilityTests/StringListTest.LongestCommonPrefixEmpty (2042 of 2339)
PASS: lldb-unit :: ScriptInterpreter/Python/./ScriptInterpreterPythonTests/PythonDataObjectsTest.TestPythonTupleToStructuredList (2043 of 2339)
PASS: lldb-unit :: UnwindAssembly/x86/./UnwindAssemblyx86Tests/Testx86AssemblyInspectionEngine.TestStackRealign8BitDisp_i386 (2044 of 2339)
PASS: lldb-api :: lang/cpp/class-template-parameter-pack/TestClassTemplateParameterPack.py (2045 of 2339)
PASS: lldb-api :: lang/objc/objc-struct-return/TestObjCStructReturn.py (2046 of 2339)
PASS: lldb-unit :: Process/gdb-remote/./ProcessGdbRemoteTests/GDBRemoteCommunicationServerTest.SendErrorResponse_ErrorNumber (2047 of 2339)
PASS: lldb-unit :: ScriptInterpreter/Python/./ScriptInterpreterPythonTests/PythonDataObjectsTest.TestPythonTupleSize (2048 of 2339)
PASS: lldb-unit :: Core/./LLDBCoreTests/RichManglingContextTest.FromCxxMethodName (2049 of 2339)
PASS: lldb-api :: functionalities/conditional_break/TestConditionalBreak.py (2050 of 2339)
PASS: lldb-shell :: SymbolFile/DWARF/x86/debug_ranges.s (2051 of 2339)
PASS: lldb-unit :: Expression/./ExpressionTests/DiagnosticManagerTest.GetStringPreserveOrder (2052 of 2339)
PASS: lldb-api :: lang/objc/modules-hash-mismatch/TestClangModulesHashMismatch.py (2053 of 2339)
PASS: lldb-unit :: Core/./LLDBCoreTests/DumpDataExtractorTest.MultiLine (2054 of 2339)
PASS: lldb-unit :: ScriptInterpreter/Python/./ScriptInterpreterPythonTests/PythonDataObjectsTest.TestPythonCallableInvoke (2055 of 2339)
PASS: lldb-unit :: Utility/./UtilityTests/ConstStringTest.YAML (2056 of 2339)
PASS: lldb-shell :: Settings/TestModuleCacheSanity.test (2057 of 2339)
UNSUPPORTED: lldb-api :: benchmarks/continue/TestBenchmarkContinue.py (2058 of 2339)
PASS: lldb-api :: lang/cpp/type_lookup/TestCppTypeLookup.py (2059 of 2339)
UNSUPPORTED: lldb-api :: python_api/disassemble-raw-data/TestDisassemble_VST1_64.py (2060 of 2339)
PASS: lldb-api :: python_api/symbol-context/TestSymbolContext.py (2061 of 2339)
PASS: lldb-unit :: Utility/./UtilityTests/StringLexerTest.NextIf (2062 of 2339)
UNSUPPORTED: lldb-api :: functionalities/darwin_log/source/info/TestDarwinLogSourceInfo.py (2063 of 2339)
PASS: lldb-api :: functionalities/param_entry_vals/basic_entry_values/TestBasicEntryValues.py (2064 of 2339)
PASS: lldb-unit :: ObjectFile/PECOFF/./ObjectFilePECOFFTests/PECallFrameInfoTest.Chained_eh (2065 of 2339)
PASS: lldb-unit :: UnwindAssembly/x86/./UnwindAssemblyx86Tests/Testx86AssemblyInspectionEngine.TestPopR12 (2066 of 2339)
PASS: lldb-unit :: Utility/./UtilityTests/StringExtractorTest.GetU64BigEndian (2067 of 2339)
PASS: lldb-unit :: ScriptInterpreter/Python/./ScriptInterpreterPythonTests/PythonDataObjectsTest.TestPythonCallableCheck (2068 of 2339)
PASS: lldb-api :: commands/watchpoints/watchpoint_on_vectors/TestValueOfVectorVariable.py (2069 of 2339)
PASS: lldb-api :: functionalities/data-formatter/data-formatter-objc/nsindexpath/TestDataFormatterNSIndexPath.py (2070 of 2339)
PASS: lldb-shell :: ObjectFile/ELF/netbsd-exec-8.99.30-amd64.yaml (2071 of 2339)
PASS: lldb-shell :: Breakpoint/debug_rnglist_basic.test (2072 of 2339)
PASS: lldb-unit :: Utility/./UtilityTests/BinaryStreamTest.PutSLEB128NineBytes (2073 of 2339)
PASS: lldb-unit :: Core/./LLDBCoreTests/FormatEntityTest.DefinitionConstructionNameTypeData (2074 of 2339)
PASS: lldb-api :: python_api/sbstructureddata/TestStructuredDataAPI.py (2075 of 2339)
PASS: lldb-api :: lang/cpp/auto/TestCPPAuto.py (2076 of 2339)
PASS: lldb-api :: commands/frame/var-scope/TestFrameVariableScope.py (2077 of 2339)
PASS: lldb-api :: functionalities/gdb_remote_client/TestTargetXMLArch.py (2078 of 2339)
PASS: lldb-api :: lang/c/forward/TestForwardDeclaration.py (2079 of 2339)
PASS: lldb-api :: functionalities/data-formatter/poarray/TestPrintObjectArray.py (2080 of 2339)
PASS: lldb-api :: commands/expression/unwind_expression/TestUnwindExpression.py (2081 of 2339)
PASS: lldb-unit :: Utility/./UtilityTests/StreamTest.AddressRangeInvalidRange (2082 of 2339)
PASS: lldb-api :: commands/process/attach/TestProcessAttach.py (2083 of 2339)
PASS: lldb-unit :: Utility/./UtilityTests/RangeVector.CombineConsecutiveRanges (2084 of 2339)
PASS: lldb-api :: lang/cpp/namespace/TestNamespace.py (2085 of 2339)
PASS: lldb-unit :: Utility/./UtilityTests/VMRange.SetEndAddress (2086 of 2339)
PASS: lldb-api :: tools/lldb-vscode/breakpoint-events/TestVSCode_breakpointEvents.py (2087 of 2339)
PASS: lldb-api :: functionalities/data-formatter/data-formatter-stl/libcxx/initializerlist/TestInitializerList.py (2088 of 2339)
PASS: lldb-shell :: ObjectFile/PECOFF/invalid-export-table.yaml (2089 of 2339)
PASS: lldb-unit :: ObjectFile/Breakpad/./ObjectFileBreakpadTests/InfoRecord.parse (2090 of 2339)
PASS: lldb-unit :: Utility/./UtilityTests/RangeDataVector.FindEntryIndexesThatContain (2091 of 2339)
PASS: lldb-unit :: Utility/./UtilityTests/StreamTeeTest.Write (2092 of 2339)
PASS: lldb-unit :: Symbol/./SymbolTests/TestClangASTImporter.CompleteFwdDeclWithOtherOrigin (2093 of 2339)
PASS: lldb-api :: macosx/version_zero/TestGetVersionZeroVersion.py (2094 of 2339)
PASS: lldb-api :: commands/target/stop-hook/delete/TestTargetStopHookDelete.py (2095 of 2339)
PASS: lldb-unit :: Utility/./UtilityTests/CompletionRequest.ShiftArguments (2096 of 2339)
PASS: lldb-unit :: SymbolFile/DWARF/./SymbolFileDWARFTests/SymbolFileDWARFTests.TestAbbrevOrder1Start1 (2097 of 2339)
PASS: lldb-unit :: Utility/./UtilityTests/BinaryStreamTest.PutSLEB128ThreeBytes (2098 of 2339)
PASS: lldb-shell :: Minidump/breakpad-symbols.test (2099 of 2339)
PASS: lldb-api :: functionalities/type_get_module/TestTypeGetModule.py (2100 of 2339)
PASS: lldb-api :: lang/cpp/function-qualifiers/TestCppFunctionQualifiers.py (2101 of 2339)
PASS: lldb-unit :: Language/CPlusPlus/./LanguageCPlusPlusTests/CPlusPlusLanguage.ExtractContextAndIdentifier (2102 of 2339)
UNSUPPORTED: lldb-shell :: SymbolFile/PDB/function-level-linking.test (2103 of 2339)
PASS: lldb-api :: lang/objc/direct-dispatch-step/TestObjCDirectDispatchStepping.py (2104 of 2339)
PASS: lldb-api :: functionalities/paths/TestPaths.py (2105 of 2339)
PASS: lldb-unit :: ScriptInterpreter/Python/./ScriptInterpreterPythonTests/PythonDataObjectsTest.TestBorrowedReferences (2106 of 2339)
UNSUPPORTED: lldb-api :: functionalities/darwin_log/filter/regex/category/TestDarwinLogFilterRegexCategory.py (2107 of 2339)
PASS: lldb-shell :: SymbolFile/DWARF/clang-ast-from-dwarf-objc-property.m (2108 of 2339)
PASS: lldb-unit :: Expression/./ExpressionTests/DWARFExpressionMockProcessTest.DW_OP_deref (2109 of 2339)
PASS: lldb-unit :: Process/gdb-remote/./ProcessGdbRemoteTests/GDBRemoteCommunicationServerTest.SendErrorResponse_StringError (2110 of 2339)
PASS: lldb-unit :: ObjectFile/Breakpad/./ObjectFileBreakpadTests/LineRecord.parse (2111 of 2339)
PASS: lldb-unit :: Process/gdb-remote/./ProcessGdbRemoteTests/GDBRemoteCommunicationClientTest.SendSignalsToIgnore (2112 of 2339)
UNSUPPORTED: lldb-api :: functionalities/tsan/multiple/TestTsanMultiple.py (2113 of 2339)
PASS: lldb-unit :: Process/gdb-remote/./ProcessGdbRemoteTests/GDBRemoteCommunicationClientTest.SyncThreadState (2114 of 2339)
PASS: lldb-api :: functionalities/thread/backtrace_all/TestBacktraceAll.py (2115 of 2339)
PASS: lldb-api :: lang/objc/objc-class-method/TestObjCClassMethod.py (2116 of 2339)
PASS: lldb-api :: lang/cpp/signed_types/TestSignedTypes.py (2117 of 2339)
PASS: lldb-unit :: Core/./LLDBCoreTests/FormatEntityTest.DefinitionConstructionNameAndType (2118 of 2339)
PASS: lldb-unit :: Language/CPlusPlus/./LanguageCPlusPlusTests/CPlusPlusLanguage.MethodNameParsing (2119 of 2339)
PASS: lldb-unit :: Utility/./UtilityTests/StringListTest.SplitIntoLinesSingleTrailingCR (2120 of 2339)
PASS: lldb-unit :: Utility/./UtilityTests/PassiveReplayTest.InstrumentedBar (2121 of 2339)
UNSUPPORTED: lldb-shell :: SymbolFile/DWARF/x86/DW_TAG_variable-DW_AT_decl_file-DW_AT_abstract_origin-crosscu1.s (2122 of 2339)
UNSUPPORTED: lldb-api :: functionalities/tsan/cpp_global_location/TestTsanCPPGlobalLocation.py (2123 of 2339)
PASS: lldb-unit :: Utility/./UtilityTests/ProcessInstanceInfoMatch.Name (2124 of 2339)
PASS: lldb-shell :: ScriptInterpreter/Python/scripted_breakpoint.test (2125 of 2339)
PASS: lldb-api :: functionalities/data-formatter/data-formatter-objc/TestDataFormatterObjCExpr.py (2126 of 2339)
PASS: lldb-unit :: Expression/./ExpressionTests/DiagnosticManagerTest.GetStringBasic (2127 of 2339)
PASS: lldb-api :: functionalities/rerun/TestRerun.py (2128 of 2339)
PASS: lldb-api :: functionalities/reproducers/fs-case-sensitivity/TestReproducerFSCaseSensitivity.py (2129 of 2339)
PASS: lldb-unit :: Utility/./UtilityTests/DataExtractorTest.GetULEB128_bit63 (2130 of 2339)
PASS: lldb-api :: commands/frame/diagnose/virtual-method-call/TestDiagnoseDereferenceVirtualMethodCall.py (2131 of 2339)
PASS: lldb-unit :: Symbol/./SymbolTests/TestTypeSystemClang.TestGetTypeClassTypeOfExpr (2132 of 2339)
PASS: lldb-api :: functionalities/pre_run_dylibs/TestPreRunDylibs.py (2133 of 2339)
PASS: lldb-api :: lang/objc/objc-static-method-stripped/TestObjCStaticMethodStripped.py (2134 of 2339)
PASS: lldb-unit :: ScriptInterpreter/Python/./ScriptInterpreterPythonTests/PythonDataObjectsTest.TestOwnedReferences (2135 of 2339)
PASS: lldb-api :: functionalities/data-formatter/data-formatter-synthval/TestDataFormatterSynthVal.py (2136 of 2339)
PASS: lldb-shell :: SymbolFile/DWARF/x86/dir-separator-no-comp-dir-relative-name.s (2137 of 2339)
PASS: lldb-unit :: Process/minidump/./LLDBMinidumpTests/MinidumpParserTest.MinidumpModuleOrder (2138 of 2339)
UNSUPPORTED: lldb-api :: iohandler/completion/TestIOHandlerCompletion.py (2139 of 2339)
PASS: lldb-unit :: Utility/./UtilityTests/StringListTest.InsertStringAtIndexEnd (2140 of 2339)
PASS: lldb-shell :: Reproducer/Functionalities/TestImageList.test (2141 of 2339)
PASS: lldb-unit :: Utility/./UtilityTests/RangeTest.ContainsEndInclusiveInvalid (2142 of 2339)
PASS: lldb-unit :: Utility/./UtilityTests/XcodeSDKTest.SDKSupportsSwift (2143 of 2339)
PASS: lldb-unit :: Utility/./UtilityTests/ScalarTest.RightShiftOperator (2144 of 2339)
PASS: lldb-unit :: Process/gdb-remote/./ProcessGdbRemoteTests/PortMapTest.FreePortForProcess (2145 of 2339)
PASS: lldb-unit :: Utility/./UtilityTests/StreamTest.PutHex64ByteOrderBig (2146 of 2339)
PASS: lldb-unit :: Process/Utility/./ProcessUtilityTests/RegisterContext_x86Test.AbridgedToFullTagWord (2147 of 2339)
PASS: lldb-api :: functionalities/thread/concurrent_events/TestConcurrentTwoWatchpointsOneBreakpoint.py (2148 of 2339)
PASS: lldb-api :: api/multithreaded/TestMultithreaded.py (2149 of 2339)
PASS: lldb-shell :: Register/x86-64-ymm-read.test (2150 of 2339)
PASS: lldb-unit :: Symbol/./SymbolTests/TestTypeSystemClang.TemplateArguments (2151 of 2339)
UNSUPPORTED: lldb-api :: functionalities/data-formatter/data-formatter-stl/libstdcpp/unique_ptr/TestDataFormatterStdUniquePtr.py (2152 of 2339)
PASS: lldb-api :: functionalities/data-formatter/data-formatter-stl/libcxx/optional/TestDataFormatterLibcxxOptional.py (2153 of 2339)
PASS: lldb-shell :: ObjectFile/ELF/eh_frame-symbols.yaml (2154 of 2339)
PASS: lldb-shell :: ScriptInterpreter/Python/fail_breakpoint_oneline.test (2155 of 2339)
PASS: lldb-unit :: Utility/./UtilityTests/GeneratorTest.Get (2156 of 2339)
PASS: lldb-unit :: Process/Utility/./ProcessUtilityTests/ProcSMapTests/LinuxProcSMapsTestFixture.ParseSMapRegions/7 (2157 of 2339)
PASS: lldb-unit :: Core/./LLDBCoreTests/ModuleSpecTest.TestCOFFFile (2158 of 2339)
PASS: lldb-unit :: DataFormatter/./LLDBFormatterTests/TypeMatcherTests.RegexName (2159 of 2339)
PASS: lldb-unit :: Utility/./UtilityTests/DataExtractorTest.PeekData (2160 of 2339)
PASS: lldb-api :: functionalities/abbreviation/TestCommonShortSpellings.py (2161 of 2339)
XFAIL: lldb-shell :: Expr/nodefaultlib.cpp (2162 of 2339)
PASS: lldb-unit :: Utility/./UtilityTests/AnsiTerminal.Unknown (2163 of 2339)
PASS: lldb-shell :: SymbolFile/DWARF/x86/find-variable-dwo.cpp (2164 of 2339)
PASS: lldb-api :: commands/quit/TestQuit.py (2165 of 2339)
PASS: lldb-api :: lang/cpp/char8_t/TestCxxChar8_t.py (2166 of 2339)
UNSUPPORTED: lldb-shell :: ScriptInterpreter/Lua/partial_statements.test (2167 of 2339)
PASS: lldb-shell :: ObjectFile/ELF/null-jmprel.yaml (2168 of 2339)
PASS: lldb-unit :: Utility/./UtilityTests/StreamTest.PutBytesAsRawHex8ToMixedEndian (2169 of 2339)
PASS: lldb-unit :: Utility/./UtilityTests/OptionsWithRawTest.LeadingSpaceArgs (2170 of 2339)
PASS: lldb-unit :: Utility/./UtilityTests/StreamTeeTest.GetStreamAtIndexOutOfBounds (2171 of 2339)
PASS: lldb-api :: lang/cpp/bool/TestCPPBool.py (2172 of 2339)
PASS: lldb-shell :: SymbolFile/NativePDB/nested-types.cpp (2173 of 2339)
PASS: lldb-unit :: Host/./HostTests/NativeProcessProtocolTest.SetBreakpointFailRead (2174 of 2339)
PASS: lldb-api :: python_api/process/io/TestProcessIO.py (2175 of 2339)
PASS: lldb-api :: commands/expression/import-std-module/conflicts/TestStdModuleWithConflicts.py (2176 of 2339)
PASS: lldb-api :: lang/objc/modules-objc-property/TestModulesObjCProperty.py (2177 of 2339)
PASS: lldb-unit :: Process/gdb-remote/./ProcessGdbRemoteTests/GDBRemoteClientBaseTest.SendContinueDelegateInterface (2178 of 2339)
PASS: lldb-unit :: tools/lldb-server/tests/./LLDBServerTests/TestBase.LaunchModePreservesEnvironment (2179 of 2339)
PASS: lldb-unit :: Utility/./UtilityTests/BinaryStreamTest.PutSLEB128FiveBytes (2180 of 2339)
PASS: lldb-unit :: ScriptInterpreter/Python/./ScriptInterpreterPythonTests/PythonDataObjectsTest.TestPythonBytes (2181 of 2339)
UNSUPPORTED: lldb-api :: lang/objc/rdar-12408181/TestRdar12408181.py (2182 of 2339)
PASS: lldb-unit :: SymbolFile/NativePDB/./SymbolFileNativePDBTests/PDBFPOProgramToDWARFExpressionTests.UnsupportedRASearch (2183 of 2339)
PASS: lldb-unit :: Symbol/./SymbolTests/TestTypeSystemClang.TestGetTypeClassTypeOf (2184 of 2339)
PASS: lldb-api :: functionalities/thread/concurrent_events/TestConcurrentNWatchNBreak.py (2185 of 2339)
PASS: lldb-api :: api/listeners/TestListener.py (2186 of 2339)
PASS: lldb-unit :: Utility/./UtilityTests/EventTest.DumpEventDataBytes (2187 of 2339)
PASS: lldb-unit :: Utility/./UtilityTests/StringExtractorTest.GetHexU8_Underflow2_NoEof (2188 of 2339)
PASS: lldb-shell :: Register/Core/x86-32-linux-addr.test (2189 of 2339)
PASS: lldb-unit :: Utility/./UtilityTests/RangeDataVector.FindEntryThatContains (2190 of 2339)
PASS: lldb-api :: functionalities/non-overlapping-index-variable-i/TestIndexVariable.py (2191 of 2339)
PASS: lldb-api :: python_api/value/TestValueAPI.py (2192 of 2339)
PASS: lldb-unit :: Utility/./UtilityTests/UriParserTest.SchemeHostSeparator (2193 of 2339)
PASS: lldb-unit :: Utility/./UtilityTests/ArgsTest.EscapeLLDBCommandArgument (2194 of 2339)
PASS: lldb-api :: functionalities/data-formatter/format-propagation/TestFormatPropagation.py (2195 of 2339)
PASS: lldb-api :: commands/frame/var/TestFrameVar.py (2196 of 2339)
UNSUPPORTED: lldb-api :: commands/watchpoints/multi_watchpoint_slots/TestWatchpointMultipleSlots.py (2197 of 2339)
UNSUPPORTED: lldb-api :: functionalities/thread/state/TestThreadStates.py (2198 of 2339)
UNSUPPORTED: lldb-shell :: Register/x86-ymm-read.test (2199 of 2339)
PASS: lldb-api :: lang/c/const_variables/TestConstVariables.py (2200 of 2339)
PASS: lldb-api :: commands/expression/codegen-crash-typedefdecl-not-in_declcontext/TestCodegenCrashTypedefDeclNotInDeclContext.py (2201 of 2339)
PASS: lldb-api :: commands/add-dsym/uuid/TestAddDsymCommand.py (2202 of 2339)
PASS: lldb-shell :: SymbolFile/DWARF/dwo-relative-path.s (2203 of 2339)
PASS: lldb-unit :: Utility/./UtilityTests/StringListTest.ForRangeEmpty (2204 of 2339)
PASS: lldb-unit :: Utility/./UtilityTests/RegisterValueTest.GetScalarValue (2205 of 2339)
PASS: lldb-api :: commands/expression/call-function/TestCallStopAndContinue.py (2206 of 2339)
PASS: lldb-unit :: Expression/./ExpressionTests/DWARFExpression.DW_OP_pick (2207 of 2339)
PASS: lldb-unit :: Utility/./UtilityTests/FileSpecTest.Equal (2208 of 2339)
PASS: lldb-api :: macosx/order/TestOrderFile.py (2209 of 2339)
PASS: lldb-shell :: SymbolFile/DWARF/x86/debug_aranges-empty-section.s (2210 of 2339)
PASS: lldb-unit :: Utility/./UtilityTests/StringExtractorTest.GetHexBytes_OddPair (2211 of 2339)
PASS: lldb-shell :: Register/Core/x86-64-linux-fp.test (2212 of 2339)
PASS: lldb-shell :: ObjectFile/ELF/PT_LOAD-overlap.yaml (2213 of 2339)
PASS: lldb-api :: python_api/value/change_values/TestChangeValueAPI.py (2214 of 2339)
PASS: lldb-api :: lang/objc/foundation/TestObjCMethods2.py (2215 of 2339)
PASS: lldb-unit :: Utility/./UtilityTests/AnsiTerminal.AtEnd (2216 of 2339)
PASS: lldb-api :: api/log/TestAPILog.py (2217 of 2339)
PASS: lldb-shell :: SymbolFile/NativePDB/global-classes.cpp (2218 of 2339)
PASS: lldb-unit :: Process/minidump/./LLDBMinidumpTests/RegisterContextMinidump.ConvertMinidumpContext_x86_64 (2219 of 2339)
PASS: lldb-shell :: Driver/TestFile.test (2220 of 2339)
PASS: lldb-api :: lang/cpp/offsetof/TestOffsetofCpp.py (2221 of 2339)
PASS: lldb-api :: commands/platform/process/list/TestProcessList.py (2222 of 2339)
UNSUPPORTED: lldb-shell :: ScriptInterpreter/Lua/breakpoint_function_callback.test (2223 of 2339)
PASS: lldb-unit :: Platform/./LLDBPlatformTests/PlatformAppleSimulatorTest.TestHostPlatformToSim (2224 of 2339)
PASS: lldb-unit :: Utility/./UtilityTests/StreamTest.PutHex16ByteOrderLittle (2225 of 2339)
PASS: lldb-shell :: ObjectFile/Breakpad/sections-trailing-func.test (2226 of 2339)
PASS: lldb-unit :: Interpreter/./InterpreterTests/OptionArgParserTest.toChar (2227 of 2339)
PASS: lldb-shell :: BuildScript/script-args.test (2228 of 2339)
PASS: lldb-unit :: Utility/./UtilityTests/XcodeSDKTest.GetSDKTypeForTriple (2229 of 2339)
PASS: lldb-unit :: Utility/./UtilityTests/NameMatchesTest.Ignore (2230 of 2339)
PASS: lldb-api :: functionalities/data-formatter/type_summary_list_arg/TestTypeSummaryListArg.py (2231 of 2339)
PASS: lldb-unit :: Language/Highlighting/./HighlighterTests/HighlighterTest.ClangCursorPosAfterOtherToken (2232 of 2339)
UNSUPPORTED: lldb-api :: lang/cpp/printf/TestPrintf.py (2233 of 2339)
PASS: lldb-api :: functionalities/data-formatter/data-formatter-named-summaries/TestDataFormatterNamedSummaries.py (2234 of 2339)
PASS: lldb-unit :: Utility/./UtilityTests/FileSpecTest.AppendPathComponent (2235 of 2339)
PASS: lldb-unit :: Utility/./UtilityTests/StreamTeeTest.GetStreamAtIndexOutOfBoundsEmpty (2236 of 2339)
PASS: lldb-unit :: SymbolFile/DWARF/./SymbolFileDWARFTests/SymbolFileDWARFTests.ParseAranges (2237 of 2339)
PASS: lldb-unit :: ScriptInterpreter/Python/./ScriptInterpreterPythonTests/PythonDataObjectsTest.TestPythonListManipulation (2238 of 2339)
PASS: lldb-unit :: Host/./HostTests/PipeTest.OpenAsReader (2239 of 2339)
PASS: lldb-api :: lang/cpp/constructors/TestCppConstructors.py (2240 of 2339)
PASS: lldb-api :: commands/expression/persistent_types/TestPersistentTypes.py (2241 of 2339)
PASS: lldb-unit :: Expression/./ExpressionTests/DiagnosticManagerTest.AppendMessageAttachToLastDiag (2242 of 2339)
PASS: lldb-unit :: Utility/./UtilityTests/OptionsWithRawTest.SingleWordSuffix (2243 of 2339)
PASS: lldb-unit :: Language/Highlighting/./HighlighterTests/HighlighterTest.ClangOperators (2244 of 2339)
PASS: lldb-unit :: Host/./HostTests/HostInfoTest.GetHostname (2245 of 2339)
PASS: lldb-shell :: SymbolFile/DWARF/x86/inline-function-address-shared.test (2246 of 2339)
PASS: lldb-unit :: Process/./ProcessEventDataTests/ProcessEventDataTest.ShouldStop (2247 of 2339)
PASS: lldb-api :: functionalities/object-file/TestImageListMultiArchitecture.py (2248 of 2339)
PASS: lldb-unit :: Utility/./UtilityTests/StringListTest.JoinSingle (2249 of 2339)
PASS: lldb-api :: functionalities/postmortem/minidump-new/TestMiniDumpUUID.py (2250 of 2339)
PASS: lldb-unit :: Utility/./UtilityTests/StringListTest.ShiftCString (2251 of 2339)
UNSUPPORTED: lldb-api :: commands/register/register/aarch64_sve_registers/rw_access_static_config/TestSVERegisters.py (2252 of 2339)
PASS: lldb-unit :: Core/./LLDBCoreTests/RichManglingContextTest.IPDRealloc (2253 of 2339)
PASS: lldb-shell :: Reproducer/TestVersionCheck.test (2254 of 2339)
PASS: lldb-unit :: UnwindAssembly/x86/./UnwindAssemblyx86Tests/Testx86AssemblyInspectionEngine.TestPushImm (2255 of 2339)
PASS: lldb-api :: lang/cpp/typeof/TestTypeOfDeclTypeExpr.py (2256 of 2339)
PASS: lldb-api :: functionalities/multiword-commands/TestMultiWordCommands.py (2257 of 2339)
PASS: lldb-unit :: Process/gdb-remote/./ProcessGdbRemoteTests/PortMapTest.AllowPort (2258 of 2339)
PASS: lldb-api :: functionalities/data-formatter/data-formatter-objc/TestDataFormatterObjCCF.py (2259 of 2339)
PASS: lldb-unit :: Utility/./UtilityTests/DataExtractorTest.GetBitfield (2260 of 2339)
PASS: lldb-unit :: Utility/./UtilityTests/DeserializerTest.HasData (2261 of 2339)
PASS: lldb-unit :: Expression/./ExpressionTests/CppModuleConfigurationTest.AmbiguousLibCpp (2262 of 2339)
PASS: lldb-unit :: UnwindAssembly/x86/./UnwindAssemblyx86Tests/Testx86AssemblyInspectionEngine.TestPopESI (2263 of 2339)
PASS: lldb-unit :: Language/Highlighting/./HighlighterTests/HighlighterTest.ClangTrailingBackslashMissingNewLine (2264 of 2339)
UNSUPPORTED: lldb-shell :: Register/x86-zmm-write.test (2265 of 2339)
PASS: lldb-api :: lang/cpp/overloaded-functions/TestOverloadedFunctions.py (2266 of 2339)
PASS: lldb-api :: lang/cpp/operators/TestCppOperators.py (2267 of 2339)
PASS: lldb-api :: commands/target/create-no-such-arch/TestNoSuchArch.py (2268 of 2339)
PASS: lldb-unit :: Utility/./UtilityTests/UriParserTest.BracketedHostnamePort (2269 of 2339)
PASS: lldb-api :: types/TestCharType.py (2270 of 2339)
PASS: lldb-shell :: VSCode/TestOptions.test (2271 of 2339)
PASS: lldb-shell :: SymbolFile/DWARF/x86/debug-line-basic.s (2272 of 2339)
PASS: lldb-shell :: Register/Core/x86-32-freebsd-gp.test (2273 of 2339)
PASS: lldb-api :: functionalities/data-formatter/data-formatter-skip-summary/TestDataFormatterSkipSummary.py (2274 of 2339)
PASS: lldb-shell :: Commands/command-target-modules-dump-sections.yaml (2275 of 2339)
XFAIL: lldb-shell :: Register/x86-mm-xmm-write.test (2276 of 2339)
PASS: lldb-shell :: Reproducer/TestDriverOptions.test (2277 of 2339)
PASS: lldb-api :: lang/objc/forward-decl/TestForwardDecl.py (2278 of 2339)
PASS: lldb-api :: functionalities/data-formatter/data-formatter-stl/libcxx/bitset/TestDataFormatterLibcxxBitset.py (2279 of 2339)
PASS: lldb-unit :: Symbol/./SymbolTests/TestTypeSystemClang.TestUnifyAccessSpecifiers (2280 of 2339)
PASS: lldb-shell :: Commands/command-regex-delete.test (2281 of 2339)
PASS: lldb-api :: lang/objc/objc_direct-methods/TestObjCDirectMethods.py (2282 of 2339)
PASS: lldb-unit :: Utility/./UtilityTests/XcodeSDKTest.ParseTest (2283 of 2339)
PASS: lldb-api :: lang/c/step_over_no_deadlock/TestStepOverDoesntBlock.py (2284 of 2339)
PASS: lldb-api :: commands/command/script/import/TestImport.py (2285 of 2339)
PASS: lldb-api :: functionalities/avoids-fd-leak/TestFdLeak.py (2286 of 2339)
PASS: lldb-shell :: Reproducer/TestHomeDir.test (2287 of 2339)
PASS: lldb-api :: lang/c/unions/TestUnionMembers.py (2288 of 2339)
PASS: lldb-unit :: Utility/./UtilityTests/StringExtractorTest.GetU32BigEndian (2289 of 2339)
PASS: lldb-api :: functionalities/data-formatter/data-formatter-disabling/TestDataFormatterDisabling.py (2290 of 2339)
PASS: lldb-unit :: Language/Highlighting/./HighlighterTests/HighlighterTest.ClangPPDirectives (2291 of 2339)
PASS: lldb-shell :: ObjectFile/PECOFF/symbol.yaml (2292 of 2339)
PASS: lldb-unit :: Utility/./UtilityTests/StringListTest.GetMaxStringLengthEmpty (2293 of 2339)
PASS: lldb-unit :: Process/minidump/./LLDBMinidumpTests/MinidumpParserTest.GetPidWindows (2294 of 2339)
PASS: lldb-unit :: Utility/./UtilityTests/RangeTest.EqualInvalid (2295 of 2339)
PASS: lldb-unit :: Utility/./UtilityTests/SerializationRountripTest.SerializeDeserializeCStringArrayNullptrElem (2296 of 2339)
UNSUPPORTED: lldb-api :: terminal/TestEditline.py (2297 of 2339)
PASS: lldb-unit :: Process/Utility/./ProcessUtilityTests/ProcSMapTests/LinuxProcSMapsTestFixture.ParseSMapRegions/1 (2298 of 2339)
PASS: lldb-api :: commands/expression/test/TestExprs.py (2299 of 2339)
UNSUPPORTED: lldb-api :: benchmarks/frame_variable/TestFrameVariableResponse.py (2300 of 2339)
PASS: lldb-api :: functionalities/reproducers/attach/TestReproducerAttach.py (2301 of 2339)
PASS: lldb-api :: commands/frame/select/TestFrameSelect.py (2302 of 2339)
PASS: lldb-api :: functionalities/step_scripted/TestStepScripted.py (2303 of 2339)
PASS: lldb-shell :: Driver/TestHelp.test (2304 of 2339)
PASS: lldb-api :: commands/expression/import_builtin_fileid/TestImportBuiltinFileID.py (2305 of 2339)
PASS: lldb-shell :: SymbolFile/DWARF/x86/gnu-style-compression.cpp (2306 of 2339)
UNSUPPORTED: lldb-api :: android/platform/TestDefaultCacheLineSize.py (2307 of 2339)
UNSUPPORTED: lldb-shell :: Unwind/eh-frame-augment-noop.test (2308 of 2339)
PASS: lldb-shell :: SymbolFile/DWARF/x86/dwarf5-debug_line-file-index.s (2309 of 2339)
PASS: lldb-unit :: Utility/./UtilityTests/StructuredDataTest.ParseJSONFromFile (2310 of 2339)
PASS: lldb-unit :: Utility/./UtilityTests/StreamTest.PutPtr (2311 of 2339)
UNSUPPORTED: lldb-api :: functionalities/darwin_log/filter/exact_match/activity-chain/TestDarwinLogFilterMatchActivityChain.py (2312 of 2339)
PASS: lldb-api :: functionalities/tail_call_frames/inlining_and_tail_calls/TestInliningAndTailCalls.py (2313 of 2339)
PASS: lldb-unit :: Utility/./UtilityTests/CompletionRequest.TryCompleteCurrentArgMode (2314 of 2339)
PASS: lldb-api :: functionalities/data-formatter/array_typedef/TestArrayTypedef.py (2315 of 2339)
PASS: lldb-api :: functionalities/data-formatter/data-formatter-objc/TestDataFormatterObjCNSData.py (2316 of 2339)
PASS: lldb-api :: lang/c/array_types/TestArrayTypes.py (2317 of 2339)
PASS: lldb-unit :: Utility/./UtilityTests/StringListTest.GetMaxStringLengthMixed (2318 of 2339)
PASS: lldb-unit :: Host/./HostTests/FileSystemTest.MakeAbsolute (2319 of 2339)
PASS: lldb-unit :: Utility/./UtilityTests/PassiveReplayTest.InstrumentedFoo (2320 of 2339)
PASS: lldb-api :: functionalities/thread_plan/TestThreadPlanCommands.py (2321 of 2339)
PASS: lldb-unit :: Host/./HostTests/FileSystemTest.Exists (2322 of 2339)
PASS: lldb-unit :: Core/./LLDBCoreTests/MangledTest.EmptyForInvalidName (2323 of 2339)
PASS: lldb-unit :: Utility/./UtilityTests/RangeTest.ContainsRange (2324 of 2339)
PASS: lldb-api :: functionalities/breakpoint/address_breakpoints/TestAddressBreakpoints.py (2325 of 2339)
PASS: lldb-unit :: Process/gdb-remote/./ProcessGdbRemoteTests/GDBRemoteClientBaseTest.SendContinueAndInterrupt2PacketBug (2326 of 2339)
PASS: lldb-unit :: Utility/./UtilityTests/StreamTest.AddressSuffix (2327 of 2339)
UNSUPPORTED: lldb-shell :: SymbolFile/PDB/variables-locations.test (2328 of 2339)
PASS: lldb-api :: functionalities/set-data/TestSetData.py (2329 of 2339)
PASS: lldb-unit :: ObjectFile/ELF/./ObjectFileELFTests/ObjectFileELFTest.SectionsResolveConsistently (2330 of 2339)
PASS: lldb-unit :: Utility/./UtilityTests/LogChannelEnabledTest.LogThread (2331 of 2339)
PASS: lldb-unit :: Process/minidump/./LLDBMinidumpTests/MinidumpParserTest.GetLinuxProcStatus_no_stream (2332 of 2339)
PASS: lldb-api :: functionalities/thread/concurrent_events/TestConcurrentTwoBreakpointsOneSignal.py (2333 of 2339)
UNSUPPORTED: lldb-api :: functionalities/data-formatter/data-formatter-stl/libstdcpp/iterator/TestDataFormatterStdIterator.py (2334 of 2339)
PASS: lldb-api :: commands/command/script/import/rdar-12586188/TestRdar12586188.py (2335 of 2339)
UNSUPPORTED: lldb-api :: lang/c/typedef/Testtypedef.py (2336 of 2339)
PASS: lldb-api :: functionalities/gdb_remote_client/TestJLink6Armv7RegisterDefinition.py (2337 of 2339)
PASS: lldb-api :: commands/expression/import-std-module/shared_ptr/TestSharedPtrFromStdModule.py (2338 of 2339)
PASS: lldb-api :: commands/expression/po_verbosity/TestPoVerbosity.py (2339 of 2339)
Slowest Tests:
--------------------------------------------------------------------------
413.31s: lldb-api :: tools/lldb-server/TestLldbGdbServer.py
243.52s: lldb-api :: api/multithreaded/TestMultithreaded.py
128.17s: lldb-api :: functionalities/completion/TestCompletion.py
113.62s: lldb-api :: lang/objc/exceptions/TestObjCExceptions.py
108.19s: lldb-api :: lang/objc/hidden-ivars/TestHiddenIvars.py
104.22s: lldb-api :: lang/cpp/namespace/TestNamespaceLookup.py
103.27s: lldb-api :: lang/objc/objc-new-syntax/TestObjCNewSyntaxLiteral.py
102.95s: lldb-api :: lang/objc/foundation/TestObjCMethods.py
102.39s: lldb-api :: types/TestLongTypesExpr.py
93.29s: lldb-api :: lang/objc/real-definition/TestRealDefinition.py
91.64s: lldb-api :: functionalities/gdb_remote_client/TestWasm.py
85.23s: lldb-api :: types/TestIntegerTypeExpr.py
81.33s: lldb-api :: commands/expression/import-std-module/queue/TestQueueFromStdModule.py
78.28s: lldb-api :: lang/objc/objc-new-syntax/TestObjCNewSyntaxArray.py
78.15s: lldb-api :: commands/expression/import-std-module/stack/TestStackFromStdModule.py
77.13s: lldb-api :: lang/objc/objc-new-syntax/TestObjCNewSyntaxDictionary.py
75.84s: lldb-api :: tools/lldb-server/TestGdbRemoteThreadsInStopReply.py
72.17s: lldb-api :: commands/settings/TestSettings.py
68.98s: lldb-api :: python_api/target/TestTargetAPI.py
67.48s: lldb-api :: lang/objc/modules/TestObjCModules.py

Tests Times:
--------------------------------------------------------------------------
[   Range   ] :: [               Percentage               ] :: [  Count  ]
--------------------------------------------------------------------------
[400s,420s) :: [                                        ] :: [   1/2339]
[380s,400s) :: [                                        ] :: [   0/2339]
[360s,380s) :: [                                        ] :: [   0/2339]
[340s,360s) :: [                                        ] :: [   0/2339]
[320s,340s) :: [                                        ] :: [   0/2339]
[300s,320s) :: [                                        ] :: [   0/2339]
[280s,300s) :: [                                        ] :: [   0/2339]
[260s,280s) :: [                                        ] :: [   0/2339]
[240s,260s) :: [                                        ] :: [   1/2339]
[220s,240s) :: [                                        ] :: [   0/2339]
[200s,220s) :: [                                        ] :: [   0/2339]
[180s,200s) :: [                                        ] :: [   0/2339]
[160s,180s) :: [                                        ] :: [   0/2339]
[140s,160s) :: [                                        ] :: [   0/2339]
[120s,140s) :: [                                        ] :: [   1/2339]
[100s,120s) :: [                                        ] :: [   6/2339]
[ 80s,100s) :: [                                        ] :: [   4/2339]
[ 60s, 80s) :: [                                        ] :: [  11/2339]
[ 40s, 60s) :: [                                        ] :: [  37/2339]
[ 20s, 40s) :: [**                                      ] :: [ 142/2339]
[  0s, 20s) :: [************************************    ] :: [2136/2339]
--------------------------------------------------------------------------
********************
Failed Tests (3):
  lldb-api :: tools/lldb-vscode/breakpoint/TestVSCode_setBreakpoints.py
  lldb-api :: tools/lldb-vscode/breakpoint/TestVSCode_setFunctionBreakpoints.py
  lldb-api :: tools/lldb-vscode/evaluate/TestVSCode_evaluate.py


Testing Time: 3506.12s
  Unsupported      :  209
  Passed           : 2117
  Expectedly Failed:   10
  Failed           :    3
FAILED: tools/lldb/test/CMakeFiles/check-lldb 
cd /Users/buildslave/jenkins/workspace/lldb-cmake-sanitized/lldb-build/tools/lldb/test && /usr/local/Frameworks/Python.framework/Versions/3.7/bin/python3.7 /Users/buildslave/jenkins/workspace/lldb-cmake-sanitized/lldb-build/./bin/llvm-lit -v --time-tests --shuffle --xunit-xml-output=/Users/buildslave/jenkins/workspace/lldb-cmake-sanitized/test/results.xml -v -j 4 --timeout 1200 /Users/buildslave/jenkins/workspace/lldb-cmake-sanitized/lldb-build/tools/lldb/test
ninja: build stopped: subcommand failed.
Command failed: Command '['/usr/bin/env', 'TERM=vt100', '/usr/local/bin/ninja', '-v', 'check-lldb']' returned non-zero exit status 1.
Command: ['/usr/bin/env', 'TERM=vt100', '/usr/local/bin/ninja', '-v', 'check-lldb']