Console Output

Skipping 9,496 KB.. Full Log

Hide Details

{"command":"stackTrace","type":"request","arguments":{"threadId":259631,"startFrame":0,"levels":1},"seq":14} <-- Content-Length: 331

Hide Details

{"body":{"stackFrames":[{"column":14,"id":524288,"line":23,"name":"main","source":{"name":"main.cpp","path":"/Users/buildslave/jenkins/workspace/lldb-cmake-sanitized/llvm-project/lldb/test/API/tools/lldb-vscode/evaluate/main.cpp"}}],"totalFrames":3},"command":"stackTrace","request_seq":14,"seq":0,"success":true,"type":"response"} --> Content-Length: 119

Hide Details

{"command":"evaluate","type":"request","arguments":{"expression":"struct1","context":"repl","frameId":524288},"seq":15} <-- Content-Length: 169

Hide Details

{"body":{"result":"my_struct @ 0x7ffeefbff7c8","type":"my_struct","variablesReference":4},"command":"evaluate","request_seq":15,"seq":0,"success":true,"type":"response"} --> Content-Length: 108

Hide Details

{"command":"stackTrace","type":"request","arguments":{"threadId":259631,"startFrame":0,"levels":1},"seq":16} <-- Content-Length: 331

Hide Details

{"body":{"stackFrames":[{"column":14,"id":524288,"line":23,"name":"main","source":{"name":"main.cpp","path":"/Users/buildslave/jenkins/workspace/lldb-cmake-sanitized/llvm-project/lldb/test/API/tools/lldb-vscode/evaluate/main.cpp"}}],"totalFrames":3},"command":"stackTrace","request_seq":16,"seq":0,"success":true,"type":"response"} --> Content-Length: 123

Hide Details

{"command":"evaluate","type":"request","arguments":{"expression":"struct1.foo","context":"repl","frameId":524288},"seq":17} <-- Content-Length: 139

Hide Details

{"body":{"result":"15","type":"int","variablesReference":0},"command":"evaluate","request_seq":17,"seq":0,"success":true,"type":"response"} --> Content-Length: 108

Hide Details

{"command":"stackTrace","type":"request","arguments":{"threadId":259631,"startFrame":0,"levels":1},"seq":18} <-- Content-Length: 331

Hide Details

{"body":{"stackFrames":[{"column":14,"id":524288,"line":23,"name":"main","source":{"name":"main.cpp","path":"/Users/buildslave/jenkins/workspace/lldb-cmake-sanitized/llvm-project/lldb/test/API/tools/lldb-vscode/evaluate/main.cpp"}}],"totalFrames":3},"command":"stackTrace","request_seq":18,"seq":0,"success":true,"type":"response"} --> Content-Length: 124

Hide Details

{"command":"evaluate","type":"request","arguments":{"expression":"struct2->foo","context":"repl","frameId":524288},"seq":19} <-- Content-Length: 139

Hide Details

{"body":{"result":"16","type":"int","variablesReference":0},"command":"evaluate","request_seq":19,"seq":0,"success":true,"type":"response"} --> Content-Length: 108

Hide Details

{"command":"stackTrace","type":"request","arguments":{"threadId":259631,"startFrame":0,"levels":1},"seq":20} <-- Content-Length: 331

Hide Details

{"body":{"stackFrames":[{"column":14,"id":524288,"line":23,"name":"main","source":{"name":"main.cpp","path":"/Users/buildslave/jenkins/workspace/lldb-cmake-sanitized/llvm-project/lldb/test/API/tools/lldb-vscode/evaluate/main.cpp"}}],"totalFrames":3},"command":"stackTrace","request_seq":20,"seq":0,"success":true,"type":"response"} --> Content-Length: 115

Hide Details

{"command":"evaluate","type":"request","arguments":{"expression":"var","context":"repl","frameId":524288},"seq":21} <-- Content-Length: 209

Hide Details

{"body":{},"command":"evaluate","message":"expression failed to parse:\nerror: <user expression 0>:1:1: use of undeclared identifier 'var'\nvar\n^\n","request_seq":21,"seq":0,"success":false,"type":"response"} --> Content-Length: 108

Hide Details

{"command":"stackTrace","type":"request","arguments":{"threadId":259631,"startFrame":0,"levels":1},"seq":22} <-- Content-Length: 331

Hide Details

{"body":{"stackFrames":[{"column":14,"id":524288,"line":23,"name":"main","source":{"name":"main.cpp","path":"/Users/buildslave/jenkins/workspace/lldb-cmake-sanitized/llvm-project/lldb/test/API/tools/lldb-vscode/evaluate/main.cpp"}}],"totalFrames":3},"command":"stackTrace","request_seq":22,"seq":0,"success":true,"type":"response"} --> Content-Length: 121

Hide Details

{"command":"evaluate","type":"request","arguments":{"expression":"my_struct","context":"repl","frameId":524288},"seq":23} <-- Content-Length: 311

Hide Details

{"body":{"category":"console","output":"/Users/buildslave/jenkins/workspace/lldb-cmake-sanitized/llvm-project/lldb/tools/lldb-vscode/ProgressEvent.cpp:89:64: runtime error: load of value 808464432, which is not a valid value for type 'lldb_vscode::ProgressEventType'\n"},"event":"output","seq":0,"type":"event"} <-- Content-Length: 261

Hide Details

{"body":{"category":"console","output":"SUMMARY: UndefinedBehaviorSanitizer: undefined-behavior /Users/buildslave/jenkins/workspace/lldb-cmake-sanitized/llvm-project/lldb/tools/lldb-vscode/ProgressEvent.cpp:89:64 in \n"},"event":"output","seq":0,"type":"event"} <-- Content-Length: 170

Hide Details

{"body":{"category":"console","output":"PLEASE submit a bug report to https://bugs.llvm.org/ and include the crash backtrace.\n"},"event":"output","seq":0,"type":"event"} <-- Content-Length: 117

Hide Details

{"body":{},"command":"evaluate","message":"unknown error","request_seq":23,"seq":0,"success":false,"type":"response"} --> Content-Length: 108

Hide Details

{"command":"stackTrace","type":"request","arguments":{"threadId":259631,"startFrame":0,"levels":1},"seq":24} <-- Content-Length: 331

Hide Details

{"body":{"stackFrames":[{"column":14,"id":524288,"line":23,"name":"main","source":{"name":"main.cpp","path":"/Users/buildslave/jenkins/workspace/lldb-cmake-sanitized/llvm-project/lldb/test/API/tools/lldb-vscode/evaluate/main.cpp"}}],"totalFrames":3},"command":"stackTrace","request_seq":24,"seq":0,"success":true,"type":"response"} --> Content-Length: 115

Hide Details

{"command":"evaluate","type":"request","arguments":{"expression":"int","context":"repl","frameId":524288},"seq":25}

Hide Details

========= END ========= ========= DEBUG ADAPTER PROTOCOL LOGS ========= --> Content-Length: 284

Hide Details

{"command":"initialize","type":"request","arguments":{"adapterID":"lldb-native","clientID":"vscode","columnsStartAt1":true,"linesStartAt1":true,"locale":"en-us","pathFormat":"path","supportsRunInTerminalRequest":true,"supportsVariablePaging":true,"supportsVariableType":true},"seq":1} <-- Content-Length: 1222

Hide Details

{"body":{"exceptionBreakpointFilters":[{"default":false,"filter":"cpp_catch","label":"C++ Catch"},{"default":false,"filter":"cpp_throw","label":"C++ Throw"},{"default":false,"filter":"objc_catch","label":"Objective C Catch"},{"default":false,"filter":"objc_throw","label":"Objective C Throw"},{"default":false,"filter":"swift_catch","label":"Swift Catch"},{"default":false,"filter":"swift_throw","label":"Swift Throw"}],"supportTerminateDebuggee":true,"supportsCompletionsRequest":false,"supportsConditionalBreakpoints":true,"supportsConfigurationDoneRequest":true,"supportsDelayedStackTraceLoading":true,"supportsEvaluateForHovers":true,"supportsExceptionInfoRequest":true,"supportsExceptionOptions":true,"supportsFunctionBreakpoints":true,"supportsGotoTargetsRequest":false,"supportsHitConditionalBreakpoints":true,"supportsLoadedSourcesRequest":false,"supportsModulesRequest":false,"supportsProgressReporting":true,"supportsRestartFrame":false,"supportsRestartRequest":false,"supportsRunInTerminalRequest":true,"supportsSetVariable":true,"supportsStepBack":false,"supportsStepInTargetsRequest":false,"supportsValueFormattingOptions":true},"command":"initialize","request_seq":1,"seq":0,"success":true,"type":"response"} --> Content-Length: 1041

Hide Details

{"command":"launch","type":"request","arguments":{"program":"/Users/buildslave/jenkins/workspace/lldb-cmake-sanitized/lldb-build/lldb-test-build.noindex/tools/lldb-vscode/evaluate/TestVSCode_evaluate.test_watch_evaluate_expressions/a.out","disableASLR":true,"initCommands":["settings clear -all","settings set symbols.enable-external-lookup false","settings set target.inherit-tcc true","settings set target.detach-on-error false","settings set target.auto-apply-fixits false","settings set plugin.process.gdb-remote.packet-timeout 60","settings set symbols.clang-modules-cache-path \"/Users/buildslave/jenkins/workspace/lldb-cmake-sanitized/lldb-build/lldb-test-build.noindex/module-cache-lldb/lldb-api\"","settings set use-color false","setting set target.prefer-dynamic-value no-dynamic-values","settings set target.env-vars ASAN_OPTIONS=detect_stack_use_after_return=1 DYLD_INSERT_LIBRARIES=/Users/buildslave/jenkins/workspace/lldb-cmake-sanitized/host-compiler/lib/clang/13.0.99/lib/darwin/libclang_rt.asan_osx_dynamic.dylib"]},"seq":2} <-- Content-Length: 923

Hide Details

{"body":{"category":"console","output":"Running initCommands:\n(lldb) settings clear -all\n(lldb) settings set symbols.enable-external-lookup false\n(lldb) settings set target.inherit-tcc true\n(lldb) settings set target.detach-on-error false\n(lldb) settings set target.auto-apply-fixits false\n(lldb) settings set plugin.process.gdb-remote.packet-timeout 60\n(lldb) settings set symbols.clang-modules-cache-path \"/Users/buildslave/jenkins/workspace/lldb-cmake-sanitized/lldb-build/lldb-test-build.noindex/module-cache-lldb/lldb-api\"\n(lldb) settings set use-color false\n(lldb) setting set target.prefer-dynamic-value no-dynamic-values\n(lldb) settings set target.env-vars ASAN_OPTIONS=detect_stack_use_after_return=1 DYLD_INSERT_LIBRARIES=/Users/buildslave/jenkins/workspace/lldb-cmake-sanitized/host-compiler/lib/clang/13.0.99/lib/darwin/libclang_rt.asan_osx_dynamic.dylib\n"},"event":"output","seq":0,"type":"event"} <-- Content-Length: 77

Hide Details

{"command":"launch","request_seq":2,"seq":0,"success":true,"type":"response"} <-- Content-Length: 306

Hide Details

{"body":{"isLocalProcess":true,"name":"/Users/buildslave/jenkins/workspace/lldb-cmake-sanitized/lldb-build/lldb-test-build.noindex/tools/lldb-vscode/evaluate/TestVSCode_evaluate.test_watch_evaluate_expressions/a.out","startMethod":"launch","systemProcessId":41974},"event":"process","seq":0,"type":"event"} <-- Content-Length: 46

Hide Details

{"event":"initialized","seq":0,"type":"event"} --> Content-Length: 276

Hide Details

{"command":"setBreakpoints","type":"request","arguments":{"source":{"name":"main.cpp","path":"main.cpp"},"sourceModified":false,"lines":"[23, 27, 11, 35, 40, 44, 45]","breakpoints":[{"line":23},{"line":27},{"line":11},{"line":35},{"line":40},{"line":44},{"line":45}]},"seq":3} <-- Content-Length: 684

Hide Details

{"body":{"breakpoints":[{"id":1,"line":23,"source":{"name":"main.cpp","path":"main.cpp"},"verified":true},{"id":2,"line":27,"source":{"name":"main.cpp","path":"main.cpp"},"verified":true},{"id":3,"line":11,"source":{"name":"main.cpp","path":"main.cpp"},"verified":true},{"id":4,"line":35,"source":{"name":"main.cpp","path":"main.cpp"},"verified":true},{"id":5,"line":40,"source":{"name":"main.cpp","path":"main.cpp"},"verified":true},{"id":6,"line":44,"source":{"name":"main.cpp","path":"main.cpp"},"verified":true},{"id":7,"line":45,"source":{"name":"main.cpp","path":"main.cpp"},"verified":true}]},"command":"setBreakpoints","request_seq":3,"seq":0,"success":true,"type":"response"} --> Content-Length: 71

Hide Details

{"command":"configurationDone","type":"request","arguments":{},"seq":4} <-- Content-Length: 88

Hide Details

{"command":"configurationDone","request_seq":4,"seq":0,"success":true,"type":"response"} <-- Content-Length: 198

Hide Details

{"body":{"allThreadsStopped":true,"description":"breakpoint 1.1","preserveFocusHint":false,"reason":"breakpoint","threadCausedFocus":true,"threadId":260061},"event":"stopped","seq":0,"type":"event"} --> Content-Length: 61

Hide Details

{"command":"threads","type":"request","arguments":{},"seq":5} <-- Content-Length: 132

Hide Details

{"body":{"threads":[{"id":260061,"name":"Thread #1"}]},"command":"threads","request_seq":5,"seq":0,"success":true,"type":"response"} --> Content-Length: 107

Hide Details

{"command":"stackTrace","type":"request","arguments":{"threadId":260061,"startFrame":0,"levels":1},"seq":6} <-- Content-Length: 330

Hide Details

{"body":{"stackFrames":[{"column":14,"id":524288,"line":23,"name":"main","source":{"name":"main.cpp","path":"/Users/buildslave/jenkins/workspace/lldb-cmake-sanitized/llvm-project/lldb/test/API/tools/lldb-vscode/evaluate/main.cpp"}}],"totalFrames":2},"command":"stackTrace","request_seq":6,"seq":0,"success":true,"type":"response"} --> Content-Length: 116

Hide Details

{"command":"evaluate","type":"request","arguments":{"expression":"var1","context":"watch","frameId":524288},"seq":7} <-- Content-Length: 138

Hide Details

{"body":{"result":"20","type":"int","variablesReference":0},"command":"evaluate","request_seq":7,"seq":0,"success":true,"type":"response"} --> Content-Length: 107

Hide Details

{"command":"stackTrace","type":"request","arguments":{"threadId":260061,"startFrame":0,"levels":1},"seq":8} <-- Content-Length: 330

Hide Details

{"body":{"stackFrames":[{"column":14,"id":524288,"line":23,"name":"main","source":{"name":"main.cpp","path":"/Users/buildslave/jenkins/workspace/lldb-cmake-sanitized/llvm-project/lldb/test/API/tools/lldb-vscode/evaluate/main.cpp"}}],"totalFrames":2},"command":"stackTrace","request_seq":8,"seq":0,"success":true,"type":"response"} --> Content-Length: 116

Hide Details

{"command":"evaluate","type":"request","arguments":{"expression":"var2","context":"watch","frameId":524288},"seq":9} <-- Content-Length: 138

Hide Details

{"body":{"result":"21","type":"int","variablesReference":0},"command":"evaluate","request_seq":9,"seq":0,"success":true,"type":"response"} --> Content-Length: 108

Hide Details

{"command":"stackTrace","type":"request","arguments":{"threadId":260061,"startFrame":0,"levels":1},"seq":10} <-- Content-Length: 331

Hide Details

{"body":{"stackFrames":[{"column":14,"id":524288,"line":23,"name":"main","source":{"name":"main.cpp","path":"/Users/buildslave/jenkins/workspace/lldb-cmake-sanitized/llvm-project/lldb/test/API/tools/lldb-vscode/evaluate/main.cpp"}}],"totalFrames":2},"command":"stackTrace","request_seq":10,"seq":0,"success":true,"type":"response"} --> Content-Length: 123

Hide Details

{"command":"evaluate","type":"request","arguments":{"expression":"static_int","context":"watch","frameId":524288},"seq":11} <-- Content-Length: 139

Hide Details

{"body":{"result":"42","type":"int","variablesReference":0},"command":"evaluate","request_seq":11,"seq":0,"success":true,"type":"response"} --> Content-Length: 108

Hide Details

{"command":"stackTrace","type":"request","arguments":{"threadId":260061,"startFrame":0,"levels":1},"seq":12} <-- Content-Length: 331

Hide Details

{"body":{"stackFrames":[{"column":14,"id":524288,"line":23,"name":"main","source":{"name":"main.cpp","path":"/Users/buildslave/jenkins/workspace/lldb-cmake-sanitized/llvm-project/lldb/test/API/tools/lldb-vscode/evaluate/main.cpp"}}],"totalFrames":2},"command":"stackTrace","request_seq":12,"seq":0,"success":true,"type":"response"} --> Content-Length: 127

Hide Details

{"command":"evaluate","type":"request","arguments":{"expression":"non_static_int","context":"watch","frameId":524288},"seq":13} <-- Content-Length: 139

Hide Details

{"body":{"result":"43","type":"int","variablesReference":0},"command":"evaluate","request_seq":13,"seq":0,"success":true,"type":"response"} --> Content-Length: 108

Hide Details

{"command":"stackTrace","type":"request","arguments":{"threadId":260061,"startFrame":0,"levels":1},"seq":14} <-- Content-Length: 331

Hide Details

{"body":{"stackFrames":[{"column":14,"id":524288,"line":23,"name":"main","source":{"name":"main.cpp","path":"/Users/buildslave/jenkins/workspace/lldb-cmake-sanitized/llvm-project/lldb/test/API/tools/lldb-vscode/evaluate/main.cpp"}}],"totalFrames":2},"command":"stackTrace","request_seq":14,"seq":0,"success":true,"type":"response"} --> Content-Length: 120

Hide Details

{"command":"evaluate","type":"request","arguments":{"expression":"struct1","context":"watch","frameId":524288},"seq":15} <-- Content-Length: 169

Hide Details

{"body":{"result":"my_struct @ 0x7ffeefbff7c8","type":"my_struct","variablesReference":4},"command":"evaluate","request_seq":15,"seq":0,"success":true,"type":"response"} --> Content-Length: 108

Hide Details

{"command":"stackTrace","type":"request","arguments":{"threadId":260061,"startFrame":0,"levels":1},"seq":16} <-- Content-Length: 331

Hide Details

{"body":{"stackFrames":[{"column":14,"id":524288,"line":23,"name":"main","source":{"name":"main.cpp","path":"/Users/buildslave/jenkins/workspace/lldb-cmake-sanitized/llvm-project/lldb/test/API/tools/lldb-vscode/evaluate/main.cpp"}}],"totalFrames":2},"command":"stackTrace","request_seq":16,"seq":0,"success":true,"type":"response"} --> Content-Length: 124

Hide Details

{"command":"evaluate","type":"request","arguments":{"expression":"struct1.foo","context":"watch","frameId":524288},"seq":17} <-- Content-Length: 139

Hide Details

{"body":{"result":"15","type":"int","variablesReference":0},"command":"evaluate","request_seq":17,"seq":0,"success":true,"type":"response"} --> Content-Length: 108

Hide Details

{"command":"stackTrace","type":"request","arguments":{"threadId":260061,"startFrame":0,"levels":1},"seq":18} <-- Content-Length: 331

Hide Details

{"body":{"stackFrames":[{"column":14,"id":524288,"line":23,"name":"main","source":{"name":"main.cpp","path":"/Users/buildslave/jenkins/workspace/lldb-cmake-sanitized/llvm-project/lldb/test/API/tools/lldb-vscode/evaluate/main.cpp"}}],"totalFrames":2},"command":"stackTrace","request_seq":18,"seq":0,"success":true,"type":"response"} --> Content-Length: 125

Hide Details

{"command":"evaluate","type":"request","arguments":{"expression":"struct2->foo","context":"watch","frameId":524288},"seq":19} <-- Content-Length: 139

Hide Details

{"body":{"result":"16","type":"int","variablesReference":0},"command":"evaluate","request_seq":19,"seq":0,"success":true,"type":"response"} --> Content-Length: 108

Hide Details

{"command":"stackTrace","type":"request","arguments":{"threadId":260061,"startFrame":0,"levels":1},"seq":20} <-- Content-Length: 331

Hide Details

{"body":{"stackFrames":[{"column":14,"id":524288,"line":23,"name":"main","source":{"name":"main.cpp","path":"/Users/buildslave/jenkins/workspace/lldb-cmake-sanitized/llvm-project/lldb/test/API/tools/lldb-vscode/evaluate/main.cpp"}}],"totalFrames":2},"command":"stackTrace","request_seq":20,"seq":0,"success":true,"type":"response"} --> Content-Length: 116

Hide Details

{"command":"evaluate","type":"request","arguments":{"expression":"var","context":"watch","frameId":524288},"seq":21} <-- Content-Length: 209

Hide Details

{"body":{},"command":"evaluate","message":"expression failed to parse:\nerror: <user expression 0>:1:1: use of undeclared identifier 'var'\nvar\n^\n","request_seq":21,"seq":0,"success":false,"type":"response"} --> Content-Length: 108

Hide Details

{"command":"stackTrace","type":"request","arguments":{"threadId":260061,"startFrame":0,"levels":1},"seq":22} <-- Content-Length: 331

Hide Details

{"body":{"stackFrames":[{"column":14,"id":524288,"line":23,"name":"main","source":{"name":"main.cpp","path":"/Users/buildslave/jenkins/workspace/lldb-cmake-sanitized/llvm-project/lldb/test/API/tools/lldb-vscode/evaluate/main.cpp"}}],"totalFrames":2},"command":"stackTrace","request_seq":22,"seq":0,"success":true,"type":"response"} --> Content-Length: 122

Hide Details

{"command":"evaluate","type":"request","arguments":{"expression":"my_struct","context":"watch","frameId":524288},"seq":23} <-- Content-Length: 311

Hide Details

{"body":{"category":"console","output":"/Users/buildslave/jenkins/workspace/lldb-cmake-sanitized/llvm-project/lldb/tools/lldb-vscode/ProgressEvent.cpp:89:64: runtime error: load of value 808464432, which is not a valid value for type 'lldb_vscode::ProgressEventType'\n"},"event":"output","seq":0,"type":"event"} <-- Content-Length: 261

Hide Details

{"body":{"category":"console","output":"SUMMARY: UndefinedBehaviorSanitizer: undefined-behavior /Users/buildslave/jenkins/workspace/lldb-cmake-sanitized/llvm-project/lldb/tools/lldb-vscode/ProgressEvent.cpp:89:64 in \n"},"event":"output","seq":0,"type":"event"} <-- Content-Length: 170

Hide Details

{"body":{"category":"console","output":"PLEASE submit a bug report to https://bugs.llvm.org/ and include the crash backtrace.\n"},"event":"output","seq":0,"type":"event"} <-- Content-Length: 117

Hide Details

{"body":{},"command":"evaluate","message":"unknown error","request_seq":23,"seq":0,"success":false,"type":"response"} --> Content-Length: 108

Hide Details

{"command":"stackTrace","type":"request","arguments":{"threadId":260061,"startFrame":0,"levels":1},"seq":24} <-- Content-Length: 331

Hide Details

{"body":{"stackFrames":[{"column":14,"id":524288,"line":23,"name":"main","source":{"name":"main.cpp","path":"/Users/buildslave/jenkins/workspace/lldb-cmake-sanitized/llvm-project/lldb/test/API/tools/lldb-vscode/evaluate/main.cpp"}}],"totalFrames":2},"command":"stackTrace","request_seq":24,"seq":0,"success":true,"type":"response"} --> Content-Length: 116

Hide Details

{"command":"evaluate","type":"request","arguments":{"expression":"int","context":"watch","frameId":524288},"seq":25}

Hide Details

========= END =========

Hide Details

-- Command Output (stderr): -- Change dir to: /Users/buildslave/jenkins/workspace/lldb-cmake-sanitized/llvm-project/lldb/test/API/tools/lldb-vscode/evaluate runCmd: settings clear -all output:

Hide Details

runCmd: settings set symbols.enable-external-lookup false output:

Hide Details

runCmd: settings set target.inherit-tcc true output:

Hide Details

runCmd: settings set target.detach-on-error false output:

Hide Details

runCmd: settings set target.auto-apply-fixits false output:

Hide Details

runCmd: settings set plugin.process.gdb-remote.packet-timeout 60 output:

Hide Details

runCmd: settings set symbols.clang-modules-cache-path "/Users/buildslave/jenkins/workspace/lldb-cmake-sanitized/lldb-build/lldb-test-build.noindex/module-cache-lldb/lldb-api" output:

Hide Details

runCmd: settings set use-color false output:

Hide Details

runCmd: setting set target.prefer-dynamic-value no-dynamic-values output:

Hide Details

runCmd: settings set target.env-vars ASAN_OPTIONS=detect_stack_use_after_return=1 DYLD_INSERT_LIBRARIES=/Users/buildslave/jenkins/workspace/lldb-cmake-sanitized/host-compiler/lib/clang/13.0.99/lib/darwin/libclang_rt.asan_osx_dynamic.dylib output:

Hide Details

Adding tearDown hook: def cleanup(): if disconnectAutomatically: self.vscode.request_disconnect(terminateDebuggee=True) self.vscode.terminate()

Hide Details

Hide Details

FAIL: LLDB (/Users/buildslave/jenkins/workspace/lldb-cmake-sanitized/host-compiler/bin/clang-x86_64) :: test_generic_evaluate_expressions (TestVSCode_evaluate.TestVSCode_variables) Executing tearDown hook: def cleanup(): if disconnectAutomatically: self.vscode.request_disconnect(terminateDebuggee=True) self.vscode.terminate()

Hide Details

Hide Details

CLEANUP ERROR: LLDB (/Users/buildslave/jenkins/workspace/lldb-cmake-sanitized/host-compiler/bin/clang-x86_64) :: test_generic_evaluate_expressions (TestVSCode_evaluate.TestVSCode_variables) Traceback (most recent call last): File "/Users/buildslave/jenkins/workspace/lldb-cmake-sanitized/llvm-project/lldb/third_party/Python/module/unittest2/unittest2/case.py", line 386, in run self.tearDown() File "/Users/buildslave/jenkins/workspace/lldb-cmake-sanitized/llvm-project/lldb/packages/Python/lldbsuite/test/lldbtest.py", line 2095, in tearDown Base.tearDown(self) File "/Users/buildslave/jenkins/workspace/lldb-cmake-sanitized/llvm-project/lldb/packages/Python/lldbsuite/test/lldbtest.py", line 1065, in tearDown hook() # try the plain call and hope it works File "/Users/buildslave/jenkins/workspace/lldb-cmake-sanitized/llvm-project/lldb/packages/Python/lldbsuite/test/tools/lldb-vscode/lldbvscode_testcase.py", line 294, in cleanup self.vscode.request_disconnect(terminateDebuggee=True) File "/Users/buildslave/jenkins/workspace/lldb-cmake-sanitized/llvm-project/lldb/packages/Python/lldbsuite/test/tools/lldb-vscode/vscode.py", line 590, in request_disconnect return self.send_recv(command_dict) File "/Users/buildslave/jenkins/workspace/lldb-cmake-sanitized/llvm-project/lldb/packages/Python/lldbsuite/test/tools/lldb-vscode/vscode.py", line 315, in send_recv self.send_packet(command) File "/Users/buildslave/jenkins/workspace/lldb-cmake-sanitized/llvm-project/lldb/packages/Python/lldbsuite/test/tools/lldb-vscode/vscode.py", line 271, in send_packet self.send.flush() BrokenPipeError: [Errno 32] Broken pipe

Hide Details

runCmd: settings clear -all output:

Hide Details

runCmd: settings set symbols.enable-external-lookup false output:

Hide Details

runCmd: settings set target.inherit-tcc true output:

Hide Details

runCmd: settings set target.detach-on-error false output:

Hide Details

runCmd: settings set target.auto-apply-fixits false output:

Hide Details

runCmd: settings set plugin.process.gdb-remote.packet-timeout 60 output:

Hide Details

runCmd: settings set symbols.clang-modules-cache-path "/Users/buildslave/jenkins/workspace/lldb-cmake-sanitized/lldb-build/lldb-test-build.noindex/module-cache-lldb/lldb-api" output:

Hide Details

runCmd: settings set use-color false output:

Hide Details

runCmd: setting set target.prefer-dynamic-value no-dynamic-values output:

Hide Details

runCmd: settings set target.env-vars ASAN_OPTIONS=detect_stack_use_after_return=1 DYLD_INSERT_LIBRARIES=/Users/buildslave/jenkins/workspace/lldb-cmake-sanitized/host-compiler/lib/clang/13.0.99/lib/darwin/libclang_rt.asan_osx_dynamic.dylib output:

Hide Details

Adding tearDown hook: def cleanup(): if disconnectAutomatically: self.vscode.request_disconnect(terminateDebuggee=True) self.vscode.terminate()

Hide Details

Hide Details

Executing tearDown hook: def cleanup(): if disconnectAutomatically: self.vscode.request_disconnect(terminateDebuggee=True) self.vscode.terminate()

Hide Details

Hide Details

PASS: LLDB (/Users/buildslave/jenkins/workspace/lldb-cmake-sanitized/host-compiler/bin/clang-x86_64) :: test_hover_evaluate_expressions (TestVSCode_evaluate.TestVSCode_variables) runCmd: settings clear -all output:

Hide Details

runCmd: settings set symbols.enable-external-lookup false output:

Hide Details

runCmd: settings set target.inherit-tcc true output:

Hide Details

runCmd: settings set target.detach-on-error false output:

Hide Details

runCmd: settings set target.auto-apply-fixits false output:

Hide Details

runCmd: settings set plugin.process.gdb-remote.packet-timeout 60 output:

Hide Details

runCmd: settings set symbols.clang-modules-cache-path "/Users/buildslave/jenkins/workspace/lldb-cmake-sanitized/lldb-build/lldb-test-build.noindex/module-cache-lldb/lldb-api" output:

Hide Details

runCmd: settings set use-color false output:

Hide Details

runCmd: setting set target.prefer-dynamic-value no-dynamic-values output:

Hide Details

runCmd: settings set target.env-vars ASAN_OPTIONS=detect_stack_use_after_return=1 DYLD_INSERT_LIBRARIES=/Users/buildslave/jenkins/workspace/lldb-cmake-sanitized/host-compiler/lib/clang/13.0.99/lib/darwin/libclang_rt.asan_osx_dynamic.dylib output:

Hide Details

Adding tearDown hook: def cleanup(): if disconnectAutomatically: self.vscode.request_disconnect(terminateDebuggee=True) self.vscode.terminate()

Hide Details

Hide Details

FAIL: LLDB (/Users/buildslave/jenkins/workspace/lldb-cmake-sanitized/host-compiler/bin/clang-x86_64) :: test_repl_evaluate_expressions (TestVSCode_evaluate.TestVSCode_variables) Executing tearDown hook: def cleanup(): if disconnectAutomatically: self.vscode.request_disconnect(terminateDebuggee=True) self.vscode.terminate()

Hide Details

Hide Details

CLEANUP ERROR: LLDB (/Users/buildslave/jenkins/workspace/lldb-cmake-sanitized/host-compiler/bin/clang-x86_64) :: test_repl_evaluate_expressions (TestVSCode_evaluate.TestVSCode_variables) Traceback (most recent call last): File "/Users/buildslave/jenkins/workspace/lldb-cmake-sanitized/llvm-project/lldb/third_party/Python/module/unittest2/unittest2/case.py", line 386, in run self.tearDown() File "/Users/buildslave/jenkins/workspace/lldb-cmake-sanitized/llvm-project/lldb/packages/Python/lldbsuite/test/lldbtest.py", line 2095, in tearDown Base.tearDown(self) File "/Users/buildslave/jenkins/workspace/lldb-cmake-sanitized/llvm-project/lldb/packages/Python/lldbsuite/test/lldbtest.py", line 1065, in tearDown hook() # try the plain call and hope it works File "/Users/buildslave/jenkins/workspace/lldb-cmake-sanitized/llvm-project/lldb/packages/Python/lldbsuite/test/tools/lldb-vscode/lldbvscode_testcase.py", line 294, in cleanup self.vscode.request_disconnect(terminateDebuggee=True) File "/Users/buildslave/jenkins/workspace/lldb-cmake-sanitized/llvm-project/lldb/packages/Python/lldbsuite/test/tools/lldb-vscode/vscode.py", line 590, in request_disconnect return self.send_recv(command_dict) File "/Users/buildslave/jenkins/workspace/lldb-cmake-sanitized/llvm-project/lldb/packages/Python/lldbsuite/test/tools/lldb-vscode/vscode.py", line 315, in send_recv self.send_packet(command) File "/Users/buildslave/jenkins/workspace/lldb-cmake-sanitized/llvm-project/lldb/packages/Python/lldbsuite/test/tools/lldb-vscode/vscode.py", line 271, in send_packet self.send.flush() BrokenPipeError: [Errno 32] Broken pipe

Hide Details

runCmd: settings clear -all output:

Hide Details

runCmd: settings set symbols.enable-external-lookup false output:

Hide Details

runCmd: settings set target.inherit-tcc true output:

Hide Details

runCmd: settings set target.detach-on-error false output:

Hide Details

runCmd: settings set target.auto-apply-fixits false output:

Hide Details

runCmd: settings set plugin.process.gdb-remote.packet-timeout 60 output:

Hide Details

runCmd: settings set symbols.clang-modules-cache-path "/Users/buildslave/jenkins/workspace/lldb-cmake-sanitized/lldb-build/lldb-test-build.noindex/module-cache-lldb/lldb-api" output:

Hide Details

runCmd: settings set use-color false output:

Hide Details

runCmd: setting set target.prefer-dynamic-value no-dynamic-values output:

Hide Details

runCmd: settings set target.env-vars ASAN_OPTIONS=detect_stack_use_after_return=1 DYLD_INSERT_LIBRARIES=/Users/buildslave/jenkins/workspace/lldb-cmake-sanitized/host-compiler/lib/clang/13.0.99/lib/darwin/libclang_rt.asan_osx_dynamic.dylib output:

Hide Details

Adding tearDown hook: def cleanup(): if disconnectAutomatically: self.vscode.request_disconnect(terminateDebuggee=True) self.vscode.terminate()

Hide Details

Hide Details

FAIL: LLDB (/Users/buildslave/jenkins/workspace/lldb-cmake-sanitized/host-compiler/bin/clang-x86_64) :: test_watch_evaluate_expressions (TestVSCode_evaluate.TestVSCode_variables) Executing tearDown hook: def cleanup(): if disconnectAutomatically: self.vscode.request_disconnect(terminateDebuggee=True) self.vscode.terminate()

Hide Details

Hide Details

CLEANUP ERROR: LLDB (/Users/buildslave/jenkins/workspace/lldb-cmake-sanitized/host-compiler/bin/clang-x86_64) :: test_watch_evaluate_expressions (TestVSCode_evaluate.TestVSCode_variables) Traceback (most recent call last): File "/Users/buildslave/jenkins/workspace/lldb-cmake-sanitized/llvm-project/lldb/third_party/Python/module/unittest2/unittest2/case.py", line 386, in run self.tearDown() File "/Users/buildslave/jenkins/workspace/lldb-cmake-sanitized/llvm-project/lldb/packages/Python/lldbsuite/test/lldbtest.py", line 2095, in tearDown Base.tearDown(self) File "/Users/buildslave/jenkins/workspace/lldb-cmake-sanitized/llvm-project/lldb/packages/Python/lldbsuite/test/lldbtest.py", line 1065, in tearDown hook() # try the plain call and hope it works File "/Users/buildslave/jenkins/workspace/lldb-cmake-sanitized/llvm-project/lldb/packages/Python/lldbsuite/test/tools/lldb-vscode/lldbvscode_testcase.py", line 294, in cleanup self.vscode.request_disconnect(terminateDebuggee=True) File "/Users/buildslave/jenkins/workspace/lldb-cmake-sanitized/llvm-project/lldb/packages/Python/lldbsuite/test/tools/lldb-vscode/vscode.py", line 590, in request_disconnect return self.send_recv(command_dict) File "/Users/buildslave/jenkins/workspace/lldb-cmake-sanitized/llvm-project/lldb/packages/Python/lldbsuite/test/tools/lldb-vscode/vscode.py", line 315, in send_recv self.send_packet(command) File "/Users/buildslave/jenkins/workspace/lldb-cmake-sanitized/llvm-project/lldb/packages/Python/lldbsuite/test/tools/lldb-vscode/vscode.py", line 271, in send_packet self.send.flush() BrokenPipeError: [Errno 32] Broken pipe

Hide Details

Restore dir to: /Users/buildslave/jenkins/workspace/lldb-cmake-sanitized/lldb-build/tools/lldb/test ====================================================================== ERROR: test_generic_evaluate_expressions (TestVSCode_evaluate.TestVSCode_variables) ---------------------------------------------------------------------- Traceback (most recent call last): File "/Users/buildslave/jenkins/workspace/lldb-cmake-sanitized/llvm-project/lldb/test/API/tools/lldb-vscode/evaluate/TestVSCode_evaluate.py", line 157, in test_generic_evaluate_expressions self.run_test_evaluate_expressions() File "/Users/buildslave/jenkins/workspace/lldb-cmake-sanitized/llvm-project/lldb/test/API/tools/lldb-vscode/evaluate/TestVSCode_evaluate.py", line 62, in run_test_evaluate_expressions self.assertEvaluateFailure("int") # type name File "/Users/buildslave/jenkins/workspace/lldb-cmake-sanitized/llvm-project/lldb/test/API/tools/lldb-vscode/evaluate/TestVSCode_evaluate.py", line 24, in assertEvaluateFailure self.vscode.request_evaluate(expression, context=self.context)['body']) File "/Users/buildslave/jenkins/workspace/lldb-cmake-sanitized/llvm-project/lldb/packages/Python/lldbsuite/test/tools/lldb-vscode/vscode.py", line 607, in request_evaluate return self.send_recv(command_dict) File "/Users/buildslave/jenkins/workspace/lldb-cmake-sanitized/llvm-project/lldb/packages/Python/lldbsuite/test/tools/lldb-vscode/vscode.py", line 321, in send_recv raise ValueError(desc) ValueError: no response for "evaluate" Config=x86_64-/Users/buildslave/jenkins/workspace/lldb-cmake-sanitized/host-compiler/bin/clang ====================================================================== ERROR: test_repl_evaluate_expressions (TestVSCode_evaluate.TestVSCode_variables) ---------------------------------------------------------------------- Traceback (most recent call last): File "/Users/buildslave/jenkins/workspace/lldb-cmake-sanitized/llvm-project/lldb/test/API/tools/lldb-vscode/evaluate/TestVSCode_evaluate.py", line 163, in test_repl_evaluate_expressions self.run_test_evaluate_expressions("repl") File "/Users/buildslave/jenkins/workspace/lldb-cmake-sanitized/llvm-project/lldb/test/API/tools/lldb-vscode/evaluate/TestVSCode_evaluate.py", line 62, in run_test_evaluate_expressions self.assertEvaluateFailure("int") # type name File "/Users/buildslave/jenkins/workspace/lldb-cmake-sanitized/llvm-project/lldb/test/API/tools/lldb-vscode/evaluate/TestVSCode_evaluate.py", line 24, in assertEvaluateFailure self.vscode.request_evaluate(expression, context=self.context)['body']) File "/Users/buildslave/jenkins/workspace/lldb-cmake-sanitized/llvm-project/lldb/packages/Python/lldbsuite/test/tools/lldb-vscode/vscode.py", line 607, in request_evaluate return self.send_recv(command_dict) File "/Users/buildslave/jenkins/workspace/lldb-cmake-sanitized/llvm-project/lldb/packages/Python/lldbsuite/test/tools/lldb-vscode/vscode.py", line 321, in send_recv raise ValueError(desc) ValueError: no response for "evaluate" Config=x86_64-/Users/buildslave/jenkins/workspace/lldb-cmake-sanitized/host-compiler/bin/clang ====================================================================== ERROR: test_watch_evaluate_expressions (TestVSCode_evaluate.TestVSCode_variables) ---------------------------------------------------------------------- Traceback (most recent call last): File "/Users/buildslave/jenkins/workspace/lldb-cmake-sanitized/llvm-project/lldb/test/API/tools/lldb-vscode/evaluate/TestVSCode_evaluate.py", line 169, in test_watch_evaluate_expressions self.run_test_evaluate_expressions("watch") File "/Users/buildslave/jenkins/workspace/lldb-cmake-sanitized/llvm-project/lldb/test/API/tools/lldb-vscode/evaluate/TestVSCode_evaluate.py", line 62, in run_test_evaluate_expressions self.assertEvaluateFailure("int") # type name File "/Users/buildslave/jenkins/workspace/lldb-cmake-sanitized/llvm-project/lldb/test/API/tools/lldb-vscode/evaluate/TestVSCode_evaluate.py", line 24, in assertEvaluateFailure self.vscode.request_evaluate(expression, context=self.context)['body']) File "/Users/buildslave/jenkins/workspace/lldb-cmake-sanitized/llvm-project/lldb/packages/Python/lldbsuite/test/tools/lldb-vscode/vscode.py", line 607, in request_evaluate return self.send_recv(command_dict) File "/Users/buildslave/jenkins/workspace/lldb-cmake-sanitized/llvm-project/lldb/packages/Python/lldbsuite/test/tools/lldb-vscode/vscode.py", line 321, in send_recv raise ValueError(desc) ValueError: no response for "evaluate" Config=x86_64-/Users/buildslave/jenkins/workspace/lldb-cmake-sanitized/host-compiler/bin/clang ---------------------------------------------------------------------- Ran 4 tests in 15.744s

Hide Details

RESULT: FAILED (1 passes, 0 failures, 3 errors, 0 skipped, 0 expected failures, 0 unexpected successes)

Hide Details

--

Hide Details

******************** PASS: lldb-unit :: ObjectFile/Breakpad/./ObjectFileBreakpadTests/Record.classify (1216 of 2354) PASS: lldb-api :: functionalities/inferior-crashing/TestInferiorCrashing.py (1217 of 2354) UNSUPPORTED: lldb-shell :: SymbolFile/PDB/typedefs.test (1218 of 2354) PASS: lldb-unit :: SymbolFile/DWARF/./SymbolFileDWARFTests/SymbolFileDWARFTests.TestAbbrevOrder1Start1 (1219 of 2354) PASS: lldb-api :: python_api/watchpoint/TestWatchpointIgnoreCount.py (1220 of 2354) PASS: lldb-shell :: ScriptInterpreter/Python/scripted_breakpoint_lua.test (1221 of 2354) PASS: lldb-unit :: Utility/./UtilityTests/StreamTeeTest.AppendStream (1222 of 2354) PASS: lldb-api :: iohandler/resize/TestIOHandlerResizeNoEditline.py (1223 of 2354) PASS: lldb-api :: lang/cpp/non-type-template-param/TestCppNonTypeTemplateParam.py (1224 of 2354) PASS: lldb-api :: lang/objc/direct-dispatch-step/TestObjCDirectDispatchStepping.py (1225 of 2354) PASS: lldb-api :: lang/cpp/class-template-type-parameter-pack/TestClassTemplateTypeParameterPack.py (1226 of 2354) PASS: lldb-unit :: Utility/./UtilityTests/LogChannelEnabledTest.LogVerboseThread (1227 of 2354) PASS: lldb-shell :: Reproducer/TestFileRepro.test (1228 of 2354) UNSUPPORTED: lldb-api :: tools/lldb-vscode/disconnect/TestVSCode_disconnect.py (1229 of 2354) PASS: lldb-api :: lang/objc/objc-runtime-ivars/TestRuntimeIvars.py (1230 of 2354) PASS: lldb-unit :: Utility/./UtilityTests/VMRange.Comparison (1231 of 2354) PASS: lldb-api :: lang/objc/foundation/TestObjCMethodsNSArray.py (1232 of 2354) PASS: lldb-api :: python_api/lldbutil/iter/TestLLDBIterator.py (1233 of 2354) PASS: lldb-unit :: Platform/./LLDBPlatformTests/PlatformDarwinTest.FindComponentInPath (1234 of 2354) PASS: lldb-unit :: Process/minidump/./LLDBMinidumpTests/MinidumpParserTest.GetPidWindows (1235 of 2354) PASS: lldb-unit :: Language/Highlighting/./HighlighterTests/HighlighterTest.ClangCursorPosInOtherToken (1236 of 2354) PASS: lldb-api :: functionalities/thread/concurrent_events/TestConcurrentSignalDelayWatch.py (1237 of 2354) PASS: lldb-shell :: Reproducer/TestDiscard.test (1238 of 2354) PASS: lldb-unit :: Utility/./UtilityTests/StringListTest.LongestCommonPrefixDuplicateElement (1239 of 2354) PASS: lldb-shell :: Settings/TestFrameFormatMangling.test (1240 of 2354) PASS: lldb-api :: python_api/sbstructureddata/TestStructuredDataAPI.py (1241 of 2354) PASS: lldb-shell :: Breakpoint/debug_rnglist_rlestartend.test (1242 of 2354) PASS: lldb-shell :: ObjectFile/PECOFF/section-types.yaml (1243 of 2354) PASS: lldb-api :: functionalities/gdb_remote_client/TestThreadSelectionBug.py (1244 of 2354) PASS: lldb-api :: functionalities/data-formatter/language_category_updates/TestDataFormatterLanguageCategoryUpdates.py (1245 of 2354) PASS: lldb-api :: api/listeners/TestListener.py (1246 of 2354) PASS: lldb-shell :: SymbolFile/NativePDB/bitfields.cpp (1247 of 2354) PASS: lldb-shell :: Settings/TestEchoCommands.test (1248 of 2354) PASS: lldb-unit :: ScriptInterpreter/Python/./ScriptInterpreterPythonTests/PythonDataObjectsTest.TestPythonTupleSize (1249 of 2354) PASS: lldb-api :: lang/c/anonymous/TestAnonymous.py (1250 of 2354) PASS: lldb-unit :: DataFormatter/./LLDBFormatterTests/StringPrinterTests.SwiftUTF8 (1251 of 2354) PASS: lldb-api :: tools/lldb-server/TestGdbRemoteSingleStep.py (1252 of 2354) PASS: lldb-api :: commands/statistics/basic/TestStats.py (1253 of 2354) PASS: lldb-api :: commands/frame/recognizer/TestFrameRecognizer.py (1254 of 2354) PASS: lldb-shell :: Reproducer/TestMultipleTargets.test (1255 of 2354) UNSUPPORTED: lldb-shell :: Register/x86-gp-read.test (1256 of 2354) PASS: lldb-unit :: Expression/./ExpressionTests/DWARFExpression.DW_OP_implicit_value (1257 of 2354) UNSUPPORTED: lldb-shell :: SymbolFile/target-symbols-add-unwind.test (1258 of 2354) PASS: lldb-api :: functionalities/data-formatter/data-formatter-skip-summary/TestDataFormatterSkipSummary.py (1259 of 2354) UNSUPPORTED: lldb-shell :: SymbolFile/PDB/class-layout.test (1260 of 2354) PASS: lldb-unit :: SymbolFile/DWARF/./SymbolFileDWARFTests/SymbolFileDWARFTests.ParseArangesSkipErrors (1261 of 2354) PASS: lldb-unit :: Utility/./UtilityTests/StringListTest.GetMaxStringLengthEqualSize (1262 of 2354) PASS: lldb-unit :: Symbol/./SymbolTests/TestClangASTImporter.CopyTypeTagDecl (1263 of 2354) PASS: lldb-api :: commands/watchpoints/multiple_hits/TestMultipleHits.py (1264 of 2354) PASS: lldb-api :: macosx/debugserver-exit-code/TestDebugServerExitCode.py (1265 of 2354) PASS: lldb-unit :: ObjectFile/Breakpad/./ObjectFileBreakpadTests/StackWinRecord.parse (1266 of 2354) PASS: lldb-shell :: SymbolFile/DWARF/x86/subprogram_ranges.test (1267 of 2354) PASS: lldb-unit :: Utility/./UtilityTests/StreamTeeTest.GetStreamAtIndexOutOfBounds (1268 of 2354) UNSUPPORTED: lldb-shell :: SymbolFile/DWARF/x86/DW_TAG_GNU_call_site-DW_AT_low_pc.s (1269 of 2354) PASS: lldb-api :: functionalities/data-formatter/data-formatter-caching/TestDataFormatterCaching.py (1270 of 2354) UNSUPPORTED: lldb-shell :: Subprocess/clone-follow-parent.test (1271 of 2354) PASS: lldb-shell :: Reproducer/TestDSYM.test (1272 of 2354) PASS: lldb-shell :: SymbolFile/DWARF/x86/find-basic-namespace.cpp (1273 of 2354) PASS: lldb-unit :: Language/Highlighting/./HighlighterTests/HighlighterTest.ClangSquareBrackets (1274 of 2354) PASS: lldb-api :: functionalities/data-formatter/data-formatter-advanced/TestDataFormatterAdv.py (1275 of 2354) PASS: lldb-api :: functionalities/target_var/no_vars/TestTargetVarNoVars.py (1276 of 2354) PASS: lldb-unit :: Expression/./ExpressionTests/DiagnosticManagerTest.HasFixits (1277 of 2354) PASS: lldb-unit :: Interpreter/./InterpreterTests/CompletionTest.DirCompletionUsername (1278 of 2354) PASS: lldb-api :: functionalities/gdb_remote_client/TestTargetXMLArch.py (1279 of 2354) PASS: lldb-unit :: Utility/./UtilityTests/StringListTest.SplitIntoLines (1280 of 2354) PASS: lldb-api :: lang/cpp/exceptions/TestCPPExceptionBreakpoints.py (1281 of 2354) PASS: lldb-unit :: Utility/./UtilityTests/ArgsTest.DoubleQuotedItem (1282 of 2354) PASS: lldb-unit :: Symbol/./SymbolTests/SymbolsTest.LocateExecutableSymbolFileForUnknownExecutableAndMissingSymbolFile (1283 of 2354) PASS: lldb-api :: tools/lldb-server/TestGdbRemoteRegisterState.py (1284 of 2354) PASS: lldb-shell :: Driver/TestSingleQuote.test (1285 of 2354) PASS: lldb-api :: lang/cpp/llvm-style/TestLLVMStyle.py (1286 of 2354) PASS: lldb-unit :: Utility/./UtilityTests/VASprintfTest.BufferResize (1287 of 2354) PASS: lldb-unit :: Process/minidump/./LLDBMinidumpTests/RegisterContextMinidump.ConvertMinidumpContext_x86_64 (1288 of 2354) PASS: lldb-unit :: Utility/./UtilityTests/ArchSpecTest.Compatibility (1289 of 2354) PASS: lldb-api :: functionalities/archives/TestBSDArchives.py (1290 of 2354) PASS: lldb-unit :: Core/./LLDBCoreTests/MangledTest.NameIndexes_FindFunctionSymbols (1291 of 2354) PASS: lldb-api :: functionalities/thread/exit_during_expression/TestExitDuringExpression.py (1292 of 2354) PASS: lldb-unit :: UnwindAssembly/x86/./UnwindAssemblyx86Tests/Testx86AssemblyInspectionEngine.TestPushEBP (1293 of 2354) PASS: lldb-shell :: SymbolFile/DWARF/x86/find-variable-file.cpp (1294 of 2354) PASS: lldb-unit :: Host/./HostTests/File.GetWaitableHandleFileno (1295 of 2354) PASS: lldb-api :: lang/c/array_types/TestArrayTypes.py (1296 of 2354) PASS: lldb-shell :: ObjectFile/ELF/short-build-id.yaml (1297 of 2354) PASS: lldb-unit :: Utility/./UtilityTests/ArgsTest.TestAppendArg (1298 of 2354) PASS: lldb-api :: functionalities/data-formatter/data-formatter-stl/libcxx/function/TestLibCxxFunction.py (1299 of 2354) PASS: lldb-api :: python_api/sbvalue_const_addrof/TestSBValueConstAddrOf.py (1300 of 2354) PASS: lldb-api :: functionalities/data-formatter/setvaluefromcstring/TestSetValueFromCString.py (1301 of 2354) PASS: lldb-api :: lang/cpp/virtual-overload/TestVirtualOverload.py (1302 of 2354) PASS: lldb-api :: source-manager/TestSourceManager.py (1303 of 2354) PASS: lldb-api :: lang/objc/conflicting-definition/TestConflictingDefinition.py (1304 of 2354) PASS: lldb-unit :: Utility/./UtilityTests/StringExtractorTest.GetHexU8_InvalidHex (1305 of 2354) PASS: lldb-unit :: Process/minidump/./LLDBMinidumpTests/MinidumpParserTest.GetLinuxProcStatus_no_stream (1306 of 2354) PASS: lldb-unit :: Host/./HostTests/FileSystemTest.Resolve (1307 of 2354) PASS: lldb-api :: functionalities/data-formatter/parray/TestPrintArray.py (1308 of 2354) PASS: lldb-unit :: Utility/./UtilityTests/RegularExpression.Invalid (1309 of 2354) PASS: lldb-shell :: SymbolFile/DWARF/x86/debug-types-address-ranges.s (1310 of 2354) PASS: lldb-unit :: Utility/./UtilityTests/BinaryStreamTest.PutSLEB128OneByte (1311 of 2354) PASS: lldb-unit :: Utility/./UtilityTests/FileSpecTest.GetPath (1312 of 2354) PASS: lldb-unit :: Process/minidump/./LLDBMinidumpTests/MinidumpParserTest.InvalidMinidump (1313 of 2354) UNSUPPORTED: lldb-api :: commands/watchpoints/variable_out_of_scope/TestWatchedVarHitWhenInScope.py (1314 of 2354) PASS: lldb-unit :: DataFormatter/./LLDBFormatterTests/TypeMatcherTests.RegexName (1315 of 2354) PASS: lldb-unit :: ObjectFile/Breakpad/./ObjectFileBreakpadTests/StackCFIRecord.parse (1316 of 2354) PASS: lldb-unit :: Host/./HostTests/NativeProcessProtocolTest.SetBreakpoint (1317 of 2354) PASS: lldb-unit :: Symbol/./SymbolTests/LineEntryTest.GetSameLineContiguousAddressRangeNestedInline (1318 of 2354) PASS: lldb-unit :: Utility/./UtilityTests/RangeTest.Union (1319 of 2354) PASS: lldb-shell :: Minidump/Windows/find-module.test (1320 of 2354) PASS: lldb-unit :: Utility/./UtilityTests/BinaryStreamTest.PutULEB128OneByte (1321 of 2354) PASS: lldb-api :: python_api/watchpoint/condition/TestWatchpointConditionAPI.py (1322 of 2354) PASS: lldb-api :: functionalities/thread/concurrent_events/TestConcurrentBreakpointOneDelayBreakpointThreads.py (1323 of 2354) PASS: lldb-unit :: Host/./HostTests/MainLoopTest.Signal (1324 of 2354) PASS: lldb-unit :: Utility/./UtilityTests/StreamTest.PutHex32ByteOrderBig (1325 of 2354) PASS: lldb-shell :: Reproducer/TestVersionCheck.test (1326 of 2354) PASS: lldb-unit :: Utility/./UtilityTests/StringExtractorGDBRemoteTest.GetPidTidMultipleValues (1327 of 2354) PASS: lldb-unit :: Editline/./EditlineTests/EditlineTestFixture.EditlineReceivesMultiLineText (1328 of 2354) PASS: lldb-api :: lang/c/bitfields/TestBitfields.py (1329 of 2354) PASS: lldb-unit :: Utility/./UtilityTests/UriParserTest.BracketedHostname (1330 of 2354) PASS: lldb-unit :: ScriptInterpreter/Python/./ScriptInterpreterPythonTests/PythonDataObjectsTest.TestExceptions (1331 of 2354) PASS: lldb-shell :: SymbolFile/DWARF/x86/debug-names-compressed.cpp (1332 of 2354) UNSUPPORTED: lldb-api :: functionalities/tsan/thread_numbers/TestTsanThreadNumbers.py (1333 of 2354) PASS: lldb-api :: python_api/type/TestTypeList.py (1334 of 2354) UNSUPPORTED: lldb-shell :: ScriptInterpreter/Lua/lua.test (1335 of 2354) PASS: lldb-api :: macosx/dyld-trie-symbols/TestDyldTrieSymbols.py (1336 of 2354) PASS: lldb-unit :: Utility/./UtilityTests/StringListTest.LongestCommonPrefixNoPrefix (1337 of 2354) UNSUPPORTED: lldb-api :: commands/platform/connect/TestPlatformConnect.py (1338 of 2354) PASS: lldb-api :: functionalities/breakpoint/serialize/TestBreakpointSerialization.py (1339 of 2354) PASS: lldb-unit :: Utility/./UtilityTests/StringListTest.Clear (1340 of 2354) PASS: lldb-api :: lang/objc/rdar-11355592/TestRdar11355592.py (1341 of 2354) PASS: lldb-api :: functionalities/postmortem/elf-core/TestLinuxCore.py (1342 of 2354) PASS: lldb-unit :: Process/Utility/./ProcessUtilityTests/ProcMapTests/LinuxProcMapsTestFixture.ParseMapRegions/4 (1343 of 2354) PASS: lldb-unit :: SymbolFile/NativePDB/./SymbolFileNativePDBTests/PDBFPOProgramToDWARFExpressionTests.MissingTargetRegister (1344 of 2354) PASS: lldb-unit :: SymbolFile/DWARF/./SymbolFileDWARFTests/SymbolFileDWARFTests.TestAbbrevInvalidNULLTag (1345 of 2354) PASS: lldb-shell :: Register/Core/x86-32-netbsd-gp.test (1346 of 2354) PASS: lldb-unit :: UnwindAssembly/x86/./UnwindAssemblyx86Tests/Testx86AssemblyInspectionEngine.TestDisassemblyJunkBytes (1347 of 2354) PASS: lldb-unit :: DataFormatter/./LLDBFormatterTests/TypeMatcherTests.GetMatchStringExactName (1348 of 2354) PASS: lldb-api :: functionalities/breakpoint/breakpoint_options/TestBreakpointOptions.py (1349 of 2354) PASS: lldb-api :: tools/lldb-server/memory-allocation/TestGdbRemoteMemoryAllocation.py (1350 of 2354) PASS: lldb-unit :: Utility/./UtilityTests/ConstStringTest.format_provider (1351 of 2354) PASS: lldb-unit :: DataFormatter/./LLDBFormatterTests/TypeMatcherTests.RegexMatchPart (1352 of 2354) PASS: lldb-unit :: UnwindAssembly/x86/./UnwindAssemblyx86Tests/Testx86AssemblyInspectionEngine.TestPopESI (1353 of 2354) PASS: lldb-api :: lang/cpp/default-template-args/TestDefaultTemplateArgs.py (1354 of 2354) PASS: lldb-api :: lang/c/conflicting-symbol/TestConflictingSymbol.py (1355 of 2354) PASS: lldb-api :: tools/lldb-server/TestGdbRemoteAttachOrWait.py (1356 of 2354) PASS: lldb-api :: commands/target/create-deps/TestTargetCreateDeps.py (1357 of 2354) PASS: lldb-api :: lang/cpp/reference-to-outer-type/TestCppReferenceToOuterClass.py (1358 of 2354) PASS: lldb-unit :: Utility/./UtilityTests/BinaryStreamTest.PutSLEB128SevenBytes (1359 of 2354) PASS: lldb-api :: commands/frame/diagnose/dereference-function-return/TestDiagnoseDereferenceFunctionReturn.py (1360 of 2354) XFAIL: lldb-shell :: SymbolFile/DWARF/find-type-in-function.cpp (1361 of 2354) PASS: lldb-unit :: Symbol/./SymbolTests/TestTypeSystemClang.TestGetEnumIntegerTypeUnexpectedType (1362 of 2354) PASS: lldb-unit :: UnwindAssembly/x86/./UnwindAssemblyx86Tests/Testx86AssemblyInspectionEngine.Test64bitFramelessSmallStackFrame (1363 of 2354) PASS: lldb-unit :: Core/./LLDBCoreTests/DumpDataExtractorTest.Formats (1364 of 2354) PASS: lldb-api :: types/TestIntegerTypeExpr.py (1365 of 2354) PASS: lldb-unit :: SymbolFile/DWARF/./SymbolFileDWARFTests/DWARFUnitTest.MissingSentinel (1366 of 2354) UNSUPPORTED: lldb-api :: benchmarks/stepping/TestSteppingSpeed.py (1367 of 2354) PASS: lldb-unit :: Utility/./UtilityTests/DataExtractorTest.GetCStrUnterminated (1368 of 2354) PASS: lldb-api :: functionalities/memory/tag/TestMemoryTag.py (1369 of 2354) PASS: lldb-shell :: SymbolFile/DWARF/x86/debug-types-signature-loop.s (1370 of 2354) PASS: lldb-api :: tools/lldb-vscode/stackTrace/TestVSCode_stackTrace.py (1371 of 2354) PASS: lldb-unit :: Utility/./UtilityTests/Flags.AllSet (1372 of 2354) PASS: lldb-unit :: Process/gdb-remote/./ProcessGdbRemoteTests/PortMapTest.Constructors (1373 of 2354) PASS: lldb-api :: lang/objc/objc-struct-return/TestObjCStructReturn.py (1374 of 2354) UNSUPPORTED: lldb-api :: functionalities/longjmp/TestLongjmp.py (1375 of 2354) PASS: lldb-unit :: Expression/./ExpressionTests/CppModuleConfigurationTest.AmbiguousLibCpp (1376 of 2354) PASS: lldb-api :: lang/cpp/std-function-step-into-callable/TestStdFunctionStepIntoCallable.py (1377 of 2354) PASS: lldb-api :: functionalities/data-formatter/data-formatter-python-synth/TestDataFormatterPythonSynth.py (1378 of 2354) PASS: lldb-unit :: Symbol/./SymbolTests/TestTypeSystemClang.AddMethodToObjCObjectType (1379 of 2354) PASS: lldb-api :: commands/expression/persist_objc_pointeetype/TestPersistObjCPointeeType.py (1380 of 2354) PASS: lldb-unit :: Symbol/./SymbolTests/TestScratchTypeSystemClang.InferSubASTFromLangOpts (1381 of 2354) PASS: lldb-shell :: Reproducer/Modules/TestModuleCXX.test (1382 of 2354) PASS: lldb-unit :: Utility/./UtilityTests/SerializationRountripTest.SerializeDeserializeCStringArray (1383 of 2354) PASS: lldb-api :: lang/objc/modules-non-objc-target/TestObjCModulesNonObjCTarget.py (1384 of 2354) PASS: lldb-unit :: Utility/./UtilityTests/SubsystemRAIITest.NormalSubsystem (1385 of 2354) PASS: lldb-unit :: Core/./LLDBCoreTests/UniqueCStringMap.NoDefaultConstructor (1386 of 2354) PASS: lldb-shell :: Reproducer/TestHomeDir.test (1387 of 2354) PASS: lldb-unit :: Language/Highlighting/./HighlighterTests/HighlighterTest.ClangOperators (1388 of 2354) UNSUPPORTED: lldb-shell :: BuildScript/toolchain-msvc.test (1389 of 2354) PASS: lldb-unit :: Process/minidump/./LLDBMinidumpTests/MinidumpParserTest.GetMemoryRegionInfo (1390 of 2354) PASS: lldb-api :: functionalities/memory-region/TestMemoryRegion.py (1391 of 2354) PASS: lldb-unit :: Symbol/./SymbolTests/TestTypeSystemClang.TestOwningModule (1392 of 2354) UNSUPPORTED: lldb-api :: benchmarks/turnaround/TestCompileRunToBreakpointTurnaround.py (1393 of 2354) PASS: lldb-api :: lang/cpp/elaborated-types/TestElaboratedTypes.py (1394 of 2354) PASS: lldb-shell :: Register/Core/x86-64-netbsd-fp.test (1395 of 2354) PASS: lldb-shell :: ObjectFile/ELF/PT_LOAD-overlap-PT_INTERP.yaml (1396 of 2354) PASS: lldb-unit :: Process/minidump/./LLDBMinidumpTests/MinidumpParserTest.GetMiscInfoWindows (1397 of 2354) PASS: lldb-shell :: Quit/TestQuitExitCodeTooManyArgs.test (1398 of 2354) PASS: lldb-shell :: ScriptInterpreter/Python/command_import.test (1399 of 2354) PASS: lldb-shell :: SymbolFile/DWARF/x86/dwarf5-implicit-const.s (1400 of 2354) UNSUPPORTED: lldb-api :: iohandler/unicode/TestUnicode.py (1401 of 2354) PASS: lldb-unit :: Expression/./ExpressionTests/CppModuleConfigurationTest.UnrelatedLibrary (1402 of 2354) PASS: lldb-shell :: Reproducer/Functionalities/TestImageList.test (1403 of 2354) PASS: lldb-unit :: Language/CPlusPlus/./LanguageCPlusPlusTests/CPlusPlusLanguage.FindAlternateFunctionManglings (1404 of 2354) PASS: lldb-unit :: Utility/./UtilityTests/ArgsTest.TestOverwriteArgs (1405 of 2354) PASS: lldb-shell :: SymbolFile/DWARF/x86/dir-separator-no-comp-dir.s (1406 of 2354) PASS: lldb-shell :: SymbolFile/NativePDB/break-by-function.cpp (1407 of 2354) PASS: lldb-api :: tools/lldb-vscode/attach/TestVSCode_attach.py (1408 of 2354) PASS: lldb-api :: functionalities/thread/concurrent_events/TestConcurrentManyBreakpoints.py (1409 of 2354) PASS: lldb-unit :: Utility/./UtilityTests/BinaryStreamTest.PutULEB128ThreeBytes (1410 of 2354) PASS: lldb-api :: functionalities/data-formatter/data-formatter-stl/libcxx/unique_ptr/TestDataFormatterLibcxxUniquePtr.py (1411 of 2354) PASS: lldb-api :: python_api/watchpoint/watchlocation/TestSetWatchlocation.py (1412 of 2354) PASS: lldb-api :: macosx/find-dsym/deep-bundle/TestDeepBundle.py (1413 of 2354) PASS: lldb-unit :: Language/Highlighting/./HighlighterTests/HighlighterTest.ClangTrailingBackslashBeforeNewline (1414 of 2354) PASS: lldb-unit :: SymbolFile/NativePDB/./SymbolFileNativePDBTests/PDBFPOProgramToDWARFExpressionTests.InvalidOpUnary (1415 of 2354) PASS: lldb-api :: functionalities/thread/create_after_attach/TestCreateAfterAttach.py (1416 of 2354) UNSUPPORTED: lldb-api :: functionalities/darwin_log/filter/exact_match/activity/TestDarwinLogFilterMatchActivity.py (1417 of 2354) PASS: lldb-unit :: Utility/./UtilityTests/StreamTest.PutBytesAsRawHex8ToMixedEndian (1418 of 2354) PASS: lldb-unit :: Utility/./UtilityTests/ListenerTest.GetEventWait (1419 of 2354) PASS: lldb-unit :: Core/./LLDBCoreTests/StreamCallbackTest.Callback (1420 of 2354) UNSUPPORTED: lldb-shell :: ObjectFile/ELF/minidebuginfo-no-lzma.yaml (1421 of 2354) PASS: lldb-unit :: Utility/./UtilityTests/FileSpecTest.IsRelative (1422 of 2354) PASS: lldb-api :: python_api/sbplatform/TestSBPlatform.py (1423 of 2354) PASS: lldb-unit :: Expression/./ExpressionTests/DiagnosticManagerTest.AppendMessageSubsequentDiags (1424 of 2354) PASS: lldb-api :: python_api/sbtype_typeclass/TestSBTypeTypeClass.py (1425 of 2354) PASS: lldb-unit :: Utility/./UtilityTests/StreamTeeTest.Assignment (1426 of 2354) PASS: lldb-unit :: ScriptInterpreter/Python/./ScriptInterpreterPythonTests/PythonDataObjectsTest.TestPythonCallableInvoke (1427 of 2354) PASS: lldb-unit :: Utility/./UtilityTests/StreamTest.PutHex64ByteOrderBig (1428 of 2354) PASS: lldb-shell :: Minidump/dump-all.test (1429 of 2354) UNSUPPORTED: lldb-api :: commands/register/register/intel_xtended_registers/mpx_bound_violation/TestBoundViolation.py (1430 of 2354) UNSUPPORTED: lldb-api :: linux/mix-dwo-and-regular-objects/TestMixedDwarfBinary.py (1431 of 2354) PASS: lldb-shell :: Reproducer/TestSynchronous.test (1432 of 2354) UNSUPPORTED: lldb-shell :: Register/x86-64-xmm16-read.test (1433 of 2354) PASS: lldb-unit :: Utility/./UtilityTests/UriParserTest.TypicalPortPathIPv6 (1434 of 2354) PASS: lldb-unit :: Utility/./UtilityTests/OptionsWithRawTest.UnterminatedQuote (1435 of 2354) PASS: lldb-shell :: Reproducer/Functionalities/TestDataFormatter.test (1436 of 2354) PASS: lldb-api :: functionalities/data-formatter/format-propagation/TestFormatPropagation.py (1437 of 2354) PASS: lldb-unit :: Process/minidump/./LLDBMinidumpTests/MinidumpParserTest.GetMemoryRegionInfoFromMemoryList (1438 of 2354) PASS: lldb-api :: python_api/lldbutil/process/TestPrintStackTraces.py (1439 of 2354) PASS: lldb-shell :: Breakpoint/split-dwarf-5-addrbase.test (1440 of 2354) UNSUPPORTED: lldb-api :: functionalities/breakpoint/hardware_breakpoints/hardware_breakpoint_on_multiple_threads/TestHWBreakMultiThread.py (1441 of 2354) UNSUPPORTED: lldb-shell :: SymbolFile/NativePDB/ast-functions-msvc.cpp (1442 of 2354) PASS: lldb-api :: commands/expression/import-std-module/forward_list/TestForwardListFromStdModule.py (1443 of 2354) PASS: lldb-api :: commands/expression/call-function/TestCallStopAndContinue.py (1444 of 2354) PASS: lldb-api :: functionalities/memory/read/TestMemoryRead.py (1445 of 2354) PASS: lldb-unit :: Signals/./SignalsTests/UnixSignalsTest.VersionChange (1446 of 2354) PASS: lldb-unit :: Utility/./UtilityTests/ProcessInstanceInfoMatch.Name (1447 of 2354) PASS: lldb-api :: tools/lldb-server/register-reading/TestGdbRemoteGPacket.py (1448 of 2354) PASS: lldb-unit :: Utility/./UtilityTests/CompletionRequest.FakeLastArg (1449 of 2354) PASS: lldb-unit :: Utility/./UtilityTests/CompletionRequest.ShiftArguments (1450 of 2354) PASS: lldb-unit :: Utility/./UtilityTests/StringExtractorTest.GetHexU8_Underflow_NoEof (1451 of 2354) PASS: lldb-shell :: Commands/command-stop-hook-output.test (1452 of 2354) UNSUPPORTED: lldb-api :: benchmarks/libcxxmap/TestBenchmarkLibcxxMap.py (1453 of 2354) PASS: lldb-unit :: Core/./LLDBCoreTests/ModuleSpecTest.InvalidInMemoryBufferValidFile (1454 of 2354) PASS: lldb-shell :: SymbolFile/DWARF/x86/find-method-local-struct.cpp (1455 of 2354) PASS: lldb-unit :: Process/gdb-remote/./ProcessGdbRemoteTests/GDBRemoteClientBaseTest.InterruptNoResponse (1456 of 2354) PASS: lldb-unit :: Utility/./UtilityTests/LogTest.Register (1457 of 2354) PASS: lldb-unit :: Utility/./UtilityTests/StringListTest.JoinMultiCharSeparator (1458 of 2354) PASS: lldb-api :: lang/cpp/bool/TestCPPBool.py (1459 of 2354) UNSUPPORTED: lldb-api :: linux/aarch64/mte_memory_region/TestAArch64LinuxMTEMemoryRegion.py (1460 of 2354) PASS: lldb-api :: functionalities/breakpoint/breakpoint_locations/TestBreakpointLocations.py (1461 of 2354) PASS: lldb-unit :: ScriptInterpreter/Python/./ScriptInterpreterPythonTests/PythonDataObjectsTest.TestPythonIntegerToStr (1462 of 2354) PASS: lldb-api :: functionalities/type_completion/TestTypeCompletion.py (1463 of 2354) UNSUPPORTED: lldb-api :: functionalities/darwin_log/source/debug/TestDarwinLogSourceDebug.py (1464 of 2354) PASS: lldb-unit :: Utility/./UtilityTests/ScalarTest.Scalar_512 (1465 of 2354) PASS: lldb-api :: functionalities/data-formatter/boolreference/TestFormattersBoolRefPtr.py (1466 of 2354) PASS: lldb-api :: tools/lldb-server/commandline/TestStubSetSID.py (1467 of 2354) PASS: lldb-api :: functionalities/thread/backtrace_all/TestBacktraceAll.py (1468 of 2354) PASS: lldb-api :: functionalities/thread/concurrent_events/TestConcurrentBreakpointsDelayedBreakpointOneWatchpoint.py (1469 of 2354) PASS: lldb-api :: functionalities/data-formatter/data-formatter-stl/libcxx/list/loop/TestDataFormatterLibcxxListLoop.py (1470 of 2354) PASS: lldb-api :: lang/objcxx/objcxx-ivar-vector/TestIvarVector.py (1471 of 2354) PASS: lldb-api :: functionalities/dead-strip/TestDeadStrip.py (1472 of 2354) PASS: lldb-api :: functionalities/gdb_remote_client/TestGDBRemoteClient.py (1473 of 2354) PASS: lldb-unit :: Utility/./UtilityTests/StringListTest.Join (1474 of 2354) PASS: lldb-unit :: DataFormatter/./LLDBFormatterTests/StringPrinterTests.CxxUTF8 (1475 of 2354) PASS: lldb-unit :: SymbolFile/NativePDB/./SymbolFileNativePDBTests/PDBFPOProgramToDWARFExpressionTests.InvalidAssignmentSingle (1476 of 2354) PASS: lldb-api :: functionalities/data-formatter/nssetsynth/TestNSSetSynthetic.py (1477 of 2354) PASS: lldb-unit :: Utility/./UtilityTests/ScalarTest.ExtractBitfield (1478 of 2354) PASS: lldb-unit :: Utility/./UtilityTests/DataExtractorTest.UncommonAddressSize (1479 of 2354) PASS: lldb-unit :: Utility/./UtilityTests/StringLexerTest.Next (1480 of 2354) UNSUPPORTED: lldb-shell :: Subprocess/clone-follow-parent-wp.test (1481 of 2354) PASS: lldb-api :: functionalities/memory/cache/TestMemoryCache.py (1482 of 2354) PASS: lldb-unit :: Utility/./UtilityTests/StringExtractorTest.GetHexU8_Exact (1483 of 2354) PASS: lldb-api :: lang/objc/hidden-ivars/TestHiddenIvars.py (1484 of 2354) PASS: lldb-unit :: Utility/./UtilityTests/DataExtractorTest.GetFloat (1485 of 2354) PASS: lldb-unit :: Host/./HostTests/SocketTests/SocketTest.DomainListenConnectAccept/ipv6 (1486 of 2354) PASS: lldb-unit :: Utility/./UtilityTests/RangeTest.Clear (1487 of 2354) UNSUPPORTED: lldb-shell :: Unwind/split-machine-functions.test (1488 of 2354) PASS: lldb-shell :: Breakpoint/jit-loader_jitlink_elf.test (1489 of 2354) PASS: lldb-unit :: Host/./HostTests/NativeProcessProtocolTest.ReadCStringFromMemory_MaxSize (1490 of 2354) PASS: lldb-unit :: Utility/./UtilityTests/StringLexerTest.Peek (1491 of 2354) PASS: lldb-api :: functionalities/multidebugger_commands/TestMultipleDebuggersCommands.py (1492 of 2354) PASS: lldb-shell :: Register/x86-multithread-write.test (1493 of 2354) PASS: lldb-unit :: Utility/./UtilityTests/UserIDResolver.GetUserName (1494 of 2354) PASS: lldb-shell :: SymbolFile/DWARF/x86/debug-types-line-tables.s (1495 of 2354) UNSUPPORTED: lldb-api :: commands/trace/TestTraceLoad.py (1496 of 2354) PASS: lldb-api :: lang/cpp/struct_with_keyword_name/TestStructWithKeywordName.py (1497 of 2354) PASS: lldb-unit :: Host/./HostTests/Host.WaitStatusFormat (1498 of 2354) XFAIL: lldb-shell :: Register/x86-fp-write.test (1499 of 2354) PASS: lldb-unit :: Symbol/./SymbolTests/Type.GetTypeScopeAndBasename (1500 of 2354) PASS: lldb-api :: commands/expression/import-std-module/sysroot/TestStdModuleSysroot.py (1501 of 2354) PASS: lldb-api :: commands/expression/deleting-implicit-copy-constructor/TestDeletingImplicitCopyConstructor.py (1502 of 2354) UNSUPPORTED: lldb-api :: functionalities/darwin_log/filter/exact_match/category/TestDarwinLogFilterMatchCategory.py (1503 of 2354) PASS: lldb-api :: functionalities/plugins/python_os_plugin/stepping_plugin_threads/TestOSPluginStepping.py (1504 of 2354) UNSUPPORTED: lldb-api :: functionalities/data-formatter/data-formatter-stl/libstdcpp/unique_ptr/TestDataFormatterStdUniquePtr.py (1505 of 2354) PASS: lldb-unit :: Host/./HostTests/PipeTest.CreateWithUniqueName (1506 of 2354) PASS: lldb-unit :: Expression/./ExpressionTests/CppModuleConfigurationTest.MissingUsrInclude (1507 of 2354) PASS: lldb-api :: commands/target/stop-hooks/TestStopHookScripted.py (1508 of 2354) PASS: lldb-unit :: Process/gdb-remote/./ProcessGdbRemoteTests/GDBRemoteCommunicationServerTest.SendErrorResponse_ErrorList (1509 of 2354) UNSUPPORTED: lldb-api :: macosx/macCatalystAppMacOSFramework/TestMacCatalystAppWithMacOSFramework.py (1510 of 2354) PASS: lldb-api :: commands/expression/formatters/TestFormatters.py (1511 of 2354) PASS: lldb-unit :: Expression/./ExpressionTests/ClangExpressionDeclMapTest.TestUnknownIdentifierLookup (1512 of 2354) PASS: lldb-unit :: Utility/./UtilityTests/StringLexerTest.GetUnlexed (1513 of 2354) PASS: lldb-unit :: Utility/./UtilityTests/ScalarTest.Promotion (1514 of 2354) PASS: lldb-unit :: Utility/./UtilityTests/ScalarTest.GetBytes (1515 of 2354) PASS: lldb-unit :: Utility/./UtilityTests/ArgsTest.Yaml (1516 of 2354) PASS: lldb-api :: commands/expression/import-std-module/basic/TestImportStdModule.py (1517 of 2354) PASS: lldb-api :: functionalities/inferior-crashing/recursive-inferior/TestRecursiveInferiorStep.py (1518 of 2354) PASS: lldb-shell :: Reproducer/TestGDBRemoteRepro.test (1519 of 2354) PASS: lldb-api :: functionalities/reproducers/attach/TestReproducerAttach.py (1520 of 2354) PASS: lldb-unit :: SymbolFile/DWARF/./SymbolFileDWARFTests/SymbolFileDWARFTests.TestAbilitiesForDWARF (1521 of 2354) PASS: lldb-unit :: Utility/./UtilityTests/StatusTest.ErrorConversion (1522 of 2354) PASS: lldb-unit :: Utility/./UtilityTests/StreamTest.AddressNoSuffix (1523 of 2354) PASS: lldb-unit :: Utility/./UtilityTests/CompletionRequest.Constructor (1524 of 2354) PASS: lldb-api :: python_api/value/linked_list/TestValueAPILinkedList.py (1525 of 2354) PASS: lldb-shell :: Driver/TestRepl.test (1526 of 2354) PASS: lldb-unit :: Utility/./UtilityTests/DataExtractorTest.GetCStrAtNullOffset (1527 of 2354) PASS: lldb-unit :: Host/./HostTests/SocketTests/SocketTest.DomainListenConnectAccept/ipv4 (1528 of 2354) PASS: lldb-unit :: UnwindAssembly/x86/./UnwindAssemblyx86Tests/Testx86AssemblyInspectionEngine.TestPushImm (1529 of 2354) PASS: lldb-api :: lang/objc/objc-new-syntax/TestObjCNewSyntaxLiteral.py (1530 of 2354) PASS: lldb-shell :: Commands/command-regex-delete.test (1531 of 2354) PASS: lldb-unit :: Utility/./UtilityTests/StreamTeeTest.Flush (1532 of 2354) UNSUPPORTED: lldb-shell :: Subprocess/vfork-follow-parent-wp.test (1533 of 2354) PASS: lldb-api :: functionalities/data-formatter/data-formatter-stl/libcxx/set/TestDataFormatterLibcxxSet.py (1534 of 2354) PASS: lldb-unit :: Utility/./UtilityTests/ArgsTest.AppendArguments (1535 of 2354) PASS: lldb-api :: lang/objc/radar-9691614/TestObjCMethodReturningBOOL.py (1536 of 2354) PASS: lldb-unit :: Utility/./UtilityTests/GeneratorTest.Get (1537 of 2354) PASS: lldb-shell :: ObjectFile/wasm/basic.yaml (1538 of 2354) UNSUPPORTED: lldb-shell :: ScriptInterpreter/Lua/quit.test (1539 of 2354) UNSUPPORTED: lldb-shell :: ScriptInterpreter/Lua/breakpoint_function_callback.test (1540 of 2354) PASS: lldb-api :: commands/expression/import-std-module/shared_ptr/TestSharedPtrFromStdModule.py (1541 of 2354) PASS: lldb-unit :: Utility/./UtilityTests/ArgsTest.ReplaceArgumentAtIndexOutOfRange (1542 of 2354) PASS: lldb-unit :: ScriptInterpreter/Python/./ScriptInterpreterPythonTests/PythonDataObjectsTest.TestInstanceNameResolutionNoDot (1543 of 2354) PASS: lldb-unit :: Utility/./UtilityTests/SerializationRountripTest.SerializeDeserializePodReferences (1544 of 2354) UNSUPPORTED: lldb-shell :: Unwind/eh-frame-augment-noop.test (1545 of 2354) PASS: lldb-unit :: Utility/./UtilityTests/StateTest.Formatv (1546 of 2354) PASS: lldb-api :: python_api/interpreter/TestRunCommandInterpreterAPI.py (1547 of 2354) PASS: lldb-api :: python_api/get-value-32bit-int/TestGetValue32BitInt.py (1548 of 2354) PASS: lldb-unit :: Core/./LLDBCoreTests/FormatEntityTest.DefinitionConstructionNameAndType (1549 of 2354) PASS: lldb-unit :: Utility/./UtilityTests/TimerTest.CategoryTimes (1550 of 2354) PASS: lldb-shell :: SymbolFile/DWARF/x86/DW_AT_declaration-with-children.s (1551 of 2354) PASS: lldb-api :: macosx/load-kext/TestLoadKext.py (1552 of 2354) PASS: lldb-unit :: Utility/./UtilityTests/DataExtractorTest.GetMaxU64 (1553 of 2354) UNSUPPORTED: lldb-shell :: Register/x86-db-read.test (1554 of 2354) PASS: lldb-unit :: Utility/./UtilityTests/ProcessInstanceInfo.Dump (1555 of 2354) PASS: lldb-shell :: SymbolFile/NativePDB/load-pdb.cpp (1556 of 2354) PASS: lldb-api :: functionalities/data-formatter/data-formatter-stl/libcxx/unordered/TestDataFormatterUnordered.py (1557 of 2354) UNSUPPORTED: lldb-api :: commands/register/register/aarch64_sve_registers/rw_access_static_config/TestSVERegisters.py (1558 of 2354) PASS: lldb-api :: types/TestCharType.py (1559 of 2354) PASS: lldb-unit :: Utility/./UtilityTests/StringListTest.AppendListCStringArray (1560 of 2354) PASS: lldb-api :: lang/c/local_variables/TestLocalVariables.py (1561 of 2354) PASS: lldb-api :: functionalities/data-formatter/data-formatter-script/TestDataFormatterScript.py (1562 of 2354) PASS: lldb-unit :: Process/Utility/./ProcessUtilityTests/ProcSMapTests/LinuxProcSMapsTestFixture.ParseSMapRegions/2 (1563 of 2354) UNSUPPORTED: lldb-api :: functionalities/data-formatter/data-formatter-stl/libstdcpp/smart_ptr/TestDataFormatterStdSmartPtr.py (1564 of 2354) PASS: lldb-api :: lang/cpp/const_this/TestConstThis.py (1565 of 2354) UNSUPPORTED: lldb-api :: functionalities/asan/TestMemoryHistory.py (1566 of 2354) PASS: lldb-api :: commands/expression/result_numbering/TestResultNumbering.py (1567 of 2354) PASS: lldb-unit :: Utility/./UtilityTests/ArgsTest.GetArgumentArrayRef (1568 of 2354) PASS: lldb-unit :: UnwindAssembly/x86/./UnwindAssemblyx86Tests/Testx86AssemblyInspectionEngine.Testi386IgnoredRegisters (1569 of 2354) PASS: lldb-shell :: SymbolFile/NativePDB/globals-bss.cpp (1570 of 2354) PASS: lldb-api :: commands/expression/import-std-module/deque-basic/TestDequeFromStdModule.py (1571 of 2354) PASS: lldb-api :: lang/cpp/limit-debug-info/TestWithLimitDebugInfo.py (1572 of 2354) PASS: lldb-unit :: Utility/./UtilityTests/StreamTest.PutRawBytesToBigEndian (1573 of 2354) PASS: lldb-unit :: UnwindAssembly/x86/./UnwindAssemblyx86Tests/Testx86AssemblyInspectionEngine.TestPushRBPWithREX (1574 of 2354) PASS: lldb-api :: lang/objc/unicode-string/TestUnicodeString.py (1575 of 2354) PASS: lldb-api :: types/TestShortType.py (1576 of 2354) PASS: lldb-unit :: Breakpoint/./LLDBBreakpointTests/BreakpointIDTest.StringIsBreakpointName (1577 of 2354) PASS: lldb-shell :: ObjectFile/ELF/basic-info.yaml (1578 of 2354) PASS: lldb-unit :: ObjectFile/PECOFF/./ObjectFilePECOFFTests/PECallFrameInfoTest.Chained_eh (1579 of 2354) PASS: lldb-unit :: Utility/./UtilityTests/FileSpecTest.EqualDotsPosix (1580 of 2354) UNSUPPORTED: lldb-shell :: Register/x86-zmm-read.test (1581 of 2354) PASS: lldb-unit :: Expression/./ExpressionTests/DWARFExpressionMockProcessTest.DW_OP_deref (1582 of 2354) PASS: lldb-api :: functionalities/gdb_remote_client/TestWriteMemory.py (1583 of 2354) PASS: lldb-unit :: Utility/./UtilityTests/ProcessInstanceInfo.DumpTable_invalidUID (1584 of 2354) PASS: lldb-shell :: Settings/TestDisableColor.test (1585 of 2354) PASS: lldb-api :: lang/cpp/operator-overload/TestOperatorOverload.py (1586 of 2354) PASS: lldb-unit :: Process/Utility/./ProcessUtilityTests/ProcMapTests/LinuxProcMapsTestFixture.ParseMapRegions/0 (1587 of 2354) PASS: lldb-unit :: Process/gdb-remote/./ProcessGdbRemoteTests/GDBRemoteCommunicationClientTest.WriteRegister (1588 of 2354) PASS: lldb-api :: macosx/builtin-debugtrap/TestBuiltinDebugTrap.py (1589 of 2354) UNSUPPORTED: lldb-shell :: SymbolFile/PDB/enums-layout.test (1590 of 2354) UNSUPPORTED: lldb-api :: lang/objc/rdar-12408181/TestRdar12408181.py (1591 of 2354) PASS: lldb-unit :: Utility/./UtilityTests/AnsiTerminal.AtEnd (1592 of 2354) PASS: lldb-api :: functionalities/data-formatter/data-formatter-stl/libcxx/vector/TestDataFormatterLibcxxVector.py (1593 of 2354) PASS: lldb-unit :: Utility/./UtilityTests/UriParserTest.BracketedHostnamePort (1594 of 2354) PASS: lldb-unit :: Utility/./UtilityTests/RecordReplayTest.InstrumentedFooSameThis (1595 of 2354) PASS: lldb-unit :: Host/./HostTests/FileSystemTest.GetPermissions (1596 of 2354) PASS: lldb-shell :: BuildScript/toolchain-clang.test (1597 of 2354) PASS: lldb-unit :: UnwindAssembly/x86/./UnwindAssemblyx86Tests/Testx86AssemblyInspectionEngine.TestLEAVE (1598 of 2354) PASS: lldb-api :: functionalities/data-formatter/stringprinter/TestStringPrinter.py (1599 of 2354) PASS: lldb-unit :: Process/gdb-remote/./ProcessGdbRemoteTests/GDBRemoteClientBaseTest.SendContinueAndWait (1600 of 2354) PASS: lldb-unit :: Core/./LLDBCoreTests/FormatEntityTest.DefinitionConstructionNameAndString (1601 of 2354) PASS: lldb-unit :: Interpreter/./InterpreterTests/OptionArgParserTest.toChar (1602 of 2354) PASS: lldb-unit :: UnwindAssembly/x86/./UnwindAssemblyx86Tests/Testx86AssemblyInspectionEngine.TestPushR13 (1603 of 2354) PASS: lldb-api :: lang/objc/print-obj/TestPrintObj.py (1604 of 2354) PASS: lldb-unit :: Core/./LLDBCoreTests/SourceFileCache.FindSourceFileFound (1605 of 2354) PASS: lldb-unit :: Utility/./UtilityTests/RangeDataVector.CustomSort (1606 of 2354) PASS: lldb-unit :: Process/gdb-remote/./ProcessGdbRemoteTests/GDBRemoteCommunicationServerTest.SendErrorResponse_StringError (1607 of 2354) PASS: lldb-unit :: Utility/./UtilityTests/StringExtractorTest.GetHexBytesAvail_Underflow (1608 of 2354) PASS: lldb-shell :: Driver/TestFile.test (1609 of 2354) PASS: lldb-unit :: Expression/./ExpressionTests/ClangHostTest.MacOSX (1610 of 2354) XFAIL: lldb-shell :: Register/x86-64-ymm-write.test (1611 of 2354) PASS: lldb-api :: tools/lldb-server/TestGdbRemote_qThreadStopInfo.py (1612 of 2354) PASS: lldb-api :: commands/expression/import-std-module/list/TestListFromStdModule.py (1613 of 2354) PASS: lldb-api :: functionalities/breakpoint/consecutive_breakpoints/TestConsecutiveBreakpoints.py (1614 of 2354) PASS: lldb-shell :: Driver/TestTarget.test (1615 of 2354) PASS: lldb-unit :: Utility/./UtilityTests/TimerTest.CategoryTimesNested (1616 of 2354) PASS: lldb-unit :: Symbol/./SymbolTests/TestTypeSystemClang.TestGetTypeClassNested (1617 of 2354) PASS: lldb-api :: functionalities/thread/step_until/TestStepUntil.py (1618 of 2354) PASS: lldb-unit :: Core/./LLDBCoreTests/FormatEntityTest.DefinitionConstructionNameTypeChildren (1619 of 2354) PASS: lldb-unit :: Core/./LLDBCoreTests/MangledTest.ResultForValidRustV0Name (1620 of 2354) PASS: lldb-api :: macosx/indirect_symbol/TestIndirectSymbols.py (1621 of 2354) PASS: lldb-api :: functionalities/multiword-commands/TestMultiWordCommands.py (1622 of 2354) PASS: lldb-api :: functionalities/thread_plan/TestThreadPlanCommands.py (1623 of 2354) PASS: lldb-unit :: Language/Highlighting/./HighlighterTests/HighlighterTest.DefaultHighlighterWithCursor (1624 of 2354) PASS: lldb-unit :: Utility/./UtilityTests/RegisterValueTest.GetSet8 (1625 of 2354) UNSUPPORTED: lldb-shell :: Expr/TestIRMemoryMapWindows.test (1626 of 2354) PASS: lldb-api :: functionalities/set-data/TestSetData.py (1627 of 2354) PASS: lldb-unit :: Utility/./UtilityTests/ConstStringTest.NullAndEmptyStates (1628 of 2354) UNSUPPORTED: lldb-api :: functionalities/darwin_log/filter/exact_match/activity-chain/TestDarwinLogFilterMatchActivityChain.py (1629 of 2354) PASS: lldb-unit :: Utility/./UtilityTests/OptionsWithRawTest.ArgsButNoDelimiter (1630 of 2354) PASS: lldb-api :: lang/cpp/char1632_t/TestChar1632T.py (1631 of 2354) PASS: lldb-unit :: ScriptInterpreter/Python/./ScriptInterpreterPythonTests/PythonDataObjectsTest.TestPythonDictionaryManipulation (1632 of 2354) PASS: lldb-api :: functionalities/thread/concurrent_events/TestConcurrentSignalDelayBreak.py (1633 of 2354) PASS: lldb-unit :: Symbol/./SymbolTests/TestTypeSystemClang.TemplateArguments (1634 of 2354) PASS: lldb-shell :: ObjectFile/ELF/PT_LOAD-overlap-section.yaml (1635 of 2354) PASS: lldb-unit :: Utility/./UtilityTests/PassiveReplayTest.InstrumentedBar (1636 of 2354) PASS: lldb-unit :: Host/./HostTests/SocketTests/SocketTest.DecodeHostAndPort/ipv4 (1637 of 2354) PASS: lldb-api :: lang/cpp/member-and-local-vars-with-same-name/TestMembersAndLocalsWithSameName.py (1638 of 2354) PASS: lldb-api :: functionalities/data-formatter/data-formatter-stl/libcxx/queue/TestDataFormatterLibcxxQueue.py (1639 of 2354) PASS: lldb-unit :: Utility/./UtilityTests/StreamTest.AddressRangeInvalidRange (1640 of 2354) PASS: lldb-unit :: Utility/./UtilityTests/StringExtractorTest.DecodeHexU8_Underflow2 (1641 of 2354) PASS: lldb-shell :: SymbolFile/NativePDB/s_constant.cpp (1642 of 2354) PASS: lldb-shell :: SymbolFile/DWARF/x86/DW_OP_piece-struct.s (1643 of 2354) UNSUPPORTED: lldb-shell :: SymbolFile/Breakpad/stack-cfi-arm.yaml (1644 of 2354) PASS: lldb-api :: commands/expression/completion-crash-incomplete-record/TestCompletionCrashIncompleteRecord.py (1645 of 2354) PASS: lldb-unit :: Utility/./UtilityTests/ArgsTest.TestUnknownEscape (1646 of 2354) PASS: lldb-unit :: SymbolFile/DWARF/./SymbolFileDWARFTests/DWARFUnitTest.NullUnitDie (1647 of 2354) PASS: lldb-api :: lang/cpp/unicode-literals/TestUnicodeLiterals.py (1648 of 2354) PASS: lldb-api :: commands/expression/import-std-module/non-module-type-separation/TestNonModuleTypeSeparation.py (1649 of 2354) PASS: lldb-api :: commands/version/TestVersion.py (1650 of 2354) PASS: lldb-unit :: Utility/./UtilityTests/FileSpecTest.FileAndDirectoryComponents (1651 of 2354) PASS: lldb-api :: linux/builtin_trap/TestBuiltinTrap.py (1652 of 2354) PASS: lldb-unit :: SymbolFile/DWARF/./SymbolFileDWARFTests/SymbolFileDWARFTests.TestAbbrevValidAttrNullForm (1653 of 2354) PASS: lldb-shell :: SymbolFile/DWARF/x86/debug-types-basic.test (1654 of 2354) PASS: lldb-unit :: ObjectFile/ELF/./ObjectFileELFTests/ObjectFileELFTest.SectionsResolveConsistently (1655 of 2354) PASS: lldb-unit :: Utility/./UtilityTests/StringListTest.ShiftStdString (1656 of 2354) PASS: lldb-api :: lang/objc/modules-hash-mismatch/TestClangModulesHashMismatch.py (1657 of 2354) PASS: lldb-unit :: Utility/./UtilityTests/LogChannelEnabledTest.LogThread (1658 of 2354) PASS: lldb-shell :: ScriptInterpreter/Python/Crashlog/text.test (1659 of 2354) PASS: lldb-shell :: Commands/command-source.test (1660 of 2354) PASS: lldb-unit :: UnwindAssembly/x86/./UnwindAssemblyx86Tests/Testx86AssemblyInspectionEngine.TestPopEBP (1661 of 2354) PASS: lldb-shell :: ScriptInterpreter/Python/scripted_breakpoint.test (1662 of 2354) PASS: lldb-shell :: SymbolFile/Breakpad/symtab.test (1663 of 2354) PASS: lldb-shell :: Minidump/memory-region.yaml (1664 of 2354) PASS: lldb-api :: lang/cpp/stl/TestStdCXXDisassembly.py (1665 of 2354) PASS: lldb-api :: lang/c/global_variables/TestGlobalVariables.py (1666 of 2354) PASS: lldb-api :: functionalities/gdb_remote_client/TestNoWatchpointSupportInfo.py (1667 of 2354) PASS: lldb-unit :: Process/Utility/./ProcessUtilityTests/MemoryTagManagerAArch64MTETest.RemoveNonAddressBits (1668 of 2354) PASS: lldb-shell :: SymbolFile/DWARF/x86/find-basic-variable.cpp (1669 of 2354) PASS: lldb-unit :: SymbolFile/DWARF/./SymbolFileDWARFTests/XcodeSDKModuleTests.TestModuleGetXcodeSDK (1670 of 2354) PASS: lldb-shell :: Subprocess/fork-follow-parent-wp.test (1671 of 2354) PASS: lldb-api :: lang/objc/foundation/TestObjCMethods.py (1672 of 2354) PASS: lldb-unit :: UnwindAssembly/x86/./UnwindAssemblyx86Tests/Testx86AssemblyInspectionEngine.TestPushRBP (1673 of 2354) UNSUPPORTED: lldb-api :: functionalities/tty/TestTerminal.py (1674 of 2354) PASS: lldb-shell :: Minidump/memory-region-from-module.yaml (1675 of 2354) PASS: lldb-api :: functionalities/breakpoint/breakpoint_command/TestBreakpointCommandsFromPython.py (1676 of 2354) PASS: lldb-api :: lang/cpp/nsimport/TestCppNsImport.py (1677 of 2354) PASS: lldb-unit :: Utility/./UtilityTests/XcodeSDKTest.SDKSupportsSwift (1678 of 2354) PASS: lldb-shell :: ObjectFile/ELF/minidebuginfo-find-symbols.yaml (1679 of 2354) PASS: lldb-unit :: tools/lldb-server/tests/./LLDBServerTests/TestBase.LaunchModePreservesEnvironment (1680 of 2354) PASS: lldb-api :: functionalities/data-formatter/type_summary_list_script/TestTypeSummaryListScript.py (1681 of 2354) PASS: lldb-api :: lang/objc/objc-struct-argument/TestObjCStructArgument.py (1682 of 2354) PASS: lldb-unit :: Process/gdb-remote/./ProcessGdbRemoteTests/GDBRemoteCommunicationClientTest.GetMemoryRegionInfoInvalidResponse (1683 of 2354) PASS: lldb-api :: commands/platform/basic/TestPlatformCommand.py (1684 of 2354) PASS: lldb-api :: functionalities/data-formatter/data-formatter-smart-array/TestDataFormatterSmartArray.py (1685 of 2354) PASS: lldb-unit :: Expression/./ExpressionTests/DWARFExpression.DW_OP_piece (1686 of 2354) PASS: lldb-shell :: Breakpoint/split-dwarf5-debug-stroffsets.test (1687 of 2354) PASS: lldb-unit :: Utility/./UtilityTests/RangeTest.NotEqualInvalid (1688 of 2354) PASS: lldb-shell :: SymbolFile/DWARF/x86/DW_AT_location-DW_AT_const_value.s (1689 of 2354) PASS: lldb-unit :: ObjectFile/Breakpad/./ObjectFileBreakpadTests/InfoRecord.parse (1690 of 2354) PASS: lldb-shell :: SymbolFile/Breakpad/line-table.test (1691 of 2354) PASS: lldb-api :: functionalities/inferior-assert/TestInferiorAssert.py (1692 of 2354) PASS: lldb-api :: commands/quit/TestQuit.py (1693 of 2354) PASS: lldb-unit :: Utility/./UtilityTests/ArgsTest.TestTrailingBackslash (1694 of 2354) PASS: lldb-api :: commands/expression/char/TestExprsChar.py (1695 of 2354) PASS: lldb-unit :: Utility/./UtilityTests/StringExtractorTest.GetU64LittleEndian (1696 of 2354) PASS: lldb-unit :: Utility/./UtilityTests/VASprintfTest.NoBufferResize (1697 of 2354) PASS: lldb-shell :: ObjectFile/ELF/netbsd-exec-8.99.30-amd64.yaml (1698 of 2354) PASS: lldb-unit :: Host/./HostTests/SocketTests/SocketTest.UDPConnect/ipv4 (1699 of 2354) UNSUPPORTED: lldb-shell :: SymbolFile/NativePDB/typedefs.cpp (1700 of 2354) PASS: lldb-unit :: Utility/./UtilityTests/StringExtractorTest.GetHexU8_Underflow (1701 of 2354) PASS: lldb-shell :: ObjectFile/PECOFF/basic-info-arm64.yaml (1702 of 2354) PASS: lldb-unit :: Utility/./UtilityTests/StreamTest.AddressPrefix (1703 of 2354) PASS: lldb-unit :: Host/./HostTests/MainLoopTest.ReadObject (1704 of 2354) PASS: lldb-unit :: Symbol/./SymbolTests/TestTypeSystemClang.TestGetBasicTypeFromName (1705 of 2354) PASS: lldb-unit :: Utility/./UtilityTests/CompletionRequest.DuplicateFiltering (1706 of 2354) PASS: lldb-unit :: Core/./LLDBCoreTests/DumpDataExtractorTest.StartOffset (1707 of 2354) UNSUPPORTED: lldb-api :: tools/intel-features/intel-pt/test/TestIntelPTSimpleBinary.py (1708 of 2354) PASS: lldb-shell :: Quit/TestQuitExitCodeHexA.test (1709 of 2354) PASS: lldb-unit :: SymbolFile/NativePDB/./SymbolFileNativePDBTests/PDBFPOProgramToDWARFExpressionTests.DependencyChain (1710 of 2354) PASS: lldb-api :: commands/session/history/TestSessionHistory.py (1711 of 2354) PASS: lldb-unit :: Symbol/./SymbolTests/TestClangASTImporter.RecordLayout (1712 of 2354) PASS: lldb-api :: commands/expression/diagnostics/TestExprDiagnostics.py (1713 of 2354) PASS: lldb-api :: lang/c/set_values/TestSetValues.py (1714 of 2354) PASS: lldb-api :: commands/platform/sdk/TestPlatformSDK.py (1715 of 2354) PASS: lldb-unit :: Core/./LLDBCoreTests/FormatEntityTest.DefinitionConstructionNameTypeData (1716 of 2354) PASS: lldb-unit :: Utility/./UtilityTests/RangeTest.SetRangeBase (1717 of 2354) PASS: lldb-unit :: ScriptInterpreter/Python/./ScriptInterpreterPythonTests/PythonDataObjectsTest.TestResetting (1718 of 2354) PASS: lldb-unit :: Utility/./UtilityTests/RangeTest.ContainsAddr (1719 of 2354) PASS: lldb-api :: functionalities/data-formatter/data-formatter-stl/libcxx/iterator/TestDataFormatterLibccIterator.py (1720 of 2354) PASS: lldb-api :: commands/watchpoints/watchpoint_commands/condition/TestWatchpointConditionCmd.py (1721 of 2354) PASS: lldb-unit :: Process/minidump/./LLDBMinidumpTests/MinidumpParserTest.GetPidWow64 (1722 of 2354) UNSUPPORTED: lldb-api :: commands/gui/basic/TestGuiBasic.py (1723 of 2354) PASS: lldb-api :: python_api/thread/TestThreadAPI.py (1724 of 2354) PASS: lldb-api :: lang/cpp/function-qualifiers/TestCppFunctionQualifiers.py (1725 of 2354) PASS: lldb-api :: functionalities/data-formatter/data-formatter-objc/TestDataFormatterObjNSException.py (1726 of 2354) PASS: lldb-api :: functionalities/gdb_remote_client/TestPartialGPacket.py (1727 of 2354) PASS: lldb-api :: commands/expression/persistent_types/TestNestedPersistentTypes.py (1728 of 2354) PASS: lldb-api :: functionalities/load_using_paths/TestLoadUsingPaths.py (1729 of 2354) PASS: lldb-api :: commands/expression/import-std-module/stack/TestStackFromStdModule.py (1730 of 2354) PASS: lldb-unit :: Utility/./UtilityTests/UriParserTest.MinimalPort (1731 of 2354) PASS: lldb-api :: functionalities/data-formatter/hexcaps/TestDataFormatterHexCaps.py (1732 of 2354) PASS: lldb-api :: functionalities/breakpoint/objc/TestObjCBreakpoints.py (1733 of 2354) PASS: lldb-api :: functionalities/paths/TestPaths.py (1734 of 2354) PASS: lldb-unit :: Utility/./UtilityTests/StreamTest.PutSLEB128 (1735 of 2354) PASS: lldb-api :: functionalities/thread/concurrent_events/TestConcurrentWatchpointDelayWatchpointOneBreakpoint.py (1736 of 2354) PASS: lldb-unit :: Language/Highlighting/./HighlighterTests/HighlighterTest.DefaultHighlighterWithCursorOutOfBounds (1737 of 2354) PASS: lldb-unit :: Utility/./UtilityTests/StringListTest.ForRangeEmpty (1738 of 2354) PASS: lldb-api :: python_api/class_members/TestSBTypeClassMembers.py (1739 of 2354) PASS: lldb-shell :: ObjectFile/ELF/riscv-arch.yaml (1740 of 2354) PASS: lldb-shell :: SymbolFile/NativePDB/locate-pdb.cpp (1741 of 2354) PASS: lldb-unit :: Utility/./UtilityTests/UriParserTest.MinimalPortPath (1742 of 2354) PASS: lldb-unit :: Symbol/./SymbolTests/TestClangASTImporter.MetadataPropagation (1743 of 2354) PASS: lldb-api :: commands/target/dump-symtab-demangle/TestDumpSymtabDemangle.py (1744 of 2354) PASS: lldb-unit :: Utility/./UtilityTests/VMRange.Clear (1745 of 2354) PASS: lldb-api :: functionalities/thread/concurrent_events/TestConcurrentTwoBreakpointsOneSignal.py (1746 of 2354) UNSUPPORTED: lldb-api :: tools/lldb-server/registers-target-xml-reading/TestGdbRemoteTargetXmlPacket.py (1747 of 2354) PASS: lldb-unit :: Signals/./SignalsTests/UnixSignalsTest.Iteration (1748 of 2354) PASS: lldb-api :: commands/frame/diagnose/dereference-argument/TestDiagnoseDereferenceArgument.py (1749 of 2354) PASS: lldb-shell :: ScriptInterpreter/Python/python.test (1750 of 2354) PASS: lldb-unit :: Symbol/./SymbolTests/TestTypeSystemClang.TestGetTypeClassDeclType (1751 of 2354) PASS: lldb-shell :: ObjectFile/MachO/lc_version_min.yaml (1752 of 2354) UNSUPPORTED: lldb-api :: benchmarks/expression/TestRepeatedExprs.py (1753 of 2354) PASS: lldb-unit :: Utility/./UtilityTests/StringListTest.InsertStringAtIndexStdString (1754 of 2354) PASS: lldb-api :: functionalities/data-formatter/data-formatter-objc/TestDataFormatterObjCNSError.py (1755 of 2354) PASS: lldb-unit :: Utility/./UtilityTests/StringListTest.SetSize (1756 of 2354) PASS: lldb-api :: tools/lldb-server/TestGdbRemoteThreadsInStopReply.py (1757 of 2354) PASS: lldb-unit :: Utility/./UtilityTests/AnsiTerminal.KnownPrefix (1758 of 2354) PASS: lldb-api :: lang/cpp/break-on-initializers/TestBreakOnCPP11Initializers.py (1759 of 2354) PASS: lldb-unit :: Process/./ProcessEventDataTests/ProcessEventDataTest.ShouldStop (1760 of 2354) UNSUPPORTED: lldb-shell :: SymbolFile/PDB/expressions.test (1761 of 2354) PASS: lldb-unit :: Utility/./UtilityTests/StringListTest.Assignment (1762 of 2354) PASS: lldb-shell :: SymbolFile/DWARF/x86/win-i386-line-table.s (1763 of 2354) PASS: lldb-unit :: Platform/./LLDBPlatformTests/PlatformAppleSimulatorTest.TestSimHasSimEnvionament (1764 of 2354) PASS: lldb-shell :: SymbolFile/DWARF/anon_class_w_and_wo_export_symbols.ll (1765 of 2354) PASS: lldb-api :: functionalities/float-display/TestFloatDisplay.py (1766 of 2354) PASS: lldb-unit :: Utility/./UtilityTests/ScalarTest.LongLongAssigmentOperator (1767 of 2354) PASS: lldb-unit :: UnwindAssembly/x86/./UnwindAssemblyx86Tests/Testx86AssemblyInspectionEngine.TestPushR14 (1768 of 2354) UNSUPPORTED: lldb-api :: functionalities/darwin_log/basic/TestDarwinLogBasic.py (1769 of 2354) UNSUPPORTED: lldb-shell :: ScriptInterpreter/Lua/breakpoint_oneline_callback.test (1770 of 2354) UNSUPPORTED: lldb-api :: functionalities/gdb_remote_client/TestWasm.py (1771 of 2354) PASS: lldb-shell :: SymbolFile/DWARF/x86/DW_TAG_variable-DW_AT_const_value.s (1772 of 2354) PASS: lldb-unit :: UnwindAssembly/x86/./UnwindAssemblyx86Tests/Testx86AssemblyInspectionEngine.TestPopRBP (1773 of 2354) UNSUPPORTED: lldb-shell :: SymbolFile/PDB/calling-conventions.test (1774 of 2354) PASS: lldb-shell :: Settings/TestDisassemblyFormat.test (1775 of 2354) PASS: lldb-api :: functionalities/step_scripted/TestStepScripted.py (1776 of 2354) PASS: lldb-api :: functionalities/thread/num_threads/TestNumThreads.py (1777 of 2354) PASS: lldb-api :: lang/cpp/namespace/TestNamespaceLookup.py (1778 of 2354) PASS: lldb-unit :: Process/Utility/./ProcessUtilityTests/MemoryTagManagerAArch64MTETest.GetLogicalTag (1779 of 2354) PASS: lldb-shell :: ObjectFile/ELF/PT_LOAD.yaml (1780 of 2354) PASS: lldb-api :: commands/target/stop-hooks/TestStopHooks.py (1781 of 2354) PASS: lldb-api :: lang/c/step_over_no_deadlock/TestStepOverDoesntBlock.py (1782 of 2354) UNSUPPORTED: lldb-api :: iohandler/completion/TestIOHandlerCompletion.py (1783 of 2354) PASS: lldb-api :: commands/target/basic/TestTargetCommand.py (1784 of 2354) PASS: lldb-unit :: Target/./TargetTests/ExecutionContextTest.GetByteOrder (1785 of 2354) PASS: lldb-shell :: Register/x86-multithread-read.test (1786 of 2354) PASS: lldb-unit :: Utility/./UtilityTests/StreamTest.PutCString (1787 of 2354) PASS: lldb-api :: commands/platform/process/list/TestProcessList.py (1788 of 2354) PASS: lldb-unit :: Utility/./UtilityTests/UserIDResolver.GetGroupName (1789 of 2354) PASS: lldb-api :: functionalities/data-formatter/varscript_formatting/TestDataFormatterVarScriptFormatting.py (1790 of 2354) PASS: lldb-api :: functionalities/breakpoint/breakpoint_language/TestBreakpointLanguage.py (1791 of 2354) PASS: lldb-shell :: ObjectFile/ELF/eh_frame-symbols.yaml (1792 of 2354) PASS: lldb-unit :: API/./APITests/SBStructuredDataTest.NullImpl (1793 of 2354) PASS: lldb-unit :: Utility/./UtilityTests/StringExtractorTest.GetNameColonValueNoSemicolon (1794 of 2354) PASS: lldb-unit :: SymbolFile/DWARF/./SymbolFileDWARFTests/SymbolFileDWARFTests.TestAbbrevNullAttrValidForm (1795 of 2354) PASS: lldb-unit :: Expression/./ExpressionTests/DWARFExpression.DW_OP_pick (1796 of 2354) PASS: lldb-unit :: Expression/./ExpressionTests/DiagnosticManagerTest.FixedExpression (1797 of 2354) PASS: lldb-unit :: Symbol/./SymbolTests/LineEntryTest.GetSameLineContiguousAddressRangeOneInline (1798 of 2354) PASS: lldb-api :: functionalities/gdb_remote_client/TestIOSSimulator.py (1799 of 2354) PASS: lldb-unit :: ScriptInterpreter/Python/./ScriptInterpreterPythonTests/PythonDataObjectsTest.TestPythonDictionaryValueEquality (1800 of 2354) PASS: lldb-shell :: SymbolFile/DWARF/x86/debug_loc_and_loclists.s (1801 of 2354) PASS: lldb-unit :: Host/./HostTests/FileSystemTest.FileAndDirectoryComponents (1802 of 2354) PASS: lldb-unit :: Interpreter/./InterpreterTests/OptionValueFileColonLine.setFromString (1803 of 2354) PASS: lldb-shell :: SymbolFile/NativePDB/ast-methods.cpp (1804 of 2354) PASS: lldb-unit :: SymbolFile/DWARF/./SymbolFileDWARFTests/SymbolFileDWARFTests.ParseAranges (1805 of 2354) PASS: lldb-shell :: Settings/TestFrameFormatNoColor.test (1806 of 2354) PASS: lldb-api :: functionalities/data-formatter/ostypeformatting/TestFormattersOsType.py (1807 of 2354) PASS: lldb-unit :: Host/./HostTests/FileSystemTest.EmptyTest (1808 of 2354) PASS: lldb-unit :: Language/CLanguages/./LanguageCLanguagesTests/CLanguages.LookupCLanguagesByLanguageType (1809 of 2354) PASS: lldb-api :: functionalities/pre_run_dylibs/TestPreRunDylibs.py (1810 of 2354) UNSUPPORTED: lldb-shell :: Register/x86-ymm-read.test (1811 of 2354) PASS: lldb-unit :: ScriptInterpreter/Python/./ScriptInterpreterPythonTests/PythonDataObjectsTest.TestPythonBoolean (1812 of 2354) PASS: lldb-api :: commands/process/launch/TestProcessLaunch.py (1813 of 2354) PASS: lldb-shell :: ObjectFile/wasm/stripped-debug-sections.yaml (1814 of 2354) PASS: lldb-unit :: Utility/./UtilityTests/FileSpecTest.RemoveLastPathComponent (1815 of 2354) PASS: lldb-unit :: Platform/Android/./AdbClientTests/AdbClientTest.CreateByDeviceId (1816 of 2354) PASS: lldb-unit :: Utility/./UtilityTests/UUIDTest.Validity (1817 of 2354) PASS: lldb-api :: commands/expression/dont_allow_jit/TestAllowJIT.py (1818 of 2354) UNSUPPORTED: lldb-shell :: Breakpoint/ppc64-localentry.test (1819 of 2354) PASS: lldb-unit :: UnwindAssembly/x86/./UnwindAssemblyx86Tests/Testx86AssemblyInspectionEngine.TestCALLNextInsn (1820 of 2354) PASS: lldb-unit :: Symbol/./SymbolTests/TestTypeSystemClang.TestDisplayNameEmpty (1821 of 2354) PASS: lldb-shell :: Register/Core/x86-32-linux-addr.test (1822 of 2354) UNSUPPORTED: lldb-shell :: Unwind/unwind-plan-dwarf-dump.test (1823 of 2354) PASS: lldb-unit :: Process/minidump/./LLDBMinidumpTests/MinidumpParserTest.GetThreadContext_x86_64 (1824 of 2354) PASS: lldb-unit :: Utility/./UtilityTests/UriParserTest.SchemeHostSeparator2 (1825 of 2354) PASS: lldb-unit :: Utility/./UtilityTests/NameMatchesTest.RegularExpression (1826 of 2354) PASS: lldb-unit :: Utility/./UtilityTests/UriParserTest.BracketedHostnameWithColon (1827 of 2354) PASS: lldb-api :: lang/objc/modules-compile-error/TestModulesCompileError.py (1828 of 2354) UNSUPPORTED: lldb-api :: lang/c/typedef/Testtypedef.py (1829 of 2354) PASS: lldb-unit :: Process/Utility/./ProcessUtilityTests/ProcSMapTests/LinuxProcSMapsTestFixture.ParseSMapRegions/6 (1830 of 2354) PASS: lldb-api :: functionalities/gdb_remote_client/TestMemoryRegionDirtyPages.py (1831 of 2354) PASS: lldb-unit :: Platform/./LLDBPlatformTests/PlatformAppleSimulatorTest.TestHostPlatformToSim (1832 of 2354) PASS: lldb-api :: lang/objc/modules/TestObjCModules.py (1833 of 2354) PASS: lldb-unit :: Target/./TargetTests/PathMappingListTest.RelativeTests (1834 of 2354) PASS: lldb-api :: lang/cpp/lambdas/TestLambdas.py (1835 of 2354) PASS: lldb-unit :: Utility/./UtilityTests/ScalarTest.RightShiftOperator (1836 of 2354) PASS: lldb-unit :: Language/Highlighting/./HighlighterTests/HighlighterTest.ClangComments (1837 of 2354) PASS: lldb-api :: functionalities/data-formatter/typedef_array/TestTypedefArray.py (1838 of 2354) PASS: lldb-api :: lang/objc/objc++/TestObjCXX.py (1839 of 2354) PASS: lldb-unit :: Symbol/./SymbolTests/SymbolsTest.TerminateLocateExecutableSymbolFileForUnknownExecutableAndUnknownSymbolFile (1840 of 2354) PASS: lldb-api :: functionalities/thread/exit_during_step/TestExitDuringStep.py (1841 of 2354) PASS: lldb-unit :: Process/gdb-remote/./ProcessGdbRemoteTests/GDBRemoteClientBaseTest.SendContinueAndLateInterrupt (1842 of 2354) PASS: lldb-unit :: Utility/./UtilityTests/StringExtractorTest.GetU32LittleEndian (1843 of 2354) PASS: lldb-unit :: Utility/./UtilityTests/XcodeSDKTest.SDKSupportsModules (1844 of 2354) PASS: lldb-unit :: Utility/./UtilityTests/AnsiTerminal.AtStart (1845 of 2354) PASS: lldb-unit :: Utility/./UtilityTests/OptionsWithRawTest.SingleWhitespaceInput (1846 of 2354) PASS: lldb-api :: functionalities/data-formatter/builtin-formats/TestBuiltinFormats.py (1847 of 2354) PASS: lldb-api :: lang/cpp/template-function/TestTemplateFunctions.py (1848 of 2354) PASS: lldb-unit :: Process/minidump/./LLDBMinidumpTests/MinidumpParserTest.MinidumpDuplicateModuleMappedFirst (1849 of 2354) PASS: lldb-api :: types/TestCharTypeExpr.py (1850 of 2354) PASS: lldb-shell :: SymbolFile/NativePDB/disassembly.cpp (1851 of 2354) PASS: lldb-api :: commands/settings/TestSettings.py (1852 of 2354) PASS: lldb-unit :: Utility/./UtilityTests/RangeDataVector.FindEntryIndexesThatContain_Overlap (1853 of 2354) PASS: lldb-unit :: Utility/./UtilityTests/StreamTeeTest.SetStreamAtIndexOverwrite (1854 of 2354) PASS: lldb-api :: macosx/function-starts/TestFunctionStarts.py (1855 of 2354) PASS: lldb-shell :: Commands/command-disassemble.s (1856 of 2354) UNSUPPORTED: lldb-shell :: Watchpoint/netbsd-nouserdbregs.test (1857 of 2354) UNSUPPORTED: lldb-api :: benchmarks/frame_variable/TestFrameVariableResponse.py (1858 of 2354) PASS: lldb-api :: lang/c/local_types/TestUseClosestType.py (1859 of 2354) UNSUPPORTED: lldb-api :: functionalities/darwin_log/filter/regex/category/TestDarwinLogFilterRegexCategory.py (1860 of 2354) PASS: lldb-unit :: Platform/Android/./AdbClientTests/AdbClientTest.CreateByDeviceId_ByEnvVar (1861 of 2354) PASS: lldb-unit :: ScriptInterpreter/Python/./ScriptInterpreterPythonTests/PythonDataObjectsTest.TestPythonFile (1862 of 2354) UNSUPPORTED: lldb-api :: lang/cpp/printf/TestPrintf.py (1863 of 2354) PASS: lldb-unit :: Utility/./UtilityTests/StringExtractorTest.GetHexU8_Exact_NoEof (1864 of 2354) PASS: lldb-api :: commands/expression/import-std-module/vector/TestVectorFromStdModule.py (1865 of 2354) PASS: lldb-unit :: ScriptInterpreter/Python/./ScriptInterpreterPythonTests/PythonDataObjectsTest.TestExtractingUInt64ThroughStructuredData (1866 of 2354) PASS: lldb-unit :: Expression/./ExpressionTests/DiagnosticManagerTest.AppendMessageAttachToLastDiag (1867 of 2354) PASS: lldb-api :: commands/frame/var-scope/TestFrameVariableScope.py (1868 of 2354) PASS: lldb-api :: commands/expression/call-function/TestCallBuiltinFunction.py (1869 of 2354) PASS: lldb-unit :: Expression/./ExpressionTests/ClangExpressionDeclMapTest.TestPersistentDeclLookup (1870 of 2354) PASS: lldb-unit :: Utility/./UtilityTests/StringExtractorTest.GetHexBytesAvail_OddPair (1871 of 2354) PASS: lldb-unit :: Utility/./UtilityTests/StringListTest.JoinSingle (1872 of 2354) PASS: lldb-shell :: Heap/heap-cstr.test (1873 of 2354) UNSUPPORTED: lldb-api :: functionalities/data-formatter/data-formatter-stl/libstdcpp/map/TestDataFormatterStdMap.py (1874 of 2354) PASS: lldb-unit :: UnwindAssembly/x86/./UnwindAssemblyx86Tests/Testx86AssemblyInspectionEngine.TestSubRSP (1875 of 2354) UNSUPPORTED: lldb-api :: functionalities/ptr_refs/TestPtrRefs.py (1876 of 2354) PASS: lldb-shell :: SymbolFile/DWARF/x86/find-inline-method.s (1877 of 2354) PASS: lldb-shell :: SymbolFile/DWARF/x86/dwarf5-atomic.s (1878 of 2354) PASS: lldb-unit :: Utility/./UtilityTests/AnsiTerminal.Incomplete (1879 of 2354) PASS: lldb-api :: lang/cpp/forward-declared-template-specialization/TestCppForwardDeclaredTemplateSpecialization.py (1880 of 2354) PASS: lldb-unit :: Utility/./UtilityTests/UUIDTest.SetFromStringRef (1881 of 2354) PASS: lldb-api :: driver/batch_mode/TestBatchMode.py (1882 of 2354) PASS: lldb-unit :: Core/./LLDBCoreTests/SourceLocationSpecTest.OperatorBool (1883 of 2354) PASS: lldb-unit :: Utility/./UtilityTests/DataExtractorTest.GetFloatUnaligned (1884 of 2354) PASS: lldb-api :: lang/cpp/multiple-inheritance/TestCppMultipleInheritance.py (1885 of 2354) PASS: lldb-api :: macosx/DBGSourcePathRemapping/TestDSYMSourcePathRemapping.py (1886 of 2354) PASS: lldb-api :: types/TestShortTypeExpr.py (1887 of 2354) PASS: lldb-unit :: UnwindAssembly/x86/./UnwindAssemblyx86Tests/Testx86AssemblyInspectionEngine.TestPopR15 (1888 of 2354) PASS: lldb-api :: functionalities/thread/concurrent_events/TestConcurrentDelaySignalBreak.py (1889 of 2354) PASS: lldb-unit :: Utility/./UtilityTests/StringExtractorTest.GetU64BigEndian (1890 of 2354) PASS: lldb-unit :: Utility/./UtilityTests/RangeTest.LessThan (1891 of 2354) PASS: lldb-api :: functionalities/history/TestHistoryRecall.py (1892 of 2354) PASS: lldb-shell :: ObjectFile/ELF/section-overlap.yaml (1893 of 2354) PASS: lldb-shell :: ObjectFile/PECOFF/symbol.yaml (1894 of 2354) PASS: lldb-unit :: DataFormatter/./LLDBFormatterTests/FormatManagerTests.CompatibleLangs (1895 of 2354) PASS: lldb-unit :: Process/Utility/./ProcessUtilityTests/ProcMapTests/LinuxProcMapsTestFixture.ParseMapRegions/6 (1896 of 2354) PASS: lldb-shell :: Register/Core/x86-64-freebsd-fp.test (1897 of 2354) PASS: lldb-api :: tools/lldb-server/TestAppleSimulatorOSType.py (1898 of 2354) PASS: lldb-api :: commands/expression/expr-in-syscall/TestExpressionInSyscall.py (1899 of 2354) PASS: lldb-unit :: Utility/./UtilityTests/FileSpecTest.CopyByAppendingPathComponent (1900 of 2354) PASS: lldb-api :: lang/cpp/global_operators/TestCppGlobalOperators.py (1901 of 2354) PASS: lldb-api :: sample_test/TestSampleTest.py (1902 of 2354) PASS: lldb-api :: functionalities/gdb_remote_client/TestNestedRegDefinitions.py (1903 of 2354) PASS: lldb-api :: functionalities/data-formatter/data-formatter-stl/libcxx/bitset/TestDataFormatterLibcxxBitset.py (1904 of 2354) PASS: lldb-unit :: Utility/./UtilityTests/OptionsWithRawTest.WhitespaceSuffix (1905 of 2354) PASS: lldb-api :: lang/cpp/modules-import/TestCXXModulesImport.py (1906 of 2354) PASS: lldb-api :: functionalities/data-formatter/data-formatter-globals/TestDataFormatterGlobals.py (1907 of 2354) PASS: lldb-api :: lang/objc/single-entry-dictionary/TestObjCSingleEntryDictionary.py (1908 of 2354) PASS: lldb-api :: functionalities/testid/TestTestId.py (1909 of 2354) PASS: lldb-shell :: ObjectFile/ELF/PT_LOAD-overlap.yaml (1910 of 2354) PASS: lldb-api :: macosx/save_crashlog/TestSaveCrashlog.py (1911 of 2354) PASS: lldb-unit :: Utility/./UtilityTests/ArgsTest.ReplaceArgumentAtIndexLonger (1912 of 2354) PASS: lldb-unit :: Host/./HostTests/ProcessLaunchInfoTest.Constructor (1913 of 2354) PASS: lldb-unit :: Utility/./UtilityTests/StreamTest.AddressSuffix (1914 of 2354) PASS: lldb-shell :: SymbolFile/DWARF/x86/find-function-regex.cpp (1915 of 2354) PASS: lldb-unit :: UnwindAssembly/x86/./UnwindAssemblyx86Tests/Testx86AssemblyInspectionEngine.TestStackRealign8BitDisp_i386 (1916 of 2354) PASS: lldb-unit :: Symbol/./SymbolTests/TestClangASTImporter.MetadataPropagationIndirectImport (1917 of 2354) PASS: lldb-unit :: Process/Utility/./ProcessUtilityTests/ProcSMapTests/LinuxProcSMapsTestFixture.ParseSMapRegions/5 (1918 of 2354) PASS: lldb-api :: lang/c/enum_types/TestEnumTypes.py (1919 of 2354) PASS: lldb-api :: commands/frame/var/TestFrameVar.py (1920 of 2354) PASS: lldb-unit :: Utility/./UtilityTests/StringExtractorTest.DecodeHexU8_Underflow (1921 of 2354) PASS: lldb-unit :: Symbol/./SymbolTests/TestClangASTImporter.DeportTypeTagDecl (1922 of 2354) PASS: lldb-unit :: Utility/./UtilityTests/VMRange.ContainsAddr (1923 of 2354) PASS: lldb-api :: functionalities/data-formatter/data-formatter-objc/TestDataFormatterObjCPlain.py (1924 of 2354) PASS: lldb-api :: lang/objcxx/cpp_keywords_enabled/TestObjCppKeywordsEnabled.py (1925 of 2354) UNSUPPORTED: lldb-api :: lang/objc/objc-dynamic-value/TestObjCDynamicValue.py (1926 of 2354) PASS: lldb-unit :: Process/minidump/./LLDBMinidumpTests/MinidumpParserTest.GetLinuxProcStatus (1927 of 2354) PASS: lldb-api :: python_api/sbvalue_persist/TestSBValuePersist.py (1928 of 2354) PASS: lldb-unit :: Process/minidump/./LLDBMinidumpTests/MinidumpParserTest.MinidumpDuplicateModuleMappedSecond (1929 of 2354) PASS: lldb-unit :: ScriptInterpreter/Python/./ScriptInterpreterPythonTests/PythonDataObjectsTest.TestPythonStringToStructuredString (1930 of 2354) PASS: lldb-api :: lang/cpp/typeof/TestTypeOfDeclTypeExpr.py (1931 of 2354) PASS: lldb-api :: python_api/interpreter/TestCommandInterpreterAPI.py (1932 of 2354) PASS: lldb-api :: commands/settings/use_source_cache/TestUseSourceCache.py (1933 of 2354) PASS: lldb-unit :: Core/./LLDBCoreTests/ModuleSpecTest.InvalidInMemoryBuffer (1934 of 2354) PASS: lldb-api :: lang/objc/foundation/TestRuntimeTypes.py (1935 of 2354) PASS: lldb-api :: commands/watchpoints/multiple_threads/TestWatchpointMultipleThreads.py (1936 of 2354) PASS: lldb-api :: lang/objcxx/hide-runtime-values/TestObjCXXHideRuntimeValues.py (1937 of 2354) PASS: lldb-unit :: Utility/./UtilityTests/ArgsTest.TestSingleArgWithQuotedSpace (1938 of 2354) PASS: lldb-unit :: Host/./HostTests/SocketTests/SocketTest.TCPGetAddress/ipv4 (1939 of 2354) PASS: lldb-api :: lang/objc/objc-new-syntax/TestObjCNewSyntaxArray.py (1940 of 2354) PASS: lldb-unit :: SymbolFile/NativePDB/./SymbolFileNativePDBTests/PDBFPOProgramToDWARFExpressionTests.UnresolvedDependentCyclicRegisterAssignmentReference (1941 of 2354) PASS: lldb-unit :: Language/Highlighting/./HighlighterTests/HighlighterTest.ClangCursorPos (1942 of 2354) PASS: lldb-unit :: Language/Highlighting/./HighlighterTests/HighlighterTest.Colons (1943 of 2354) PASS: lldb-unit :: Utility/./UtilityTests/FileSpecTest.FormatFileSpec (1944 of 2354) PASS: lldb-api :: functionalities/gdb_remote_client/TestRemoteRegNums.py (1945 of 2354) PASS: lldb-api :: python_api/name_lookup/TestNameLookup.py (1946 of 2354) PASS: lldb-unit :: Utility/./UtilityTests/StreamTest.PutULEB128 (1947 of 2354) PASS: lldb-api :: python_api/lldbutil/iter/TestRegistersIterator.py (1948 of 2354) PASS: lldb-shell :: Register/Core/x86-64-netbsd-gp.test (1949 of 2354) PASS: lldb-unit :: Utility/./UtilityTests/StringExtractorTest.GetHexBytes_OddPair (1950 of 2354) PASS: lldb-unit :: Core/./LLDBCoreTests/ModuleSpecTest.TestCOFFFile (1951 of 2354) PASS: lldb-api :: python_api/default-constructor/TestDefaultConstructorForAPIObjects.py (1952 of 2354) PASS: lldb-api :: lang/cpp/namespace/TestNamespace.py (1953 of 2354) PASS: lldb-unit :: Utility/./UtilityTests/FileSpecTest.EqualDotsWindows (1954 of 2354) PASS: lldb-api :: macosx/universal/TestUniversal.py (1955 of 2354) UNSUPPORTED: lldb-api :: arm/breakpoint-it/TestBreakpointIt.py (1956 of 2354) PASS: lldb-api :: lang/cpp/diamond/TestDiamond.py (1957 of 2354) PASS: lldb-api :: functionalities/tail_call_frames/ambiguous_tail_call_seq2/TestAmbiguousTailCallSeq2.py (1958 of 2354) PASS: lldb-api :: commands/frame/diagnose/bad-reference/TestBadReference.py (1959 of 2354) PASS: lldb-unit :: Process/minidump/./LLDBMinidumpTests/MinidumpParserTest.MinidumpModuleOrder (1960 of 2354) PASS: lldb-api :: lang/cpp/gmodules-templates/TestGModules.py (1961 of 2354) PASS: lldb-unit :: Symbol/./SymbolTests/Type.CompilerContextPattern (1962 of 2354) PASS: lldb-api :: lang/cpp/this_class_type_mixing/TestThisClassTypeMixing.py (1963 of 2354) PASS: lldb-api :: lang/cpp/constructors/TestCppConstructors.py (1964 of 2354) PASS: lldb-api :: commands/expression/import-std-module/conflicts/TestStdModuleWithConflicts.py (1965 of 2354) UNSUPPORTED: lldb-shell :: Register/x86-gp-write.test (1966 of 2354) PASS: lldb-unit :: Utility/./UtilityTests/StatusTest.Formatv (1967 of 2354) PASS: lldb-unit :: Core/./LLDBCoreTests/DumpDataExtractorTest.BaseAddress (1968 of 2354) PASS: lldb-api :: functionalities/target_var/TestTargetVar.py (1969 of 2354) PASS: lldb-unit :: Language/Highlighting/./HighlighterTests/HighlighterTest.ClangCursorPosBeforeOtherToken (1970 of 2354) PASS: lldb-unit :: Expression/./ExpressionTests/DWARFExpression.DW_OP_stack_value (1971 of 2354) PASS: lldb-unit :: Host/./HostTests/PipeTest.OpenAsReader (1972 of 2354) PASS: lldb-api :: commands/register/register/register_command/TestRegisters.py (1973 of 2354) PASS: lldb-unit :: UnwindAssembly/x86/./UnwindAssemblyx86Tests/Testx86AssemblyInspectionEngine.Test32bitFramelessBigStackFrame (1974 of 2354) UNSUPPORTED: lldb-api :: commands/register/register/aarch64_sve_registers/rw_access_dynamic_resize/TestSVEThreadedDynamic.py (1975 of 2354) PASS: lldb-api :: python_api/value_var_update/TestValueVarUpdate.py (1976 of 2354) PASS: lldb-unit :: Expression/./ExpressionTests/DiagnosticManagerTest.PutString (1977 of 2354) PASS: lldb-unit :: Symbol/./SymbolTests/TestClangASTImporter.CompleteFwdDeclWithOtherOrigin (1978 of 2354) PASS: lldb-unit :: Utility/./UtilityTests/StreamTeeTest.GetStreamAtIndexOutOfBoundsEmpty (1979 of 2354) PASS: lldb-unit :: Process/Utility/./ProcessUtilityTests/ProcMapTests/LinuxProcMapsTestFixture.ParseMapRegions/3 (1980 of 2354) PASS: lldb-unit :: UnwindAssembly/x86/./UnwindAssemblyx86Tests/Testx86AssemblyInspectionEngine.TestPopRBPWithREX (1981 of 2354) PASS: lldb-shell :: ObjectFile/MachO/lc_build_version.yaml (1982 of 2354) PASS: lldb-unit :: Utility/./UtilityTests/LogTest.Unregister (1983 of 2354) PASS: lldb-unit :: Host/./HostTests/SocketTests/SocketTest.DomainGetConnectURI/ipv4 (1984 of 2354) PASS: lldb-unit :: Host/./HostTests/HostInfoTest.GetAugmentedArchSpec (1985 of 2354) PASS: lldb-unit :: Utility/./UtilityTests/RangeDataVector.FindEntryIndexesThatContain (1986 of 2354) PASS: lldb-unit :: Utility/./UtilityTests/VMRange.ContainsRange (1987 of 2354) PASS: lldb-unit :: Utility/./UtilityTests/Flags.Test (1988 of 2354) PASS: lldb-shell :: ObjectFile/PECOFF/sections-names.yaml (1989 of 2354) PASS: lldb-unit :: Utility/./UtilityTests/StreamTest.PutHex32ByteOrderLittle (1990 of 2354) PASS: lldb-api :: functionalities/tail_call_frames/unambiguous_sequence/TestUnambiguousTailCalls.py (1991 of 2354) PASS: lldb-api :: lang/c/tls_globals/TestTlsGlobals.py (1992 of 2354) PASS: lldb-api :: lang/cpp/operators/TestCppOperators.py (1993 of 2354) PASS: lldb-shell :: ScriptInterpreter/None/import_module.test (1994 of 2354) PASS: lldb-unit :: Signals/./SignalsTests/UnixSignalsTest.GetFilteredSignals (1995 of 2354) PASS: lldb-unit :: Symbol/./SymbolTests/TestTypeSystemClang.TestGetBasicTypeFromEnum (1996 of 2354) PASS: lldb-unit :: Symbol/./SymbolTests/TestTypeSystemClang.TestFunctionTemplateInRecordConstruction (1997 of 2354) PASS: lldb-unit :: Utility/./UtilityTests/StringListTest.GetMaxStringLengthDecreasingSize (1998 of 2354) PASS: lldb-unit :: Language/Highlighting/./HighlighterTests/HighlighterTest.ClangScalarLiterals (1999 of 2354) PASS: lldb-api :: commands/expression/class_template_specialization_empty_pack/TestClassTemplateSpecializationParametersHandling.py (2000 of 2354) PASS: lldb-unit :: Utility/./UtilityTests/BinaryStreamTest.PutULEB128One (2001 of 2354) PASS: lldb-shell :: SymbolFile/DWARF/x86/apple-index-is-used.cpp (2002 of 2354) PASS: lldb-shell :: SymbolFile/DWARF/x86/dir-separator-windows.s (2003 of 2354) UNSUPPORTED: lldb-shell :: SymbolFile/PDB/ast-restore.test (2004 of 2354) PASS: lldb-unit :: Expression/./ExpressionTests/CppModuleConfigurationTest.Linux (2005 of 2354) PASS: lldb-api :: commands/watchpoints/watchpoint_commands/TestWatchpointCommands.py (2006 of 2354) PASS: lldb-unit :: Utility/./UtilityTests/StringListTest.ShiftCString (2007 of 2354) PASS: lldb-unit :: Utility/./UtilityTests/StreamTest.PutStringAsRawHex8 (2008 of 2354) PASS: lldb-api :: python_api/watchpoint/TestSetWatchpoint.py (2009 of 2354) PASS: lldb-unit :: Process/Utility/./ProcessUtilityTests/MemoryTagManagerAArch64MTETest.ExpandToGranule (2010 of 2354) PASS: lldb-api :: types/TestDoubleTypes.py (2011 of 2354) PASS: lldb-shell :: SymbolFile/DWARF/x86/dwarf5-split.s (2012 of 2354) PASS: lldb-api :: python_api/lldbutil/frame/TestFrameUtils.py (2013 of 2354) PASS: lldb-unit :: Utility/./UtilityTests/RangeTest.Equal (2014 of 2354) PASS: lldb-unit :: Utility/./UtilityTests/UriParserTest.SchemeHostSeparator3 (2015 of 2354) PASS: lldb-shell :: SymbolFile/Breakpad/unwind-via-stack-cfi.test (2016 of 2354) PASS: lldb-unit :: Utility/./UtilityTests/StringExtractorTest.GetHexBytes (2017 of 2354) UNSUPPORTED: lldb-shell :: SymbolFile/PDB/pointers.test (2018 of 2354) UNSUPPORTED: lldb-shell :: ScriptInterpreter/Lua/lua-python.test (2019 of 2354) PASS: lldb-api :: functionalities/thread/concurrent_events/TestConcurrentManyWatchpoints.py (2020 of 2354) PASS: lldb-api :: python_api/signals/TestSignalsAPI.py (2021 of 2354) PASS: lldb-api :: functionalities/gdb_remote_client/TestNoGPacketSupported.py (2022 of 2354) PASS: lldb-unit :: Expression/./ExpressionTests/DiagnosticManagerTest.GetStringNoDiags (2023 of 2354) PASS: lldb-api :: functionalities/source-map/TestTargetSourceMap.py (2024 of 2354) PASS: lldb-api :: functionalities/tail_call_frames/cross_object/TestCrossObjectTailCalls.py (2025 of 2354) PASS: lldb-api :: commands/gui/invalid-args/TestInvalidArgsGui.py (2026 of 2354) PASS: lldb-unit :: Utility/./UtilityTests/RecordReplayTest.ValidSequence (2027 of 2354) PASS: lldb-api :: functionalities/data-formatter/data-formatter-stl/libcxx/deque/TestDataFormatterLibcxxDeque.py (2028 of 2354) PASS: lldb-shell :: Minidump/Windows/Sigsegv/sigsegv.test (2029 of 2354) PASS: lldb-unit :: Process/minidump/./LLDBMinidumpTests/RegisterContextMinidump.CheckRegisterContextMinidump_ARM (2030 of 2354) PASS: lldb-unit :: Utility/./UtilityTests/StreamTest.AddressSize (2031 of 2354) PASS: lldb-api :: commands/platform/file/close/TestPlatformFileClose.py (2032 of 2354) PASS: lldb-unit :: Process/minidump/./LLDBMinidumpTests/MinidumpParserTest.GetMemoryRegionInfoLinuxMapsError (2033 of 2354) PASS: lldb-unit :: Symbol/./SymbolTests/TestTypeSystemClang.GetExeModuleWhenMissingSymbolFile (2034 of 2354) PASS: lldb-shell :: Commands/command-breakpoint-col.test (2035 of 2354) PASS: lldb-api :: functionalities/postmortem/elf-core/thread_crash/TestLinuxCoreThreads.py (2036 of 2354) PASS: lldb-unit :: Host/./HostTests/FileSystemTest.Exists (2037 of 2354) PASS: lldb-shell :: Commands/CommandScriptImmediateOutput/CommandScriptImmediateOutputFile.test (2038 of 2354) PASS: lldb-unit :: Host/./HostTests/SocketTests/SocketTest.TCPListen0GetPort/ipv6 (2039 of 2354) PASS: lldb-unit :: Core/./LLDBCoreTests/SourceLocationSpecTest.FileLineColumnComponents (2040 of 2354) PASS: lldb-shell :: SymbolFile/DWARF/x86/debug-line-basic.s (2041 of 2354) PASS: lldb-api :: functionalities/data-formatter/data-formatter-objc/TestDataFormatterObjCNSBundle.py (2042 of 2354) PASS: lldb-unit :: Utility/./UtilityTests/StreamTest.ShiftOperatorPtr (2043 of 2354) PASS: lldb-api :: lang/cpp/overloaded-functions/TestOverloadedFunctions.py (2044 of 2354) PASS: lldb-api :: lang/objc/objc-baseclass-sbtype/TestObjCBaseClassSBType.py (2045 of 2354) PASS: lldb-api :: python_api/section/TestSectionAPI.py (2046 of 2354) PASS: lldb-shell :: Reproducer/Functionalities/TestStepping.test (2047 of 2354) PASS: lldb-api :: functionalities/thread/concurrent_events/TestConcurrentTwoWatchpointThreads.py (2048 of 2354) PASS: lldb-api :: lang/cpp/unsigned_types/TestUnsignedTypes.py (2049 of 2354) PASS: lldb-unit :: Symbol/./SymbolTests/DWARFCallFrameInfoTest.Basic_dwarf4 (2050 of 2354) PASS: lldb-unit :: Process/minidump/./LLDBMinidumpTests/MinidumpParserTest.GetFilteredModuleList (2051 of 2354) PASS: lldb-api :: commands/expression/context-object-objc/TestContextObjectObjc.py (2052 of 2354) PASS: lldb-api :: macosx/find-dsym/bundle-with-dot-in-filename/TestBundleWithDotInFilename.py (2053 of 2354) PASS: lldb-shell :: SymbolFile/Breakpad/line-table-edgecases.test (2054 of 2354) PASS: lldb-api :: functionalities/tail_call_frames/disambiguate_paths_to_common_sink/TestDisambiguatePathsToCommonSink.py (2055 of 2354) PASS: lldb-shell :: Driver/TestHelp.test (2056 of 2354) PASS: lldb-unit :: ScriptInterpreter/Python/./ScriptInterpreterPythonTests/PythonDataObjectsTest.TestPythonTupleValues (2057 of 2354) PASS: lldb-unit :: Utility/./UtilityTests/Flags.Reset (2058 of 2354) PASS: lldb-unit :: Target/./TargetTests/ModuleCacheTest.GetAndPutUuidExists (2059 of 2354) PASS: lldb-unit :: Utility/./UtilityTests/ScalarTest.ComparisonFloat (2060 of 2354) PASS: lldb-shell :: ObjectFile/Breakpad/sections-trailing-func.test (2061 of 2354) PASS: lldb-unit :: Host/./HostTests/ConnectionFileDescriptorTest.TCPGetURIv6 (2062 of 2354) PASS: lldb-shell :: Expr/TestMultilineExpr.test (2063 of 2354) PASS: lldb-api :: lang/cpp/class_types/TestClassTypesDisassembly.py (2064 of 2354) PASS: lldb-api :: tools/lldb-server/TestLldbGdbServer.py (2065 of 2354) PASS: lldb-api :: lang/c/modules/TestCModules.py (2066 of 2354) PASS: lldb-unit :: Utility/./UtilityTests/TimerTest.CategoryTimes2 (2067 of 2354) PASS: lldb-api :: commands/process/attach/attach_denied/TestAttachDenied.py (2068 of 2354) PASS: lldb-api :: functionalities/breakpoint/hardware_breakpoints/require_hw_breakpoints/TestRequireHWBreakpoints.py (2069 of 2354) PASS: lldb-api :: functionalities/tail_call_frames/inlining_and_tail_calls/TestInliningAndTailCalls.py (2070 of 2354) PASS: lldb-unit :: Process/gdb-remote/./ProcessGdbRemoteTests/GDBRemoteCommunicationClientTest.GetModulesInfo (2071 of 2354) PASS: lldb-api :: macosx/add-dsym/TestAddDsymMidExecutionCommand.py (2072 of 2354) PASS: lldb-unit :: Process/gdb-remote/./ProcessGdbRemoteTests/PortMapTest.AllowPort (2073 of 2354) PASS: lldb-api :: lang/c/unicode/TestUnicodeSymbols.py (2074 of 2354) PASS: lldb-unit :: Process/gdb-remote/./ProcessGdbRemoteTests/PortMapTest.FreePortForProcess (2075 of 2354) UNSUPPORTED: lldb-api :: functionalities/breakpoint/breakpoint_callback_command_source/TestBreakpointCallbackCommandSource.py (2076 of 2354) PASS: lldb-api :: commands/expression/call-function/TestCallStdStringFunction.py (2077 of 2354) PASS: lldb-api :: functionalities/breakpoint/address_breakpoints/TestBadAddressBreakpoints.py (2078 of 2354) PASS: lldb-api :: functionalities/breakpoint/comp_dir_symlink/TestCompDirSymLink.py (2079 of 2354) PASS: lldb-shell :: Settings/TestSettingsSet.test (2080 of 2354) PASS: lldb-unit :: Utility/./UtilityTests/XcodeSDKTest.FindXcodeContentsDirectoryInPath (2081 of 2354) PASS: lldb-unit :: Process/minidump/./LLDBMinidumpTests/MinidumpParserTest.MinidumpDuplicateModuleMappedSecondHigh (2082 of 2354) PASS: lldb-api :: lang/c/inlines/TestRedefinitionsInInlines.py (2083 of 2354) PASS: lldb-unit :: Utility/./UtilityTests/StreamTest.PutBytesAsRawHex8ToLittleEndian (2084 of 2354) PASS: lldb-unit :: Utility/./UtilityTests/AnsiTerminal.Unknown (2085 of 2354) PASS: lldb-unit :: Utility/./UtilityTests/StreamTest.QuotedCString (2086 of 2354) PASS: lldb-api :: lang/cpp/this/TestCPPThis.py (2087 of 2354) PASS: lldb-unit :: Utility/./UtilityTests/NameMatchesTest.Contains (2088 of 2354) UNSUPPORTED: lldb-shell :: Register/arm-gp-read.test (2089 of 2354) PASS: lldb-shell :: Driver/TestProcessAttach.test (2090 of 2354) PASS: lldb-unit :: Utility/./UtilityTests/RecordReplayTest.InstrumentedBarRef (2091 of 2354) PASS: lldb-unit :: Utility/./UtilityTests/StringListTest.PopBack (2092 of 2354) PASS: lldb-unit :: UnwindAssembly/x86/./UnwindAssemblyx86Tests/Testx86AssemblyInspectionEngine.TestReturnDetect (2093 of 2354) PASS: lldb-unit :: Process/minidump/./LLDBMinidumpTests/MinidumpParserTest.GetThreadContext_x86_32 (2094 of 2354) PASS: lldb-unit :: Utility/./UtilityTests/StatusTest.ErrorConstructor (2095 of 2354) PASS: lldb-api :: functionalities/unwind/noreturn/module-end/TestNoReturnModuleEnd.py (2096 of 2354) PASS: lldb-unit :: Utility/./UtilityTests/StringExtractorGDBRemoteTest.GetPidTid (2097 of 2354) PASS: lldb-unit :: Process/gdb-remote/./ProcessGdbRemoteTests/GDBRemoteCommunicationClientTest.TestPacketSpeedJSON (2098 of 2354) PASS: lldb-api :: commands/target/modules/search-paths/insert/TestTargetModulesSearchpathsInsert.py (2099 of 2354) PASS: lldb-api :: commands/watchpoints/hello_watchpoint/TestMyFirstWatchpoint.py (2100 of 2354) UNSUPPORTED: lldb-api :: functionalities/data-formatter/data-formatter-stl/libstdcpp/iterator/TestDataFormatterStdIterator.py (2101 of 2354) PASS: lldb-api :: lang/cpp/class_types/TestClassTypes.py (2102 of 2354) PASS: lldb-api :: commands/command/invalid-args/TestInvalidArgsCommand.py (2103 of 2354) PASS: lldb-unit :: Utility/./UtilityTests/StringListTest.AppendStringStdString (2104 of 2354) PASS: lldb-shell :: SymbolFile/DWARF/x86/dwarf5_tu_index_abbrev_offset.s (2105 of 2354) PASS: lldb-shell :: ObjectFile/ELF/null-jmprel.yaml (2106 of 2354) PASS: lldb-api :: tools/lldb-server/TestGdbRemoteExpeditedRegisters.py (2107 of 2354) PASS: lldb-api :: lang/objc/objc-dyn-sbtype/TestObjCDynamicSBType.py (2108 of 2354) PASS: lldb-shell :: Settings/TestModuleCacheSanity.test (2109 of 2354) PASS: lldb-unit :: Symbol/./SymbolTests/TestTypeSystemClang.TestDisplayName (2110 of 2354) PASS: lldb-api :: functionalities/scripted_process/TestScriptedProcess.py (2111 of 2354) PASS: lldb-shell :: SymbolFile/DWARF/x86/find-basic-function.cpp (2112 of 2354) PASS: lldb-unit :: Process/Utility/./ProcessUtilityTests/MemoryTagManagerAArch64MTETest.AddressDiff (2113 of 2354) PASS: lldb-api :: lang/cpp/namespace_conflicts/TestNamespaceConflicts.py (2114 of 2354) PASS: lldb-unit :: Utility/./UtilityTests/VASprintfTest.EncodingError (2115 of 2354) PASS: lldb-unit :: Utility/./UtilityTests/SerializationRountripTest.SerializeDeserializeCString (2116 of 2354) PASS: lldb-unit :: SymbolFile/DWARF/./SymbolFileDWARFTests/SymbolFileDWARFTests.ParseArangesNonzeroSegmentSize (2117 of 2354) PASS: lldb-api :: functionalities/postmortem/elf-core/gcore/TestGCore.py (2118 of 2354) PASS: lldb-api :: functionalities/tail_call_frames/thread_step_out_or_return/TestSteppingOutWithArtificialFrames.py (2119 of 2354) PASS: lldb-shell :: BuildScript/modes.test (2120 of 2354) PASS: lldb-api :: commands/expression/po_verbosity/TestPoVerbosity.py (2121 of 2354) PASS: lldb-unit :: Utility/./UtilityTests/StringListTest.GetMaxStringLengthMixed (2122 of 2354) PASS: lldb-unit :: Utility/./UtilityTests/StringExtractorTest.GetHexU8_Underflow2_NoEof (2123 of 2354) PASS: lldb-shell :: ObjectFile/Breakpad/discontiguous-sections.test (2124 of 2354) UNSUPPORTED: lldb-api :: functionalities/tsan/basic/TestTsanBasic.py (2125 of 2354) UNSUPPORTED: lldb-api :: commands/gui/viewlarge/TestGuiViewLarge.py (2126 of 2354) PASS: lldb-api :: commands/expression/import_base_class_when_class_has_derived_member/TestImportBaseClassWhenClassHasDerivedMember.py (2127 of 2354) PASS: lldb-shell :: Commands/command-target-modules-dump-sections.yaml (2128 of 2354) PASS: lldb-shell :: SymbolFile/NativePDB/function-types-calling-conv.cpp (2129 of 2354) PASS: lldb-unit :: Utility/./UtilityTests/UriParserTest.TypicalPortPathIPv4 (2130 of 2354) UNSUPPORTED: lldb-shell :: SymbolFile/NativePDB/stack_unwinding01.cpp (2131 of 2354) PASS: lldb-api :: commands/expression/issue_11588/Test11588.py (2132 of 2354) UNSUPPORTED: lldb-api :: functionalities/tsan/cpp_global_location/TestTsanCPPGlobalLocation.py (2133 of 2354) PASS: lldb-api :: types/TestLongTypesExpr.py (2134 of 2354) PASS: lldb-unit :: Utility/./UtilityTests/LogChannelEnabledTest.log_options (2135 of 2354) UNSUPPORTED: lldb-api :: functionalities/thread/state/TestThreadStates.py (2136 of 2354) PASS: lldb-unit :: Core/./LLDBCoreTests/DumpDataExtractorTest.FormatCharArray (2137 of 2354) PASS: lldb-unit :: Utility/./UtilityTests/SerializationRountripTest.SerializeDeserializePod (2138 of 2354) PASS: lldb-shell :: ScriptInterpreter/None/none.test (2139 of 2354) UNSUPPORTED: lldb-shell :: SymbolFile/dissassemble-entry-point.s (2140 of 2354) PASS: lldb-shell :: Unwind/thread-step-out-ret-addr-check.test (2141 of 2354) UNSUPPORTED: lldb-api :: functionalities/gdb_remote_client/TestAArch64XMLRegOffsets.py (2142 of 2354) PASS: lldb-api :: lang/cpp/signed_types/TestSignedTypes.py (2143 of 2354) PASS: lldb-unit :: UnwindAssembly/x86/./UnwindAssemblyx86Tests/Testx86AssemblyInspectionEngine.TestAddESP (2144 of 2354) PASS: lldb-unit :: Process/Utility/./ProcessUtilityTests/ProcMapTests/LinuxProcMapsTestFixture.ParseMapRegions/7 (2145 of 2354) PASS: lldb-shell :: lldb-server/TestErrorMessages.test (2146 of 2354) PASS: lldb-unit :: Utility/./UtilityTests/StreamTeeTest.Constructor1Stream (2147 of 2354) PASS: lldb-api :: commands/expression/vector_of_enums/TestVectorOfEnums.py (2148 of 2354) PASS: lldb-unit :: Utility/./UtilityTests/StreamTest.PutHex64ByteOrderLittle (2149 of 2354) PASS: lldb-api :: functionalities/signal/handle-abrt/TestHandleAbort.py (2150 of 2354) PASS: lldb-unit :: ScriptInterpreter/Python/./ScriptInterpreterPythonTests/PythonDataObjectsTest.TestGlobalNameResolutionNoDot (2151 of 2354) PASS: lldb-unit :: Utility/./UtilityTests/ArchSpecTest.YAML (2152 of 2354) PASS: lldb-unit :: Target/./TargetTests/ModuleCacheTest.GetAndPutStrangeHostname (2153 of 2354) PASS: lldb-shell :: Commands/CommandScriptImmediateOutput/CommandScriptImmediateOutputConsole.test (2154 of 2354) PASS: lldb-api :: functionalities/optimized_code/TestNoASanExceptionAfterEvalOP_piece.py (2155 of 2354) PASS: lldb-api :: functionalities/thread/step_out/TestThreadStepOut.py (2156 of 2354) PASS: lldb-unit :: Utility/./UtilityTests/ArgsTest.TestArgv (2157 of 2354) PASS: lldb-api :: lang/c/const_variables/TestConstVariables.py (2158 of 2354) PASS: lldb-shell :: SymbolFile/DWARF/x86/compilercontext.ll (2159 of 2354) PASS: lldb-unit :: Utility/./UtilityTests/NameMatchesTest.StartsWith (2160 of 2354) PASS: lldb-shell :: Commands/command-script-import.test (2161 of 2354) PASS: lldb-unit :: Utility/./UtilityTests/StringExtractorTest.GetNameColonValueContainsColon (2162 of 2354) PASS: lldb-api :: commands/frame/select/TestFrameSelect.py (2163 of 2354) PASS: lldb-unit :: Language/Highlighting/./HighlighterTests/HighlighterTest.ClangCursorOutOfBounds (2164 of 2354) PASS: lldb-api :: lang/objc/modules-objc-property/TestModulesObjCProperty.py (2165 of 2354) PASS: lldb-unit :: Utility/./UtilityTests/StreamTest.PutPtr (2166 of 2354) PASS: lldb-unit :: UnwindAssembly/x86/./UnwindAssemblyx86Tests/Testx86AssemblyInspectionEngine.TestSimplex86_64Augmented (2167 of 2354) PASS: lldb-api :: functionalities/breakpoint/breakpoint_conditions/TestBreakpointConditions.py (2168 of 2354) UNSUPPORTED: lldb-api :: functionalities/thread/concurrent_events/TestConcurrentManySignals.py (2169 of 2354) UNSUPPORTED: lldb-shell :: ExecControl/StopHook/stop-hook-threads.test (2170 of 2354) PASS: lldb-unit :: ScriptInterpreter/Python/./ScriptInterpreterPythonTests/PythonDataObjectsTest.TestPythonBytes (2171 of 2354) PASS: lldb-unit :: Utility/./UtilityTests/RangeTest.ContainsRangeStartingFromZero (2172 of 2354) PASS: lldb-api :: commands/target/select/TestTargetSelect.py (2173 of 2354) PASS: lldb-unit :: Utility/./UtilityTests/StringExtractorTest.GetHexBytes_OddPair2 (2174 of 2354) UNSUPPORTED: lldb-shell :: Unwind/eh-frame-small-fde.test (2175 of 2354) PASS: lldb-api :: lang/cpp/static_methods/TestCPPStaticMethods.py (2176 of 2354) PASS: lldb-unit :: Expression/./ExpressionTests/CppModuleConfigurationTest.UnknownLibCppFile (2177 of 2354) PASS: lldb-api :: types/TestLongTypes.py (2178 of 2354) PASS: lldb-unit :: Language/Highlighting/./HighlighterTests/HighlighterTest.ClangBraces (2179 of 2354) PASS: lldb-unit :: Utility/./UtilityTests/RecordReplayTest.InstrumentedBar (2180 of 2354) PASS: lldb-api :: commands/expression/options/TestExprOptions.py (2181 of 2354) PASS: lldb-api :: commands/expression/radar_8638051/Test8638051.py (2182 of 2354) PASS: lldb-api :: lang/objc/objc_direct-methods/TestObjCDirectMethods.py (2183 of 2354) PASS: lldb-api :: commands/expression/ir-interpreter/TestIRInterpreter.py (2184 of 2354) UNSUPPORTED: lldb-api :: macosx/simulator/TestSimulatorPlatform.py (2185 of 2354) PASS: lldb-api :: lang/cpp/unique-types/TestUniqueTypes.py (2186 of 2354) UNSUPPORTED: lldb-api :: commands/trace/multiple-threads/TestTraceStartStopMultipleThreads.py (2187 of 2354) PASS: lldb-api :: commands/expression/import-std-module/weak_ptr-dbg-info-content/TestDbgInfoContentWeakPtrFromStdModule.py (2188 of 2354) PASS: lldb-unit :: Utility/./UtilityTests/StreamTest.PutBytesAsRawHex8ToBigEndian (2189 of 2354) PASS: lldb-api :: lang/cpp/enum_types/TestCPP11EnumTypes.py (2190 of 2354) PASS: lldb-api :: python_api/watchpoint/TestWatchpointIter.py (2191 of 2354) PASS: lldb-api :: functionalities/fat_archives/TestFatArchives.py (2192 of 2354) PASS: lldb-shell :: SymbolFile/DWARF/x86/debug_rnglists.s (2193 of 2354) PASS: lldb-unit :: Utility/./UtilityTests/OptionsWithRawTest.WhitespaceInput (2194 of 2354) PASS: lldb-unit :: Utility/./UtilityTests/BroadcasterTest.EventTypeHasListeners (2195 of 2354) PASS: lldb-api :: commands/expression/namespace_local_var_same_name_obj_c/TestNamespaceLocalVarSameNameObjC.py (2196 of 2354) PASS: lldb-api :: functionalities/data-formatter/data-formatter-stl/libcxx/list/TestDataFormatterLibcxxList.py (2197 of 2354) PASS: lldb-api :: lang/objc/cpp_keyword_identifiers/TestCppKeywordsAsObjCIdentifiers.py (2198 of 2354) PASS: lldb-unit :: Utility/./UtilityTests/RegularExpression.CopyAssignment (2199 of 2354) PASS: lldb-unit :: ScriptInterpreter/Python/./ScriptInterpreterPythonTests/PythonDataObjectsTest.TestObjectAttributes (2200 of 2354) PASS: lldb-unit :: Language/Highlighting/./HighlighterTests/HighlighterTest.ClangPreserveNewLine (2201 of 2354) PASS: lldb-unit :: ObjectFile/PECOFF/./ObjectFilePECOFFTests/PECallFrameInfoTest.Frame_reg_eh (2202 of 2354) PASS: lldb-unit :: Utility/./UtilityTests/TimeoutTest.Format (2203 of 2354) PASS: lldb-unit :: Expression/./ExpressionTests/CppModuleConfigurationTest.Xcode (2204 of 2354) PASS: lldb-unit :: Host/./HostTests/SocketTests/SocketTest.UDPGetConnectURI/ipv4 (2205 of 2354) PASS: lldb-unit :: Process/minidump/./LLDBMinidumpTests/MinidumpParserTest.GetExceptionStream (2206 of 2354) PASS: lldb-api :: lang/cpp/class-template-parameter-pack/TestClassTemplateParameterPack.py (2207 of 2354) PASS: lldb-unit :: Symbol/./SymbolTests/TestClangASTImporter.CanImportInvalidType (2208 of 2354) PASS: lldb-unit :: Utility/./UtilityTests/RangeTest.NotEqual (2209 of 2354) PASS: lldb-api :: commands/expression/save_jit_objects/TestSaveJITObjects.py (2210 of 2354) UNSUPPORTED: lldb-shell :: Reproducer/TestLuaImport.test (2211 of 2354) PASS: lldb-api :: commands/expression/no-deadlock/TestExprDoesntBlock.py (2212 of 2354) PASS: lldb-unit :: Process/gdb-remote/./ProcessGdbRemoteTests/GDBRemoteClientBaseTest.SendPacketAndReceiveResponseWithOutputSupport (2213 of 2354) PASS: lldb-unit :: Host/./HostTests/HostInfoTestInitialization.InitTwice (2214 of 2354) PASS: lldb-shell :: ObjectFile/ELF/PT_LOAD-overlap-PT_TLS.yaml (2215 of 2354) PASS: lldb-shell :: SymbolFile/Breakpad/stack-cfi-parsing.test (2216 of 2354) PASS: lldb-shell :: ObjectFile/PECOFF/sections.yaml (2217 of 2354) PASS: lldb-unit :: Process/Utility/./ProcessUtilityTests/ProcSMapTests/LinuxProcSMapsTestFixture.ParseSMapRegions/4 (2218 of 2354) UNSUPPORTED: lldb-shell :: ScriptInterpreter/Lua/independent_state.test (2219 of 2354) PASS: lldb-shell :: Process/Optimization.test (2220 of 2354) PASS: lldb-unit :: Utility/./UtilityTests/StringLexerTest.PutBack (2221 of 2354) PASS: lldb-api :: functionalities/data-formatter/frameformat_smallstruct/TestFrameFormatSmallStruct.py (2222 of 2354) PASS: lldb-unit :: Utility/./UtilityTests/GeneratorTest.GetOrCreate (2223 of 2354) PASS: lldb-shell :: ObjectFile/MachO/symtab.yaml (2224 of 2354) PASS: lldb-api :: functionalities/target-new-solib-notifications/TestModuleLoadedNotifys.py (2225 of 2354) PASS: lldb-unit :: Utility/./UtilityTests/SubsystemRAIITest.SubsystemWithErrorFailure (2226 of 2354) PASS: lldb-unit :: Utility/./UtilityTests/ScalarTest.SetValueFromData (2227 of 2354) PASS: lldb-shell :: Breakpoint/dummy-target.test (2228 of 2354) PASS: lldb-unit :: Host/./HostTests/SocketTests/SocketTest.DomainGetConnectURI/ipv6 (2229 of 2354) PASS: lldb-api :: functionalities/thread/exit_during_break/TestExitDuringBreak.py (2230 of 2354) PASS: lldb-api :: commands/expression/xvalue/TestXValuePrinting.py (2231 of 2354) PASS: lldb-shell :: SymbolFile/DWARF/x86/debug-types-dwo-cross-reference.cpp (2232 of 2354) PASS: lldb-unit :: ScriptInterpreter/Python/./ScriptInterpreterPythonTests/PythonDataObjectsTest.TestPythonTupleToStructuredList (2233 of 2354) PASS: lldb-unit :: Process/gdb-remote/./ProcessGdbRemoteTests/GDBRemoteCommunicationClientTest.GetModulesInfoInvalidResponse (2234 of 2354) PASS: lldb-api :: functionalities/breakpoint/breakpoint_names/TestBreakpointNames.py (2235 of 2354) PASS: lldb-shell :: SymbolFile/DWARF/x86/static_scope.s (2236 of 2354) PASS: lldb-unit :: API/./APITests/SBCommandInterpreterTest.MultiWordCommand (2237 of 2354) PASS: lldb-unit :: Utility/./UtilityTests/ConstStringTest.MangledCounterpart (2238 of 2354) PASS: lldb-unit :: Host/./HostTests/SocketTests/SocketTest.TCPListen0ConnectAccept/ipv4 (2239 of 2354) UNSUPPORTED: lldb-api :: functionalities/ubsan/user-expression/TestUbsanUserExpression.py (2240 of 2354) PASS: lldb-api :: commands/expression/import-std-module/pair/TestPairFromStdModule.py (2241 of 2354) PASS: lldb-unit :: Utility/./UtilityTests/Flags.AnyClear (2242 of 2354) PASS: lldb-unit :: Utility/./UtilityTests/StreamTest.SetIndentLevel (2243 of 2354) PASS: lldb-unit :: ScriptInterpreter/Python/./ScriptInterpreterPythonTests/PythonDataObjectsTest.TestPythonListManipulation (2244 of 2354) UNSUPPORTED: lldb-shell :: Register/x86-zmm-write.test (2245 of 2354) PASS: lldb-unit :: Language/Highlighting/./HighlighterTests/HighlighterTest.ClangCursorPosAfterOtherToken (2246 of 2354) PASS: lldb-api :: lang/objc/modules-app-update/TestClangModulesAppUpdate.py (2247 of 2354) PASS: lldb-shell :: BuildScript/script-args.test (2248 of 2354) PASS: lldb-unit :: Utility/./UtilityTests/RegularExpression.Valid (2249 of 2354) PASS: lldb-shell :: ObjectFile/PECOFF/basic-info.yaml (2250 of 2354) PASS: lldb-shell :: Breakpoint/debug_rnglist_offset_pair.test (2251 of 2354) UNSUPPORTED: lldb-shell :: ScriptInterpreter/Lua/nested_sessions.test (2252 of 2354) PASS: lldb-unit :: Utility/./UtilityTests/StringListTest.DefaultConstructor (2253 of 2354) PASS: lldb-unit :: Utility/./UtilityTests/StructuredDataTest.StringDump (2254 of 2354) PASS: lldb-api :: functionalities/thread/concurrent_events/TestConcurrentDelayedCrashWithBreakpointSignal.py (2255 of 2354) PASS: lldb-unit :: Utility/./UtilityTests/LogChannelEnabledTest.LLDB_LOG_ERROR (2256 of 2354) PASS: lldb-api :: api/command-return-object/TestSBCommandReturnObject.py (2257 of 2354) PASS: lldb-api :: functionalities/data-formatter/data-formatter-objc/TestDataFormatterObjCNSContainer.py (2258 of 2354) PASS: lldb-api :: functionalities/breakpoint/global_constructor/TestBreakpointInGlobalConstructor.py (2259 of 2354) PASS: lldb-shell :: SymbolFile/DWARF/x86/dwp.s (2260 of 2354) UNSUPPORTED: lldb-api :: commands/trace/TestTraceDumpInstructions.py (2261 of 2354) PASS: lldb-shell :: ScriptInterpreter/Python/command_relative_import.test (2262 of 2354) PASS: lldb-api :: lang/cpp/static_members/TestCPPStaticMembers.py (2263 of 2354) PASS: lldb-unit :: Core/./LLDBCoreTests/RichManglingContextTest.Basic (2264 of 2354) PASS: lldb-api :: lang/objc/objc-static-method-stripped/TestObjCStaticMethodStripped.py (2265 of 2354) PASS: lldb-api :: macosx/thread_suspend/TestInternalThreadSuspension.py (2266 of 2354) PASS: lldb-unit :: Process/./ProcessEventDataTests/ProcessEventDataTest.DoOnRemoval (2267 of 2354) PASS: lldb-api :: functionalities/thread/concurrent_events/TestConcurrentCrashWithBreak.py (2268 of 2354) UNSUPPORTED: lldb-api :: functionalities/tsan/global_location/TestTsanGlobalLocation.py (2269 of 2354) PASS: lldb-unit :: UnwindAssembly/x86/./UnwindAssemblyx86Tests/Testx86AssemblyInspectionEngine.TestStackRealign32BitDisp_x86_64 (2270 of 2354) XFAIL: lldb-shell :: Unwind/prefer-debug-over-eh-frame.test (2271 of 2354) PASS: lldb-unit :: Core/./LLDBCoreTests/MangledTest.ResultForBlockInvocation (2272 of 2354) PASS: lldb-api :: functionalities/data-formatter/data-formatter-stl/libcxx/shared_ptr/TestDataFormatterLibcxxSharedPtr.py (2273 of 2354) PASS: lldb-shell :: Reproducer/TestWorkingDir.test (2274 of 2354) PASS: lldb-shell :: SymbolFile/DWARF/x86/debug_line-relative_path.s (2275 of 2354) XFAIL: lldb-shell :: Expr/nodefaultlib.cpp (2276 of 2354) PASS: lldb-api :: commands/frame/diagnose/array/TestArray.py (2277 of 2354) PASS: lldb-api :: functionalities/data-formatter/data-formatter-synthtype/TestDataFormatterSynthType.py (2278 of 2354) PASS: lldb-unit :: Utility/./UtilityTests/RangeDataVector.FindEntryThatContains (2279 of 2354) PASS: lldb-unit :: Symbol/./SymbolTests/TestClangASTImporter.DeportDeclTagDecl (2280 of 2354) PASS: lldb-shell :: SymbolFile/symbol-binding.test (2281 of 2354) PASS: lldb-api :: functionalities/gdb_remote_client/TestArmRegisterDefinition.py (2282 of 2354) PASS: lldb-unit :: Utility/./UtilityTests/UriParserTest.PortOverflow (2283 of 2354) PASS: lldb-api :: functionalities/thread/jump/TestThreadJump.py (2284 of 2354) PASS: lldb-unit :: Core/./LLDBCoreTests/DumpDataExtractorTest.NullStream (2285 of 2354) PASS: lldb-unit :: Utility/./UtilityTests/Flags.AnySet (2286 of 2354) PASS: lldb-shell :: Settings/TestDefaultModuleCachePath.test (2287 of 2354) PASS: lldb-unit :: Host/./HostTests/SocketTests/SocketTest.TCPGetConnectURI/ipv4 (2288 of 2354) PASS: lldb-api :: lang/cpp/typedef/TestCppTypedef.py (2289 of 2354) PASS: lldb-api :: functionalities/gdb_remote_client/TestGDBRemoteDiskFileCompletion.py (2290 of 2354) PASS: lldb-api :: lang/objc/modules-incomplete/TestIncompleteModules.py (2291 of 2354) PASS: lldb-unit :: SymbolFile/DWARF/./SymbolFileDWARFTests/SymbolFileDWARFTests.ParseArangesIgnoreEmpty (2292 of 2354) PASS: lldb-unit :: Symbol/./SymbolTests/TestTypeSystemClang.TestFunctionTemplateConstruction (2293 of 2354) PASS: lldb-unit :: Utility/./UtilityTests/ArgsTest.StringListConstructor (2294 of 2354) PASS: lldb-api :: lang/cpp/global_variables/TestCPPGlobalVariables.py (2295 of 2354) PASS: lldb-shell :: SymbolFile/DWARF/x86/debug_loc-aslr.s (2296 of 2354) PASS: lldb-api :: functionalities/limit-debug-info/TestLimitDebugInfo.py (2297 of 2354) PASS: lldb-unit :: Utility/./UtilityTests/BinaryStreamTest.PutULEB128NineBytes (2298 of 2354) PASS: lldb-unit :: ScriptInterpreter/Python/./ScriptInterpreterPythonTests/PythonDataObjectsTest.TestGlobalNameResolutionWithDot (2299 of 2354) PASS: lldb-api :: lang/cpp/wchar_t/TestCxxWCharT.py (2300 of 2354) PASS: lldb-unit :: Utility/./UtilityTests/GeneratorTest.Create (2301 of 2354) PASS: lldb-api :: functionalities/gdb_remote_client/TestRestartBug.py (2302 of 2354) PASS: lldb-shell :: Reproducer/TestRelativePath.test (2303 of 2354) PASS: lldb-api :: lang/objcxx/objc-builtin-types/TestObjCBuiltinTypes.py (2304 of 2354) UNSUPPORTED: lldb-shell :: Register/x86-64-zmm-read.test (2305 of 2354) PASS: lldb-api :: functionalities/data-formatter/refpointer-recursion/TestDataFormatterRefPtrRecursion.py (2306 of 2354) PASS: lldb-shell :: Breakpoint/breakpoint-command.test (2307 of 2354) UNSUPPORTED: lldb-api :: commands/register/register/aarch64_dynamic_regset/TestArm64DynamicRegsets.py (2308 of 2354) PASS: lldb-unit :: Expression/./ExpressionTests/DiagnosticManagerTest.GetStringMultiline (2309 of 2354) PASS: lldb-api :: lang/cpp/template/TestTemplateArgs.py (2310 of 2354) PASS: lldb-api :: api/multithreaded/TestMultithreaded.py (2311 of 2354) UNSUPPORTED: lldb-api :: android/platform/TestDefaultCacheLineSize.py (2312 of 2354) PASS: lldb-api :: functionalities/breakpoint/step_over_breakpoint/TestStepOverBreakpoint.py (2313 of 2354) PASS: lldb-shell :: ObjectFile/ELF/aarch64-relocations.yaml (2314 of 2354) PASS: lldb-unit :: Utility/./UtilityTests/StringExtractorTest.GetU32BigEndian (2315 of 2354) PASS: lldb-unit :: Utility/./UtilityTests/ProcessInfoTest.Constructor (2316 of 2354) PASS: lldb-api :: functionalities/thread/concurrent_events/TestConcurrentTwoWatchpointsOneBreakpoint.py (2317 of 2354) PASS: lldb-unit :: Utility/./UtilityTests/GeneratorTest.YamlMultiProvider (2318 of 2354) PASS: lldb-unit :: Language/Highlighting/./HighlighterTests/HighlighterTest.ClangEmptyInput (2319 of 2354) PASS: lldb-unit :: Utility/./UtilityTests/BinaryStreamTest.PutULEB128EightBytes (2320 of 2354) PASS: lldb-api :: lang/cpp/dynamic-value-same-basename/TestDynamicValueSameBase.py (2321 of 2354) PASS: lldb-unit :: Process/gdb-remote/./ProcessGdbRemoteTests/GDBRemoteCommunicationClientTest.WriteRegisterNoSuffix (2322 of 2354) PASS: lldb-unit :: Utility/./UtilityTests/XcodeSDKTest.MergeTest (2323 of 2354) PASS: lldb-unit :: Host/./HostTests/NativeProcessProtocolTest.ReadMemoryWithoutTrap (2324 of 2354) PASS: lldb-api :: functionalities/breakpoint/breakpoint_hit_count/TestBreakpointHitCount.py (2325 of 2354) PASS: lldb-api :: lang/c/record_decl_in_expr/TestRecordDeclInExpr.py (2326 of 2354) PASS: lldb-api :: functionalities/data-formatter/data-formatter-stl/libstdcpp/unique_ptr/invalid/TestDataFormatterInvalidStdUniquePtr.py (2327 of 2354) PASS: lldb-unit :: Utility/./UtilityTests/UriParserTest.BadPort (2328 of 2354) PASS: lldb-unit :: Utility/./UtilityTests/DataExtractorTest.GetULEB128_bit63 (2329 of 2354) PASS: lldb-unit :: ObjectFile/PECOFF/./ObjectFilePECOFFTests/PECallFrameInfoTest.Basic_eh (2330 of 2354) PASS: lldb-api :: functionalities/data-formatter/data-formatter-objc/TestDataFormatterObjCNSData.py (2331 of 2354) PASS: lldb-shell :: SymbolFile/DWARF/x86/DW_AT_loclists_base.s (2332 of 2354) PASS: lldb-unit :: Utility/./UtilityTests/LogChannelTest.Enable (2333 of 2354) PASS: lldb-shell :: SymbolFile/DWARF/x86/split-dwarf-inlining.cpp (2334 of 2354) PASS: lldb-unit :: Process/minidump/./LLDBMinidumpTests/MinidumpParserTest.GetThreadsAndGetThreadContext (2335 of 2354) PASS: lldb-unit :: Utility/./UtilityTests/RangeTest.Slide (2336 of 2354) PASS: lldb-unit :: Language/CPlusPlus/./LanguageCPlusPlusTests/CPlusPlusLanguage.MethodNameParsing (2337 of 2354) UNSUPPORTED: lldb-shell :: Register/aarch64-fp-read.test (2338 of 2354) PASS: lldb-api :: lang/cpp/type_lookup/TestCppTypeLookup.py (2339 of 2354) PASS: lldb-api :: lang/objc/exceptions/TestObjCExceptions.py (2340 of 2354) PASS: lldb-unit :: Process/minidump/./LLDBMinidumpTests/MinidumpParserTest.MinidumpDuplicateModuleMinAddress (2341 of 2354) PASS: lldb-unit :: ObjectFile/Breakpad/./ObjectFileBreakpadTests/LineRecord.parse (2342 of 2354) PASS: lldb-unit :: UnwindAssembly/x86/./UnwindAssemblyx86Tests/Testx86AssemblyInspectionEngine.TestAddRSP (2343 of 2354) PASS: lldb-api :: commands/expression/dollar-in-variable/TestDollarInVariable.py (2344 of 2354) PASS: lldb-shell :: SymbolFile/DWARF/x86/childless-compile-unit.s (2345 of 2354) PASS: lldb-api :: functionalities/unwind/zeroth_frame/TestZerothFrame.py (2346 of 2354) PASS: lldb-api :: python_api/module_section/TestModuleAndSection.py (2347 of 2354) UNSUPPORTED: lldb-api :: functionalities/darwin_log/format/TestDarwinLogMessageFormat.py (2348 of 2354) PASS: lldb-shell :: Settings/TestFrameFormatColor.test (2349 of 2354) PASS: lldb-api :: macosx/nslog/TestDarwinNSLogOutput.py (2350 of 2354) UNSUPPORTED: lldb-api :: commands/gui/basicdebug/TestGuiBasicDebug.py (2351 of 2354) PASS: lldb-unit :: Utility/./UtilityTests/SerializationRountripTest.SerializeDeserializePodPointers (2352 of 2354) PASS: lldb-api :: functionalities/data-formatter/data-formatter-stl/libcxx/map/TestDataFormatterLibccMap.py (2353 of 2354) PASS: lldb-api :: lang/objc/foundation/TestObjCMethodsNSError.py (2354 of 2354) Slowest Tests: -------------------------------------------------------------------------- 262.81s: lldb-api :: tools/lldb-server/TestLldbGdbServer.py 137.85s: lldb-api :: functionalities/memory-region/TestMemoryRegion.py 127.61s: lldb-api :: api/multithreaded/TestMultithreaded.py 116.52s: lldb-api :: macosx/skinny-corefile/TestSkinnyCorefile.py 91.60s: lldb-api :: functionalities/gdb_remote_client/TestWasm.py 83.15s: lldb-api :: types/TestLongTypesExpr.py 72.27s: lldb-api :: lang/objc/exceptions/TestObjCExceptions.py 69.15s: lldb-api :: commands/expression/import-std-module/queue/TestQueueFromStdModule.py 68.15s: lldb-api :: commands/expression/import-std-module/stack/TestStackFromStdModule.py 64.47s: lldb-api :: lang/objc/hidden-ivars/TestHiddenIvars.py 62.68s: lldb-api :: lang/objc/objc-new-syntax/TestObjCNewSyntaxLiteral.py 58.75s: lldb-api :: lang/cpp/namespace/TestNamespaceLookup.py 58.54s: lldb-api :: lang/objc/foundation/TestObjCMethods.py 55.07s: lldb-api :: commands/expression/import-std-module/vector/TestVectorFromStdModule.py 52.44s: lldb-api :: types/TestIntegerTypeExpr.py 50.21s: lldb-api :: python_api/target/TestTargetAPI.py 50.16s: lldb-api :: commands/expression/import-std-module/deque-basic/TestDequeFromStdModule.py 49.44s: lldb-api :: tools/lldb-server/TestGdbRemoteThreadsInStopReply.py 47.54s: lldb-api :: lang/objc/objc-new-syntax/TestObjCNewSyntaxDictionary.py 47.20s: lldb-api :: commands/expression/import-std-module/vector-dbg-info-content/TestDbgInfoContentVectorFromStdModule.py

Hide Details

Tests Times: -------------------------------------------------------------------------- [ Range ] :: [ Percentage ] :: [ Count ] -------------------------------------------------------------------------- [260s,280s) :: [ ] :: [ 1/2354] [240s,260s) :: [ ] :: [ 0/2354] [220s,240s) :: [ ] :: [ 0/2354] [200s,220s) :: [ ] :: [ 0/2354] [180s,200s) :: [ ] :: [ 0/2354] [160s,180s) :: [ ] :: [ 0/2354] [140s,160s) :: [ ] :: [ 1/2354] [120s,140s) :: [ ] :: [ 2/2354] [100s,120s) :: [ ] :: [ 0/2354] [ 80s,100s) :: [ ] :: [ 2/2354] [ 60s, 80s) :: [ ] :: [ 7/2354] [ 40s, 60s) :: [ ] :: [ 15/2354] [ 20s, 40s) :: [* ] :: [ 74/2354] [ 0s, 20s) :: [************************************** ] :: [2252/2354] -------------------------------------------------------------------------- ******************** Failed Tests (2): lldb-api :: tools/lldb-vscode/breakpoint/TestVSCode_setFunctionBreakpoints.py lldb-api :: tools/lldb-vscode/evaluate/TestVSCode_evaluate.py

Hide Details

Hide Details

Testing Time: 2406.20s Unsupported : 211 Passed : 2131 Expectedly Failed: 10 Failed : 2 FAILED: tools/lldb/test/CMakeFiles/check-lldb cd /Users/buildslave/jenkins/workspace/lldb-cmake-sanitized/lldb-build/tools/lldb/test && /usr/local/Frameworks/Python.framework/Versions/3.7/bin/python3.7 /Users/buildslave/jenkins/workspace/lldb-cmake-sanitized/lldb-build/./bin/llvm-lit -v --time-tests --shuffle --xunit-xml-output=/Users/buildslave/jenkins/workspace/lldb-cmake-sanitized/test/results.xml -v -j 4 --timeout 1200 /Users/buildslave/jenkins/workspace/lldb-cmake-sanitized/lldb-build/tools/lldb/test ninja: build stopped: subcommand failed. Command failed: Command '['/usr/bin/env', 'TERM=vt100', '/usr/local/bin/ninja', '-v', 'check-lldb']' returned non-zero exit status 1. Command: ['/usr/bin/env', 'TERM=vt100', '/usr/local/bin/ninja', '-v', 'check-lldb'] [Pipeline] } [Pipeline] // timeout [Pipeline] } [Pipeline] // stage [Pipeline] stage [Pipeline] { (Declarative: Post Actions) [Pipeline] scanForIssues [Clang (LLVM based)] Sleeping for 5 seconds due to JENKINS-32191... [Clang (LLVM based)] Parsing console log (workspace: '/Users/buildslave/jenkins/workspace/lldb-cmake-sanitized') [Clang (LLVM based)] Successfully parsed console log [Clang (LLVM based)] -> found 5 issues (skipped 2 duplicates) [Clang (LLVM based)] [-ERROR-] Can't create fingerprints for some files: [Clang (LLVM based)] [-ERROR-] - '/Users/buildslave/jenkins/workspace/lldb-cmake-sanitized/lldb-build/{"body":{"category":"console","output":"/Users/buildslave/jenkins/workspace/lldb-cmake-sanitized/llvm-project/lldb/tools/lldb-vscode/ProgressEvent.cpp', IO exception has been thrown: java.nio.file.NoSuchFileException: /Users/buildslave/jenkins/workspace/lldb-cmake-sanitized/lldb-build/{"body":{"category":"console","output":"/Users/buildslave/jenkins/workspace/lldb-cmake-sanitized/llvm-project/lldb/tools/lldb-vscode/ProgressEvent.cpp [Clang (LLVM based)] [-ERROR-] - '/Users/buildslave/jenkins/workspace/lldb-cmake-sanitized/lldb-build/{"body":{"category":"console","output":"/Users/buildslave/jenkins/workspace/lldb-cmake-sanitized/llvm-project/lldb/tools/lldb-vscode/ProgressEvent.cpp', IO exception has been thrown: java.nio.file.NoSuchFileException: /Users/buildslave/jenkins/workspace/lldb-cmake-sanitized/lldb-build/{"body":{"category":"console","output":"/Users/buildslave/jenkins/workspace/lldb-cmake-sanitized/llvm-project/lldb/tools/lldb-vscode/ProgressEvent.cpp [Clang (LLVM based)] Post processing issues on 'green-dragon-23' with source code encoding 'UTF-8' [Clang (LLVM based)] Creating SCM blamer to obtain author and commit information for affected files [Clang (LLVM based)] -> No blamer installed yet. You need to install the 'git-forensics' plugin to enable blaming for Git. [Clang (LLVM based)] Resolving file names for all issues in source directory '/Users/buildslave/jenkins/workspace/lldb-cmake-sanitized' [Clang (LLVM based)] -> resolved paths in source directory (3 found, 1 not found) [Clang (LLVM based)] Resolving module names from module definitions (build.xml, pom.xml, or Manifest.mf files) [Clang (LLVM based)] -> resolved module names for 5 issues [Clang (LLVM based)] Resolving package names (or namespaces) by parsing the affected files [Clang (LLVM based)] -> resolved package names of 4 affected files [Clang (LLVM based)] No filter has been set, publishing all 5 issues [Clang (LLVM based)] Creating fingerprints for all affected code blocks to track issues over different builds [Clang (LLVM based)] -> created fingerprints for 3 issues (skipped 2 issues) [Clang (LLVM based)] Copying affected files to Jenkins' build folder '/Users/Shared/Jenkins/Home/jobs/lldb-cmake-sanitized/builds/1894/files-with-issues' [Clang (LLVM based)] -> 3 copied, 0 not in workspace, 2 not-found, 0 with I/O error [Clang (LLVM based)] Repository miner is not configured, skipping repository mining [Pipeline] junit Recording test results [Checks API] No suitable checks publisher found. [Pipeline] } [Pipeline] // stage [Pipeline] } [Pipeline] // withEnv [Pipeline] } [Pipeline] // node [Pipeline] End of Pipeline ERROR: script returned exit code 1 Finished: FAILURE