Console Output

Skipping 9,498 KB.. Full Log
--> 
Content-Length: 121

Hide Details

{"command":"evaluate","type":"request","arguments":{"expression":"foo_func","context":"hover","frameId":524288},"seq":61} <-- Content-Length: 119

Hide Details

{"body":{},"command":"evaluate","message":"error: No value","request_seq":61,"seq":0,"success":false,"type":"response"} --> Content-Length: 109

Hide Details

{"command":"stackTrace","type":"request","arguments":{"threadId":1670223,"startFrame":0,"levels":1},"seq":62} <-- Content-Length: 331

Hide Details

{"body":{"stackFrames":[{"column":16,"id":524288,"line":27,"name":"main","source":{"name":"main.cpp","path":"/Users/buildslave/jenkins/workspace/lldb-cmake-sanitized/llvm-project/lldb/test/API/tools/lldb-vscode/evaluate/main.cpp"}}],"totalFrames":2},"command":"stackTrace","request_seq":62,"seq":0,"success":true,"type":"response"} --> Content-Length: 120

Hide Details

{"command":"evaluate","type":"request","arguments":{"expression":"foo_var","context":"hover","frameId":524288},"seq":63} <-- Content-Length: 119

Hide Details

{"body":{},"command":"evaluate","message":"error: No value","request_seq":63,"seq":0,"success":false,"type":"response"} --> Content-Length: 81

Hide Details

{"command":"continue","type":"request","arguments":{"threadId":1670223},"seq":64} <-- Content-Length: 116

Hide Details

{"body":{"allThreadsContinued":true},"command":"continue","request_seq":64,"seq":0,"success":true,"type":"response"} <-- Content-Length: 199

Hide Details

{"body":{"allThreadsStopped":true,"description":"breakpoint 3.1","preserveFocusHint":false,"reason":"breakpoint","threadCausedFocus":true,"threadId":1670223},"event":"stopped","seq":0,"type":"event"} --> Content-Length: 62

Hide Details

{"command":"threads","type":"request","arguments":{},"seq":65} <-- Content-Length: 134

Hide Details

{"body":{"threads":[{"id":1670223,"name":"Thread #1"}]},"command":"threads","request_seq":65,"seq":0,"success":true,"type":"response"} --> Content-Length: 109

Hide Details

{"command":"stackTrace","type":"request","arguments":{"threadId":1670223,"startFrame":0,"levels":1},"seq":66} <-- Content-Length: 342

Hide Details

{"body":{"stackFrames":[{"column":10,"id":524288,"line":11,"name":"a_function(int)","source":{"name":"main.cpp","path":"/Users/buildslave/jenkins/workspace/lldb-cmake-sanitized/llvm-project/lldb/test/API/tools/lldb-vscode/evaluate/main.cpp"}}],"totalFrames":3},"command":"stackTrace","request_seq":66,"seq":0,"success":true,"type":"response"} --> Content-Length: 116

Hide Details

{"command":"evaluate","type":"request","arguments":{"expression":"var","context":"hover","frameId":524288},"seq":67} <-- Content-Length: 139

Hide Details

{"body":{"result":"42","type":"int","variablesReference":0},"command":"evaluate","request_seq":67,"seq":0,"success":true,"type":"response"} --> Content-Length: 109

Hide Details

{"command":"stackTrace","type":"request","arguments":{"threadId":1670223,"startFrame":0,"levels":1},"seq":68} <-- Content-Length: 342

Hide Details

{"body":{"stackFrames":[{"column":10,"id":524288,"line":11,"name":"a_function(int)","source":{"name":"main.cpp","path":"/Users/buildslave/jenkins/workspace/lldb-cmake-sanitized/llvm-project/lldb/test/API/tools/lldb-vscode/evaluate/main.cpp"}}],"totalFrames":3},"command":"stackTrace","request_seq":68,"seq":0,"success":true,"type":"response"} --> Content-Length: 123

Hide Details

{"command":"evaluate","type":"request","arguments":{"expression":"static_int","context":"hover","frameId":524288},"seq":69} <-- Content-Length: 139

Hide Details

{"body":{"result":"42","type":"int","variablesReference":0},"command":"evaluate","request_seq":69,"seq":0,"success":true,"type":"response"} --> Content-Length: 109

Hide Details

{"command":"stackTrace","type":"request","arguments":{"threadId":1670223,"startFrame":0,"levels":1},"seq":70} <-- Content-Length: 342

Hide Details

{"body":{"stackFrames":[{"column":10,"id":524288,"line":11,"name":"a_function(int)","source":{"name":"main.cpp","path":"/Users/buildslave/jenkins/workspace/lldb-cmake-sanitized/llvm-project/lldb/test/API/tools/lldb-vscode/evaluate/main.cpp"}}],"totalFrames":3},"command":"stackTrace","request_seq":70,"seq":0,"success":true,"type":"response"} --> Content-Length: 127

Hide Details

{"command":"evaluate","type":"request","arguments":{"expression":"non_static_int","context":"hover","frameId":524288},"seq":71} <-- Content-Length: 139

Hide Details

{"body":{"result":"43","type":"int","variablesReference":0},"command":"evaluate","request_seq":71,"seq":0,"success":true,"type":"response"} --> Content-Length: 109

Hide Details

{"command":"stackTrace","type":"request","arguments":{"threadId":1670223,"startFrame":0,"levels":1},"seq":72} <-- Content-Length: 342

Hide Details

{"body":{"stackFrames":[{"column":10,"id":524288,"line":11,"name":"a_function(int)","source":{"name":"main.cpp","path":"/Users/buildslave/jenkins/workspace/lldb-cmake-sanitized/llvm-project/lldb/test/API/tools/lldb-vscode/evaluate/main.cpp"}}],"totalFrames":3},"command":"stackTrace","request_seq":72,"seq":0,"success":true,"type":"response"} --> Content-Length: 117

Hide Details

{"command":"evaluate","type":"request","arguments":{"expression":"var1","context":"hover","frameId":524288},"seq":73} <-- Content-Length: 119

Hide Details

{"body":{},"command":"evaluate","message":"error: No value","request_seq":73,"seq":0,"success":false,"type":"response"} --> Content-Length: 109

Hide Details

{"command":"stackTrace","type":"request","arguments":{"threadId":1670223,"startFrame":0,"levels":1},"seq":74} <-- Content-Length: 342

Hide Details

{"body":{"stackFrames":[{"column":10,"id":524288,"line":11,"name":"a_function(int)","source":{"name":"main.cpp","path":"/Users/buildslave/jenkins/workspace/lldb-cmake-sanitized/llvm-project/lldb/test/API/tools/lldb-vscode/evaluate/main.cpp"}}],"totalFrames":3},"command":"stackTrace","request_seq":74,"seq":0,"success":true,"type":"response"} --> Content-Length: 117

Hide Details

{"command":"evaluate","type":"request","arguments":{"expression":"var2","context":"hover","frameId":524288},"seq":75} <-- Content-Length: 119

Hide Details

{"body":{},"command":"evaluate","message":"error: No value","request_seq":75,"seq":0,"success":false,"type":"response"} --> Content-Length: 109

Hide Details

{"command":"stackTrace","type":"request","arguments":{"threadId":1670223,"startFrame":0,"levels":1},"seq":76} <-- Content-Length: 342

Hide Details

{"body":{"stackFrames":[{"column":10,"id":524288,"line":11,"name":"a_function(int)","source":{"name":"main.cpp","path":"/Users/buildslave/jenkins/workspace/lldb-cmake-sanitized/llvm-project/lldb/test/API/tools/lldb-vscode/evaluate/main.cpp"}}],"totalFrames":3},"command":"stackTrace","request_seq":76,"seq":0,"success":true,"type":"response"} --> Content-Length: 120

Hide Details

{"command":"evaluate","type":"request","arguments":{"expression":"struct1","context":"hover","frameId":524288},"seq":77} <-- Content-Length: 119

Hide Details

{"body":{},"command":"evaluate","message":"error: No value","request_seq":77,"seq":0,"success":false,"type":"response"} --> Content-Length: 109

Hide Details

{"command":"stackTrace","type":"request","arguments":{"threadId":1670223,"startFrame":0,"levels":1},"seq":78} <-- Content-Length: 342

Hide Details

{"body":{"stackFrames":[{"column":10,"id":524288,"line":11,"name":"a_function(int)","source":{"name":"main.cpp","path":"/Users/buildslave/jenkins/workspace/lldb-cmake-sanitized/llvm-project/lldb/test/API/tools/lldb-vscode/evaluate/main.cpp"}}],"totalFrames":3},"command":"stackTrace","request_seq":78,"seq":0,"success":true,"type":"response"} --> Content-Length: 124

Hide Details

{"command":"evaluate","type":"request","arguments":{"expression":"struct1.foo","context":"hover","frameId":524288},"seq":79} <-- Content-Length: 119

Hide Details

{"body":{},"command":"evaluate","message":"error: No value","request_seq":79,"seq":0,"success":false,"type":"response"} --> Content-Length: 109

Hide Details

{"command":"stackTrace","type":"request","arguments":{"threadId":1670223,"startFrame":0,"levels":1},"seq":80} <-- Content-Length: 342

Hide Details

{"body":{"stackFrames":[{"column":10,"id":524288,"line":11,"name":"a_function(int)","source":{"name":"main.cpp","path":"/Users/buildslave/jenkins/workspace/lldb-cmake-sanitized/llvm-project/lldb/test/API/tools/lldb-vscode/evaluate/main.cpp"}}],"totalFrames":3},"command":"stackTrace","request_seq":80,"seq":0,"success":true,"type":"response"} --> Content-Length: 125

Hide Details

{"command":"evaluate","type":"request","arguments":{"expression":"struct2->foo","context":"hover","frameId":524288},"seq":81} <-- Content-Length: 119

Hide Details

{"body":{},"command":"evaluate","message":"error: No value","request_seq":81,"seq":0,"success":false,"type":"response"} --> Content-Length: 109

Hide Details

{"command":"stackTrace","type":"request","arguments":{"threadId":1670223,"startFrame":0,"levels":1},"seq":82} <-- Content-Length: 342

Hide Details

{"body":{"stackFrames":[{"column":10,"id":524288,"line":11,"name":"a_function(int)","source":{"name":"main.cpp","path":"/Users/buildslave/jenkins/workspace/lldb-cmake-sanitized/llvm-project/lldb/test/API/tools/lldb-vscode/evaluate/main.cpp"}}],"totalFrames":3},"command":"stackTrace","request_seq":82,"seq":0,"success":true,"type":"response"} --> Content-Length: 131

Hide Details

{"command":"evaluate","type":"request","arguments":{"expression":"var2 + struct1.foo","context":"hover","frameId":524288},"seq":83} <-- Content-Length: 119

Hide Details

{"body":{},"command":"evaluate","message":"error: No value","request_seq":83,"seq":0,"success":false,"type":"response"} --> Content-Length: 109

Hide Details

{"command":"stackTrace","type":"request","arguments":{"threadId":1670223,"startFrame":0,"levels":1},"seq":84} <-- Content-Length: 342

Hide Details

{"body":{"stackFrames":[{"column":10,"id":524288,"line":11,"name":"a_function(int)","source":{"name":"main.cpp","path":"/Users/buildslave/jenkins/workspace/lldb-cmake-sanitized/llvm-project/lldb/test/API/tools/lldb-vscode/evaluate/main.cpp"}}],"totalFrames":3},"command":"stackTrace","request_seq":84,"seq":0,"success":true,"type":"response"} --> Content-Length: 123

Hide Details

{"command":"evaluate","type":"request","arguments":{"expression":"a_function","context":"hover","frameId":524288},"seq":85} <-- Content-Length: 119

Hide Details

{"body":{},"command":"evaluate","message":"error: No value","request_seq":85,"seq":0,"success":false,"type":"response"} --> Content-Length: 109

Hide Details

{"command":"stackTrace","type":"request","arguments":{"threadId":1670223,"startFrame":0,"levels":1},"seq":86} <-- Content-Length: 342

Hide Details

{"body":{"stackFrames":[{"column":10,"id":524288,"line":11,"name":"a_function(int)","source":{"name":"main.cpp","path":"/Users/buildslave/jenkins/workspace/lldb-cmake-sanitized/llvm-project/lldb/test/API/tools/lldb-vscode/evaluate/main.cpp"}}],"totalFrames":3},"command":"stackTrace","request_seq":86,"seq":0,"success":true,"type":"response"} --> Content-Length: 126

Hide Details

{"command":"evaluate","type":"request","arguments":{"expression":"a_function(1)","context":"hover","frameId":524288},"seq":87} <-- Content-Length: 119

Hide Details

{"body":{},"command":"evaluate","message":"error: No value","request_seq":87,"seq":0,"success":false,"type":"response"} --> Content-Length: 109

Hide Details

{"command":"stackTrace","type":"request","arguments":{"threadId":1670223,"startFrame":0,"levels":1},"seq":88} <-- Content-Length: 342

Hide Details

{"body":{"stackFrames":[{"column":10,"id":524288,"line":11,"name":"a_function(int)","source":{"name":"main.cpp","path":"/Users/buildslave/jenkins/workspace/lldb-cmake-sanitized/llvm-project/lldb/test/API/tools/lldb-vscode/evaluate/main.cpp"}}],"totalFrames":3},"command":"stackTrace","request_seq":88,"seq":0,"success":true,"type":"response"} --> Content-Length: 120

Hide Details

{"command":"evaluate","type":"request","arguments":{"expression":"var + 1","context":"hover","frameId":524288},"seq":89} <-- Content-Length: 119

Hide Details

{"body":{},"command":"evaluate","message":"error: No value","request_seq":89,"seq":0,"success":false,"type":"response"} --> Content-Length: 109

Hide Details

{"command":"stackTrace","type":"request","arguments":{"threadId":1670223,"startFrame":0,"levels":1},"seq":90} <-- Content-Length: 342

Hide Details

{"body":{"stackFrames":[{"column":10,"id":524288,"line":11,"name":"a_function(int)","source":{"name":"main.cpp","path":"/Users/buildslave/jenkins/workspace/lldb-cmake-sanitized/llvm-project/lldb/test/API/tools/lldb-vscode/evaluate/main.cpp"}}],"totalFrames":3},"command":"stackTrace","request_seq":90,"seq":0,"success":true,"type":"response"} --> Content-Length: 121

Hide Details

{"command":"evaluate","type":"request","arguments":{"expression":"foo_func","context":"hover","frameId":524288},"seq":91} <-- Content-Length: 119

Hide Details

{"body":{},"command":"evaluate","message":"error: No value","request_seq":91,"seq":0,"success":false,"type":"response"} --> Content-Length: 109

Hide Details

{"command":"stackTrace","type":"request","arguments":{"threadId":1670223,"startFrame":0,"levels":1},"seq":92} <-- Content-Length: 342

Hide Details

{"body":{"stackFrames":[{"column":10,"id":524288,"line":11,"name":"a_function(int)","source":{"name":"main.cpp","path":"/Users/buildslave/jenkins/workspace/lldb-cmake-sanitized/llvm-project/lldb/test/API/tools/lldb-vscode/evaluate/main.cpp"}}],"totalFrames":3},"command":"stackTrace","request_seq":92,"seq":0,"success":true,"type":"response"} --> Content-Length: 120

Hide Details

{"command":"evaluate","type":"request","arguments":{"expression":"foo_var","context":"hover","frameId":524288},"seq":93} <-- Content-Length: 119

Hide Details

{"body":{},"command":"evaluate","message":"error: No value","request_seq":93,"seq":0,"success":false,"type":"response"} --> Content-Length: 81

Hide Details

{"command":"continue","type":"request","arguments":{"threadId":1670223},"seq":94} <-- Content-Length: 116

Hide Details

{"body":{"allThreadsContinued":true},"command":"continue","request_seq":94,"seq":0,"success":true,"type":"response"} <-- Content-Length: 199

Hide Details

{"body":{"allThreadsStopped":true,"description":"breakpoint 4.1","preserveFocusHint":false,"reason":"breakpoint","threadCausedFocus":true,"threadId":1670223},"event":"stopped","seq":0,"type":"event"} --> Content-Length: 62

Hide Details

{"command":"threads","type":"request","arguments":{},"seq":95} <-- Content-Length: 134

Hide Details

{"body":{"threads":[{"id":1670223,"name":"Thread #1"}]},"command":"threads","request_seq":95,"seq":0,"success":true,"type":"response"} --> Content-Length: 109

Hide Details

{"command":"stackTrace","type":"request","arguments":{"threadId":1670223,"startFrame":0,"levels":1},"seq":96} <-- Content-Length: 331

Hide Details

{"body":{"stackFrames":[{"column":20,"id":524288,"line":35,"name":"main","source":{"name":"main.cpp","path":"/Users/buildslave/jenkins/workspace/lldb-cmake-sanitized/llvm-project/lldb/test/API/tools/lldb-vscode/evaluate/main.cpp"}}],"totalFrames":2},"command":"stackTrace","request_seq":96,"seq":0,"success":true,"type":"response"} --> Content-Length: 119

Hide Details

{"command":"evaluate","type":"request","arguments":{"expression":"my_vec","context":"hover","frameId":524288},"seq":97} <-- Content-Length: 179

Hide Details

{"body":{"result":" size=2","type":"std::vector<int, std::allocator<int> >","variablesReference":6},"command":"evaluate","request_seq":97,"seq":0,"success":true,"type":"response"} --> Content-Length: 81

Hide Details

{"command":"continue","type":"request","arguments":{"threadId":1670223},"seq":98} <-- Content-Length: 116

Hide Details

{"body":{"allThreadsContinued":true},"command":"continue","request_seq":98,"seq":0,"success":true,"type":"response"} <-- Content-Length: 199

Hide Details

{"body":{"allThreadsStopped":true,"description":"breakpoint 5.1","preserveFocusHint":false,"reason":"breakpoint","threadCausedFocus":true,"threadId":1670223},"event":"stopped","seq":0,"type":"event"} --> Content-Length: 62

Hide Details

{"command":"threads","type":"request","arguments":{},"seq":99} <-- Content-Length: 134

Hide Details

{"body":{"threads":[{"id":1670223,"name":"Thread #1"}]},"command":"threads","request_seq":99,"seq":0,"success":true,"type":"response"} --> Content-Length: 110

Hide Details

{"command":"stackTrace","type":"request","arguments":{"threadId":1670223,"startFrame":0,"levels":1},"seq":100} <-- Content-Length: 332

Hide Details

{"body":{"stackFrames":[{"column":10,"id":524288,"line":40,"name":"main","source":{"name":"main.cpp","path":"/Users/buildslave/jenkins/workspace/lldb-cmake-sanitized/llvm-project/lldb/test/API/tools/lldb-vscode/evaluate/main.cpp"}}],"totalFrames":2},"command":"stackTrace","request_seq":100,"seq":0,"success":true,"type":"response"} --> Content-Length: 120

Hide Details

{"command":"evaluate","type":"request","arguments":{"expression":"my_vec","context":"hover","frameId":524288},"seq":101} <-- Content-Length: 180

Hide Details

{"body":{"result":" size=3","type":"std::vector<int, std::allocator<int> >","variablesReference":7},"command":"evaluate","request_seq":101,"seq":0,"success":true,"type":"response"} --> Content-Length: 110

Hide Details

{"command":"stackTrace","type":"request","arguments":{"threadId":1670223,"startFrame":0,"levels":1},"seq":102} <-- Content-Length: 332

Hide Details

{"body":{"stackFrames":[{"column":10,"id":524288,"line":40,"name":"main","source":{"name":"main.cpp","path":"/Users/buildslave/jenkins/workspace/lldb-cmake-sanitized/llvm-project/lldb/test/API/tools/lldb-vscode/evaluate/main.cpp"}}],"totalFrames":2},"command":"stackTrace","request_seq":102,"seq":0,"success":true,"type":"response"} --> Content-Length: 120

Hide Details

{"command":"evaluate","type":"request","arguments":{"expression":"my_map","context":"hover","frameId":524288},"seq":103} <-- Content-Length: 221

Hide Details

{"body":{"result":" size=2","type":"std::map<int, int, std::less<int>, std::allocator<std::pair<const int, int> > >","variablesReference":8},"command":"evaluate","request_seq":103,"seq":0,"success":true,"type":"response"} --> Content-Length: 82

Hide Details

{"command":"continue","type":"request","arguments":{"threadId":1670223},"seq":104} <-- Content-Length: 117

Hide Details

{"body":{"allThreadsContinued":true},"command":"continue","request_seq":104,"seq":0,"success":true,"type":"response"} <-- Content-Length: 199

Hide Details

{"body":{"allThreadsStopped":true,"description":"breakpoint 6.1","preserveFocusHint":false,"reason":"breakpoint","threadCausedFocus":true,"threadId":1670223},"event":"stopped","seq":0,"type":"event"} --> Content-Length: 63

Hide Details

{"command":"threads","type":"request","arguments":{},"seq":105} <-- Content-Length: 135

Hide Details

{"body":{"threads":[{"id":1670223,"name":"Thread #1"}]},"command":"threads","request_seq":105,"seq":0,"success":true,"type":"response"} --> Content-Length: 110

Hide Details

{"command":"stackTrace","type":"request","arguments":{"threadId":1670223,"startFrame":0,"levels":1},"seq":106} <-- Content-Length: 332

Hide Details

{"body":{"stackFrames":[{"column":25,"id":524288,"line":44,"name":"main","source":{"name":"main.cpp","path":"/Users/buildslave/jenkins/workspace/lldb-cmake-sanitized/llvm-project/lldb/test/API/tools/lldb-vscode/evaluate/main.cpp"}}],"totalFrames":2},"command":"stackTrace","request_seq":106,"seq":0,"success":true,"type":"response"} --> Content-Length: 120

Hide Details

{"command":"evaluate","type":"request","arguments":{"expression":"my_map","context":"hover","frameId":524288},"seq":107} <-- Content-Length: 221

Hide Details

{"body":{"result":" size=3","type":"std::map<int, int, std::less<int>, std::allocator<std::pair<const int, int> > >","variablesReference":9},"command":"evaluate","request_seq":107,"seq":0,"success":true,"type":"response"} --> Content-Length: 110

Hide Details

{"command":"stackTrace","type":"request","arguments":{"threadId":1670223,"startFrame":0,"levels":1},"seq":108} <-- Content-Length: 332

Hide Details

{"body":{"stackFrames":[{"column":25,"id":524288,"line":44,"name":"main","source":{"name":"main.cpp","path":"/Users/buildslave/jenkins/workspace/lldb-cmake-sanitized/llvm-project/lldb/test/API/tools/lldb-vscode/evaluate/main.cpp"}}],"totalFrames":2},"command":"stackTrace","request_seq":108,"seq":0,"success":true,"type":"response"} --> Content-Length: 125

Hide Details

{"command":"evaluate","type":"request","arguments":{"expression":"my_bool_vec","context":"hover","frameId":524288},"seq":109} <-- Content-Length: 183

Hide Details

{"body":{"result":" size=1","type":"std::vector<bool, std::allocator<bool> >","variablesReference":10},"command":"evaluate","request_seq":109,"seq":0,"success":true,"type":"response"} --> Content-Length: 82

Hide Details

{"command":"continue","type":"request","arguments":{"threadId":1670223},"seq":110} <-- Content-Length: 117

Hide Details

{"body":{"allThreadsContinued":true},"command":"continue","request_seq":110,"seq":0,"success":true,"type":"response"} <-- Content-Length: 199

Hide Details

{"body":{"allThreadsStopped":true,"description":"breakpoint 7.1","preserveFocusHint":false,"reason":"breakpoint","threadCausedFocus":true,"threadId":1670223},"event":"stopped","seq":0,"type":"event"} --> Content-Length: 63

Hide Details

{"command":"threads","type":"request","arguments":{},"seq":111} <-- Content-Length: 135

Hide Details

{"body":{"threads":[{"id":1670223,"name":"Thread #1"}]},"command":"threads","request_seq":111,"seq":0,"success":true,"type":"response"} --> Content-Length: 110

Hide Details

{"command":"stackTrace","type":"request","arguments":{"threadId":1670223,"startFrame":0,"levels":1},"seq":112} <-- Content-Length: 332

Hide Details

{"body":{"stackFrames":[{"column":25,"id":524288,"line":45,"name":"main","source":{"name":"main.cpp","path":"/Users/buildslave/jenkins/workspace/lldb-cmake-sanitized/llvm-project/lldb/test/API/tools/lldb-vscode/evaluate/main.cpp"}}],"totalFrames":2},"command":"stackTrace","request_seq":112,"seq":0,"success":true,"type":"response"} --> Content-Length: 125

Hide Details

{"command":"evaluate","type":"request","arguments":{"expression":"my_bool_vec","context":"hover","frameId":524288},"seq":113} <-- Content-Length: 183

Hide Details

{"body":{"result":" size=2","type":"std::vector<bool, std::allocator<bool> >","variablesReference":11},"command":"evaluate","request_seq":113,"seq":0,"success":true,"type":"response"} --> Content-Length: 90

Hide Details

{"command":"disconnect","type":"request","arguments":{"terminateDebuggee":true},"seq":114} <-- Content-Length: 45

Hide Details

{"event":"terminated","seq":0,"type":"event"} <-- Content-Length: 63

Hide Details

{"body":{"exitCode":9},"event":"exited","seq":0,"type":"event"} <-- Content-Length: 83

Hide Details

{"command":"disconnect","request_seq":114,"seq":0,"success":true,"type":"response"}

Hide Details

========= END ========= ========= DEBUG ADAPTER PROTOCOL LOGS ========= --> Content-Length: 284

Hide Details

{"command":"initialize","type":"request","arguments":{"adapterID":"lldb-native","clientID":"vscode","columnsStartAt1":true,"linesStartAt1":true,"locale":"en-us","pathFormat":"path","supportsRunInTerminalRequest":true,"supportsVariablePaging":true,"supportsVariableType":true},"seq":1} <-- Content-Length: 1222

Hide Details

{"body":{"exceptionBreakpointFilters":[{"default":false,"filter":"cpp_catch","label":"C++ Catch"},{"default":false,"filter":"cpp_throw","label":"C++ Throw"},{"default":false,"filter":"objc_catch","label":"Objective C Catch"},{"default":false,"filter":"objc_throw","label":"Objective C Throw"},{"default":false,"filter":"swift_catch","label":"Swift Catch"},{"default":false,"filter":"swift_throw","label":"Swift Throw"}],"supportTerminateDebuggee":true,"supportsCompletionsRequest":false,"supportsConditionalBreakpoints":true,"supportsConfigurationDoneRequest":true,"supportsDelayedStackTraceLoading":true,"supportsEvaluateForHovers":true,"supportsExceptionInfoRequest":true,"supportsExceptionOptions":true,"supportsFunctionBreakpoints":true,"supportsGotoTargetsRequest":false,"supportsHitConditionalBreakpoints":true,"supportsLoadedSourcesRequest":false,"supportsModulesRequest":false,"supportsProgressReporting":true,"supportsRestartFrame":false,"supportsRestartRequest":false,"supportsRunInTerminalRequest":true,"supportsSetVariable":true,"supportsStepBack":false,"supportsStepInTargetsRequest":false,"supportsValueFormattingOptions":true},"command":"initialize","request_seq":1,"seq":0,"success":true,"type":"response"} --> Content-Length: 1040

Hide Details

{"command":"launch","type":"request","arguments":{"program":"/Users/buildslave/jenkins/workspace/lldb-cmake-sanitized/lldb-build/lldb-test-build.noindex/tools/lldb-vscode/evaluate/TestVSCode_evaluate.test_repl_evaluate_expressions/a.out","disableASLR":true,"initCommands":["settings clear -all","settings set symbols.enable-external-lookup false","settings set target.inherit-tcc true","settings set target.detach-on-error false","settings set target.auto-apply-fixits false","settings set plugin.process.gdb-remote.packet-timeout 60","settings set symbols.clang-modules-cache-path \"/Users/buildslave/jenkins/workspace/lldb-cmake-sanitized/lldb-build/lldb-test-build.noindex/module-cache-lldb/lldb-api\"","settings set use-color false","setting set target.prefer-dynamic-value no-dynamic-values","settings set target.env-vars ASAN_OPTIONS=detect_stack_use_after_return=1 DYLD_INSERT_LIBRARIES=/Users/buildslave/jenkins/workspace/lldb-cmake-sanitized/host-compiler/lib/clang/13.0.99/lib/darwin/libclang_rt.asan_osx_dynamic.dylib"]},"seq":2} <-- Content-Length: 923

Hide Details

{"body":{"category":"console","output":"Running initCommands:\n(lldb) settings clear -all\n(lldb) settings set symbols.enable-external-lookup false\n(lldb) settings set target.inherit-tcc true\n(lldb) settings set target.detach-on-error false\n(lldb) settings set target.auto-apply-fixits false\n(lldb) settings set plugin.process.gdb-remote.packet-timeout 60\n(lldb) settings set symbols.clang-modules-cache-path \"/Users/buildslave/jenkins/workspace/lldb-cmake-sanitized/lldb-build/lldb-test-build.noindex/module-cache-lldb/lldb-api\"\n(lldb) settings set use-color false\n(lldb) setting set target.prefer-dynamic-value no-dynamic-values\n(lldb) settings set target.env-vars ASAN_OPTIONS=detect_stack_use_after_return=1 DYLD_INSERT_LIBRARIES=/Users/buildslave/jenkins/workspace/lldb-cmake-sanitized/host-compiler/lib/clang/13.0.99/lib/darwin/libclang_rt.asan_osx_dynamic.dylib\n"},"event":"output","seq":0,"type":"event"} <-- Content-Length: 77

Hide Details

{"command":"launch","request_seq":2,"seq":0,"success":true,"type":"response"} <-- Content-Length: 305

Hide Details

{"body":{"isLocalProcess":true,"name":"/Users/buildslave/jenkins/workspace/lldb-cmake-sanitized/lldb-build/lldb-test-build.noindex/tools/lldb-vscode/evaluate/TestVSCode_evaluate.test_repl_evaluate_expressions/a.out","startMethod":"launch","systemProcessId":17356},"event":"process","seq":0,"type":"event"} <-- Content-Length: 46

Hide Details

{"event":"initialized","seq":0,"type":"event"} --> Content-Length: 276

Hide Details

{"command":"setBreakpoints","type":"request","arguments":{"source":{"name":"main.cpp","path":"main.cpp"},"sourceModified":false,"lines":"[23, 27, 11, 35, 40, 44, 45]","breakpoints":[{"line":23},{"line":27},{"line":11},{"line":35},{"line":40},{"line":44},{"line":45}]},"seq":3} <-- Content-Length: 684

Hide Details

{"body":{"breakpoints":[{"id":1,"line":23,"source":{"name":"main.cpp","path":"main.cpp"},"verified":true},{"id":2,"line":27,"source":{"name":"main.cpp","path":"main.cpp"},"verified":true},{"id":3,"line":11,"source":{"name":"main.cpp","path":"main.cpp"},"verified":true},{"id":4,"line":35,"source":{"name":"main.cpp","path":"main.cpp"},"verified":true},{"id":5,"line":40,"source":{"name":"main.cpp","path":"main.cpp"},"verified":true},{"id":6,"line":44,"source":{"name":"main.cpp","path":"main.cpp"},"verified":true},{"id":7,"line":45,"source":{"name":"main.cpp","path":"main.cpp"},"verified":true}]},"command":"setBreakpoints","request_seq":3,"seq":0,"success":true,"type":"response"} --> Content-Length: 71

Hide Details

{"command":"configurationDone","type":"request","arguments":{},"seq":4} <-- Content-Length: 88

Hide Details

{"command":"configurationDone","request_seq":4,"seq":0,"success":true,"type":"response"} <-- Content-Length: 199

Hide Details

{"body":{"allThreadsStopped":true,"description":"breakpoint 1.1","preserveFocusHint":false,"reason":"breakpoint","threadCausedFocus":true,"threadId":1670458},"event":"stopped","seq":0,"type":"event"} --> Content-Length: 61

Hide Details

{"command":"threads","type":"request","arguments":{},"seq":5} <-- Content-Length: 133

Hide Details

{"body":{"threads":[{"id":1670458,"name":"Thread #1"}]},"command":"threads","request_seq":5,"seq":0,"success":true,"type":"response"} --> Content-Length: 108

Hide Details

{"command":"stackTrace","type":"request","arguments":{"threadId":1670458,"startFrame":0,"levels":1},"seq":6} <-- Content-Length: 330

Hide Details

{"body":{"stackFrames":[{"column":14,"id":524288,"line":23,"name":"main","source":{"name":"main.cpp","path":"/Users/buildslave/jenkins/workspace/lldb-cmake-sanitized/llvm-project/lldb/test/API/tools/lldb-vscode/evaluate/main.cpp"}}],"totalFrames":3},"command":"stackTrace","request_seq":6,"seq":0,"success":true,"type":"response"} --> Content-Length: 115

Hide Details

{"command":"evaluate","type":"request","arguments":{"expression":"var1","context":"repl","frameId":524288},"seq":7} <-- Content-Length: 138

Hide Details

{"body":{"result":"20","type":"int","variablesReference":0},"command":"evaluate","request_seq":7,"seq":0,"success":true,"type":"response"} --> Content-Length: 108

Hide Details

{"command":"stackTrace","type":"request","arguments":{"threadId":1670458,"startFrame":0,"levels":1},"seq":8} <-- Content-Length: 330

Hide Details

{"body":{"stackFrames":[{"column":14,"id":524288,"line":23,"name":"main","source":{"name":"main.cpp","path":"/Users/buildslave/jenkins/workspace/lldb-cmake-sanitized/llvm-project/lldb/test/API/tools/lldb-vscode/evaluate/main.cpp"}}],"totalFrames":3},"command":"stackTrace","request_seq":8,"seq":0,"success":true,"type":"response"} --> Content-Length: 115

Hide Details

{"command":"evaluate","type":"request","arguments":{"expression":"var2","context":"repl","frameId":524288},"seq":9} <-- Content-Length: 138

Hide Details

{"body":{"result":"21","type":"int","variablesReference":0},"command":"evaluate","request_seq":9,"seq":0,"success":true,"type":"response"} --> Content-Length: 109

Hide Details

{"command":"stackTrace","type":"request","arguments":{"threadId":1670458,"startFrame":0,"levels":1},"seq":10} <-- Content-Length: 331

Hide Details

{"body":{"stackFrames":[{"column":14,"id":524288,"line":23,"name":"main","source":{"name":"main.cpp","path":"/Users/buildslave/jenkins/workspace/lldb-cmake-sanitized/llvm-project/lldb/test/API/tools/lldb-vscode/evaluate/main.cpp"}}],"totalFrames":3},"command":"stackTrace","request_seq":10,"seq":0,"success":true,"type":"response"} --> Content-Length: 122

Hide Details

{"command":"evaluate","type":"request","arguments":{"expression":"static_int","context":"repl","frameId":524288},"seq":11} <-- Content-Length: 139

Hide Details

{"body":{"result":"42","type":"int","variablesReference":0},"command":"evaluate","request_seq":11,"seq":0,"success":true,"type":"response"} --> Content-Length: 109

Hide Details

{"command":"stackTrace","type":"request","arguments":{"threadId":1670458,"startFrame":0,"levels":1},"seq":12} <-- Content-Length: 331

Hide Details

{"body":{"stackFrames":[{"column":14,"id":524288,"line":23,"name":"main","source":{"name":"main.cpp","path":"/Users/buildslave/jenkins/workspace/lldb-cmake-sanitized/llvm-project/lldb/test/API/tools/lldb-vscode/evaluate/main.cpp"}}],"totalFrames":3},"command":"stackTrace","request_seq":12,"seq":0,"success":true,"type":"response"} --> Content-Length: 126

Hide Details

{"command":"evaluate","type":"request","arguments":{"expression":"non_static_int","context":"repl","frameId":524288},"seq":13} <-- Content-Length: 139

Hide Details

{"body":{"result":"43","type":"int","variablesReference":0},"command":"evaluate","request_seq":13,"seq":0,"success":true,"type":"response"} --> Content-Length: 109

Hide Details

{"command":"stackTrace","type":"request","arguments":{"threadId":1670458,"startFrame":0,"levels":1},"seq":14} <-- Content-Length: 331

Hide Details

{"body":{"stackFrames":[{"column":14,"id":524288,"line":23,"name":"main","source":{"name":"main.cpp","path":"/Users/buildslave/jenkins/workspace/lldb-cmake-sanitized/llvm-project/lldb/test/API/tools/lldb-vscode/evaluate/main.cpp"}}],"totalFrames":3},"command":"stackTrace","request_seq":14,"seq":0,"success":true,"type":"response"} --> Content-Length: 119

Hide Details

{"command":"evaluate","type":"request","arguments":{"expression":"struct1","context":"repl","frameId":524288},"seq":15} <-- Content-Length: 169

Hide Details

{"body":{"result":"my_struct @ 0x7ffeefbff7c8","type":"my_struct","variablesReference":4},"command":"evaluate","request_seq":15,"seq":0,"success":true,"type":"response"} --> Content-Length: 109

Hide Details

{"command":"stackTrace","type":"request","arguments":{"threadId":1670458,"startFrame":0,"levels":1},"seq":16} <-- Content-Length: 331

Hide Details

{"body":{"stackFrames":[{"column":14,"id":524288,"line":23,"name":"main","source":{"name":"main.cpp","path":"/Users/buildslave/jenkins/workspace/lldb-cmake-sanitized/llvm-project/lldb/test/API/tools/lldb-vscode/evaluate/main.cpp"}}],"totalFrames":3},"command":"stackTrace","request_seq":16,"seq":0,"success":true,"type":"response"} --> Content-Length: 123

Hide Details

{"command":"evaluate","type":"request","arguments":{"expression":"struct1.foo","context":"repl","frameId":524288},"seq":17} <-- Content-Length: 139

Hide Details

{"body":{"result":"15","type":"int","variablesReference":0},"command":"evaluate","request_seq":17,"seq":0,"success":true,"type":"response"} --> Content-Length: 109

Hide Details

{"command":"stackTrace","type":"request","arguments":{"threadId":1670458,"startFrame":0,"levels":1},"seq":18} <-- Content-Length: 331

Hide Details

{"body":{"stackFrames":[{"column":14,"id":524288,"line":23,"name":"main","source":{"name":"main.cpp","path":"/Users/buildslave/jenkins/workspace/lldb-cmake-sanitized/llvm-project/lldb/test/API/tools/lldb-vscode/evaluate/main.cpp"}}],"totalFrames":3},"command":"stackTrace","request_seq":18,"seq":0,"success":true,"type":"response"} --> Content-Length: 124

Hide Details

{"command":"evaluate","type":"request","arguments":{"expression":"struct2->foo","context":"repl","frameId":524288},"seq":19} <-- Content-Length: 139

Hide Details

{"body":{"result":"16","type":"int","variablesReference":0},"command":"evaluate","request_seq":19,"seq":0,"success":true,"type":"response"} --> Content-Length: 109

Hide Details

{"command":"stackTrace","type":"request","arguments":{"threadId":1670458,"startFrame":0,"levels":1},"seq":20} <-- Content-Length: 331

Hide Details

{"body":{"stackFrames":[{"column":14,"id":524288,"line":23,"name":"main","source":{"name":"main.cpp","path":"/Users/buildslave/jenkins/workspace/lldb-cmake-sanitized/llvm-project/lldb/test/API/tools/lldb-vscode/evaluate/main.cpp"}}],"totalFrames":3},"command":"stackTrace","request_seq":20,"seq":0,"success":true,"type":"response"} --> Content-Length: 115

Hide Details

{"command":"evaluate","type":"request","arguments":{"expression":"var","context":"repl","frameId":524288},"seq":21} <-- Content-Length: 209

Hide Details

{"body":{},"command":"evaluate","message":"expression failed to parse:\nerror: <user expression 0>:1:1: use of undeclared identifier 'var'\nvar\n^\n","request_seq":21,"seq":0,"success":false,"type":"response"} --> Content-Length: 109

Hide Details

{"command":"stackTrace","type":"request","arguments":{"threadId":1670458,"startFrame":0,"levels":1},"seq":22} <-- Content-Length: 331

Hide Details

{"body":{"stackFrames":[{"column":14,"id":524288,"line":23,"name":"main","source":{"name":"main.cpp","path":"/Users/buildslave/jenkins/workspace/lldb-cmake-sanitized/llvm-project/lldb/test/API/tools/lldb-vscode/evaluate/main.cpp"}}],"totalFrames":3},"command":"stackTrace","request_seq":22,"seq":0,"success":true,"type":"response"} --> Content-Length: 121

Hide Details

{"command":"evaluate","type":"request","arguments":{"expression":"my_struct","context":"repl","frameId":524288},"seq":23} <-- Content-Length: 311

Hide Details

{"body":{"category":"console","output":"/Users/buildslave/jenkins/workspace/lldb-cmake-sanitized/llvm-project/lldb/tools/lldb-vscode/ProgressEvent.cpp:89:64: runtime error: load of value 808464432, which is not a valid value for type 'lldb_vscode::ProgressEventType'\n"},"event":"output","seq":0,"type":"event"} <-- Content-Length: 261

Hide Details

{"body":{"category":"console","output":"SUMMARY: UndefinedBehaviorSanitizer: undefined-behavior /Users/buildslave/jenkins/workspace/lldb-cmake-sanitized/llvm-project/lldb/tools/lldb-vscode/ProgressEvent.cpp:89:64 in \n"},"event":"output","seq":0,"type":"event"} <-- Content-Length: 170

Hide Details

{"body":{"category":"console","output":"PLEASE submit a bug report to https://bugs.llvm.org/ and include the crash backtrace.\n"},"event":"output","seq":0,"type":"event"} <-- Content-Length: 117

Hide Details

{"body":{},"command":"evaluate","message":"unknown error","request_seq":23,"seq":0,"success":false,"type":"response"} --> Content-Length: 109

Hide Details

{"command":"stackTrace","type":"request","arguments":{"threadId":1670458,"startFrame":0,"levels":1},"seq":24} <-- Content-Length: 331

Hide Details

{"body":{"stackFrames":[{"column":14,"id":524288,"line":23,"name":"main","source":{"name":"main.cpp","path":"/Users/buildslave/jenkins/workspace/lldb-cmake-sanitized/llvm-project/lldb/test/API/tools/lldb-vscode/evaluate/main.cpp"}}],"totalFrames":3},"command":"stackTrace","request_seq":24,"seq":0,"success":true,"type":"response"} --> Content-Length: 115

Hide Details

{"command":"evaluate","type":"request","arguments":{"expression":"int","context":"repl","frameId":524288},"seq":25}

Hide Details

========= END ========= ========= DEBUG ADAPTER PROTOCOL LOGS ========= --> Content-Length: 284

Hide Details

{"command":"initialize","type":"request","arguments":{"adapterID":"lldb-native","clientID":"vscode","columnsStartAt1":true,"linesStartAt1":true,"locale":"en-us","pathFormat":"path","supportsRunInTerminalRequest":true,"supportsVariablePaging":true,"supportsVariableType":true},"seq":1} <-- Content-Length: 1222

Hide Details

{"body":{"exceptionBreakpointFilters":[{"default":false,"filter":"cpp_catch","label":"C++ Catch"},{"default":false,"filter":"cpp_throw","label":"C++ Throw"},{"default":false,"filter":"objc_catch","label":"Objective C Catch"},{"default":false,"filter":"objc_throw","label":"Objective C Throw"},{"default":false,"filter":"swift_catch","label":"Swift Catch"},{"default":false,"filter":"swift_throw","label":"Swift Throw"}],"supportTerminateDebuggee":true,"supportsCompletionsRequest":false,"supportsConditionalBreakpoints":true,"supportsConfigurationDoneRequest":true,"supportsDelayedStackTraceLoading":true,"supportsEvaluateForHovers":true,"supportsExceptionInfoRequest":true,"supportsExceptionOptions":true,"supportsFunctionBreakpoints":true,"supportsGotoTargetsRequest":false,"supportsHitConditionalBreakpoints":true,"supportsLoadedSourcesRequest":false,"supportsModulesRequest":false,"supportsProgressReporting":true,"supportsRestartFrame":false,"supportsRestartRequest":false,"supportsRunInTerminalRequest":true,"supportsSetVariable":true,"supportsStepBack":false,"supportsStepInTargetsRequest":false,"supportsValueFormattingOptions":true},"command":"initialize","request_seq":1,"seq":0,"success":true,"type":"response"} --> Content-Length: 1041

Hide Details

{"command":"launch","type":"request","arguments":{"program":"/Users/buildslave/jenkins/workspace/lldb-cmake-sanitized/lldb-build/lldb-test-build.noindex/tools/lldb-vscode/evaluate/TestVSCode_evaluate.test_watch_evaluate_expressions/a.out","disableASLR":true,"initCommands":["settings clear -all","settings set symbols.enable-external-lookup false","settings set target.inherit-tcc true","settings set target.detach-on-error false","settings set target.auto-apply-fixits false","settings set plugin.process.gdb-remote.packet-timeout 60","settings set symbols.clang-modules-cache-path \"/Users/buildslave/jenkins/workspace/lldb-cmake-sanitized/lldb-build/lldb-test-build.noindex/module-cache-lldb/lldb-api\"","settings set use-color false","setting set target.prefer-dynamic-value no-dynamic-values","settings set target.env-vars ASAN_OPTIONS=detect_stack_use_after_return=1 DYLD_INSERT_LIBRARIES=/Users/buildslave/jenkins/workspace/lldb-cmake-sanitized/host-compiler/lib/clang/13.0.99/lib/darwin/libclang_rt.asan_osx_dynamic.dylib"]},"seq":2} <-- Content-Length: 923

Hide Details

{"body":{"category":"console","output":"Running initCommands:\n(lldb) settings clear -all\n(lldb) settings set symbols.enable-external-lookup false\n(lldb) settings set target.inherit-tcc true\n(lldb) settings set target.detach-on-error false\n(lldb) settings set target.auto-apply-fixits false\n(lldb) settings set plugin.process.gdb-remote.packet-timeout 60\n(lldb) settings set symbols.clang-modules-cache-path \"/Users/buildslave/jenkins/workspace/lldb-cmake-sanitized/lldb-build/lldb-test-build.noindex/module-cache-lldb/lldb-api\"\n(lldb) settings set use-color false\n(lldb) setting set target.prefer-dynamic-value no-dynamic-values\n(lldb) settings set target.env-vars ASAN_OPTIONS=detect_stack_use_after_return=1 DYLD_INSERT_LIBRARIES=/Users/buildslave/jenkins/workspace/lldb-cmake-sanitized/host-compiler/lib/clang/13.0.99/lib/darwin/libclang_rt.asan_osx_dynamic.dylib\n"},"event":"output","seq":0,"type":"event"} <-- Content-Length: 77

Hide Details

{"command":"launch","request_seq":2,"seq":0,"success":true,"type":"response"} <-- Content-Length: 306

Hide Details

{"body":{"isLocalProcess":true,"name":"/Users/buildslave/jenkins/workspace/lldb-cmake-sanitized/lldb-build/lldb-test-build.noindex/tools/lldb-vscode/evaluate/TestVSCode_evaluate.test_watch_evaluate_expressions/a.out","startMethod":"launch","systemProcessId":17447},"event":"process","seq":0,"type":"event"} <-- Content-Length: 46

Hide Details

{"event":"initialized","seq":0,"type":"event"} --> Content-Length: 276

Hide Details

{"command":"setBreakpoints","type":"request","arguments":{"source":{"name":"main.cpp","path":"main.cpp"},"sourceModified":false,"lines":"[23, 27, 11, 35, 40, 44, 45]","breakpoints":[{"line":23},{"line":27},{"line":11},{"line":35},{"line":40},{"line":44},{"line":45}]},"seq":3} <-- Content-Length: 684

Hide Details

{"body":{"breakpoints":[{"id":1,"line":23,"source":{"name":"main.cpp","path":"main.cpp"},"verified":true},{"id":2,"line":27,"source":{"name":"main.cpp","path":"main.cpp"},"verified":true},{"id":3,"line":11,"source":{"name":"main.cpp","path":"main.cpp"},"verified":true},{"id":4,"line":35,"source":{"name":"main.cpp","path":"main.cpp"},"verified":true},{"id":5,"line":40,"source":{"name":"main.cpp","path":"main.cpp"},"verified":true},{"id":6,"line":44,"source":{"name":"main.cpp","path":"main.cpp"},"verified":true},{"id":7,"line":45,"source":{"name":"main.cpp","path":"main.cpp"},"verified":true}]},"command":"setBreakpoints","request_seq":3,"seq":0,"success":true,"type":"response"} --> Content-Length: 71

Hide Details

{"command":"configurationDone","type":"request","arguments":{},"seq":4} <-- Content-Length: 88

Hide Details

{"command":"configurationDone","request_seq":4,"seq":0,"success":true,"type":"response"} <-- Content-Length: 199

Hide Details

{"body":{"allThreadsStopped":true,"description":"breakpoint 1.1","preserveFocusHint":false,"reason":"breakpoint","threadCausedFocus":true,"threadId":1670810},"event":"stopped","seq":0,"type":"event"} --> Content-Length: 61

Hide Details

{"command":"threads","type":"request","arguments":{},"seq":5} <-- Content-Length: 133

Hide Details

{"body":{"threads":[{"id":1670810,"name":"Thread #1"}]},"command":"threads","request_seq":5,"seq":0,"success":true,"type":"response"} --> Content-Length: 108

Hide Details

{"command":"stackTrace","type":"request","arguments":{"threadId":1670810,"startFrame":0,"levels":1},"seq":6} <-- Content-Length: 330

Hide Details

{"body":{"stackFrames":[{"column":14,"id":524288,"line":23,"name":"main","source":{"name":"main.cpp","path":"/Users/buildslave/jenkins/workspace/lldb-cmake-sanitized/llvm-project/lldb/test/API/tools/lldb-vscode/evaluate/main.cpp"}}],"totalFrames":2},"command":"stackTrace","request_seq":6,"seq":0,"success":true,"type":"response"} --> Content-Length: 116

Hide Details

{"command":"evaluate","type":"request","arguments":{"expression":"var1","context":"watch","frameId":524288},"seq":7} <-- Content-Length: 138

Hide Details

{"body":{"result":"20","type":"int","variablesReference":0},"command":"evaluate","request_seq":7,"seq":0,"success":true,"type":"response"} --> Content-Length: 108

Hide Details

{"command":"stackTrace","type":"request","arguments":{"threadId":1670810,"startFrame":0,"levels":1},"seq":8} <-- Content-Length: 330

Hide Details

{"body":{"stackFrames":[{"column":14,"id":524288,"line":23,"name":"main","source":{"name":"main.cpp","path":"/Users/buildslave/jenkins/workspace/lldb-cmake-sanitized/llvm-project/lldb/test/API/tools/lldb-vscode/evaluate/main.cpp"}}],"totalFrames":2},"command":"stackTrace","request_seq":8,"seq":0,"success":true,"type":"response"} --> Content-Length: 116

Hide Details

{"command":"evaluate","type":"request","arguments":{"expression":"var2","context":"watch","frameId":524288},"seq":9} <-- Content-Length: 138

Hide Details

{"body":{"result":"21","type":"int","variablesReference":0},"command":"evaluate","request_seq":9,"seq":0,"success":true,"type":"response"} --> Content-Length: 109

Hide Details

{"command":"stackTrace","type":"request","arguments":{"threadId":1670810,"startFrame":0,"levels":1},"seq":10} <-- Content-Length: 331

Hide Details

{"body":{"stackFrames":[{"column":14,"id":524288,"line":23,"name":"main","source":{"name":"main.cpp","path":"/Users/buildslave/jenkins/workspace/lldb-cmake-sanitized/llvm-project/lldb/test/API/tools/lldb-vscode/evaluate/main.cpp"}}],"totalFrames":2},"command":"stackTrace","request_seq":10,"seq":0,"success":true,"type":"response"} --> Content-Length: 123

Hide Details

{"command":"evaluate","type":"request","arguments":{"expression":"static_int","context":"watch","frameId":524288},"seq":11} <-- Content-Length: 139

Hide Details

{"body":{"result":"42","type":"int","variablesReference":0},"command":"evaluate","request_seq":11,"seq":0,"success":true,"type":"response"} --> Content-Length: 109

Hide Details

{"command":"stackTrace","type":"request","arguments":{"threadId":1670810,"startFrame":0,"levels":1},"seq":12} <-- Content-Length: 331

Hide Details

{"body":{"stackFrames":[{"column":14,"id":524288,"line":23,"name":"main","source":{"name":"main.cpp","path":"/Users/buildslave/jenkins/workspace/lldb-cmake-sanitized/llvm-project/lldb/test/API/tools/lldb-vscode/evaluate/main.cpp"}}],"totalFrames":2},"command":"stackTrace","request_seq":12,"seq":0,"success":true,"type":"response"} --> Content-Length: 127

Hide Details

{"command":"evaluate","type":"request","arguments":{"expression":"non_static_int","context":"watch","frameId":524288},"seq":13} <-- Content-Length: 139

Hide Details

{"body":{"result":"43","type":"int","variablesReference":0},"command":"evaluate","request_seq":13,"seq":0,"success":true,"type":"response"} --> Content-Length: 109

Hide Details

{"command":"stackTrace","type":"request","arguments":{"threadId":1670810,"startFrame":0,"levels":1},"seq":14} <-- Content-Length: 331

Hide Details

{"body":{"stackFrames":[{"column":14,"id":524288,"line":23,"name":"main","source":{"name":"main.cpp","path":"/Users/buildslave/jenkins/workspace/lldb-cmake-sanitized/llvm-project/lldb/test/API/tools/lldb-vscode/evaluate/main.cpp"}}],"totalFrames":2},"command":"stackTrace","request_seq":14,"seq":0,"success":true,"type":"response"} --> Content-Length: 120

Hide Details

{"command":"evaluate","type":"request","arguments":{"expression":"struct1","context":"watch","frameId":524288},"seq":15} <-- Content-Length: 169

Hide Details

{"body":{"result":"my_struct @ 0x7ffeefbff7c8","type":"my_struct","variablesReference":4},"command":"evaluate","request_seq":15,"seq":0,"success":true,"type":"response"} --> Content-Length: 109

Hide Details

{"command":"stackTrace","type":"request","arguments":{"threadId":1670810,"startFrame":0,"levels":1},"seq":16} <-- Content-Length: 331

Hide Details

{"body":{"stackFrames":[{"column":14,"id":524288,"line":23,"name":"main","source":{"name":"main.cpp","path":"/Users/buildslave/jenkins/workspace/lldb-cmake-sanitized/llvm-project/lldb/test/API/tools/lldb-vscode/evaluate/main.cpp"}}],"totalFrames":2},"command":"stackTrace","request_seq":16,"seq":0,"success":true,"type":"response"} --> Content-Length: 124

Hide Details

{"command":"evaluate","type":"request","arguments":{"expression":"struct1.foo","context":"watch","frameId":524288},"seq":17} <-- Content-Length: 139

Hide Details

{"body":{"result":"15","type":"int","variablesReference":0},"command":"evaluate","request_seq":17,"seq":0,"success":true,"type":"response"} --> Content-Length: 109

Hide Details

{"command":"stackTrace","type":"request","arguments":{"threadId":1670810,"startFrame":0,"levels":1},"seq":18} <-- Content-Length: 331

Hide Details

{"body":{"stackFrames":[{"column":14,"id":524288,"line":23,"name":"main","source":{"name":"main.cpp","path":"/Users/buildslave/jenkins/workspace/lldb-cmake-sanitized/llvm-project/lldb/test/API/tools/lldb-vscode/evaluate/main.cpp"}}],"totalFrames":2},"command":"stackTrace","request_seq":18,"seq":0,"success":true,"type":"response"} --> Content-Length: 125

Hide Details

{"command":"evaluate","type":"request","arguments":{"expression":"struct2->foo","context":"watch","frameId":524288},"seq":19} <-- Content-Length: 139

Hide Details

{"body":{"result":"16","type":"int","variablesReference":0},"command":"evaluate","request_seq":19,"seq":0,"success":true,"type":"response"} --> Content-Length: 109

Hide Details

{"command":"stackTrace","type":"request","arguments":{"threadId":1670810,"startFrame":0,"levels":1},"seq":20} <-- Content-Length: 331

Hide Details

{"body":{"stackFrames":[{"column":14,"id":524288,"line":23,"name":"main","source":{"name":"main.cpp","path":"/Users/buildslave/jenkins/workspace/lldb-cmake-sanitized/llvm-project/lldb/test/API/tools/lldb-vscode/evaluate/main.cpp"}}],"totalFrames":2},"command":"stackTrace","request_seq":20,"seq":0,"success":true,"type":"response"} --> Content-Length: 116

Hide Details

{"command":"evaluate","type":"request","arguments":{"expression":"var","context":"watch","frameId":524288},"seq":21} <-- Content-Length: 209

Hide Details

{"body":{},"command":"evaluate","message":"expression failed to parse:\nerror: <user expression 0>:1:1: use of undeclared identifier 'var'\nvar\n^\n","request_seq":21,"seq":0,"success":false,"type":"response"} --> Content-Length: 109

Hide Details

{"command":"stackTrace","type":"request","arguments":{"threadId":1670810,"startFrame":0,"levels":1},"seq":22} <-- Content-Length: 331

Hide Details

{"body":{"stackFrames":[{"column":14,"id":524288,"line":23,"name":"main","source":{"name":"main.cpp","path":"/Users/buildslave/jenkins/workspace/lldb-cmake-sanitized/llvm-project/lldb/test/API/tools/lldb-vscode/evaluate/main.cpp"}}],"totalFrames":2},"command":"stackTrace","request_seq":22,"seq":0,"success":true,"type":"response"} --> Content-Length: 122

Hide Details

{"command":"evaluate","type":"request","arguments":{"expression":"my_struct","context":"watch","frameId":524288},"seq":23} <-- Content-Length: 311

Hide Details

{"body":{"category":"console","output":"/Users/buildslave/jenkins/workspace/lldb-cmake-sanitized/llvm-project/lldb/tools/lldb-vscode/ProgressEvent.cpp:89:64: runtime error: load of value 808464432, which is not a valid value for type 'lldb_vscode::ProgressEventType'\n"},"event":"output","seq":0,"type":"event"} <-- Content-Length: 261

Hide Details

{"body":{"category":"console","output":"SUMMARY: UndefinedBehaviorSanitizer: undefined-behavior /Users/buildslave/jenkins/workspace/lldb-cmake-sanitized/llvm-project/lldb/tools/lldb-vscode/ProgressEvent.cpp:89:64 in \n"},"event":"output","seq":0,"type":"event"} <-- Content-Length: 170

Hide Details

{"body":{"category":"console","output":"PLEASE submit a bug report to https://bugs.llvm.org/ and include the crash backtrace.\n"},"event":"output","seq":0,"type":"event"} <-- Content-Length: 117

Hide Details

{"body":{},"command":"evaluate","message":"unknown error","request_seq":23,"seq":0,"success":false,"type":"response"} --> Content-Length: 109

Hide Details

{"command":"stackTrace","type":"request","arguments":{"threadId":1670810,"startFrame":0,"levels":1},"seq":24} <-- Content-Length: 331

Hide Details

{"body":{"stackFrames":[{"column":14,"id":524288,"line":23,"name":"main","source":{"name":"main.cpp","path":"/Users/buildslave/jenkins/workspace/lldb-cmake-sanitized/llvm-project/lldb/test/API/tools/lldb-vscode/evaluate/main.cpp"}}],"totalFrames":2},"command":"stackTrace","request_seq":24,"seq":0,"success":true,"type":"response"} --> Content-Length: 116

Hide Details

{"command":"evaluate","type":"request","arguments":{"expression":"int","context":"watch","frameId":524288},"seq":25}

Hide Details

========= END =========

Hide Details

-- Command Output (stderr): -- Change dir to: /Users/buildslave/jenkins/workspace/lldb-cmake-sanitized/llvm-project/lldb/test/API/tools/lldb-vscode/evaluate runCmd: settings clear -all output:

Hide Details

runCmd: settings set symbols.enable-external-lookup false output:

Hide Details

runCmd: settings set target.inherit-tcc true output:

Hide Details

runCmd: settings set target.detach-on-error false output:

Hide Details

runCmd: settings set target.auto-apply-fixits false output:

Hide Details

runCmd: settings set plugin.process.gdb-remote.packet-timeout 60 output:

Hide Details

runCmd: settings set symbols.clang-modules-cache-path "/Users/buildslave/jenkins/workspace/lldb-cmake-sanitized/lldb-build/lldb-test-build.noindex/module-cache-lldb/lldb-api" output:

Hide Details

runCmd: settings set use-color false output:

Hide Details

runCmd: setting set target.prefer-dynamic-value no-dynamic-values output:

Hide Details

runCmd: settings set target.env-vars ASAN_OPTIONS=detect_stack_use_after_return=1 DYLD_INSERT_LIBRARIES=/Users/buildslave/jenkins/workspace/lldb-cmake-sanitized/host-compiler/lib/clang/13.0.99/lib/darwin/libclang_rt.asan_osx_dynamic.dylib output:

Hide Details

Adding tearDown hook: def cleanup(): if disconnectAutomatically: self.vscode.request_disconnect(terminateDebuggee=True) self.vscode.terminate()

Hide Details

Hide Details

FAIL: LLDB (/Users/buildslave/jenkins/workspace/lldb-cmake-sanitized/host-compiler/bin/clang-x86_64) :: test_generic_evaluate_expressions (TestVSCode_evaluate.TestVSCode_variables) Executing tearDown hook: def cleanup(): if disconnectAutomatically: self.vscode.request_disconnect(terminateDebuggee=True) self.vscode.terminate()

Hide Details

Hide Details

CLEANUP ERROR: LLDB (/Users/buildslave/jenkins/workspace/lldb-cmake-sanitized/host-compiler/bin/clang-x86_64) :: test_generic_evaluate_expressions (TestVSCode_evaluate.TestVSCode_variables) Traceback (most recent call last): File "/Users/buildslave/jenkins/workspace/lldb-cmake-sanitized/llvm-project/lldb/third_party/Python/module/unittest2/unittest2/case.py", line 386, in run self.tearDown() File "/Users/buildslave/jenkins/workspace/lldb-cmake-sanitized/llvm-project/lldb/packages/Python/lldbsuite/test/lldbtest.py", line 2095, in tearDown Base.tearDown(self) File "/Users/buildslave/jenkins/workspace/lldb-cmake-sanitized/llvm-project/lldb/packages/Python/lldbsuite/test/lldbtest.py", line 1065, in tearDown hook() # try the plain call and hope it works File "/Users/buildslave/jenkins/workspace/lldb-cmake-sanitized/llvm-project/lldb/packages/Python/lldbsuite/test/tools/lldb-vscode/lldbvscode_testcase.py", line 294, in cleanup self.vscode.request_disconnect(terminateDebuggee=True) File "/Users/buildslave/jenkins/workspace/lldb-cmake-sanitized/llvm-project/lldb/packages/Python/lldbsuite/test/tools/lldb-vscode/vscode.py", line 590, in request_disconnect return self.send_recv(command_dict) File "/Users/buildslave/jenkins/workspace/lldb-cmake-sanitized/llvm-project/lldb/packages/Python/lldbsuite/test/tools/lldb-vscode/vscode.py", line 315, in send_recv self.send_packet(command) File "/Users/buildslave/jenkins/workspace/lldb-cmake-sanitized/llvm-project/lldb/packages/Python/lldbsuite/test/tools/lldb-vscode/vscode.py", line 271, in send_packet self.send.flush() BrokenPipeError: [Errno 32] Broken pipe

Hide Details

runCmd: settings clear -all output:

Hide Details

runCmd: settings set symbols.enable-external-lookup false output:

Hide Details

runCmd: settings set target.inherit-tcc true output:

Hide Details

runCmd: settings set target.detach-on-error false output:

Hide Details

runCmd: settings set target.auto-apply-fixits false output:

Hide Details

runCmd: settings set plugin.process.gdb-remote.packet-timeout 60 output:

Hide Details

runCmd: settings set symbols.clang-modules-cache-path "/Users/buildslave/jenkins/workspace/lldb-cmake-sanitized/lldb-build/lldb-test-build.noindex/module-cache-lldb/lldb-api" output:

Hide Details

runCmd: settings set use-color false output:

Hide Details

runCmd: setting set target.prefer-dynamic-value no-dynamic-values output:

Hide Details

runCmd: settings set target.env-vars ASAN_OPTIONS=detect_stack_use_after_return=1 DYLD_INSERT_LIBRARIES=/Users/buildslave/jenkins/workspace/lldb-cmake-sanitized/host-compiler/lib/clang/13.0.99/lib/darwin/libclang_rt.asan_osx_dynamic.dylib output:

Hide Details

Adding tearDown hook: def cleanup(): if disconnectAutomatically: self.vscode.request_disconnect(terminateDebuggee=True) self.vscode.terminate()

Hide Details

Hide Details

Executing tearDown hook: def cleanup(): if disconnectAutomatically: self.vscode.request_disconnect(terminateDebuggee=True) self.vscode.terminate()

Hide Details

Hide Details

PASS: LLDB (/Users/buildslave/jenkins/workspace/lldb-cmake-sanitized/host-compiler/bin/clang-x86_64) :: test_hover_evaluate_expressions (TestVSCode_evaluate.TestVSCode_variables) runCmd: settings clear -all output:

Hide Details

runCmd: settings set symbols.enable-external-lookup false output:

Hide Details

runCmd: settings set target.inherit-tcc true output:

Hide Details

runCmd: settings set target.detach-on-error false output:

Hide Details

runCmd: settings set target.auto-apply-fixits false output:

Hide Details

runCmd: settings set plugin.process.gdb-remote.packet-timeout 60 output:

Hide Details

runCmd: settings set symbols.clang-modules-cache-path "/Users/buildslave/jenkins/workspace/lldb-cmake-sanitized/lldb-build/lldb-test-build.noindex/module-cache-lldb/lldb-api" output:

Hide Details

runCmd: settings set use-color false output:

Hide Details

runCmd: setting set target.prefer-dynamic-value no-dynamic-values output:

Hide Details

runCmd: settings set target.env-vars ASAN_OPTIONS=detect_stack_use_after_return=1 DYLD_INSERT_LIBRARIES=/Users/buildslave/jenkins/workspace/lldb-cmake-sanitized/host-compiler/lib/clang/13.0.99/lib/darwin/libclang_rt.asan_osx_dynamic.dylib output:

Hide Details

Adding tearDown hook: def cleanup(): if disconnectAutomatically: self.vscode.request_disconnect(terminateDebuggee=True) self.vscode.terminate()

Hide Details

Hide Details

FAIL: LLDB (/Users/buildslave/jenkins/workspace/lldb-cmake-sanitized/host-compiler/bin/clang-x86_64) :: test_repl_evaluate_expressions (TestVSCode_evaluate.TestVSCode_variables) Executing tearDown hook: def cleanup(): if disconnectAutomatically: self.vscode.request_disconnect(terminateDebuggee=True) self.vscode.terminate()

Hide Details

Hide Details

CLEANUP ERROR: LLDB (/Users/buildslave/jenkins/workspace/lldb-cmake-sanitized/host-compiler/bin/clang-x86_64) :: test_repl_evaluate_expressions (TestVSCode_evaluate.TestVSCode_variables) Traceback (most recent call last): File "/Users/buildslave/jenkins/workspace/lldb-cmake-sanitized/llvm-project/lldb/third_party/Python/module/unittest2/unittest2/case.py", line 386, in run self.tearDown() File "/Users/buildslave/jenkins/workspace/lldb-cmake-sanitized/llvm-project/lldb/packages/Python/lldbsuite/test/lldbtest.py", line 2095, in tearDown Base.tearDown(self) File "/Users/buildslave/jenkins/workspace/lldb-cmake-sanitized/llvm-project/lldb/packages/Python/lldbsuite/test/lldbtest.py", line 1065, in tearDown hook() # try the plain call and hope it works File "/Users/buildslave/jenkins/workspace/lldb-cmake-sanitized/llvm-project/lldb/packages/Python/lldbsuite/test/tools/lldb-vscode/lldbvscode_testcase.py", line 294, in cleanup self.vscode.request_disconnect(terminateDebuggee=True) File "/Users/buildslave/jenkins/workspace/lldb-cmake-sanitized/llvm-project/lldb/packages/Python/lldbsuite/test/tools/lldb-vscode/vscode.py", line 590, in request_disconnect return self.send_recv(command_dict) File "/Users/buildslave/jenkins/workspace/lldb-cmake-sanitized/llvm-project/lldb/packages/Python/lldbsuite/test/tools/lldb-vscode/vscode.py", line 315, in send_recv self.send_packet(command) File "/Users/buildslave/jenkins/workspace/lldb-cmake-sanitized/llvm-project/lldb/packages/Python/lldbsuite/test/tools/lldb-vscode/vscode.py", line 271, in send_packet self.send.flush() BrokenPipeError: [Errno 32] Broken pipe

Hide Details

runCmd: settings clear -all output:

Hide Details

runCmd: settings set symbols.enable-external-lookup false output:

Hide Details

runCmd: settings set target.inherit-tcc true output:

Hide Details

runCmd: settings set target.detach-on-error false output:

Hide Details

runCmd: settings set target.auto-apply-fixits false output:

Hide Details

runCmd: settings set plugin.process.gdb-remote.packet-timeout 60 output:

Hide Details

runCmd: settings set symbols.clang-modules-cache-path "/Users/buildslave/jenkins/workspace/lldb-cmake-sanitized/lldb-build/lldb-test-build.noindex/module-cache-lldb/lldb-api" output:

Hide Details

runCmd: settings set use-color false output:

Hide Details

runCmd: setting set target.prefer-dynamic-value no-dynamic-values output:

Hide Details

runCmd: settings set target.env-vars ASAN_OPTIONS=detect_stack_use_after_return=1 DYLD_INSERT_LIBRARIES=/Users/buildslave/jenkins/workspace/lldb-cmake-sanitized/host-compiler/lib/clang/13.0.99/lib/darwin/libclang_rt.asan_osx_dynamic.dylib output:

Hide Details

Adding tearDown hook: def cleanup(): if disconnectAutomatically: self.vscode.request_disconnect(terminateDebuggee=True) self.vscode.terminate()

Hide Details

Hide Details

FAIL: LLDB (/Users/buildslave/jenkins/workspace/lldb-cmake-sanitized/host-compiler/bin/clang-x86_64) :: test_watch_evaluate_expressions (TestVSCode_evaluate.TestVSCode_variables) Executing tearDown hook: def cleanup(): if disconnectAutomatically: self.vscode.request_disconnect(terminateDebuggee=True) self.vscode.terminate()

Hide Details

Hide Details

CLEANUP ERROR: LLDB (/Users/buildslave/jenkins/workspace/lldb-cmake-sanitized/host-compiler/bin/clang-x86_64) :: test_watch_evaluate_expressions (TestVSCode_evaluate.TestVSCode_variables) Traceback (most recent call last): File "/Users/buildslave/jenkins/workspace/lldb-cmake-sanitized/llvm-project/lldb/third_party/Python/module/unittest2/unittest2/case.py", line 386, in run self.tearDown() File "/Users/buildslave/jenkins/workspace/lldb-cmake-sanitized/llvm-project/lldb/packages/Python/lldbsuite/test/lldbtest.py", line 2095, in tearDown Base.tearDown(self) File "/Users/buildslave/jenkins/workspace/lldb-cmake-sanitized/llvm-project/lldb/packages/Python/lldbsuite/test/lldbtest.py", line 1065, in tearDown hook() # try the plain call and hope it works File "/Users/buildslave/jenkins/workspace/lldb-cmake-sanitized/llvm-project/lldb/packages/Python/lldbsuite/test/tools/lldb-vscode/lldbvscode_testcase.py", line 294, in cleanup self.vscode.request_disconnect(terminateDebuggee=True) File "/Users/buildslave/jenkins/workspace/lldb-cmake-sanitized/llvm-project/lldb/packages/Python/lldbsuite/test/tools/lldb-vscode/vscode.py", line 590, in request_disconnect return self.send_recv(command_dict) File "/Users/buildslave/jenkins/workspace/lldb-cmake-sanitized/llvm-project/lldb/packages/Python/lldbsuite/test/tools/lldb-vscode/vscode.py", line 315, in send_recv self.send_packet(command) File "/Users/buildslave/jenkins/workspace/lldb-cmake-sanitized/llvm-project/lldb/packages/Python/lldbsuite/test/tools/lldb-vscode/vscode.py", line 271, in send_packet self.send.flush() BrokenPipeError: [Errno 32] Broken pipe

Hide Details

Restore dir to: /Users/buildslave/jenkins/workspace/lldb-cmake-sanitized/lldb-build/tools/lldb/test ====================================================================== ERROR: test_generic_evaluate_expressions (TestVSCode_evaluate.TestVSCode_variables) ---------------------------------------------------------------------- Traceback (most recent call last): File "/Users/buildslave/jenkins/workspace/lldb-cmake-sanitized/llvm-project/lldb/test/API/tools/lldb-vscode/evaluate/TestVSCode_evaluate.py", line 157, in test_generic_evaluate_expressions self.run_test_evaluate_expressions() File "/Users/buildslave/jenkins/workspace/lldb-cmake-sanitized/llvm-project/lldb/test/API/tools/lldb-vscode/evaluate/TestVSCode_evaluate.py", line 62, in run_test_evaluate_expressions self.assertEvaluateFailure("int") # type name File "/Users/buildslave/jenkins/workspace/lldb-cmake-sanitized/llvm-project/lldb/test/API/tools/lldb-vscode/evaluate/TestVSCode_evaluate.py", line 24, in assertEvaluateFailure self.vscode.request_evaluate(expression, context=self.context)['body']) File "/Users/buildslave/jenkins/workspace/lldb-cmake-sanitized/llvm-project/lldb/packages/Python/lldbsuite/test/tools/lldb-vscode/vscode.py", line 607, in request_evaluate return self.send_recv(command_dict) File "/Users/buildslave/jenkins/workspace/lldb-cmake-sanitized/llvm-project/lldb/packages/Python/lldbsuite/test/tools/lldb-vscode/vscode.py", line 321, in send_recv raise ValueError(desc) ValueError: no response for "evaluate" Config=x86_64-/Users/buildslave/jenkins/workspace/lldb-cmake-sanitized/host-compiler/bin/clang ====================================================================== ERROR: test_repl_evaluate_expressions (TestVSCode_evaluate.TestVSCode_variables) ---------------------------------------------------------------------- Traceback (most recent call last): File "/Users/buildslave/jenkins/workspace/lldb-cmake-sanitized/llvm-project/lldb/test/API/tools/lldb-vscode/evaluate/TestVSCode_evaluate.py", line 163, in test_repl_evaluate_expressions self.run_test_evaluate_expressions("repl") File "/Users/buildslave/jenkins/workspace/lldb-cmake-sanitized/llvm-project/lldb/test/API/tools/lldb-vscode/evaluate/TestVSCode_evaluate.py", line 62, in run_test_evaluate_expressions self.assertEvaluateFailure("int") # type name File "/Users/buildslave/jenkins/workspace/lldb-cmake-sanitized/llvm-project/lldb/test/API/tools/lldb-vscode/evaluate/TestVSCode_evaluate.py", line 24, in assertEvaluateFailure self.vscode.request_evaluate(expression, context=self.context)['body']) File "/Users/buildslave/jenkins/workspace/lldb-cmake-sanitized/llvm-project/lldb/packages/Python/lldbsuite/test/tools/lldb-vscode/vscode.py", line 607, in request_evaluate return self.send_recv(command_dict) File "/Users/buildslave/jenkins/workspace/lldb-cmake-sanitized/llvm-project/lldb/packages/Python/lldbsuite/test/tools/lldb-vscode/vscode.py", line 321, in send_recv raise ValueError(desc) ValueError: no response for "evaluate" Config=x86_64-/Users/buildslave/jenkins/workspace/lldb-cmake-sanitized/host-compiler/bin/clang ====================================================================== ERROR: test_watch_evaluate_expressions (TestVSCode_evaluate.TestVSCode_variables) ---------------------------------------------------------------------- Traceback (most recent call last): File "/Users/buildslave/jenkins/workspace/lldb-cmake-sanitized/llvm-project/lldb/test/API/tools/lldb-vscode/evaluate/TestVSCode_evaluate.py", line 169, in test_watch_evaluate_expressions self.run_test_evaluate_expressions("watch") File "/Users/buildslave/jenkins/workspace/lldb-cmake-sanitized/llvm-project/lldb/test/API/tools/lldb-vscode/evaluate/TestVSCode_evaluate.py", line 62, in run_test_evaluate_expressions self.assertEvaluateFailure("int") # type name File "/Users/buildslave/jenkins/workspace/lldb-cmake-sanitized/llvm-project/lldb/test/API/tools/lldb-vscode/evaluate/TestVSCode_evaluate.py", line 24, in assertEvaluateFailure self.vscode.request_evaluate(expression, context=self.context)['body']) File "/Users/buildslave/jenkins/workspace/lldb-cmake-sanitized/llvm-project/lldb/packages/Python/lldbsuite/test/tools/lldb-vscode/vscode.py", line 607, in request_evaluate return self.send_recv(command_dict) File "/Users/buildslave/jenkins/workspace/lldb-cmake-sanitized/llvm-project/lldb/packages/Python/lldbsuite/test/tools/lldb-vscode/vscode.py", line 321, in send_recv raise ValueError(desc) ValueError: no response for "evaluate" Config=x86_64-/Users/buildslave/jenkins/workspace/lldb-cmake-sanitized/host-compiler/bin/clang ---------------------------------------------------------------------- Ran 4 tests in 15.995s

Hide Details

RESULT: FAILED (1 passes, 0 failures, 3 errors, 0 skipped, 0 expected failures, 0 unexpected successes)

Hide Details

--

Hide Details

******************** PASS: lldb-unit :: Expression/./ExpressionTests/CppModuleConfigurationTest.UnrelatedLibrary (1814 of 2354) PASS: lldb-unit :: Utility/./UtilityTests/FileSpecTest.EqualDotsWindows (1815 of 2354) PASS: lldb-api :: functionalities/gdb_remote_client/TestRecognizeBreakpoint.py (1816 of 2354) PASS: lldb-unit :: Process/minidump/./LLDBMinidumpTests/MinidumpParserTest.GetMemoryRegionInfoFromMemoryList (1817 of 2354) PASS: lldb-api :: functionalities/thread/concurrent_events/TestConcurrentSignalWatchBreak.py (1818 of 2354) PASS: lldb-unit :: Utility/./UtilityTests/CompletionRequest.Constructor (1819 of 2354) PASS: lldb-unit :: SymbolFile/NativePDB/./SymbolFileNativePDBTests/PDBFPOProgramToDWARFExpressionTests.UnresolvedRegisterReference (1820 of 2354) PASS: lldb-unit :: SymbolFile/DWARF/./SymbolFileDWARFTests/SymbolFileDWARFTests.ParseArangesIgnoreEmpty (1821 of 2354) PASS: lldb-unit :: Process/gdb-remote/./ProcessGdbRemoteTests/GDBRemoteCommunicationClientTest.ReadRegister (1822 of 2354) PASS: lldb-unit :: ObjectFile/Breakpad/./ObjectFileBreakpadTests/FuncRecord.parse (1823 of 2354) PASS: lldb-api :: python_api/value/empty_class/TestValueAPIEmptyClass.py (1824 of 2354) PASS: lldb-shell :: SymbolFile/NativePDB/load-pdb.cpp (1825 of 2354) PASS: lldb-unit :: ScriptInterpreter/Python/./ScriptInterpreterPythonTests/PythonDataObjectsTest.TestPythonListManipulation (1826 of 2354) PASS: lldb-api :: lang/cpp/global_variables/TestCPPGlobalVariables.py (1827 of 2354) PASS: lldb-unit :: Symbol/./SymbolTests/TestTypeSystemClang.TestGetTypeClassNested (1828 of 2354) PASS: lldb-api :: functionalities/gdb_remote_client/TestProcessConnect.py (1829 of 2354) UNSUPPORTED: lldb-api :: functionalities/darwin_log/source/debug/TestDarwinLogSourceDebug.py (1830 of 2354) PASS: lldb-unit :: Utility/./UtilityTests/StreamTest.PutRawBytesToBigEndian (1831 of 2354) PASS: lldb-api :: tools/lldb-server/TestGdbRemote_qThreadStopInfo.py (1832 of 2354) PASS: lldb-unit :: Expression/./ExpressionTests/DiagnosticManagerTest.AppendMessageSubsequentDiags (1833 of 2354) PASS: lldb-unit :: Utility/./UtilityTests/OptionsWithRawTest.SingleWhitespaceInput (1834 of 2354) PASS: lldb-unit :: Utility/./UtilityTests/RecordReplayTest.InstrumentedBar (1835 of 2354) PASS: lldb-unit :: Utility/./UtilityTests/RangeTest.SlideZero (1836 of 2354) PASS: lldb-shell :: Settings/TestDefaultModuleCachePath.test (1837 of 2354) PASS: lldb-unit :: Utility/./UtilityTests/DataExtractorTest.GetCStrEmpty (1838 of 2354) PASS: lldb-unit :: Utility/./UtilityTests/StringExtractorTest.GetHexU8_Underflow_NoEof (1839 of 2354) PASS: lldb-shell :: BuildScript/toolchain-clang.test (1840 of 2354) PASS: lldb-api :: macosx/find-app-in-bundle/TestFindAppInBundle.py (1841 of 2354) PASS: lldb-shell :: SymbolFile/DWARF/x86/inline-function-address-shared.test (1842 of 2354) UNSUPPORTED: lldb-shell :: SymbolFile/PDB/class-layout.test (1843 of 2354) PASS: lldb-api :: functionalities/value_md5_crash/TestValueMD5Crash.py (1844 of 2354) PASS: lldb-unit :: Utility/./UtilityTests/SerializationRountripTest.SerializeDeserializeCStringArrayNullptrElem (1845 of 2354) PASS: lldb-shell :: SymbolFile/DWARF/x86/DW_AT_declaration-with-children.s (1846 of 2354) PASS: lldb-api :: lang/cpp/non-type-template-param/TestCppNonTypeTemplateParam.py (1847 of 2354) PASS: lldb-api :: functionalities/tail_call_frames/ambiguous_tail_call_seq1/TestAmbiguousTailCallSeq1.py (1848 of 2354) PASS: lldb-api :: functionalities/data-formatter/data-formatter-stl/libcxx/string/TestDataFormatterLibcxxString.py (1849 of 2354) PASS: lldb-unit :: Process/minidump/./LLDBMinidumpTests/MinidumpParserTest.GetFilteredModuleList (1850 of 2354) PASS: lldb-api :: api/listeners/TestListener.py (1851 of 2354) PASS: lldb-unit :: Breakpoint/./LLDBBreakpointTests/BreakpointIDTest.StringIsBreakpointName (1852 of 2354) PASS: lldb-api :: commands/expression/persistent_variables/TestPersistentVariables.py (1853 of 2354) PASS: lldb-unit :: UnwindAssembly/x86/./UnwindAssemblyx86Tests/Testx86AssemblyInspectionEngine.TestSimplei386ugmented (1854 of 2354) PASS: lldb-api :: lang/cpp/frame-var-anon-unions/TestFrameVariableAnonymousUnions.py (1855 of 2354) PASS: lldb-api :: commands/target/stop-hook/enable/TestTargetStopHookEnable.py (1856 of 2354) PASS: lldb-unit :: Utility/./UtilityTests/Flags.AnySet (1857 of 2354) PASS: lldb-api :: functionalities/data-formatter/typedef_array/TestTypedefArray.py (1858 of 2354) PASS: lldb-api :: python_api/sbtype_typeclass/TestSBTypeTypeClass.py (1859 of 2354) PASS: lldb-api :: commands/frame/diagnose/complicated-expression/TestComplicatedExpression.py (1860 of 2354) PASS: lldb-api :: functionalities/backticks/TestBackticksWithoutATarget.py (1861 of 2354) PASS: lldb-unit :: Symbol/./SymbolTests/TestTypeSystemClang.TestDisplayName (1862 of 2354) PASS: lldb-api :: functionalities/thread/concurrent_events/TestConcurrentBreakpointsDelayedBreakpointOneWatchpoint.py (1863 of 2354) PASS: lldb-api :: lang/cpp/breakpoint_in_member_func_w_non_primitive_params/TestBreakpointInMemberFuncWNonPrimitiveParams.py (1864 of 2354) PASS: lldb-unit :: Utility/./UtilityTests/StringExtractorTest.DecodeHexU8_InvalidHex (1865 of 2354) PASS: lldb-shell :: Minidump/Windows/Sigsegv/sigsegv.test (1866 of 2354) PASS: lldb-api :: lang/objc/objc-struct-argument/TestObjCStructArgument.py (1867 of 2354) PASS: lldb-unit :: Utility/./UtilityTests/StreamTeeTest.CopyConstructor (1868 of 2354) PASS: lldb-unit :: Utility/./UtilityTests/ArgsTest.ReplaceArgumentAtIndexOutOfRange (1869 of 2354) PASS: lldb-api :: lang/c/local_variables/TestLocalVariables.py (1870 of 2354) UNSUPPORTED: lldb-shell :: Breakpoint/ppc64-localentry.test (1871 of 2354) PASS: lldb-api :: functionalities/breakpoint/address_breakpoints/TestAddressBreakpoints.py (1872 of 2354) UNSUPPORTED: lldb-api :: functionalities/darwin_log/basic/TestDarwinLogBasic.py (1873 of 2354) PASS: lldb-unit :: Language/Highlighting/./HighlighterTests/HighlighterTest.ClangComments (1874 of 2354) PASS: lldb-api :: lang/cpp/inlines/TestInlines.py (1875 of 2354) PASS: lldb-api :: lang/objc/unicode-string/TestUnicodeString.py (1876 of 2354) PASS: lldb-unit :: Utility/./UtilityTests/RangeTest.ContainsAddrInvalid (1877 of 2354) PASS: lldb-shell :: ObjectFile/MachO/lc_build_version.yaml (1878 of 2354) PASS: lldb-unit :: Process/gdb-remote/./ProcessGdbRemoteTests/GDBRemoteClientBaseTest.SendPacketAndReceiveResponseWithOutputSupport (1879 of 2354) PASS: lldb-unit :: SymbolFile/DWARF/./SymbolFileDWARFTests/DWARFUnitTest.NullUnitDie (1880 of 2354) PASS: lldb-api :: python_api/frame/inlines/TestInlinedFrame.py (1881 of 2354) PASS: lldb-unit :: UnwindAssembly/x86/./UnwindAssemblyx86Tests/Testx86AssemblyInspectionEngine.TestMovRSPtoRBP (1882 of 2354) PASS: lldb-unit :: Target/./TargetTests/ExecutionContextTest.GetByteOrder (1883 of 2354) PASS: lldb-unit :: Symbol/./SymbolTests/LineEntryTest.GetSameLineContiguousAddressRangeOneInline (1884 of 2354) PASS: lldb-shell :: ObjectFile/ELF/many-sections.s (1885 of 2354) PASS: lldb-api :: lang/c/unicode/TestUnicodeSymbols.py (1886 of 2354) PASS: lldb-api :: tools/lldb-vscode/console/TestVSCode_console.py (1887 of 2354) PASS: lldb-unit :: Utility/./UtilityTests/StringExtractorTest.GetU32BigEndian (1888 of 2354) PASS: lldb-api :: functionalities/data-formatter/data-formatter-script/TestDataFormatterScript.py (1889 of 2354) PASS: lldb-unit :: Process/gdb-remote/./ProcessGdbRemoteTests/GDBRemoteCommunicationClientTest.SendTraceSupportedPacket (1890 of 2354) PASS: lldb-unit :: Host/./HostTests/FileSystemTest.MakeAbsolute (1891 of 2354) PASS: lldb-unit :: Utility/./UtilityTests/ScalarTest.LongLongAssigmentOperator (1892 of 2354) PASS: lldb-unit :: Process/Utility/./ProcessUtilityTests/ProcMapTests/LinuxProcMapsTestFixture.ParseMapRegions/7 (1893 of 2354) PASS: lldb-api :: functionalities/data-formatter/type_summary_list_script/TestTypeSummaryListScript.py (1894 of 2354) PASS: lldb-api :: functionalities/data-formatter/data-formatter-cpp/TestDataFormatterCpp.py (1895 of 2354) PASS: lldb-api :: python_api/function_symbol/TestSymbolAPI.py (1896 of 2354) PASS: lldb-unit :: Symbol/./SymbolTests/TestClangASTImporter.DeportDeclTagDecl (1897 of 2354) PASS: lldb-api :: commands/expression/class_template_specialization_empty_pack/TestClassTemplateSpecializationParametersHandling.py (1898 of 2354) PASS: lldb-unit :: Utility/./UtilityTests/NameMatchesTest.Contains (1899 of 2354) PASS: lldb-unit :: Process/Utility/./ProcessUtilityTests/ProcSMapTests/LinuxProcSMapsTestFixture.ParseSMapRegions/3 (1900 of 2354) UNSUPPORTED: lldb-shell :: ScriptInterpreter/Lua/lua-python.test (1901 of 2354) PASS: lldb-unit :: Process/minidump/./LLDBMinidumpTests/MinidumpParserTest.GetPid (1902 of 2354) PASS: lldb-shell :: SymbolFile/DWARF/deterministic-build.cpp (1903 of 2354) PASS: lldb-api :: commands/watchpoints/hello_watchpoint/TestMyFirstWatchpoint.py (1904 of 2354) PASS: lldb-api :: commands/target/stop-hooks/TestStopHooks.py (1905 of 2354) PASS: lldb-api :: commands/disassemble/basic/TestFrameDisassemble.py (1906 of 2354) PASS: lldb-api :: functionalities/data-formatter/data-formatter-objc/TestDataFormatterObjCNSError.py (1907 of 2354) PASS: lldb-unit :: Host/./HostTests/SocketTests/SocketTest.TCPGetAddress/ipv4 (1908 of 2354) PASS: lldb-unit :: Utility/./UtilityTests/VMRange.Clear (1909 of 2354) UNSUPPORTED: lldb-api :: commands/register/register/intel_xtended_registers/mpx_offset_intersection/TestMPXOffsetIntersection.py (1910 of 2354) PASS: lldb-shell :: ObjectFile/ELF/section-addresses.yaml (1911 of 2354) PASS: lldb-unit :: Core/./LLDBCoreTests/MangledTest.ResultForValidRustV0Name (1912 of 2354) PASS: lldb-api :: functionalities/thread/concurrent_events/TestConcurrentWatchBreakDelay.py (1913 of 2354) PASS: lldb-api :: functionalities/data-formatter/ptr_ref_typedef/TestPtrRef2Typedef.py (1914 of 2354) PASS: lldb-unit :: Utility/./UtilityTests/UriParserTest.BracketedHostname (1915 of 2354) PASS: lldb-unit :: Host/./HostTests/SocketTests/SocketTest.UDPGetConnectURI/ipv6 (1916 of 2354) PASS: lldb-unit :: Utility/./UtilityTests/RangeTest.ContainsRange (1917 of 2354) PASS: lldb-unit :: Utility/./UtilityTests/StreamTest.AddressEmptyPrefix (1918 of 2354) PASS: lldb-unit :: Editline/./EditlineTests/EditlineTestFixture.EditlineReceivesMultiLineText (1919 of 2354) PASS: lldb-unit :: Utility/./UtilityTests/FileSpecTest.Yaml (1920 of 2354) PASS: lldb-unit :: Language/Highlighting/./HighlighterTests/HighlighterTest.ClangCursorPos (1921 of 2354) PASS: lldb-shell :: SymbolFile/DWARF/x86/find-function-regex.cpp (1922 of 2354) PASS: lldb-api :: lang/objc/objc-checker/TestObjCCheckers.py (1923 of 2354) PASS: lldb-shell :: SymbolFile/DWARF/x86/static_scope.s (1924 of 2354) PASS: lldb-api :: functionalities/data-formatter/data-formatter-objc/nsstring/TestDataFormatterNSString.py (1925 of 2354) PASS: lldb-unit :: Utility/./UtilityTests/LogChannelEnabledTest.LogGetLogThread (1926 of 2354) PASS: lldb-unit :: Expression/./ExpressionTests/CppModuleConfigurationTest.AmbiguousLibCpp (1927 of 2354) PASS: lldb-shell :: SymbolFile/NativePDB/tag-types.cpp (1928 of 2354) UNSUPPORTED: lldb-api :: linux/thread/create_during_instruction_step/TestCreateDuringInstructionStep.py (1929 of 2354) UNSUPPORTED: lldb-api :: commands/watchpoints/variable_out_of_scope/TestWatchedVarHitWhenInScope.py (1930 of 2354) PASS: lldb-unit :: UnwindAssembly/x86/./UnwindAssemblyx86Tests/Testx86AssemblyInspectionEngine.Test32bitFramelessBigStackFrame (1931 of 2354) PASS: lldb-api :: tools/lldb-vscode/launch/TestVSCode_launch.py (1932 of 2354) UNSUPPORTED: lldb-api :: commands/gui/basic/TestGuiBasic.py (1933 of 2354) PASS: lldb-unit :: UnwindAssembly/x86/./UnwindAssemblyx86Tests/Testx86AssemblyInspectionEngine.TestPopESI (1934 of 2354) PASS: lldb-shell :: Commands/command-stop-hook-output.test (1935 of 2354) PASS: lldb-api :: lang/objc/real-definition/TestRealDefinition.py (1936 of 2354) PASS: lldb-api :: lang/objc/single-entry-dictionary/TestObjCSingleEntryDictionary.py (1937 of 2354) PASS: lldb-api :: commands/frame/var-scope/TestFrameVariableScope.py (1938 of 2354) PASS: lldb-unit :: Utility/./UtilityTests/BinaryStreamTest.PutULEB128NineBytes (1939 of 2354) PASS: lldb-api :: commands/expression/top-level/TestTopLevelExprs.py (1940 of 2354) PASS: lldb-api :: lang/cpp/alignas_base_class/TestAlignAsBaseClass.py (1941 of 2354) PASS: lldb-unit :: debugserver/./debugserverTests/RNBSocket.LoopBackListenIPv4 (1942 of 2354) PASS: lldb-api :: functionalities/tail_call_frames/inlining_and_tail_calls/TestInliningAndTailCalls.py (1943 of 2354) PASS: lldb-unit :: Utility/./UtilityTests/StringExtractorTest.DecodeHexU8_InvalidHex2 (1944 of 2354) PASS: lldb-unit :: Utility/./UtilityTests/FileSpecTest.IsRelative (1945 of 2354) PASS: lldb-api :: commands/watchpoints/watchpoint_on_vectors/TestValueOfVectorVariable.py (1946 of 2354) PASS: lldb-unit :: Utility/./UtilityTests/BinaryStreamTest.PutSLEB128TwoBytes (1947 of 2354) UNSUPPORTED: lldb-api :: commands/register/register/aarch64_sve_registers/rw_access_dynamic_resize/TestSVEThreadedDynamic.py (1948 of 2354) PASS: lldb-unit :: Utility/./UtilityTests/SubsystemRAIITest.SubsystemWithErrorFailure (1949 of 2354) UNSUPPORTED: lldb-api :: functionalities/darwin_log/filter/regex/activity-chain/TestDarwinLogFilterRegexActivityChain.py (1950 of 2354) PASS: lldb-shell :: Settings/TestLineMarkerColor.test (1951 of 2354) PASS: lldb-shell :: ObjectFile/ELF/basic-info.yaml (1952 of 2354) UNSUPPORTED: lldb-api :: benchmarks/frame_variable/TestFrameVariableResponse.py (1953 of 2354) PASS: lldb-shell :: Breakpoint/split-dwarf5-debug-stroffsets.test (1954 of 2354) PASS: lldb-unit :: Target/./TargetTests/MCBasedABI.MapRegisterName (1955 of 2354) PASS: lldb-shell :: Register/x86-64-read.test (1956 of 2354) PASS: lldb-unit :: Utility/./UtilityTests/PassiveReplayTest.InstrumentedFoo (1957 of 2354) PASS: lldb-api :: functionalities/breakpoint/dummy_target_breakpoints/TestBreakpointsWithNoTargets.py (1958 of 2354) PASS: lldb-api :: commands/expression/import-std-module/no-std-module/TestMissingStdModule.py (1959 of 2354) PASS: lldb-unit :: ScriptInterpreter/Python/./ScriptInterpreterPythonTests/PythonDataObjectsTest.TestExceptions (1960 of 2354) PASS: lldb-api :: functionalities/postmortem/wow64_minidump/TestWow64MiniDump.py (1961 of 2354) PASS: lldb-unit :: Core/./LLDBCoreTests/RichManglingContextTest.IPDRealloc (1962 of 2354) PASS: lldb-unit :: Utility/./UtilityTests/StreamTest.AddressNoSuffix (1963 of 2354) PASS: lldb-api :: linux/builtin_trap/TestBuiltinTrap.py (1964 of 2354) PASS: lldb-unit :: Expression/./ExpressionTests/CppModuleConfigurationTest.Xcode (1965 of 2354) PASS: lldb-unit :: Utility/./UtilityTests/BinaryStreamTest.PutSLEB128SixBytes (1966 of 2354) PASS: lldb-unit :: Utility/./UtilityTests/BinaryStreamTest.PutSLEB128MaxValue (1967 of 2354) PASS: lldb-unit :: Utility/./UtilityTests/StringExtractorTest.GetHexU8_Exact_NoEof (1968 of 2354) PASS: lldb-api :: functionalities/tail_call_frames/cross_object/TestCrossObjectTailCalls.py (1969 of 2354) UNSUPPORTED: lldb-shell :: SymbolFile/PDB/variables-locations.test (1970 of 2354) PASS: lldb-unit :: Interpreter/./InterpreterTests/OptionArgParserTest.toChar (1971 of 2354) PASS: lldb-api :: commands/apropos/basic/TestApropos.py (1972 of 2354) PASS: lldb-unit :: Utility/./UtilityTests/LogChannelEnabledTest.LLDB_LOG_ERROR (1973 of 2354) PASS: lldb-api :: commands/command/delete/TestCommandDelete.py (1974 of 2354) PASS: lldb-unit :: Utility/./UtilityTests/StringListTest.AppendListCStringArrayEmpty (1975 of 2354) PASS: lldb-api :: lang/c/complex_int/TestComplexInt.py (1976 of 2354) PASS: lldb-shell :: ScriptInterpreter/Python/Crashlog/parser_text.test (1977 of 2354) PASS: lldb-api :: python_api/target/TestTargetAPI.py (1978 of 2354) PASS: lldb-shell :: ScriptInterpreter/Python/eof.test (1979 of 2354) PASS: lldb-api :: lang/cpp/nsimport/TestCppNsImport.py (1980 of 2354) PASS: lldb-unit :: UnwindAssembly/x86/./UnwindAssemblyx86Tests/Testx86AssemblyInspectionEngine.TestStackRealign32BitDisp_x86_64 (1981 of 2354) PASS: lldb-unit :: Core/./LLDBCoreTests/MangledTest.ResultForValidName (1982 of 2354) PASS: lldb-unit :: Host/./HostTests/FileSystemTest.EmptyTest (1983 of 2354) PASS: lldb-api :: tools/lldb-server/TestGdbRemoteAttach.py (1984 of 2354) PASS: lldb-api :: lang/cpp/class_static/TestStaticVariables.py (1985 of 2354) UNSUPPORTED: lldb-api :: iohandler/completion/TestIOHandlerCompletion.py (1986 of 2354) PASS: lldb-unit :: Process/gdb-remote/./ProcessGdbRemoteTests/PortMapTest.Constructors (1987 of 2354) PASS: lldb-unit :: Symbol/./SymbolTests/TestScratchTypeSystemClang.InferSubASTFromLangOpts (1988 of 2354) PASS: lldb-unit :: Language/Highlighting/./HighlighterTests/HighlighterTest.HighlighterSelectionPath (1989 of 2354) UNSUPPORTED: lldb-api :: functionalities/thread/break_after_join/TestBreakAfterJoin.py (1990 of 2354) PASS: lldb-shell :: SymbolFile/DWARF/x86/module-ownership.mm (1991 of 2354) PASS: lldb-shell :: ObjectFile/ELF/compressed-sections.yaml (1992 of 2354) PASS: lldb-unit :: Utility/./UtilityTests/StringLexerTest.GetUnlexed (1993 of 2354) PASS: lldb-api :: commands/expression/import-std-module/stack/TestStackFromStdModule.py (1994 of 2354) PASS: lldb-shell :: SymbolFile/DWARF/x86/DW_OP_piece-struct.s (1995 of 2354) PASS: lldb-unit :: Platform/./LLDBPlatformTests/PlatformAppleSimulatorTest.TestSimHasSimEnvionament (1996 of 2354) PASS: lldb-api :: functionalities/pointer_num_children/TestPointerNumChildren.py (1997 of 2354) PASS: lldb-unit :: Utility/./UtilityTests/UriParserTest.Empty (1998 of 2354) PASS: lldb-unit :: Utility/./UtilityTests/UUIDTest.Validity (1999 of 2354) PASS: lldb-api :: functionalities/reproducers/attach/TestReproducerAttach.py (2000 of 2354) PASS: lldb-unit :: Utility/./UtilityTests/ArgsTest.StringListConstructor (2001 of 2354) PASS: lldb-unit :: Utility/./UtilityTests/StringListTest.CopyListSingle (2002 of 2354) PASS: lldb-api :: functionalities/thread/concurrent_events/TestConcurrentCrashWithWatchpoint.py (2003 of 2354) PASS: lldb-api :: functionalities/data-formatter/data-formatter-stl/libcxx/list/loop/TestDataFormatterLibcxxListLoop.py (2004 of 2354) UNSUPPORTED: lldb-api :: tools/lldb-vscode/disconnect/TestVSCode_disconnect.py (2005 of 2354) PASS: lldb-api :: commands/expression/options/TestExprOptions.py (2006 of 2354) PASS: lldb-unit :: Process/gdb-remote/./ProcessGdbRemoteTests/PortMapTest.FreePort (2007 of 2354) PASS: lldb-unit :: Host/./HostTests/SocketAddressTest.Set (2008 of 2354) PASS: lldb-unit :: Process/gdb-remote/./ProcessGdbRemoteTests/GDBRemoteCommunicationServerTest.SendErrorResponse_StringError (2009 of 2354) PASS: lldb-unit :: Symbol/./SymbolTests/LineEntryTest.GetSameLineContiguousAddressRangeNoInlines (2010 of 2354) PASS: lldb-unit :: Host/./HostTests/MainLoopTest.DetectsEOF (2011 of 2354) PASS: lldb-api :: functionalities/fat_archives/TestFatArchives.py (2012 of 2354) UNSUPPORTED: lldb-shell :: Register/x86-gp-read.test (2013 of 2354) PASS: lldb-api :: functionalities/data-formatter/data-formatter-stl/libcxx/function/TestLibCxxFunction.py (2014 of 2354) PASS: lldb-shell :: ObjectFile/PDB/object.test (2015 of 2354) PASS: lldb-unit :: Utility/./UtilityTests/StreamTest.ChangingByteOrder (2016 of 2354) PASS: lldb-unit :: Utility/./UtilityTests/ArgsTest.TestTrailingBackslash (2017 of 2354) PASS: lldb-api :: functionalities/breakpoint/serialize/TestBreakpointSerialization.py (2018 of 2354) UNSUPPORTED: lldb-shell :: SymbolFile/Breakpad/stack-cfi-arm.yaml (2019 of 2354) PASS: lldb-api :: sample_test/TestSampleInlineTest.py (2020 of 2354) PASS: lldb-shell :: Quit/TestQuitExitCodeHexA.test (2021 of 2354) PASS: lldb-unit :: ObjectFile/PECOFF/./ObjectFilePECOFFTests/PECallFrameInfoTest.Frame_reg_eh (2022 of 2354) FAIL: lldb-api :: tools/lldb-vscode/breakpoint/TestVSCode_setFunctionBreakpoints.py (2023 of 2354) ******************** TEST 'lldb-api :: tools/lldb-vscode/breakpoint/TestVSCode_setFunctionBreakpoints.py' FAILED ******************** Script: -- /Users/buildslave/jenkins/workspace/lldb-cmake-sanitized/lldb-build/lldb-test-build.noindex/copied-python /Users/buildslave/jenkins/workspace/lldb-cmake-sanitized/llvm-project/lldb/test/API/dotest.py -u CXXFLAGS -u CFLAGS --codesign-identity lldb_codesign --arch x86_64 --build-dir /Users/buildslave/jenkins/workspace/lldb-cmake-sanitized/lldb-build/lldb-test-build.noindex -t --env TERM=vt100 --env LLVM_LIBS_DIR=/Users/buildslave/jenkins/workspace/lldb-cmake-sanitized/lldb-build/./lib --inferior-env ASAN_OPTIONS=detect_stack_use_after_return=1 --inferior-env DYLD_INSERT_LIBRARIES=/Users/buildslave/jenkins/workspace/lldb-cmake-sanitized/host-compiler/lib/clang/13.0.99/lib/darwin/libclang_rt.asan_osx_dynamic.dylib --arch x86_64 --build-dir /Users/buildslave/jenkins/workspace/lldb-cmake-sanitized/lldb-build/lldb-test-build.noindex --lldb-module-cache-dir /Users/buildslave/jenkins/workspace/lldb-cmake-sanitized/lldb-build/lldb-test-build.noindex/module-cache-lldb/lldb-api --clang-module-cache-dir /Users/buildslave/jenkins/workspace/lldb-cmake-sanitized/lldb-build/lldb-test-build.noindex/module-cache-clang/lldb-api --executable /Users/buildslave/jenkins/workspace/lldb-cmake-sanitized/lldb-build/./bin/lldb --compiler /Users/buildslave/jenkins/workspace/lldb-cmake-sanitized/host-compiler/bin/clang --dsymutil /Users/buildslave/jenkins/workspace/lldb-cmake-sanitized/lldb-build/./bin/dsymutil --llvm-tools-dir /Users/buildslave/jenkins/workspace/lldb-cmake-sanitized/lldb-build/./bin --lldb-libs-dir /Users/buildslave/jenkins/workspace/lldb-cmake-sanitized/lldb-build/./lib /Users/buildslave/jenkins/workspace/lldb-cmake-sanitized/llvm-project/lldb/test/API/tools/lldb-vscode/breakpoint -p TestVSCode_setFunctionBreakpoints.py -- Exit Code: 1

Hide Details

Command Output (stdout): -- lldb version 13.0.99 (http://labmaster3.local/git/llvm-project.git revision d8678246fcd9fe3a33646afab4251706e2506c51) clang revision d8678246fcd9fe3a33646afab4251706e2506c51 llvm revision d8678246fcd9fe3a33646afab4251706e2506c51 Skipping the following test categories: ['darwin-log', 'libstdcxx', 'dwo', 'llgs', 'fork'] ========= DEBUG ADAPTER PROTOCOL LOGS ========= --> Content-Length: 284

Hide Details

{"command":"initialize","type":"request","arguments":{"adapterID":"lldb-native","clientID":"vscode","columnsStartAt1":true,"linesStartAt1":true,"locale":"en-us","pathFormat":"path","supportsRunInTerminalRequest":true,"supportsVariablePaging":true,"supportsVariableType":true},"seq":1} <-- Content-Length: 1222

Hide Details

{"body":{"exceptionBreakpointFilters":[{"default":false,"filter":"cpp_catch","label":"C++ Catch"},{"default":false,"filter":"cpp_throw","label":"C++ Throw"},{"default":false,"filter":"objc_catch","label":"Objective C Catch"},{"default":false,"filter":"objc_throw","label":"Objective C Throw"},{"default":false,"filter":"swift_catch","label":"Swift Catch"},{"default":false,"filter":"swift_throw","label":"Swift Throw"}],"supportTerminateDebuggee":true,"supportsCompletionsRequest":false,"supportsConditionalBreakpoints":true,"supportsConfigurationDoneRequest":true,"supportsDelayedStackTraceLoading":true,"supportsEvaluateForHovers":true,"supportsExceptionInfoRequest":true,"supportsExceptionOptions":true,"supportsFunctionBreakpoints":true,"supportsGotoTargetsRequest":false,"supportsHitConditionalBreakpoints":true,"supportsLoadedSourcesRequest":false,"supportsModulesRequest":false,"supportsProgressReporting":true,"supportsRestartFrame":false,"supportsRestartRequest":false,"supportsRunInTerminalRequest":true,"supportsSetVariable":true,"supportsStepBack":false,"supportsStepInTargetsRequest":false,"supportsValueFormattingOptions":true},"command":"initialize","request_seq":1,"seq":0,"success":true,"type":"response"} --> Content-Length: 1044

Hide Details

{"command":"launch","type":"request","arguments":{"program":"/Users/buildslave/jenkins/workspace/lldb-cmake-sanitized/lldb-build/lldb-test-build.noindex/tools/lldb-vscode/breakpoint/TestVSCode_setFunctionBreakpoints.test_functionality/a.out","disableASLR":true,"initCommands":["settings clear -all","settings set symbols.enable-external-lookup false","settings set target.inherit-tcc true","settings set target.detach-on-error false","settings set target.auto-apply-fixits false","settings set plugin.process.gdb-remote.packet-timeout 60","settings set symbols.clang-modules-cache-path \"/Users/buildslave/jenkins/workspace/lldb-cmake-sanitized/lldb-build/lldb-test-build.noindex/module-cache-lldb/lldb-api\"","settings set use-color false","setting set target.prefer-dynamic-value no-dynamic-values","settings set target.env-vars ASAN_OPTIONS=detect_stack_use_after_return=1 DYLD_INSERT_LIBRARIES=/Users/buildslave/jenkins/workspace/lldb-cmake-sanitized/host-compiler/lib/clang/13.0.99/lib/darwin/libclang_rt.asan_osx_dynamic.dylib"]},"seq":2} <-- Content-Length: 923

Hide Details

{"body":{"category":"console","output":"Running initCommands:\n(lldb) settings clear -all\n(lldb) settings set symbols.enable-external-lookup false\n(lldb) settings set target.inherit-tcc true\n(lldb) settings set target.detach-on-error false\n(lldb) settings set target.auto-apply-fixits false\n(lldb) settings set plugin.process.gdb-remote.packet-timeout 60\n(lldb) settings set symbols.clang-modules-cache-path \"/Users/buildslave/jenkins/workspace/lldb-cmake-sanitized/lldb-build/lldb-test-build.noindex/module-cache-lldb/lldb-api\"\n(lldb) settings set use-color false\n(lldb) setting set target.prefer-dynamic-value no-dynamic-values\n(lldb) settings set target.env-vars ASAN_OPTIONS=detect_stack_use_after_return=1 DYLD_INSERT_LIBRARIES=/Users/buildslave/jenkins/workspace/lldb-cmake-sanitized/host-compiler/lib/clang/13.0.99/lib/darwin/libclang_rt.asan_osx_dynamic.dylib\n"},"event":"output","seq":0,"type":"event"} <-- Content-Length: 77

Hide Details

{"command":"launch","request_seq":2,"seq":0,"success":true,"type":"response"} <-- Content-Length: 309

Hide Details

{"body":{"isLocalProcess":true,"name":"/Users/buildslave/jenkins/workspace/lldb-cmake-sanitized/lldb-build/lldb-test-build.noindex/tools/lldb-vscode/breakpoint/TestVSCode_setFunctionBreakpoints.test_functionality/a.out","startMethod":"launch","systemProcessId":21559},"event":"process","seq":0,"type":"event"} <-- Content-Length: 46

Hide Details

{"event":"initialized","seq":0,"type":"event"} --> Content-Length: 109

Hide Details

{"command":"setFunctionBreakpoints","type":"request","arguments":{"breakpoints":[{"name":"twelve"}]},"seq":3} <-- Content-Length: 383

Hide Details

{"body":{"breakpoints":[{"id":1,"line":6,"source":{"name":"main-copy.cpp","path":"/Users/buildslave/jenkins/workspace/lldb-cmake-sanitized/lldb-build/lldb-test-build.noindex/tools/lldb-vscode/breakpoint/TestVSCode_setFunctionBreakpoints.test_functionality/main-copy.cpp"},"verified":true}]},"command":"setFunctionBreakpoints","request_seq":3,"seq":0,"success":true,"type":"response"} --> Content-Length: 71

Hide Details

{"command":"configurationDone","type":"request","arguments":{},"seq":4} <-- Content-Length: 88

Hide Details

{"command":"configurationDone","request_seq":4,"seq":0,"success":true,"type":"response"} <-- Content-Length: 199

Hide Details

{"body":{"allThreadsStopped":true,"description":"breakpoint 1.1","preserveFocusHint":false,"reason":"breakpoint","threadCausedFocus":true,"threadId":1690492},"event":"stopped","seq":0,"type":"event"} --> Content-Length: 61

Hide Details

{"command":"threads","type":"request","arguments":{},"seq":5} <-- Content-Length: 133

Hide Details

{"body":{"threads":[{"id":1690492,"name":"Thread #1"}]},"command":"threads","request_seq":5,"seq":0,"success":true,"type":"response"} --> Content-Length: 108

Hide Details

{"command":"stackTrace","type":"request","arguments":{"threadId":1690492,"startFrame":0,"levels":1},"seq":6} <-- Content-Length: 409

Hide Details

{"body":{"stackFrames":[{"column":15,"id":524288,"line":6,"name":"twelve(int)","source":{"name":"main-copy.cpp","path":"/Users/buildslave/jenkins/workspace/lldb-cmake-sanitized/lldb-build/lldb-test-build.noindex/tools/lldb-vscode/breakpoint/TestVSCode_setFunctionBreakpoints.test_functionality/main-copy.cpp"}}],"totalFrames":4},"command":"stackTrace","request_seq":6,"seq":0,"success":true,"type":"response"} --> Content-Length: 76

Hide Details

{"command":"scopes","type":"request","arguments":{"frameId":524288},"seq":7} <-- Content-Length: 335

Hide Details

{"body":{"scopes":[{"expensive":false,"name":"Locals","namedVariables":1,"variablesReference":1},{"expensive":false,"name":"Globals","namedVariables":0,"variablesReference":2},{"expensive":false,"name":"Registers","namedVariables":3,"variablesReference":3}]},"command":"scopes","request_seq":7,"seq":0,"success":true,"type":"response"} --> Content-Length: 85

Hide Details

{"command":"variables","type":"request","arguments":{"variablesReference":1},"seq":8} <-- Content-Length: 190

Hide Details

{"body":{"variables":[{"evaluateName":"i","id":0,"name":"i","type":"int","value":"0","variablesReference":0}]},"command":"variables","request_seq":8,"seq":0,"success":true,"type":"response"} --> Content-Length: 128

Hide Details

{"command":"setFunctionBreakpoints","type":"request","arguments":{"breakpoints":[{"name":"twelve","condition":"i==4"}]},"seq":9} <-- Content-Length: 383

Hide Details

{"body":{"breakpoints":[{"id":1,"line":6,"source":{"name":"main-copy.cpp","path":"/Users/buildslave/jenkins/workspace/lldb-cmake-sanitized/lldb-build/lldb-test-build.noindex/tools/lldb-vscode/breakpoint/TestVSCode_setFunctionBreakpoints.test_functionality/main-copy.cpp"},"verified":true}]},"command":"setFunctionBreakpoints","request_seq":9,"seq":0,"success":true,"type":"response"} --> Content-Length: 81

Hide Details

{"command":"continue","type":"request","arguments":{"threadId":1690492},"seq":10} <-- Content-Length: 116

Hide Details

{"body":{"allThreadsContinued":true},"command":"continue","request_seq":10,"seq":0,"success":true,"type":"response"} <-- Content-Length: 311

Hide Details

{"body":{"category":"console","output":"/Users/buildslave/jenkins/workspace/lldb-cmake-sanitized/llvm-project/lldb/tools/lldb-vscode/ProgressEvent.cpp:89:64: runtime error: load of value 829960214, which is not a valid value for type 'lldb_vscode::ProgressEventType'\n"},"event":"output","seq":0,"type":"event"} <-- Content-Length: 261

Hide Details

{"body":{"category":"console","output":"SUMMARY: UndefinedBehaviorSanitizer: undefined-behavior /Users/buildslave/jenkins/workspace/lldb-cmake-sanitized/llvm-project/lldb/tools/lldb-vscode/ProgressEvent.cpp:89:64 in \n"},"event":"output","seq":0,"type":"event"} <-- Content-Length: 170

Hide Details

{"body":{"category":"console","output":"PLEASE submit a bug report to https://bugs.llvm.org/ and include the crash backtrace.\n"},"event":"output","seq":0,"type":"event"}

Hide Details

========= END ========= ========= DEBUG ADAPTER PROTOCOL LOGS ========= --> Content-Length: 284

Hide Details

{"command":"initialize","type":"request","arguments":{"adapterID":"lldb-native","clientID":"vscode","columnsStartAt1":true,"linesStartAt1":true,"locale":"en-us","pathFormat":"path","supportsRunInTerminalRequest":true,"supportsVariablePaging":true,"supportsVariableType":true},"seq":1} <-- Content-Length: 1222

Hide Details

{"body":{"exceptionBreakpointFilters":[{"default":false,"filter":"cpp_catch","label":"C++ Catch"},{"default":false,"filter":"cpp_throw","label":"C++ Throw"},{"default":false,"filter":"objc_catch","label":"Objective C Catch"},{"default":false,"filter":"objc_throw","label":"Objective C Throw"},{"default":false,"filter":"swift_catch","label":"Swift Catch"},{"default":false,"filter":"swift_throw","label":"Swift Throw"}],"supportTerminateDebuggee":true,"supportsCompletionsRequest":false,"supportsConditionalBreakpoints":true,"supportsConfigurationDoneRequest":true,"supportsDelayedStackTraceLoading":true,"supportsEvaluateForHovers":true,"supportsExceptionInfoRequest":true,"supportsExceptionOptions":true,"supportsFunctionBreakpoints":true,"supportsGotoTargetsRequest":false,"supportsHitConditionalBreakpoints":true,"supportsLoadedSourcesRequest":false,"supportsModulesRequest":false,"supportsProgressReporting":true,"supportsRestartFrame":false,"supportsRestartRequest":false,"supportsRunInTerminalRequest":true,"supportsSetVariable":true,"supportsStepBack":false,"supportsStepInTargetsRequest":false,"supportsValueFormattingOptions":true},"command":"initialize","request_seq":1,"seq":0,"success":true,"type":"response"} --> Content-Length: 1044

Hide Details

{"command":"launch","type":"request","arguments":{"program":"/Users/buildslave/jenkins/workspace/lldb-cmake-sanitized/lldb-build/lldb-test-build.noindex/tools/lldb-vscode/breakpoint/TestVSCode_setFunctionBreakpoints.test_set_and_clear/a.out","disableASLR":true,"initCommands":["settings clear -all","settings set symbols.enable-external-lookup false","settings set target.inherit-tcc true","settings set target.detach-on-error false","settings set target.auto-apply-fixits false","settings set plugin.process.gdb-remote.packet-timeout 60","settings set symbols.clang-modules-cache-path \"/Users/buildslave/jenkins/workspace/lldb-cmake-sanitized/lldb-build/lldb-test-build.noindex/module-cache-lldb/lldb-api\"","settings set use-color false","setting set target.prefer-dynamic-value no-dynamic-values","settings set target.env-vars ASAN_OPTIONS=detect_stack_use_after_return=1 DYLD_INSERT_LIBRARIES=/Users/buildslave/jenkins/workspace/lldb-cmake-sanitized/host-compiler/lib/clang/13.0.99/lib/darwin/libclang_rt.asan_osx_dynamic.dylib"]},"seq":2} <-- Content-Length: 923

Hide Details

{"body":{"category":"console","output":"Running initCommands:\n(lldb) settings clear -all\n(lldb) settings set symbols.enable-external-lookup false\n(lldb) settings set target.inherit-tcc true\n(lldb) settings set target.detach-on-error false\n(lldb) settings set target.auto-apply-fixits false\n(lldb) settings set plugin.process.gdb-remote.packet-timeout 60\n(lldb) settings set symbols.clang-modules-cache-path \"/Users/buildslave/jenkins/workspace/lldb-cmake-sanitized/lldb-build/lldb-test-build.noindex/module-cache-lldb/lldb-api\"\n(lldb) settings set use-color false\n(lldb) setting set target.prefer-dynamic-value no-dynamic-values\n(lldb) settings set target.env-vars ASAN_OPTIONS=detect_stack_use_after_return=1 DYLD_INSERT_LIBRARIES=/Users/buildslave/jenkins/workspace/lldb-cmake-sanitized/host-compiler/lib/clang/13.0.99/lib/darwin/libclang_rt.asan_osx_dynamic.dylib\n"},"event":"output","seq":0,"type":"event"} <-- Content-Length: 77

Hide Details

{"command":"launch","request_seq":2,"seq":0,"success":true,"type":"response"} <-- Content-Length: 309

Hide Details

{"body":{"isLocalProcess":true,"name":"/Users/buildslave/jenkins/workspace/lldb-cmake-sanitized/lldb-build/lldb-test-build.noindex/tools/lldb-vscode/breakpoint/TestVSCode_setFunctionBreakpoints.test_set_and_clear/a.out","startMethod":"launch","systemProcessId":21651},"event":"process","seq":0,"type":"event"} <-- Content-Length: 46

Hide Details

{"event":"initialized","seq":0,"type":"event"} --> Content-Length: 109

Hide Details

{"command":"setFunctionBreakpoints","type":"request","arguments":{"breakpoints":[{"name":"twelve"}]},"seq":3} <-- Content-Length: 383

Hide Details

{"body":{"breakpoints":[{"id":1,"line":6,"source":{"name":"main-copy.cpp","path":"/Users/buildslave/jenkins/workspace/lldb-cmake-sanitized/lldb-build/lldb-test-build.noindex/tools/lldb-vscode/breakpoint/TestVSCode_setFunctionBreakpoints.test_set_and_clear/main-copy.cpp"},"verified":true}]},"command":"setFunctionBreakpoints","request_seq":3,"seq":0,"success":true,"type":"response"} --> Content-Length: 129

Hide Details

{"command":"setFunctionBreakpoints","type":"request","arguments":{"breakpoints":[{"name":"twelve"},{"name":"thirteen"}]},"seq":4} <-- Content-Length: 649

Hide Details

{"body":{"breakpoints":[{"id":1,"line":6,"source":{"name":"main-copy.cpp","path":"/Users/buildslave/jenkins/workspace/lldb-cmake-sanitized/lldb-build/lldb-test-build.noindex/tools/lldb-vscode/breakpoint/TestVSCode_setFunctionBreakpoints.test_set_and_clear/main-copy.cpp"},"verified":true},{"id":2,"line":10,"source":{"name":"main-copy.cpp","path":"/Users/buildslave/jenkins/workspace/lldb-cmake-sanitized/lldb-build/lldb-test-build.noindex/tools/lldb-vscode/breakpoint/TestVSCode_setFunctionBreakpoints.test_set_and_clear/main-copy.cpp"},"verified":true}]},"command":"setFunctionBreakpoints","request_seq":4,"seq":0,"success":true,"type":"response"} --> Content-Length: 109

Hide Details

{"command":"setFunctionBreakpoints","type":"request","arguments":{"breakpoints":[{"name":"twelve"}]},"seq":5} <-- Content-Length: 383

Hide Details

{"body":{"breakpoints":[{"id":1,"line":6,"source":{"name":"main-copy.cpp","path":"/Users/buildslave/jenkins/workspace/lldb-cmake-sanitized/lldb-build/lldb-test-build.noindex/tools/lldb-vscode/breakpoint/TestVSCode_setFunctionBreakpoints.test_set_and_clear/main-copy.cpp"},"verified":true}]},"command":"setFunctionBreakpoints","request_seq":5,"seq":0,"success":true,"type":"response"} --> Content-Length: 79

Hide Details

{"command":"_testGetTargetBreakpoints","type":"request","arguments":{},"seq":6} <-- Content-Length: 386

Hide Details

{"body":{"breakpoints":[{"id":1,"line":6,"source":{"name":"main-copy.cpp","path":"/Users/buildslave/jenkins/workspace/lldb-cmake-sanitized/lldb-build/lldb-test-build.noindex/tools/lldb-vscode/breakpoint/TestVSCode_setFunctionBreakpoints.test_set_and_clear/main-copy.cpp"},"verified":true}]},"command":"_testGetTargetBreakpoints","request_seq":6,"seq":0,"success":true,"type":"response"} --> Content-Length: 92

Hide Details

{"command":"setFunctionBreakpoints","type":"request","arguments":{"breakpoints":[]},"seq":7} <-- Content-Length: 119

Hide Details

{"body":{"breakpoints":[]},"command":"setFunctionBreakpoints","request_seq":7,"seq":0,"success":true,"type":"response"} --> Content-Length: 79

Hide Details

{"command":"_testGetTargetBreakpoints","type":"request","arguments":{},"seq":8} <-- Content-Length: 122

Hide Details

{"body":{"breakpoints":[]},"command":"_testGetTargetBreakpoints","request_seq":8,"seq":0,"success":true,"type":"response"} --> Content-Length: 88

Hide Details

{"command":"disconnect","type":"request","arguments":{"terminateDebuggee":true},"seq":9} <-- Content-Length: 45

Hide Details

{"event":"terminated","seq":0,"type":"event"} <-- Content-Length: 63

Hide Details

{"body":{"exitCode":9},"event":"exited","seq":0,"type":"event"} <-- Content-Length: 81

Hide Details

{"command":"disconnect","request_seq":9,"seq":0,"success":true,"type":"response"}

Hide Details

========= END =========

Hide Details

-- Command Output (stderr): -- Change dir to: /Users/buildslave/jenkins/workspace/lldb-cmake-sanitized/llvm-project/lldb/test/API/tools/lldb-vscode/breakpoint runCmd: settings clear -all output:

Hide Details

runCmd: settings set symbols.enable-external-lookup false output:

Hide Details

runCmd: settings set target.inherit-tcc true output:

Hide Details

runCmd: settings set target.detach-on-error false output:

Hide Details

runCmd: settings set target.auto-apply-fixits false output:

Hide Details

runCmd: settings set plugin.process.gdb-remote.packet-timeout 60 output:

Hide Details

runCmd: settings set symbols.clang-modules-cache-path "/Users/buildslave/jenkins/workspace/lldb-cmake-sanitized/lldb-build/lldb-test-build.noindex/module-cache-lldb/lldb-api" output:

Hide Details

runCmd: settings set use-color false output:

Hide Details

runCmd: setting set target.prefer-dynamic-value no-dynamic-values output:

Hide Details

runCmd: settings set target.env-vars ASAN_OPTIONS=detect_stack_use_after_return=1 DYLD_INSERT_LIBRARIES=/Users/buildslave/jenkins/workspace/lldb-cmake-sanitized/host-compiler/lib/clang/13.0.99/lib/darwin/libclang_rt.asan_osx_dynamic.dylib output:

Hide Details

Adding tearDown hook: def cleanup(): if disconnectAutomatically: self.vscode.request_disconnect(terminateDebuggee=True) self.vscode.terminate()

Hide Details

Hide Details

FAIL: LLDB (/Users/buildslave/jenkins/workspace/lldb-cmake-sanitized/host-compiler/bin/clang-x86_64) :: test_functionality (TestVSCode_setFunctionBreakpoints.TestVSCode_setFunctionBreakpoints) Executing tearDown hook: def cleanup(): if disconnectAutomatically: self.vscode.request_disconnect(terminateDebuggee=True) self.vscode.terminate()

Hide Details

Hide Details

CLEANUP ERROR: LLDB (/Users/buildslave/jenkins/workspace/lldb-cmake-sanitized/host-compiler/bin/clang-x86_64) :: test_functionality (TestVSCode_setFunctionBreakpoints.TestVSCode_setFunctionBreakpoints) Traceback (most recent call last): File "/Users/buildslave/jenkins/workspace/lldb-cmake-sanitized/llvm-project/lldb/third_party/Python/module/unittest2/unittest2/case.py", line 386, in run self.tearDown() File "/Users/buildslave/jenkins/workspace/lldb-cmake-sanitized/llvm-project/lldb/packages/Python/lldbsuite/test/lldbtest.py", line 2095, in tearDown Base.tearDown(self) File "/Users/buildslave/jenkins/workspace/lldb-cmake-sanitized/llvm-project/lldb/packages/Python/lldbsuite/test/lldbtest.py", line 1065, in tearDown hook() # try the plain call and hope it works File "/Users/buildslave/jenkins/workspace/lldb-cmake-sanitized/llvm-project/lldb/packages/Python/lldbsuite/test/tools/lldb-vscode/lldbvscode_testcase.py", line 294, in cleanup self.vscode.request_disconnect(terminateDebuggee=True) File "/Users/buildslave/jenkins/workspace/lldb-cmake-sanitized/llvm-project/lldb/packages/Python/lldbsuite/test/tools/lldb-vscode/vscode.py", line 590, in request_disconnect return self.send_recv(command_dict) File "/Users/buildslave/jenkins/workspace/lldb-cmake-sanitized/llvm-project/lldb/packages/Python/lldbsuite/test/tools/lldb-vscode/vscode.py", line 315, in send_recv self.send_packet(command) File "/Users/buildslave/jenkins/workspace/lldb-cmake-sanitized/llvm-project/lldb/packages/Python/lldbsuite/test/tools/lldb-vscode/vscode.py", line 271, in send_packet self.send.flush() BrokenPipeError: [Errno 32] Broken pipe

Hide Details

runCmd: settings clear -all output:

Hide Details

runCmd: settings set symbols.enable-external-lookup false output:

Hide Details

runCmd: settings set target.inherit-tcc true output:

Hide Details

runCmd: settings set target.detach-on-error false output:

Hide Details

runCmd: settings set target.auto-apply-fixits false output:

Hide Details

runCmd: settings set plugin.process.gdb-remote.packet-timeout 60 output:

Hide Details

runCmd: settings set symbols.clang-modules-cache-path "/Users/buildslave/jenkins/workspace/lldb-cmake-sanitized/lldb-build/lldb-test-build.noindex/module-cache-lldb/lldb-api" output:

Hide Details

runCmd: settings set use-color false output:

Hide Details

runCmd: setting set target.prefer-dynamic-value no-dynamic-values output:

Hide Details

runCmd: settings set target.env-vars ASAN_OPTIONS=detect_stack_use_after_return=1 DYLD_INSERT_LIBRARIES=/Users/buildslave/jenkins/workspace/lldb-cmake-sanitized/host-compiler/lib/clang/13.0.99/lib/darwin/libclang_rt.asan_osx_dynamic.dylib output:

Hide Details

Adding tearDown hook: def cleanup(): if disconnectAutomatically: self.vscode.request_disconnect(terminateDebuggee=True) self.vscode.terminate()

Hide Details

Hide Details

Executing tearDown hook: def cleanup(): if disconnectAutomatically: self.vscode.request_disconnect(terminateDebuggee=True) self.vscode.terminate()

Hide Details

Hide Details

PASS: LLDB (/Users/buildslave/jenkins/workspace/lldb-cmake-sanitized/host-compiler/bin/clang-x86_64) :: test_set_and_clear (TestVSCode_setFunctionBreakpoints.TestVSCode_setFunctionBreakpoints) Restore dir to: /Users/buildslave/jenkins/workspace/lldb-cmake-sanitized/lldb-build/tools/lldb/test ====================================================================== FAIL: test_functionality (TestVSCode_setFunctionBreakpoints.TestVSCode_setFunctionBreakpoints) Tests hitting breakpoints and the functionality of a single ---------------------------------------------------------------------- Traceback (most recent call last): File "/Users/buildslave/jenkins/workspace/lldb-cmake-sanitized/llvm-project/lldb/test/API/tools/lldb-vscode/breakpoint/TestVSCode_setFunctionBreakpoints.py", line 139, in test_functionality self.continue_to_breakpoints(breakpoint_ids) File "/Users/buildslave/jenkins/workspace/lldb-cmake-sanitized/llvm-project/lldb/packages/Python/lldbsuite/test/tools/lldb-vscode/lldbvscode_testcase.py", line 233, in continue_to_breakpoints self.verify_breakpoint_hit(breakpoint_ids) File "/Users/buildslave/jenkins/workspace/lldb-cmake-sanitized/llvm-project/lldb/packages/Python/lldbsuite/test/tools/lldb-vscode/lldbvscode_testcase.py", line 92, in verify_breakpoint_hit self.assertTrue(False, "breakpoint not hit") AssertionError: False is not True : breakpoint not hit Config=x86_64-/Users/buildslave/jenkins/workspace/lldb-cmake-sanitized/host-compiler/bin/clang ---------------------------------------------------------------------- Ran 2 tests in 4.699s

Hide Details

RESULT: FAILED (1 passes, 1 failures, 0 errors, 0 skipped, 0 expected failures, 0 unexpected successes)

Hide Details

--

Hide Details

******************** PASS: lldb-unit :: Utility/./UtilityTests/RangeTest.Copy (2024 of 2354) PASS: lldb-api :: functionalities/float-display/TestFloatDisplay.py (2025 of 2354) PASS: lldb-unit :: Utility/./UtilityTests/ArchSpecTest.MergeFromMachOUnknown (2026 of 2354) PASS: lldb-unit :: Process/minidump/./LLDBMinidumpTests/MinidumpParserTest.GetArchitecture (2027 of 2354) PASS: lldb-api :: functionalities/data-formatter/data-formatter-stl/libcxx/multimap/TestDataFormatterLibccMultiMap.py (2028 of 2354) PASS: lldb-api :: functionalities/data-formatter/data-formatter-disabling/TestDataFormatterDisabling.py (2029 of 2354) PASS: lldb-shell :: ObjectFile/wasm/unified-debug-sections.yaml (2030 of 2354) PASS: lldb-unit :: Utility/./UtilityTests/StreamTest.PutHex32ByteOrderLittle (2031 of 2354) UNSUPPORTED: lldb-api :: functionalities/breakpoint/hardware_breakpoints/write_memory_with_hw_breakpoint/TestWriteMemoryWithHWBreakpoint.py (2032 of 2354) PASS: lldb-api :: lang/objc/objc-struct-return/TestObjCStructReturn.py (2033 of 2354) PASS: lldb-api :: functionalities/breakpoint/move_nearest/TestMoveNearest.py (2034 of 2354) PASS: lldb-api :: functionalities/breakpoint/hardware_breakpoints/require_hw_breakpoints/TestRequireHWBreakpoints.py (2035 of 2354) UNSUPPORTED: lldb-shell :: ExecControl/StopHook/stop-hook-threads.test (2036 of 2354) PASS: lldb-unit :: Utility/./UtilityTests/ArgsTest.TestInsertArg (2037 of 2354) UNSUPPORTED: lldb-api :: functionalities/breakpoint/breakpoint_callback_command_source/TestBreakpointCallbackCommandSource.py (2038 of 2354) UNSUPPORTED: lldb-shell :: Subprocess/vfork-follow-parent-wp.test (2039 of 2354) PASS: lldb-unit :: Host/./HostTests/NativeProcessProtocolTest.SetBreakpointFailWrite (2040 of 2354) PASS: lldb-shell :: Settings/TestDisableColor.test (2041 of 2354) PASS: lldb-unit :: Utility/./UtilityTests/RegularExpression.CopyAssignment (2042 of 2354) PASS: lldb-unit :: SymbolFile/DWARF/./SymbolFileDWARFTests/SymbolFileDWARFTests.TestAbbrevOutOfOrder (2043 of 2354) UNSUPPORTED: lldb-api :: benchmarks/stepping/TestSteppingSpeed.py (2044 of 2354) PASS: lldb-shell :: SymbolFile/DWARF/x86/win-i386-line-table.s (2045 of 2354) PASS: lldb-api :: commands/settings/use_source_cache/TestUseSourceCache.py (2046 of 2354) PASS: lldb-unit :: Utility/./UtilityTests/StringExtractorTest.GetHexU8_Underflow2 (2047 of 2354) PASS: lldb-unit :: ScriptInterpreter/Python/./ScriptInterpreterPythonTests/PythonDataObjectsTest.TestPythonStringToStr (2048 of 2354) PASS: lldb-unit :: Utility/./UtilityTests/UserIDResolver.GetGroupName (2049 of 2354) PASS: lldb-unit :: Utility/./UtilityTests/StreamTeeTest.Constructor2Streams (2050 of 2354) PASS: lldb-unit :: Interpreter/./InterpreterTests/OptionValueArgs.DeepCopy (2051 of 2354) PASS: lldb-unit :: Utility/./UtilityTests/BinaryStreamTest.PutULEB128TwoBytes (2052 of 2354) PASS: lldb-api :: lang/objc/objc-optimized/TestObjcOptimized.py (2053 of 2354) PASS: lldb-unit :: Utility/./UtilityTests/VMRange.SetEndAddress (2054 of 2354) PASS: lldb-unit :: Utility/./UtilityTests/ArchSpecTest.TestSetTriple (2055 of 2354) PASS: lldb-api :: commands/command/nested_alias/TestNestedAlias.py (2056 of 2354) PASS: lldb-api :: commands/expression/argument_passing_restrictions/TestArgumentPassingRestrictions.py (2057 of 2354) PASS: lldb-unit :: Utility/./UtilityTests/StreamTeeTest.SetStreamAtIndexOutOfBounds (2058 of 2354) UNSUPPORTED: lldb-api :: terminal/TestEditline.py (2059 of 2354) PASS: lldb-api :: functionalities/thread/concurrent_events/TestConcurrentSignalDelayBreak.py (2060 of 2354) PASS: lldb-unit :: Utility/./UtilityTests/DataExtractorTest.GetDouble (2061 of 2354) PASS: lldb-api :: commands/expression/formatters/TestFormatters.py (2062 of 2354) PASS: lldb-unit :: Utility/./UtilityTests/RangeTest.DefaultConstructor (2063 of 2354) PASS: lldb-api :: functionalities/breakpoint/breakpoint_language/TestBreakpointLanguage.py (2064 of 2354) PASS: lldb-api :: lang/cpp/rvalue-references/TestRvalueReferences.py (2065 of 2354) PASS: lldb-unit :: Language/Highlighting/./HighlighterTests/HighlighterTest.DefaultHighlighterWithCursorOutOfBounds (2066 of 2354) PASS: lldb-unit :: UnwindAssembly/x86/./UnwindAssemblyx86Tests/Testx86AssemblyInspectionEngine.TestPopRBPWithREX (2067 of 2354) PASS: lldb-api :: lang/objc/blocks/TestObjCIvarsInBlocks.py (2068 of 2354) PASS: lldb-unit :: Utility/./UtilityTests/StringLexerTest.HasAtLeast (2069 of 2354) PASS: lldb-unit :: Process/minidump/./LLDBMinidumpTests/MinidumpParserTest.GetMiscInfoWindows (2070 of 2354) PASS: lldb-api :: functionalities/target_var/TestTargetVar.py (2071 of 2354) PASS: lldb-shell :: SymbolFile/DWARF/x86/DW_TAG_variable-invalid_location.s (2072 of 2354) PASS: lldb-api :: functionalities/data-formatter/data-formatter-globals/TestDataFormatterGlobals.py (2073 of 2354) PASS: lldb-api :: tools/lldb-server/TestGdbRemoteExpeditedRegisters.py (2074 of 2354) PASS: lldb-api :: commands/session/save/TestSessionSave.py (2075 of 2354) PASS: lldb-unit :: Utility/./UtilityTests/StringExtractorGDBRemoteTest.GetPidTid (2076 of 2354) PASS: lldb-unit :: Core/./LLDBCoreTests/FormatEntityTest.DefinitionConstructionNameAndString (2077 of 2354) PASS: lldb-unit :: Process/minidump/./LLDBMinidumpTests/MinidumpParserTest.GetExceptionStream (2078 of 2354) PASS: lldb-api :: commands/expression/issue_11588/Test11588.py (2079 of 2354) PASS: lldb-shell :: ObjectFile/wasm/basic.yaml (2080 of 2354) PASS: lldb-unit :: Utility/./UtilityTests/StringExtractorTest.GetHexU8_Extra (2081 of 2354) PASS: lldb-api :: functionalities/wrong_commands/TestWrongCommands.py (2082 of 2354) PASS: lldb-shell :: ObjectFile/ELF/netbsd-core-amd64.test (2083 of 2354) PASS: lldb-api :: functionalities/data-formatter/data-formatter-objc/TestDataFormatterObjCCF.py (2084 of 2354) UNSUPPORTED: lldb-shell :: SymbolFile/PDB/pointers.test (2085 of 2354) PASS: lldb-unit :: Process/gdb-remote/./ProcessGdbRemoteTests/GDBRemoteCommunicationClientTest.ReadMemoryTags (2086 of 2354) PASS: lldb-api :: functionalities/recursion/TestValueObjectRecursion.py (2087 of 2354) PASS: lldb-api :: tools/lldb-server/TestGdbRemoteProcessInfo.py (2088 of 2354) PASS: lldb-unit :: Utility/./UtilityTests/BinaryStreamTest.PutSLEB128NineBytes (2089 of 2354) UNSUPPORTED: lldb-shell :: SymbolFile/PDB/enums-layout.test (2090 of 2354) PASS: lldb-api :: macosx/builtin-debugtrap/TestBuiltinDebugTrap.py (2091 of 2354) PASS: lldb-unit :: Utility/./UtilityTests/StringListTest.AppendList (2092 of 2354) PASS: lldb-unit :: Utility/./UtilityTests/OptionsWithRawTest.EmptySuffixSingleWhitespace (2093 of 2354) PASS: lldb-shell :: SymbolFile/DWARF/DW_AT_range-DW_FORM_sec_offset.s (2094 of 2354) PASS: lldb-unit :: Utility/./UtilityTests/ArgsTest.AppendArguments (2095 of 2354) PASS: lldb-unit :: Process/minidump/./LLDBMinidumpTests/RegisterContextMinidump.ConvertMinidumpContext_x86_64 (2096 of 2354) PASS: lldb-shell :: ObjectFile/ELF/PT_LOAD.yaml (2097 of 2354) PASS: lldb-api :: commands/expression/call-function/TestCallStopAndContinue.py (2098 of 2354) PASS: lldb-unit :: ScriptInterpreter/Python/./ScriptInterpreterPythonTests/PythonDataObjectsTest.TestPythonBoolean (2099 of 2354) PASS: lldb-unit :: Utility/./UtilityTests/TimerTest.CategoryTimes2 (2100 of 2354) PASS: lldb-unit :: Utility/./UtilityTests/StringListTest.GetMaxStringLengthEqualSize (2101 of 2354) PASS: lldb-shell :: ObjectFile/ELF/section-permissions.yaml (2102 of 2354) PASS: lldb-api :: functionalities/breakpoint/breakpoint_ignore_count/TestBreakpointIgnoreCount.py (2103 of 2354) PASS: lldb-api :: functionalities/tail_call_frames/disambiguate_call_site/TestDisambiguateCallSite.py (2104 of 2354) PASS: lldb-unit :: Core/./LLDBCoreTests/MangledTest.EmptyForInvalidRustV0Name (2105 of 2354) PASS: lldb-unit :: Utility/./UtilityTests/SubsystemRAIITest.NormalSubsystem (2106 of 2354) PASS: lldb-shell :: Reproducer/TestHomeDir.test (2107 of 2354) PASS: lldb-shell :: ObjectFile/MachO/lc_build_version_notools.yaml (2108 of 2354) PASS: lldb-unit :: Utility/./UtilityTests/StringExtractorTest.GetHexBytesAvail_Underflow (2109 of 2354) PASS: lldb-unit :: Core/./LLDBCoreTests/DumpDataExtractorTest.MultiLine (2110 of 2354) PASS: lldb-shell :: SymbolFile/DWARF/x86/debug-types-line-tables.s (2111 of 2354) PASS: lldb-shell :: SymbolFile/DWARF/x86/DW_AT_const_value.s (2112 of 2354) PASS: lldb-api :: lang/objc/modules-incomplete/TestIncompleteModules.py (2113 of 2354) PASS: lldb-api :: lang/objc/foundation/TestConstStrings.py (2114 of 2354) PASS: lldb-unit :: Utility/./UtilityTests/StringExtractorTest.GetU64LittleEndian (2115 of 2354) PASS: lldb-api :: functionalities/data-formatter/data-formatter-stl/libcxx/bitset/TestDataFormatterLibcxxBitset.py (2116 of 2354) PASS: lldb-unit :: Utility/./UtilityTests/StringExtractorTest.GetHexU8_InvalidHex (2117 of 2354) PASS: lldb-unit :: Symbol/./SymbolTests/TestTypeSystemClang.TestGetTypeClassTypeOfExpr (2118 of 2354) PASS: lldb-unit :: Language/Highlighting/./HighlighterTests/HighlighterTest.HighlighterSelectionType (2119 of 2354) PASS: lldb-unit :: Utility/./UtilityTests/RangeTest.ClearWithStarAddress (2120 of 2354) PASS: lldb-unit :: Utility/./UtilityTests/GeneratorTest.GetOrCreate (2121 of 2354) PASS: lldb-api :: functionalities/thread/state_after_expression/TestStateAfterExpression.py (2122 of 2354) PASS: lldb-unit :: Language/Highlighting/./HighlighterTests/HighlighterTest.ClangStringLiterals (2123 of 2354) PASS: lldb-unit :: UnwindAssembly/x86/./UnwindAssemblyx86Tests/Testx86AssemblyInspectionEngine.TestPushR13 (2124 of 2354) PASS: lldb-api :: functionalities/postmortem/minidump-new/TestMiniDumpUUID.py (2125 of 2354) PASS: lldb-api :: python_api/module_section/TestModuleAndSection.py (2126 of 2354) PASS: lldb-api :: lang/cpp/static_member_type_depending_on_parent_size/TestStaticMemberTypeDependingOnParentSize.py (2127 of 2354) PASS: lldb-unit :: Utility/./UtilityTests/StringListTest.ForRangeEmpty (2128 of 2354) PASS: lldb-unit :: Utility/./UtilityTests/BinaryStreamTest.PutSLEB128One (2129 of 2354) PASS: lldb-api :: functionalities/data-formatter/data-formatter-synth/TestDataFormatterSynth.py (2130 of 2354) PASS: lldb-unit :: Utility/./UtilityTests/ArgsTest.TestOverwriteArgs (2131 of 2354) PASS: lldb-api :: functionalities/dlopen_other_executable/TestDlopenOtherExecutable.py (2132 of 2354) PASS: lldb-api :: functionalities/gdb_remote_client/TestIOSSimulator.py (2133 of 2354) PASS: lldb-shell :: ObjectFile/ELF/section-types.yaml (2134 of 2354) PASS: lldb-api :: commands/target/create-deps/TestTargetCreateDeps.py (2135 of 2354) PASS: lldb-shell :: SymbolFile/DWARF/x86/dwarf5-split.s (2136 of 2354) PASS: lldb-unit :: Utility/./UtilityTests/CompletionRequest.TryCompleteCurrentArgMode (2137 of 2354) PASS: lldb-shell :: Settings/TestDisassemblyFormat.test (2138 of 2354) PASS: lldb-api :: functionalities/process_crash_info/TestProcessCrashInfo.py (2139 of 2354) PASS: lldb-unit :: Utility/./UtilityTests/ProcessInstanceInfo.Dump (2140 of 2354) PASS: lldb-unit :: Utility/./UtilityTests/RecordReplayTest.InstrumentedFooSameThis (2141 of 2354) UNSUPPORTED: lldb-shell :: Unwind/eh-frame-small-fde.test (2142 of 2354) PASS: lldb-api :: lang/cpp/template-arguments/TestCppTemplateArguments.py (2143 of 2354) PASS: lldb-unit :: Utility/./UtilityTests/StringListTest.LongestCommonPrefixDuplicateElement (2144 of 2354) PASS: lldb-api :: functionalities/thread/step_out/TestThreadStepOut.py (2145 of 2354) PASS: lldb-unit :: DataFormatter/./LLDBFormatterTests/TypeMatcherTests.GetMatchStringRegex (2146 of 2354) PASS: lldb-api :: python_api/value/TestValueAPI.py (2147 of 2354) PASS: lldb-unit :: Utility/./UtilityTests/StreamTeeTest.DefaultConstructor (2148 of 2354) PASS: lldb-unit :: Utility/./UtilityTests/StringListTest.ShiftCString (2149 of 2354) PASS: lldb-api :: functionalities/non-overlapping-index-variable-i/TestIndexVariable.py (2150 of 2354) UNSUPPORTED: lldb-shell :: Register/x86-ymm-write.test (2151 of 2354) PASS: lldb-unit :: UnwindAssembly/x86/./UnwindAssemblyx86Tests/Testx86AssemblyInspectionEngine.TestPushExtended (2152 of 2354) PASS: lldb-unit :: Utility/./UtilityTests/RangeTest.Slide (2153 of 2354) PASS: lldb-shell :: SymbolFile/DWARF/x86/debug-types-missing-signature.test (2154 of 2354) PASS: lldb-shell :: SymbolFile/DWARF/clang-ast-from-dwarf-objc-property.m (2155 of 2354) PASS: lldb-unit :: Host/./HostTests/MainLoopTest.UnmonitoredSignal (2156 of 2354) UNSUPPORTED: lldb-api :: tools/lldb-server/TestGdbRemoteModuleInfo.py (2157 of 2354) PASS: lldb-api :: python_api/exprpath_synthetic/TestExprPathSynthetic.py (2158 of 2354) PASS: lldb-api :: functionalities/thread/concurrent_events/TestConcurrentDelayedCrashWithBreakpointSignal.py (2159 of 2354) PASS: lldb-unit :: Utility/./UtilityTests/BinaryStreamTest.PutULEB128Zero (2160 of 2354) PASS: lldb-shell :: Reproducer/TestWorkingDir.test (2161 of 2354) PASS: lldb-unit :: Utility/./UtilityTests/EventTest.DumpEventDataBytes (2162 of 2354) PASS: lldb-unit :: Process/minidump/./LLDBMinidumpTests/MinidumpParserTest.GetLinuxProcStatus_no_stream (2163 of 2354) PASS: lldb-unit :: Utility/./UtilityTests/DataExtractorTest.GetMaxS64 (2164 of 2354) PASS: lldb-unit :: Symbol/./SymbolTests/DWARFCallFrameInfoTest.Basic_eh (2165 of 2354) PASS: lldb-shell :: Commands/command-backtrace-parser-1.test (2166 of 2354) PASS: lldb-unit :: Host/./HostTests/HostInfoTestInitialization.InitTwice (2167 of 2354) PASS: lldb-unit :: SymbolFile/DWARF/./SymbolFileDWARFTests/SymbolFileDWARFTests.ParseArangesWithMultipleTerminators (2168 of 2354) XFAIL: lldb-shell :: Unwind/prefer-debug-over-eh-frame.test (2169 of 2354) PASS: lldb-unit :: Utility/./UtilityTests/UriParserTest.BracketedHostnameWithColon (2170 of 2354) PASS: lldb-api :: functionalities/thread/concurrent_events/TestConcurrentBreakpointOneDelayBreakpointThreads.py (2171 of 2354) PASS: lldb-unit :: Expression/./ExpressionTests/DiagnosticManagerTest.AddDiagnostic (2172 of 2354) PASS: lldb-api :: macosx/macCatalyst/TestMacCatalyst.py (2173 of 2354) UNSUPPORTED: lldb-api :: linux/aarch64/mte_tag_read/TestAArch64LinuxMTEMemoryTagRead.py (2174 of 2354) PASS: lldb-unit :: Process/minidump/./LLDBMinidumpTests/MinidumpParserTest.InvalidMinidump (2175 of 2354) PASS: lldb-shell :: Settings/TestSettingsSet.test (2176 of 2354) PASS: lldb-shell :: ObjectFile/Breakpad/discontiguous-sections.test (2177 of 2354) PASS: lldb-api :: tools/lldb-vscode/attach/TestVSCode_attach.py (2178 of 2354) PASS: lldb-unit :: Expression/./ExpressionTests/CppModuleConfigurationTest.Sysroot (2179 of 2354) PASS: lldb-shell :: ObjectFile/ELF/riscv-arch.yaml (2180 of 2354) XFAIL: lldb-shell :: Register/x86-mm-xmm-read.test (2181 of 2354) PASS: lldb-api :: lang/cpp/namespace/TestNamespace.py (2182 of 2354) PASS: lldb-unit :: Symbol/./SymbolTests/TestTypeSystemClang.TestNotDeletingUserCopyCstrDueToMoveCStr (2183 of 2354) UNSUPPORTED: lldb-api :: functionalities/signal/handle-segv/TestHandleSegv.py (2184 of 2354) PASS: lldb-unit :: ObjectFile/ELF/./ObjectFileELFTests/ObjectFileELFTest.GetSymtab_NoSymEntryPointArmAddressClass (2185 of 2354) PASS: lldb-shell :: SymbolFile/DWARF/x86/split-dwarf-multiple-cu.ll (2186 of 2354) PASS: lldb-api :: commands/expression/import-std-module/forward_list/TestForwardListFromStdModule.py (2187 of 2354) PASS: lldb-shell :: ObjectFile/wasm/embedded-debug-sections.yaml (2188 of 2354) PASS: lldb-api :: functionalities/inferior-assert/TestInferiorAssert.py (2189 of 2354) PASS: lldb-shell :: ObjectFile/ELF/section-types-edgecases.yaml (2190 of 2354) PASS: lldb-unit :: Utility/./UtilityTests/AnsiTerminal.WhiteSpace (2191 of 2354) UNSUPPORTED: lldb-shell :: ScriptInterpreter/Lua/nested_sessions.test (2192 of 2354) PASS: lldb-api :: commands/expression/rdar44436068/Test128BitsInteger.py (2193 of 2354) PASS: lldb-shell :: Minidump/dump-all.test (2194 of 2354) UNSUPPORTED: lldb-api :: commands/watchpoints/multi_watchpoint_slots/TestWatchpointMultipleSlots.py (2195 of 2354) PASS: lldb-unit :: Utility/./UtilityTests/VMRange.Reset (2196 of 2354) PASS: lldb-shell :: SymbolFile/DWARF/x86/DW_AT_const_value-bitfields.s (2197 of 2354) PASS: lldb-unit :: Process/minidump/./LLDBMinidumpTests/MinidumpParserTest.MinidumpModuleOrder (2198 of 2354) PASS: lldb-api :: lang/cpp/const_this/TestConstThis.py (2199 of 2354) PASS: lldb-api :: api/command-return-object/TestSBCommandReturnObject.py (2200 of 2354) PASS: lldb-api :: functionalities/data-formatter/data-formatter-stl/libcxx/optional/TestDataFormatterLibcxxOptional.py (2201 of 2354) PASS: lldb-api :: functionalities/thread/concurrent_events/TestConcurrentNWatchNBreak.py (2202 of 2354) PASS: lldb-unit :: UnwindAssembly/x86/./UnwindAssemblyx86Tests/Testx86AssemblyInspectionEngine.TestPushR12 (2203 of 2354) PASS: lldb-unit :: Target/./TargetTests/MemoryRegionInfoTest.Formatv (2204 of 2354) PASS: lldb-unit :: UnwindAssembly/x86/./UnwindAssemblyx86Tests/Testx86AssemblyInspectionEngine.TestSimplex86_64Augmented (2205 of 2354) PASS: lldb-unit :: Utility/./UtilityTests/SerializationRountripTest.SerializeDeserializeCStringNull (2206 of 2354) UNSUPPORTED: lldb-shell :: ScriptInterpreter/Lua/breakpoint_function_callback.test (2207 of 2354) PASS: lldb-unit :: SymbolFile/DWARF/./SymbolFileDWARFTests/SymbolFileDWARFTests.ParseAranges (2208 of 2354) PASS: lldb-unit :: Utility/./UtilityTests/OptionsWithRawTest.ArgsButNoLeadingDash (2209 of 2354) PASS: lldb-unit :: Process/Utility/./ProcessUtilityTests/RegisterContext_x86Test.FullToAbridgedTagWord (2210 of 2354) UNSUPPORTED: lldb-shell :: BuildScript/toolchain-msvc.test (2211 of 2354) PASS: lldb-unit :: Utility/./UtilityTests/StringExtractorTest.GetNameColonValueSuccess (2212 of 2354) UNSUPPORTED: lldb-shell :: Register/x86-64-zmm-read.test (2213 of 2354) PASS: lldb-api :: functionalities/data-formatter/data-formatter-objc/TestDataFormatterObjCKVO.py (2214 of 2354) PASS: lldb-unit :: Utility/./UtilityTests/OptionsWithRawTest.MultiWordSuffix (2215 of 2354) PASS: lldb-api :: functionalities/breakpoint/cpp/TestCPPBreakpointLocations.py (2216 of 2354) PASS: lldb-api :: functionalities/inferior-crashing/TestInferiorCrashingStep.py (2217 of 2354) PASS: lldb-unit :: Utility/./UtilityTests/StringExtractorTest.GetHexU8_InvalidHex_NoEof (2218 of 2354) PASS: lldb-unit :: Utility/./UtilityTests/StreamTest.PutSLEB128 (2219 of 2354) PASS: lldb-unit :: Utility/./UtilityTests/StringListTest.JoinSingle (2220 of 2354) PASS: lldb-unit :: Utility/./UtilityTests/NameMatchesTest.StartsWith (2221 of 2354) PASS: lldb-shell :: Reproducer/TestDSYM.test (2222 of 2354) PASS: lldb-unit :: Utility/./UtilityTests/VMRange.Ordering (2223 of 2354) PASS: lldb-shell :: Commands/command-script-import.test (2224 of 2354) PASS: lldb-unit :: Utility/./UtilityTests/StreamTest.PutHex64ByteOrderLittle (2225 of 2354) PASS: lldb-unit :: UnwindAssembly/x86/./UnwindAssemblyx86Tests/Testx86AssemblyInspectionEngine.TestPushRBPWithREX (2226 of 2354) PASS: lldb-unit :: UnwindAssembly/x86/./UnwindAssemblyx86Tests/Testx86AssemblyInspectionEngine.TestPopR13 (2227 of 2354) PASS: lldb-unit :: Utility/./UtilityTests/RangeTest.SetRangeBase (2228 of 2354) PASS: lldb-unit :: debugserver/./debugserverTests/JSON.Parse (2229 of 2354) PASS: lldb-api :: functionalities/gdb_remote_client/TestHaltFails.py (2230 of 2354) PASS: lldb-unit :: Utility/./UtilityTests/StringExtractorTest.DecodeHexU8_Exact (2231 of 2354) PASS: lldb-api :: commands/expression/char/TestExprsChar.py (2232 of 2354) PASS: lldb-unit :: Utility/./UtilityTests/BinaryStreamTest.PutSLEB128ThreeBytes (2233 of 2354) PASS: lldb-api :: lang/cpp/unsigned_types/TestUnsignedTypes.py (2234 of 2354) PASS: lldb-api :: lang/cpp/default-template-args/TestDefaultTemplateArgs.py (2235 of 2354) PASS: lldb-api :: functionalities/data-formatter/data-formatter-stl/libcxx/tuple/TestDataFormatterLibcxxTuple.py (2236 of 2354) PASS: lldb-api :: lang/cpp/breakpoint-commands/TestCPPBreakpointCommands.py (2237 of 2354) PASS: lldb-unit :: Language/Highlighting/./HighlighterTests/HighlighterTest.ClangPreserveNewLine (2238 of 2354) PASS: lldb-api :: commands/expression/persistent_ptr_update/TestPersistentPtrUpdate.py (2239 of 2354) PASS: lldb-api :: lang/objcxx/hide-runtime-values/TestObjCXXHideRuntimeValues.py (2240 of 2354) UNSUPPORTED: lldb-api :: functionalities/tty/TestTerminal.py (2241 of 2354) PASS: lldb-shell :: Register/Core/x86-32-linux-fp.test (2242 of 2354) UNSUPPORTED: lldb-api :: commands/expression/completion-crash-invalid-iterator/TestInvalidIteratorCompletionCrash.py (2243 of 2354) PASS: lldb-api :: commands/expression/radar_9673664/TestExprHelpExamples.py (2244 of 2354) PASS: lldb-unit :: Utility/./UtilityTests/Predicate.WaitForValueNotEqualTo (2245 of 2354) PASS: lldb-unit :: Thread/./ThreadTests/ThreadTest.SetStopInfo (2246 of 2354) PASS: lldb-unit :: ScriptInterpreter/Python/./ScriptInterpreterPythonTests/PythonDataObjectsTest.TestPythonTupleInitializerList2 (2247 of 2354) PASS: lldb-unit :: Utility/./UtilityTests/UriParserTest.TypicalPortPathIPv6 (2248 of 2354) PASS: lldb-api :: functionalities/data-formatter/data-formatter-ptr-to-array/TestPtrToArrayFormatting.py (2249 of 2354) UNSUPPORTED: lldb-shell :: Register/x86-64-xmm16-read.test (2250 of 2354) PASS: lldb-shell :: Reproducer/Functionalities/TestStepping.test (2251 of 2354) PASS: lldb-unit :: Utility/./UtilityTests/ConstStringTest.CompareConstString (2252 of 2354) PASS: lldb-unit :: Utility/./UtilityTests/PassiveReplayTest.InstrumentedBar (2253 of 2354) PASS: lldb-unit :: Utility/./UtilityTests/BinaryStreamTest.PutULEB128FiveBytes (2254 of 2354) UNSUPPORTED: lldb-api :: commands/gui/breakpoints/TestGuiBreakpoints.py (2255 of 2354) PASS: lldb-unit :: DataFormatter/./LLDBFormatterTests/TypeMatcherTests.GetMatchStringExactName (2256 of 2354) PASS: lldb-unit :: Symbol/./SymbolTests/TestTypeSystemClang.TestUnifyAccessSpecifiers (2257 of 2354) PASS: lldb-shell :: Breakpoint/jit-loader_rtdyld_elf.test (2258 of 2354) PASS: lldb-api :: lang/cpp/member-and-local-vars-with-same-name/TestMembersAndLocalsWithSameName.py (2259 of 2354) UNSUPPORTED: lldb-shell :: Register/x86-zmm-write.test (2260 of 2354) PASS: lldb-unit :: Process/minidump/./LLDBMinidumpTests/MinidumpParserTest.GetArchitectureWindows (2261 of 2354) PASS: lldb-api :: python_api/thread/TestThreadAPI.py (2262 of 2354) PASS: lldb-unit :: Process/Utility/./ProcessUtilityTests/ProcMapTests/LinuxProcMapsTestFixture.ParseMapRegions/8 (2263 of 2354) PASS: lldb-unit :: Language/Highlighting/./HighlighterTests/HighlighterTest.ClangCursorPosInOtherToken (2264 of 2354) PASS: lldb-unit :: Utility/./UtilityTests/StreamTest.AddressRange (2265 of 2354) PASS: lldb-shell :: Reproducer/TestDiscard.test (2266 of 2354) PASS: lldb-unit :: Utility/./UtilityTests/Flags.Reset (2267 of 2354) PASS: lldb-shell :: SymbolFile/DWARF/x86/dir-separator-no-comp-dir-relative-name.s (2268 of 2354) PASS: lldb-unit :: Utility/./UtilityTests/ArchSpecTest.MergeFrom (2269 of 2354) PASS: lldb-api :: commands/frame/diagnose/dereference-function-return/TestDiagnoseDereferenceFunctionReturn.py (2270 of 2354) PASS: lldb-unit :: Interpreter/./InterpreterTests/OptionValueString.DeepCopy (2271 of 2354) PASS: lldb-api :: functionalities/thread/concurrent_events/TestConcurrentSignalBreak.py (2272 of 2354) PASS: lldb-unit :: Utility/./UtilityTests/ArgsTest.GetShellSafeArgument (2273 of 2354) PASS: lldb-unit :: Language/Highlighting/./HighlighterTests/HighlighterTest.ClangCommas (2274 of 2354) PASS: lldb-api :: functionalities/breakpoint/comp_dir_symlink/TestCompDirSymLink.py (2275 of 2354) PASS: lldb-unit :: UnwindAssembly/x86/./UnwindAssemblyx86Tests/Testx86AssemblyInspectionEngine.TestPushR14 (2276 of 2354) PASS: lldb-api :: commands/expression/import-std-module/missing-module-sources/TestStdModuleSourcesMissing.py (2277 of 2354) PASS: lldb-unit :: Language/Highlighting/./HighlighterTests/HighlighterTest.Colons (2278 of 2354) UNSUPPORTED: lldb-api :: functionalities/data-formatter/data-formatter-stl/libstdcpp/vector/TestDataFormatterStdVector.py (2279 of 2354) UNSUPPORTED: lldb-api :: benchmarks/continue/TestBenchmarkContinue.py (2280 of 2354) PASS: lldb-unit :: Utility/./UtilityTests/LogTest.Register (2281 of 2354) PASS: lldb-unit :: Utility/./UtilityTests/StringListTest.JoinEmpty (2282 of 2354) UNSUPPORTED: lldb-shell :: SymbolFile/NativePDB/typedefs.cpp (2283 of 2354) PASS: lldb-api :: functionalities/thread/concurrent_events/TestConcurrentWatchBreak.py (2284 of 2354) PASS: lldb-unit :: Utility/./UtilityTests/StringListTest.GetMaxStringLengthEmpty (2285 of 2354) PASS: lldb-unit :: DataFormatter/./LLDBFormatterTests/FormatManagerTests.CompatibleLangs (2286 of 2354) PASS: lldb-unit :: SymbolFile/DWARF/./SymbolFileDWARFTests/DWARFASTParserClangTests.EnsureAllDIEsInDeclContextHaveBeenParsedParsesOnlyMatchingEntries (2287 of 2354) PASS: lldb-unit :: Utility/./UtilityTests/StringListTest.GetMaxStringLengthDecreasingSize (2288 of 2354) PASS: lldb-api :: commands/watchpoints/watchpoint_commands/condition/TestWatchpointConditionCmd.py (2289 of 2354) PASS: lldb-unit :: Utility/./UtilityTests/UUIDTest.SetFromStringRef (2290 of 2354) PASS: lldb-api :: lang/cpp/global_operators/TestCppGlobalOperators.py (2291 of 2354) PASS: lldb-unit :: ObjectFile/Breakpad/./ObjectFileBreakpadTests/StackWinRecord.parse (2292 of 2354) PASS: lldb-unit :: Utility/./UtilityTests/RangeTest.DoesAdjoinOrIntersect (2293 of 2354) PASS: lldb-unit :: Utility/./UtilityTests/XcodeSDKTest.ParseTest (2294 of 2354) PASS: lldb-unit :: Utility/./UtilityTests/StringListTest.LongestCommonPrefix (2295 of 2354) PASS: lldb-shell :: ObjectFile/PECOFF/sections.yaml (2296 of 2354) PASS: lldb-shell :: Register/Core/x86-32-freebsd-gp.test (2297 of 2354) PASS: lldb-unit :: Symbol/./SymbolTests/TestClangASTImporter.CopyTypeTagDecl (2298 of 2354) PASS: lldb-unit :: Utility/./UtilityTests/StringExtractorTest.DecodeHexU8_Extra (2299 of 2354) UNSUPPORTED: lldb-shell :: Breakpoint/case-insensitive.test (2300 of 2354) PASS: lldb-unit :: Core/./LLDBCoreTests/RichManglingContextTest.Basic (2301 of 2354) UNSUPPORTED: lldb-api :: functionalities/tsan/thread_leak/TestTsanThreadLeak.py (2302 of 2354) PASS: lldb-api :: python_api/process/io/TestProcessIO.py (2303 of 2354) PASS: lldb-unit :: Process/gdb-remote/./ProcessGdbRemoteTests/GDBRemoteClientBaseTest.SendContinueDelegateStructuredDataReceipt (2304 of 2354) PASS: lldb-shell :: Register/Core/x86-64-linux-addr.test (2305 of 2354) UNSUPPORTED: lldb-shell :: SymbolFile/NativePDB/stack_unwinding01.cpp (2306 of 2354) PASS: lldb-unit :: Host/./HostTests/HostInfoTest.GetAugmentedArchSpec (2307 of 2354) PASS: lldb-api :: lang/objcxx/cpp_keywords_enabled/TestObjCppKeywordsEnabled.py (2308 of 2354) PASS: lldb-shell :: SymbolFile/DWARF/x86/dwarf5_tu_index_abbrev_offset.s (2309 of 2354) PASS: lldb-api :: commands/version/TestVersion.py (2310 of 2354) PASS: lldb-unit :: Symbol/./SymbolTests/TestTypeSystemClang.TestGetTypeClassTypeOf (2311 of 2354) PASS: lldb-api :: lang/cpp/lambdas/TestLambdas.py (2312 of 2354) PASS: lldb-shell :: SymbolFile/DWARF/x86/find-variable-dwo.cpp (2313 of 2354) PASS: lldb-shell :: SymbolFile/DWARF/x86/find-variable-file.cpp (2314 of 2354) PASS: lldb-shell :: SymbolFile/DWARF/x86/debug_rnglists-dwo.s (2315 of 2354) PASS: lldb-unit :: Language/Highlighting/./HighlighterTests/HighlighterTest.ClangScalarLiterals (2316 of 2354) PASS: lldb-shell :: ObjectFile/ELF/base-address.yaml (2317 of 2354) PASS: lldb-unit :: Process/minidump/./LLDBMinidumpTests/MinidumpParserTest.GetMemory (2318 of 2354) UNSUPPORTED: lldb-shell :: Unwind/unwind-plan-dwarf-dump.test (2319 of 2354) UNSUPPORTED: lldb-api :: lang/cpp/function-template-parameter-pack/TestFunctionTemplateParameterPack.py (2320 of 2354) PASS: lldb-api :: python_api/sbvalue_persist/TestSBValuePersist.py (2321 of 2354) PASS: lldb-unit :: Symbol/./SymbolTests/TestClangASTImporter.CanImportInvalidType (2322 of 2354) PASS: lldb-api :: commands/expression/calculator_mode/TestCalculatorMode.py (2323 of 2354) PASS: lldb-unit :: ScriptInterpreter/Python/./ScriptInterpreterPythonTests/PythonDataObjectsTest.TestPythonByteArray (2324 of 2354) PASS: lldb-unit :: Host/./HostTests/ProcessLaunchInfoTest.Constructor (2325 of 2354) PASS: lldb-api :: functionalities/completion/TestCompletion.py (2326 of 2354) PASS: lldb-shell :: SymbolFile/Breakpad/unwind-via-stack-win-no-memory-info.yaml (2327 of 2354) PASS: lldb-shell :: SymbolFile/DWARF/x86/dwp-debug-types.s (2328 of 2354) PASS: lldb-api :: api/multithreaded/TestMultithreaded.py (2329 of 2354) PASS: lldb-api :: functionalities/process_group/TestChangeProcessGroup.py (2330 of 2354) UNSUPPORTED: lldb-api :: functionalities/thread/concurrent_events/TestConcurrentManySignals.py (2331 of 2354) PASS: lldb-api :: tools/lldb-server/TestGdbRemoteAttachWait.py (2332 of 2354) UNSUPPORTED: lldb-api :: linux/mix-dwo-and-regular-objects/TestMixedDwarfBinary.py (2333 of 2354) PASS: lldb-shell :: SymbolFile/DWARF/x86/dwarf5-index-is-used.cpp (2334 of 2354) PASS: lldb-unit :: Host/./HostTests/SocketTests/SocketTest.TCPGetConnectURI/ipv4 (2335 of 2354) PASS: lldb-unit :: Host/./HostTests/SocketTests/SocketTest.TCPGetConnectURI/ipv6 (2336 of 2354) UNSUPPORTED: lldb-shell :: SymbolFile/PDB/compilands.test (2337 of 2354) PASS: lldb-api :: functionalities/data-formatter/array_typedef/TestArrayTypedef.py (2338 of 2354) PASS: lldb-shell :: Unwind/trap_frame_sym_ctx.test (2339 of 2354) PASS: lldb-shell :: SymbolFile/Breakpad/unwind-via-stack-win.test (2340 of 2354) PASS: lldb-api :: commands/expression/import-std-module/retry-with-std-module/TestRetryWithStdModule.py (2341 of 2354) PASS: lldb-shell :: SymbolFile/DWARF/x86/debug-types-basic.test (2342 of 2354) PASS: lldb-unit :: Utility/./UtilityTests/StringListTest.Assignment (2343 of 2354) PASS: lldb-unit :: Utility/./UtilityTests/Flags.AllSet (2344 of 2354) PASS: lldb-shell :: SymbolFile/DWARF/x86/compilercontext.ll (2345 of 2354) PASS: lldb-api :: functionalities/data-formatter/data-formatter-categories/TestDataFormatterCategories.py (2346 of 2354) PASS: lldb-api :: functionalities/target-new-solib-notifications/TestModuleLoadedNotifys.py (2347 of 2354) UNSUPPORTED: lldb-shell :: SymbolFile/PDB/typedefs.test (2348 of 2354) PASS: lldb-api :: functionalities/data-formatter/boolreference/TestFormattersBoolRefPtr.py (2349 of 2354) PASS: lldb-shell :: Expr/TestIRMemoryMap.test (2350 of 2354) PASS: lldb-unit :: Utility/./UtilityTests/DataExtractorTest.GetCStr (2351 of 2354) PASS: lldb-api :: lang/objc/radar-9691614/TestObjCMethodReturningBOOL.py (2352 of 2354) PASS: lldb-api :: functionalities/limit-debug-info/TestLimitDebugInfo.py (2353 of 2354) PASS: lldb-api :: lang/objc/foundation/TestObjCMethods.py (2354 of 2354) Slowest Tests: -------------------------------------------------------------------------- 262.42s: lldb-api :: tools/lldb-server/TestLldbGdbServer.py 140.37s: lldb-api :: functionalities/memory-region/TestMemoryRegion.py 128.10s: lldb-api :: api/multithreaded/TestMultithreaded.py 116.31s: lldb-api :: macosx/skinny-corefile/TestSkinnyCorefile.py 91.52s: lldb-api :: functionalities/gdb_remote_client/TestWasm.py 81.95s: lldb-api :: types/TestLongTypesExpr.py 72.30s: lldb-api :: lang/objc/exceptions/TestObjCExceptions.py 68.98s: lldb-api :: commands/expression/import-std-module/queue/TestQueueFromStdModule.py 68.61s: lldb-api :: commands/expression/import-std-module/stack/TestStackFromStdModule.py 63.60s: lldb-api :: lang/objc/hidden-ivars/TestHiddenIvars.py 63.06s: lldb-api :: lang/cpp/namespace/TestNamespaceLookup.py 59.96s: lldb-api :: lang/objc/objc-new-syntax/TestObjCNewSyntaxLiteral.py 58.08s: lldb-api :: commands/expression/import-std-module/vector/TestVectorFromStdModule.py 56.22s: lldb-api :: lang/objc/foundation/TestObjCMethods.py 53.58s: lldb-api :: types/TestIntegerTypeExpr.py 50.34s: lldb-api :: commands/expression/import-std-module/deque-basic/TestDequeFromStdModule.py 49.78s: lldb-api :: tools/lldb-server/TestGdbRemoteThreadsInStopReply.py 49.48s: lldb-api :: python_api/target/TestTargetAPI.py 48.53s: lldb-api :: lang/objc/objc-new-syntax/TestObjCNewSyntaxArray.py 47.99s: lldb-api :: lang/objc/objc-new-syntax/TestObjCNewSyntaxDictionary.py

Hide Details

Tests Times: -------------------------------------------------------------------------- [ Range ] :: [ Percentage ] :: [ Count ] -------------------------------------------------------------------------- [260s,280s) :: [ ] :: [ 1/2354] [240s,260s) :: [ ] :: [ 0/2354] [220s,240s) :: [ ] :: [ 0/2354] [200s,220s) :: [ ] :: [ 0/2354] [180s,200s) :: [ ] :: [ 0/2354] [160s,180s) :: [ ] :: [ 0/2354] [140s,160s) :: [ ] :: [ 1/2354] [120s,140s) :: [ ] :: [ 2/2354] [100s,120s) :: [ ] :: [ 0/2354] [ 80s,100s) :: [ ] :: [ 2/2354] [ 60s, 80s) :: [ ] :: [ 7/2354] [ 40s, 60s) :: [ ] :: [ 17/2354] [ 20s, 40s) :: [* ] :: [ 64/2354] [ 0s, 20s) :: [************************************** ] :: [2260/2354] -------------------------------------------------------------------------- ******************** Failed Tests (2): lldb-api :: tools/lldb-vscode/breakpoint/TestVSCode_setFunctionBreakpoints.py lldb-api :: tools/lldb-vscode/evaluate/TestVSCode_evaluate.py

Hide Details

Hide Details

Testing Time: 2400.24s Unsupported : 211 Passed : 2131 Expectedly Failed: 10 Failed : 2 FAILED: tools/lldb/test/CMakeFiles/check-lldb cd /Users/buildslave/jenkins/workspace/lldb-cmake-sanitized/lldb-build/tools/lldb/test && /usr/local/Frameworks/Python.framework/Versions/3.7/bin/python3.7 /Users/buildslave/jenkins/workspace/lldb-cmake-sanitized/lldb-build/./bin/llvm-lit -v --time-tests --shuffle --xunit-xml-output=/Users/buildslave/jenkins/workspace/lldb-cmake-sanitized/test/results.xml -v -j 4 --timeout 1200 /Users/buildslave/jenkins/workspace/lldb-cmake-sanitized/lldb-build/tools/lldb/test ninja: build stopped: subcommand failed. Command failed: Command '['/usr/bin/env', 'TERM=vt100', '/usr/local/bin/ninja', '-v', 'check-lldb']' returned non-zero exit status 1. Command: ['/usr/bin/env', 'TERM=vt100', '/usr/local/bin/ninja', '-v', 'check-lldb'] [Pipeline] } [Pipeline] // timeout [Pipeline] } [Pipeline] // stage [Pipeline] stage [Pipeline] { (Declarative: Post Actions) [Pipeline] scanForIssues [Clang (LLVM based)] Sleeping for 5 seconds due to JENKINS-32191... [Clang (LLVM based)] Parsing console log (workspace: '/Users/buildslave/jenkins/workspace/lldb-cmake-sanitized') [Clang (LLVM based)] Successfully parsed console log [Clang (LLVM based)] -> found 5 issues (skipped 2 duplicates) [Clang (LLVM based)] [-ERROR-] Can't create fingerprints for some files: [Clang (LLVM based)] [-ERROR-] - '/Users/buildslave/jenkins/workspace/lldb-cmake-sanitized/lldb-build/{"body":{"category":"console","output":"/Users/buildslave/jenkins/workspace/lldb-cmake-sanitized/llvm-project/lldb/tools/lldb-vscode/ProgressEvent.cpp', IO exception has been thrown: java.nio.file.NoSuchFileException: /Users/buildslave/jenkins/workspace/lldb-cmake-sanitized/lldb-build/{"body":{"category":"console","output":"/Users/buildslave/jenkins/workspace/lldb-cmake-sanitized/llvm-project/lldb/tools/lldb-vscode/ProgressEvent.cpp [Clang (LLVM based)] [-ERROR-] - '/Users/buildslave/jenkins/workspace/lldb-cmake-sanitized/lldb-build/{"body":{"category":"console","output":"/Users/buildslave/jenkins/workspace/lldb-cmake-sanitized/llvm-project/lldb/tools/lldb-vscode/ProgressEvent.cpp', IO exception has been thrown: java.nio.file.NoSuchFileException: /Users/buildslave/jenkins/workspace/lldb-cmake-sanitized/lldb-build/{"body":{"category":"console","output":"/Users/buildslave/jenkins/workspace/lldb-cmake-sanitized/llvm-project/lldb/tools/lldb-vscode/ProgressEvent.cpp [Clang (LLVM based)] Post processing issues on 'green-dragon-23' with source code encoding 'UTF-8' [Clang (LLVM based)] Creating SCM blamer to obtain author and commit information for affected files [Clang (LLVM based)] -> No blamer installed yet. You need to install the 'git-forensics' plugin to enable blaming for Git. [Clang (LLVM based)] Resolving file names for all issues in source directory '/Users/buildslave/jenkins/workspace/lldb-cmake-sanitized' [Clang (LLVM based)] -> resolved paths in source directory (3 found, 1 not found) [Clang (LLVM based)] Resolving module names from module definitions (build.xml, pom.xml, or Manifest.mf files) [Clang (LLVM based)] -> resolved module names for 5 issues [Clang (LLVM based)] Resolving package names (or namespaces) by parsing the affected files [Clang (LLVM based)] -> resolved package names of 4 affected files [Clang (LLVM based)] No filter has been set, publishing all 5 issues [Clang (LLVM based)] Creating fingerprints for all affected code blocks to track issues over different builds [Clang (LLVM based)] -> created fingerprints for 3 issues (skipped 2 issues) [Clang (LLVM based)] Copying affected files to Jenkins' build folder '/Users/Shared/Jenkins/Home/jobs/lldb-cmake-sanitized/builds/1895/files-with-issues' [Clang (LLVM based)] -> 3 copied, 0 not in workspace, 2 not-found, 0 with I/O error [Clang (LLVM based)] Repository miner is not configured, skipping repository mining [Pipeline] junit Recording test results [Checks API] No suitable checks publisher found. [Pipeline] } [Pipeline] // stage [Pipeline] } [Pipeline] // withEnv [Pipeline] } [Pipeline] // node [Pipeline] End of Pipeline ERROR: script returned exit code 1 Finished: FAILURE