Console Output

Skipping 9,499 KB.. Full Log
PASS: lldb-unit :: Symbol/./SymbolTests/TestTypeSystemClang.TestOwningModule (2033 of 2354)
UNSUPPORTED: lldb-api :: functionalities/unwind/standard/TestStandardUnwind.py (2034 of 2354)
PASS: lldb-api :: commands/watchpoints/watchpoint_disable/TestWatchpointDisable.py (2035 of 2354)
PASS: lldb-unit :: DataFormatter/./LLDBFormatterTests/StringPrinterTests.CxxASCII (2036 of 2354)
PASS: lldb-api :: lang/cpp/lambdas/TestLambdas.py (2037 of 2354)
PASS: lldb-api :: lang/cpp/constructors/TestCppConstructors.py (2038 of 2354)
PASS: lldb-unit :: Utility/./UtilityTests/StreamTest.AddressRangeInvalidRange (2039 of 2354)
PASS: lldb-api :: python_api/frame/get-variables/TestGetVariables.py (2040 of 2354)
PASS: lldb-unit :: Symbol/./SymbolTests/TestTypeSystemClang.TestGetBasicTypeFromName (2041 of 2354)
PASS: lldb-unit :: Process/gdb-remote/./ProcessGdbRemoteTests/GDBRemoteCommunicationServerTest.SendErrorResponse_UnimplementedError (2042 of 2354)
PASS: lldb-api :: types/TestLongTypes.py (2043 of 2354)
PASS: lldb-unit :: Interpreter/./InterpreterTests/OptionValueArgs.DeepCopy (2044 of 2354)
PASS: lldb-unit :: UnwindAssembly/x86/./UnwindAssemblyx86Tests/Testx86AssemblyInspectionEngine.TestAddESP (2045 of 2354)
UNSUPPORTED: lldb-api :: functionalities/darwin_log/filter/exact_match/subsystem/TestDarwinLogFilterMatchSubsystem.py (2046 of 2354)
PASS: lldb-api :: functionalities/data-formatter/data-formatter-stl/libcxx/forward_list/TestDataFormatterLibcxxForwardList.py (2047 of 2354)
UNSUPPORTED: lldb-shell :: Subprocess/clone-follow-parent-wp.test (2048 of 2354)
PASS: lldb-unit :: Utility/./UtilityTests/SerializationRountripTest.SerializeDeserializeObjectPointer (2049 of 2354)
PASS: lldb-shell :: Settings/TestStopCommandSourceOnError.test (2050 of 2354)
PASS: lldb-unit :: Utility/./UtilityTests/RangeTest.ContainsRangeStartingFromZero (2051 of 2354)
PASS: lldb-unit :: ObjectFile/MachO/./ObjectFileMachOTests/ObjectFileMachOTest.ModuleFromSharedCacheInfo (2052 of 2354)
PASS: lldb-unit :: Utility/./UtilityTests/StreamTest.AddressRangeEmptyRange (2053 of 2354)
PASS: lldb-unit :: Utility/./UtilityTests/BinaryStreamTest.PutULEB128FiveBytes (2054 of 2354)
PASS: lldb-unit :: Language/Highlighting/./HighlighterTests/HighlighterTest.ClangEmptyInput (2055 of 2354)
PASS: lldb-api :: commands/expression/regression-access-function-template-in-record/TestRegressionAccessFunctionTemplateInRecord.py (2056 of 2354)
PASS: lldb-unit :: UnwindAssembly/x86/./UnwindAssemblyx86Tests/Testx86AssemblyInspectionEngine.Test64bitFramelessSmallStackFrame (2057 of 2354)
PASS: lldb-api :: functionalities/data-formatter/data-formatter-objc/TestDataFormatterObjCNSError.py (2058 of 2354)
PASS: lldb-api :: python_api/target/TestTargetAPI.py (2059 of 2354)
PASS: lldb-shell :: ExecControl/StopHook/stop-hook.test (2060 of 2354)
PASS: lldb-api :: lang/objcxx/objc-builtin-types/TestObjCBuiltinTypes.py (2061 of 2354)
PASS: lldb-unit :: Process/Utility/./ProcessUtilityTests/ProcSMapTests/LinuxProcSMapsTestFixture.ParseSMapRegions/5 (2062 of 2354)
PASS: lldb-unit :: Utility/./UtilityTests/CompletionRequest.TryCompleteCurrentArgBad (2063 of 2354)
PASS: lldb-shell :: BuildScript/script-args.test (2064 of 2354)
PASS: lldb-api :: functionalities/tail_call_frames/ambiguous_tail_call_seq2/TestAmbiguousTailCallSeq2.py (2065 of 2354)
PASS: lldb-api :: api/command-return-object/TestSBCommandReturnObject.py (2066 of 2354)
PASS: lldb-shell :: SymbolFile/Breakpad/line-table.test (2067 of 2354)
PASS: lldb-unit :: Utility/./UtilityTests/TimerTest.CategoryTimes (2068 of 2354)
PASS: lldb-unit :: ScriptInterpreter/Python/./ScriptInterpreterPythonTests/PythonDataObjectsTest.TestPythonCallableCheck (2069 of 2354)
PASS: lldb-shell :: ObjectFile/ELF/compressed-sections.yaml (2070 of 2354)
PASS: lldb-unit :: Process/minidump/./LLDBMinidumpTests/MinidumpParserTest.GetPid (2071 of 2354)
PASS: lldb-api :: lang/objc/objc-new-syntax/TestObjCNewSyntaxDictionary.py (2072 of 2354)
UNSUPPORTED: lldb-api :: commands/register/register/aarch64_sve_registers/rw_access_dynamic_resize/TestSVEThreadedDynamic.py (2073 of 2354)
PASS: lldb-shell :: SymbolFile/DWARF/x86/DW_TAG_basic_type_DW_ATE_UTF_nonC.ll (2074 of 2354)
PASS: lldb-unit :: Host/./HostTests/MainLoopTest.DetectsEOF (2075 of 2354)
PASS: lldb-shell :: Watchpoint/SetErrorCases.test (2076 of 2354)
PASS: lldb-unit :: Utility/./UtilityTests/UriParserTest.BracketedHostnamePort (2077 of 2354)
PASS: lldb-unit :: Utility/./UtilityTests/ConstStringTest.format_provider (2078 of 2354)
PASS: lldb-unit :: Process/minidump/./LLDBMinidumpTests/MinidumpParserTest.GetMemoryRegionInfoFromMemoryList (2079 of 2354)
PASS: lldb-unit :: Utility/./UtilityTests/AnsiTerminal.Twice (2080 of 2354)
PASS: lldb-unit :: Symbol/./SymbolTests/TestTypeSystemClang.TestGetTypeClassDeclType (2081 of 2354)
PASS: lldb-api :: functionalities/thread/state_after_expression/TestStateAfterExpression.py (2082 of 2354)
PASS: lldb-unit :: Utility/./UtilityTests/StringExtractorTest.GetHexBytes_Underflow (2083 of 2354)
PASS: lldb-unit :: ObjectFile/PECOFF/./ObjectFilePECOFFTests/PECallFrameInfoTest.Chained_eh (2084 of 2354)
UNSUPPORTED: lldb-api :: functionalities/ubsan/basic/TestUbsanBasic.py (2085 of 2354)
PASS: lldb-unit :: Utility/./UtilityTests/StringExtractorTest.GetU32LittleEndian (2086 of 2354)
PASS: lldb-unit :: Host/./HostTests/HostInfoTest.GetHostname (2087 of 2354)
PASS: lldb-unit :: Utility/./UtilityTests/VMRange.IsValid (2088 of 2354)
PASS: lldb-api :: functionalities/data-formatter/data-formatter-python-synth/TestDataFormatterPythonSynth.py (2089 of 2354)
PASS: lldb-unit :: Platform/./LLDBPlatformTests/PlatformAppleSimulatorTest.TestHostPlatformToSim (2090 of 2354)
PASS: lldb-unit :: Utility/./UtilityTests/UriParserTest.Empty (2091 of 2354)
PASS: lldb-unit :: Utility/./UtilityTests/StringListTest.SplitIntoLinesSingleTrailingCR (2092 of 2354)
PASS: lldb-api :: commands/platform/basic/TestPlatformPython.py (2093 of 2354)
PASS: lldb-unit :: ScriptInterpreter/Python/./ScriptInterpreterPythonTests/PythonDataObjectsTest.TestPythonDictionaryManipulation (2094 of 2354)
UNSUPPORTED: lldb-shell :: SymbolFile/Breakpad/stack-cfi-arm.yaml (2095 of 2354)
PASS: lldb-api :: commands/expression/import-std-module/forward_decl_from_module/TestForwardDeclFromStdModule.py (2096 of 2354)
PASS: lldb-api :: python_api/sblaunchinfo/TestSBLaunchInfo.py (2097 of 2354)
PASS: lldb-api :: lang/objc/foundation/TestObjectDescriptionAPI.py (2098 of 2354)
PASS: lldb-api :: macosx/indirect_symbol/TestIndirectSymbols.py (2099 of 2354)
PASS: lldb-unit :: Utility/./UtilityTests/ArgsTest.ReplaceArgumentAtIndexEqual (2100 of 2354)
XFAIL: lldb-shell :: Register/x86-mm-xmm-read.test (2101 of 2354)
UNSUPPORTED: lldb-shell :: SymbolFile/PDB/expressions.test (2102 of 2354)
PASS: lldb-api :: lang/objcxx/cpp_keywords_enabled/TestObjCppKeywordsEnabled.py (2103 of 2354)
PASS: lldb-api :: functionalities/gdb_remote_client/TestTargetXMLArch.py (2104 of 2354)
PASS: lldb-unit :: SymbolFile/DWARF/./SymbolFileDWARFTests/DWARFUnitTest.MissingSentinel (2105 of 2354)
PASS: lldb-api :: functionalities/thread/exit_during_break/TestExitDuringBreak.py (2106 of 2354)
PASS: lldb-api :: commands/expression/import-std-module/non-module-type-separation/TestNonModuleTypeSeparation.py (2107 of 2354)
PASS: lldb-unit :: tools/lldb-server/tests/./LLDBServerTests/TestBase.LaunchModePreservesEnvironment (2108 of 2354)
PASS: lldb-shell :: BuildScript/toolchain-clang.test (2109 of 2354)
PASS: lldb-api :: lang/cpp/unique-types/TestUniqueTypes.py (2110 of 2354)
PASS: lldb-api :: python_api/value/change_values/TestChangeValueAPI.py (2111 of 2354)
PASS: lldb-unit :: ScriptInterpreter/Python/./ScriptInterpreterPythonTests/PythonDataObjectsTest.TestObjectAttributes (2112 of 2354)
PASS: lldb-api :: macosx/find-dsym/bundle-with-dot-in-filename/TestBundleWithDotInFilename.py (2113 of 2354)
PASS: lldb-unit :: Utility/./UtilityTests/BinaryStreamTest.PutULEB128OneByte (2114 of 2354)
PASS: lldb-unit :: Core/./LLDBCoreTests/SourceFileCache.FindSourceFileFound (2115 of 2354)
PASS: lldb-unit :: Utility/./UtilityTests/XcodeSDKTest.SDKSupportsSwift (2116 of 2354)
UNSUPPORTED: lldb-api :: functionalities/longjmp/TestLongjmp.py (2117 of 2354)
PASS: lldb-shell :: ObjectFile/ELF/base-address.yaml (2118 of 2354)
PASS: lldb-unit :: Process/minidump/./LLDBMinidumpTests/RegisterContextMinidump.CheckRegisterContextMinidump_ARM (2119 of 2354)
PASS: lldb-api :: functionalities/data-formatter/stringprinter/TestStringPrinter.py (2120 of 2354)
PASS: lldb-unit :: Utility/./UtilityTests/UriParserTest.SchemeHostSeparator2 (2121 of 2354)
PASS: lldb-unit :: SymbolFile/NativePDB/./SymbolFileNativePDBTests/PDBFPOProgramToDWARFExpressionTests.UnresolvedDependentCyclicRegisterAssignmentReference (2122 of 2354)
UNSUPPORTED: lldb-api :: lang/objc/modules-update/TestClangModulesUpdate.py (2123 of 2354)
PASS: lldb-unit :: Utility/./UtilityTests/StreamTest.PutChar (2124 of 2354)
PASS: lldb-api :: functionalities/thread/num_threads/TestNumThreads.py (2125 of 2354)
UNSUPPORTED: lldb-api :: tools/lldb-server/TestGdbRemoteModuleInfo.py (2126 of 2354)
PASS: lldb-shell :: ObjectFile/ELF/netbsd-exec-8.99.30-amd64.yaml (2127 of 2354)
UNSUPPORTED: lldb-api :: tools/lldb-server/vCont-threads/TestGdbRemote_vContThreads.py (2128 of 2354)
PASS: lldb-api :: functionalities/breakpoint/breakpoint_options/TestBreakpointOptions.py (2129 of 2354)
PASS: lldb-api :: lang/cpp/namespace/TestNamespace.py (2130 of 2354)
UNSUPPORTED: lldb-shell :: SymbolFile/PDB/udt-layout.test (2131 of 2354)
PASS: lldb-api :: functionalities/inline-stepping/TestInlineStepping.py (2132 of 2354)
PASS: lldb-unit :: Utility/./UtilityTests/RangeTest.ContainsEndInclusiveInvalid (2133 of 2354)
UNSUPPORTED: lldb-api :: commands/register/register/aarch64_dynamic_regset/TestArm64DynamicRegsets.py (2134 of 2354)
PASS: lldb-unit :: Utility/./UtilityTests/CompletionRequest.FakeLastArg (2135 of 2354)
PASS: lldb-unit :: Utility/./UtilityTests/ProcessInstanceInfoMatch.Name (2136 of 2354)
PASS: lldb-api :: lang/objc/foundation/TestConstStrings.py (2137 of 2354)
PASS: lldb-api :: lang/objc/objc_direct-methods/TestObjCDirectMethods.py (2138 of 2354)
PASS: lldb-api :: commands/command/delete/TestCommandDelete.py (2139 of 2354)
PASS: lldb-unit :: Utility/./UtilityTests/ArgsTest.TestArgv (2140 of 2354)
PASS: lldb-api :: commands/expression/import-std-module/pair/TestPairFromStdModule.py (2141 of 2354)
PASS: lldb-unit :: SymbolFile/NativePDB/./SymbolFileNativePDBTests/PDBFPOProgramToDWARFExpressionTests.InvalidAssignmentSingle (2142 of 2354)
PASS: lldb-api :: lang/cpp/unsigned_types/TestUnsignedTypes.py (2143 of 2354)
PASS: lldb-unit :: Process/gdb-remote/./ProcessGdbRemoteTests/GDBRemoteClientBaseTest.SendContinueAndWait (2144 of 2354)
PASS: lldb-unit :: Utility/./UtilityTests/StringExtractorTest.GetU64BigEndian (2145 of 2354)
PASS: lldb-unit :: Utility/./UtilityTests/StringLexerTest.GetUnlexed (2146 of 2354)
PASS: lldb-unit :: Utility/./UtilityTests/AnsiTerminal.AtEnd (2147 of 2354)
PASS: lldb-api :: commands/target/stop-hook/disable/TestTargetStopHookDisable.py (2148 of 2354)
PASS: lldb-api :: functionalities/signal/TestSendSignal.py (2149 of 2354)
PASS: lldb-unit :: Thread/./ThreadTests/ThreadTest.GetPrivateStopInfo (2150 of 2354)
PASS: lldb-api :: commands/watchpoints/watchpoint_commands/command/TestWatchpointCommandLLDB.py (2151 of 2354)
PASS: lldb-unit :: Utility/./UtilityTests/AnsiTerminal.Unknown (2152 of 2354)
PASS: lldb-unit :: Language/Highlighting/./HighlighterTests/HighlighterTest.ClangStringLiterals (2153 of 2354)
PASS: lldb-api :: macosx/skinny-corefile/TestSkinnyCorefile.py (2154 of 2354)
PASS: lldb-unit :: Utility/./UtilityTests/ScalarTest.Equality (2155 of 2354)
PASS: lldb-api :: lang/c/register_variables/TestRegisterVariables.py (2156 of 2354)
PASS: lldb-api :: functionalities/reproducers/fs-case-sensitivity/TestReproducerFSCaseSensitivity.py (2157 of 2354)
PASS: lldb-unit :: Target/./TargetTests/ModuleCacheTest.GetAndPutUuidExists (2158 of 2354)
PASS: lldb-unit :: Symbol/./SymbolTests/TestClangASTImporter.CanImportInvalidType (2159 of 2354)
PASS: lldb-api :: lang/objc/direct-dispatch-step/TestObjCDirectDispatchStepping.py (2160 of 2354)
PASS: lldb-unit :: Language/Highlighting/./HighlighterTests/HighlighterTest.ClangCursorPos (2161 of 2354)
PASS: lldb-unit :: Utility/./UtilityTests/StringExtractorTest.GetHexBytesAvail_Partial (2162 of 2354)
PASS: lldb-unit :: Utility/./UtilityTests/RangeTest.DefaultConstructor (2163 of 2354)
PASS: lldb-shell :: Breakpoint/dummy-target.test (2164 of 2354)
PASS: lldb-unit :: UnwindAssembly/x86/./UnwindAssemblyx86Tests/Testx86AssemblyInspectionEngine.TestSimple64bitFrameFunction (2165 of 2354)
PASS: lldb-shell :: ScriptInterpreter/Python/Crashlog/json.test (2166 of 2354)
PASS: lldb-unit :: Process/minidump/./LLDBMinidumpTests/RegisterContextMinidump.ConvertMinidumpContext_x86_32 (2167 of 2354)
PASS: lldb-unit :: Utility/./UtilityTests/StringListTest.ShiftStdString (2168 of 2354)
PASS: lldb-unit :: SymbolFile/NativePDB/./SymbolFileNativePDBTests/PDBFPOProgramToDWARFExpressionTests.DependencyChain (2169 of 2354)
PASS: lldb-unit :: Utility/./UtilityTests/RangeTest.Equal (2170 of 2354)
PASS: lldb-unit :: Process/Utility/./ProcessUtilityTests/MemoryTagManagerAArch64MTETest.AddressDiff (2171 of 2354)
PASS: lldb-unit :: Process/gdb-remote/./ProcessGdbRemoteTests/GDBRemoteClientBaseTest.SendContinueAndAsyncSignal (2172 of 2354)
PASS: lldb-unit :: Core/./LLDBCoreTests/CommunicationTest.SynchronizeWhileClosing (2173 of 2354)
PASS: lldb-api :: lang/cpp/class_static/TestStaticVariables.py (2174 of 2354)
PASS: lldb-api :: functionalities/conditional_break/TestConditionalBreak.py (2175 of 2354)
PASS: lldb-shell :: SymbolFile/NativePDB/nested-types.cpp (2176 of 2354)
PASS: lldb-api :: functionalities/tail_call_frames/cross_dso/TestCrossDSOTailCalls.py (2177 of 2354)
PASS: lldb-api :: commands/expression/result_numbering/TestResultNumbering.py (2178 of 2354)
PASS: lldb-unit :: Process/gdb-remote/./ProcessGdbRemoteTests/GDBRemoteCommunicationClientTest.SyncThreadState (2179 of 2354)
PASS: lldb-api :: functionalities/value_md5_crash/TestValueMD5Crash.py (2180 of 2354)
PASS: lldb-api :: functionalities/gdb_remote_client/TestRestartBug.py (2181 of 2354)
PASS: lldb-shell :: ObjectFile/ELF/short-build-id.yaml (2182 of 2354)
PASS: lldb-api :: lang/objcxx/hide-runtime-values/TestObjCXXHideRuntimeValues.py (2183 of 2354)
PASS: lldb-unit :: Utility/./UtilityTests/Predicate.WaitForValueEqualTo (2184 of 2354)
PASS: lldb-api :: functionalities/target_var/TestTargetVar.py (2185 of 2354)
PASS: lldb-unit :: SymbolFile/DWARF/./SymbolFileDWARFTests/SymbolFileDWARFTests.ParseArangesNonzeroSegmentSize (2186 of 2354)
PASS: lldb-unit :: Utility/./UtilityTests/UserIDResolver.GetGroupName (2187 of 2354)
PASS: lldb-shell :: SymbolFile/DWARF/x86/debug-types-signature-loop.s (2188 of 2354)
PASS: lldb-unit :: Symbol/./SymbolTests/TestTypeSystemClang.TemplateArguments (2189 of 2354)
PASS: lldb-api :: functionalities/breakpoint/move_nearest/TestMoveNearest.py (2190 of 2354)
PASS: lldb-unit :: Utility/./UtilityTests/NameMatchesTest.EndsWith (2191 of 2354)
UNSUPPORTED: lldb-api :: commands/trace/multiple-threads/TestTraceStartStopMultipleThreads.py (2192 of 2354)
PASS: lldb-shell :: Settings/TestDefaultModuleCachePath.test (2193 of 2354)
PASS: lldb-unit :: Utility/./UtilityTests/SharedCluster.ClusterManager (2194 of 2354)
PASS: lldb-api :: lang/cpp/exceptions/TestCPPExceptionBreakpoints.py (2195 of 2354)
PASS: lldb-unit :: Utility/./UtilityTests/StreamTest.PutCharWhitespace (2196 of 2354)
PASS: lldb-unit :: Utility/./UtilityTests/ListenerTest.GetEventWait (2197 of 2354)
PASS: lldb-shell :: Minidump/Windows/broken-unwind.test (2198 of 2354)
PASS: lldb-unit :: Symbol/./SymbolTests/DWARFCallFrameInfoTest.Basic_eh (2199 of 2354)
PASS: lldb-unit :: Utility/./UtilityTests/StreamTest.PutULEB128 (2200 of 2354)
PASS: lldb-unit :: Utility/./UtilityTests/BinaryStreamTest.PutULEB128ThreeBytes (2201 of 2354)
PASS: lldb-api :: functionalities/inferior-crashing/TestInferiorCrashing.py (2202 of 2354)
PASS: lldb-unit :: Process/minidump/./LLDBMinidumpTests/MinidumpParserTest.GetMemoryRegionInfoFromMemory64List (2203 of 2354)
PASS: lldb-shell :: SymbolFile/NativePDB/break-by-line.cpp (2204 of 2354)
PASS: lldb-api :: functionalities/tail_call_frames/sbapi_support/TestTailCallFrameSBAPI.py (2205 of 2354)
PASS: lldb-unit :: Host/./HostTests/SocketTests/SocketTest.TCPListen0ConnectAccept/ipv6 (2206 of 2354)
PASS: lldb-api :: lang/cpp/overloaded-functions/TestOverloadedFunctions.py (2207 of 2354)
UNSUPPORTED: lldb-api :: commands/trace/TestTraceDumpInstructions.py (2208 of 2354)
PASS: lldb-unit :: Utility/./UtilityTests/StringExtractorTest.InitEmpty (2209 of 2354)
PASS: lldb-unit :: Utility/./UtilityTests/BinaryStreamTest.PutSLEB128FourBytes (2210 of 2354)
PASS: lldb-unit :: ScriptInterpreter/Python/./ScriptInterpreterPythonTests/PythonDataObjectsTest.TestGlobalNameResolutionWithDot (2211 of 2354)
PASS: lldb-api :: lang/c/cpp_keyword_identifiers/TestCppKeywordsAsCIdentifiers.py (2212 of 2354)
FAIL: lldb-api :: tools/lldb-vscode/evaluate/TestVSCode_evaluate.py (2213 of 2354)
******************** TEST 'lldb-api :: tools/lldb-vscode/evaluate/TestVSCode_evaluate.py' FAILED ********************
Script:
--
/Users/buildslave/jenkins/workspace/lldb-cmake-sanitized/lldb-build/lldb-test-build.noindex/copied-python /Users/buildslave/jenkins/workspace/lldb-cmake-sanitized/llvm-project/lldb/test/API/dotest.py -u CXXFLAGS -u CFLAGS --codesign-identity lldb_codesign --arch x86_64 --build-dir /Users/buildslave/jenkins/workspace/lldb-cmake-sanitized/lldb-build/lldb-test-build.noindex -t --env TERM=vt100 --env LLVM_LIBS_DIR=/Users/buildslave/jenkins/workspace/lldb-cmake-sanitized/lldb-build/./lib --inferior-env ASAN_OPTIONS=detect_stack_use_after_return=1 --inferior-env DYLD_INSERT_LIBRARIES=/Users/buildslave/jenkins/workspace/lldb-cmake-sanitized/host-compiler/lib/clang/13.0.99/lib/darwin/libclang_rt.asan_osx_dynamic.dylib --arch x86_64 --build-dir /Users/buildslave/jenkins/workspace/lldb-cmake-sanitized/lldb-build/lldb-test-build.noindex --lldb-module-cache-dir /Users/buildslave/jenkins/workspace/lldb-cmake-sanitized/lldb-build/lldb-test-build.noindex/module-cache-lldb/lldb-api --clang-module-cache-dir /Users/buildslave/jenkins/workspace/lldb-cmake-sanitized/lldb-build/lldb-test-build.noindex/module-cache-clang/lldb-api --executable /Users/buildslave/jenkins/workspace/lldb-cmake-sanitized/lldb-build/./bin/lldb --compiler /Users/buildslave/jenkins/workspace/lldb-cmake-sanitized/host-compiler/bin/clang --dsymutil /Users/buildslave/jenkins/workspace/lldb-cmake-sanitized/lldb-build/./bin/dsymutil --llvm-tools-dir /Users/buildslave/jenkins/workspace/lldb-cmake-sanitized/lldb-build/./bin --lldb-libs-dir /Users/buildslave/jenkins/workspace/lldb-cmake-sanitized/lldb-build/./lib /Users/buildslave/jenkins/workspace/lldb-cmake-sanitized/llvm-project/lldb/test/API/tools/lldb-vscode/evaluate -p TestVSCode_evaluate.py
--
Exit Code: 1

Hide Details

Command Output (stdout): -- lldb version 13.0.99 (http://labmaster3.local/git/llvm-project.git revision 7c73c2ede8088802adb8191d05cad09e3ad88539) clang revision 7c73c2ede8088802adb8191d05cad09e3ad88539 llvm revision 7c73c2ede8088802adb8191d05cad09e3ad88539 Skipping the following test categories: ['darwin-log', 'libstdcxx', 'dwo', 'llgs', 'fork'] ========= DEBUG ADAPTER PROTOCOL LOGS ========= --> Content-Length: 284

Hide Details

{"command":"initialize","type":"request","arguments":{"adapterID":"lldb-native","clientID":"vscode","columnsStartAt1":true,"linesStartAt1":true,"locale":"en-us","pathFormat":"path","supportsRunInTerminalRequest":true,"supportsVariablePaging":true,"supportsVariableType":true},"seq":1} <-- Content-Length: 1222

Hide Details

{"body":{"exceptionBreakpointFilters":[{"default":false,"filter":"cpp_catch","label":"C++ Catch"},{"default":false,"filter":"cpp_throw","label":"C++ Throw"},{"default":false,"filter":"objc_catch","label":"Objective C Catch"},{"default":false,"filter":"objc_throw","label":"Objective C Throw"},{"default":false,"filter":"swift_catch","label":"Swift Catch"},{"default":false,"filter":"swift_throw","label":"Swift Throw"}],"supportTerminateDebuggee":true,"supportsCompletionsRequest":false,"supportsConditionalBreakpoints":true,"supportsConfigurationDoneRequest":true,"supportsDelayedStackTraceLoading":true,"supportsEvaluateForHovers":true,"supportsExceptionInfoRequest":true,"supportsExceptionOptions":true,"supportsFunctionBreakpoints":true,"supportsGotoTargetsRequest":false,"supportsHitConditionalBreakpoints":true,"supportsLoadedSourcesRequest":false,"supportsModulesRequest":false,"supportsProgressReporting":true,"supportsRestartFrame":false,"supportsRestartRequest":false,"supportsRunInTerminalRequest":true,"supportsSetVariable":true,"supportsStepBack":false,"supportsStepInTargetsRequest":false,"supportsValueFormattingOptions":true},"command":"initialize","request_seq":1,"seq":0,"success":true,"type":"response"} --> Content-Length: 1043

Hide Details

{"command":"launch","type":"request","arguments":{"program":"/Users/buildslave/jenkins/workspace/lldb-cmake-sanitized/lldb-build/lldb-test-build.noindex/tools/lldb-vscode/evaluate/TestVSCode_evaluate.test_generic_evaluate_expressions/a.out","disableASLR":true,"initCommands":["settings clear -all","settings set symbols.enable-external-lookup false","settings set target.inherit-tcc true","settings set target.detach-on-error false","settings set target.auto-apply-fixits false","settings set plugin.process.gdb-remote.packet-timeout 60","settings set symbols.clang-modules-cache-path \"/Users/buildslave/jenkins/workspace/lldb-cmake-sanitized/lldb-build/lldb-test-build.noindex/module-cache-lldb/lldb-api\"","settings set use-color false","setting set target.prefer-dynamic-value no-dynamic-values","settings set target.env-vars ASAN_OPTIONS=detect_stack_use_after_return=1 DYLD_INSERT_LIBRARIES=/Users/buildslave/jenkins/workspace/lldb-cmake-sanitized/host-compiler/lib/clang/13.0.99/lib/darwin/libclang_rt.asan_osx_dynamic.dylib"]},"seq":2} <-- Content-Length: 923

Hide Details

{"body":{"category":"console","output":"Running initCommands:\n(lldb) settings clear -all\n(lldb) settings set symbols.enable-external-lookup false\n(lldb) settings set target.inherit-tcc true\n(lldb) settings set target.detach-on-error false\n(lldb) settings set target.auto-apply-fixits false\n(lldb) settings set plugin.process.gdb-remote.packet-timeout 60\n(lldb) settings set symbols.clang-modules-cache-path \"/Users/buildslave/jenkins/workspace/lldb-cmake-sanitized/lldb-build/lldb-test-build.noindex/module-cache-lldb/lldb-api\"\n(lldb) settings set use-color false\n(lldb) setting set target.prefer-dynamic-value no-dynamic-values\n(lldb) settings set target.env-vars ASAN_OPTIONS=detect_stack_use_after_return=1 DYLD_INSERT_LIBRARIES=/Users/buildslave/jenkins/workspace/lldb-cmake-sanitized/host-compiler/lib/clang/13.0.99/lib/darwin/libclang_rt.asan_osx_dynamic.dylib\n"},"event":"output","seq":0,"type":"event"} <-- Content-Length: 77

Hide Details

{"command":"launch","request_seq":2,"seq":0,"success":true,"type":"response"} <-- Content-Length: 308

Hide Details

{"body":{"isLocalProcess":true,"name":"/Users/buildslave/jenkins/workspace/lldb-cmake-sanitized/lldb-build/lldb-test-build.noindex/tools/lldb-vscode/evaluate/TestVSCode_evaluate.test_generic_evaluate_expressions/a.out","startMethod":"launch","systemProcessId":93571},"event":"process","seq":0,"type":"event"} <-- Content-Length: 46

Hide Details

{"event":"initialized","seq":0,"type":"event"} --> Content-Length: 276

Hide Details

{"command":"setBreakpoints","type":"request","arguments":{"source":{"name":"main.cpp","path":"main.cpp"},"sourceModified":false,"lines":"[23, 27, 11, 35, 40, 44, 45]","breakpoints":[{"line":23},{"line":27},{"line":11},{"line":35},{"line":40},{"line":44},{"line":45}]},"seq":3} <-- Content-Length: 684

Hide Details

{"body":{"breakpoints":[{"id":1,"line":23,"source":{"name":"main.cpp","path":"main.cpp"},"verified":true},{"id":2,"line":27,"source":{"name":"main.cpp","path":"main.cpp"},"verified":true},{"id":3,"line":11,"source":{"name":"main.cpp","path":"main.cpp"},"verified":true},{"id":4,"line":35,"source":{"name":"main.cpp","path":"main.cpp"},"verified":true},{"id":5,"line":40,"source":{"name":"main.cpp","path":"main.cpp"},"verified":true},{"id":6,"line":44,"source":{"name":"main.cpp","path":"main.cpp"},"verified":true},{"id":7,"line":45,"source":{"name":"main.cpp","path":"main.cpp"},"verified":true}]},"command":"setBreakpoints","request_seq":3,"seq":0,"success":true,"type":"response"} --> Content-Length: 71

Hide Details

{"command":"configurationDone","type":"request","arguments":{},"seq":4} <-- Content-Length: 88

Hide Details

{"command":"configurationDone","request_seq":4,"seq":0,"success":true,"type":"response"} <-- Content-Length: 199

Hide Details

{"body":{"allThreadsStopped":true,"description":"breakpoint 1.1","preserveFocusHint":false,"reason":"breakpoint","threadCausedFocus":true,"threadId":2085261},"event":"stopped","seq":0,"type":"event"} --> Content-Length: 61

Hide Details

{"command":"threads","type":"request","arguments":{},"seq":5} <-- Content-Length: 133

Hide Details

{"body":{"threads":[{"id":2085261,"name":"Thread #1"}]},"command":"threads","request_seq":5,"seq":0,"success":true,"type":"response"} --> Content-Length: 108

Hide Details

{"command":"stackTrace","type":"request","arguments":{"threadId":2085261,"startFrame":0,"levels":1},"seq":6} <-- Content-Length: 330

Hide Details

{"body":{"stackFrames":[{"column":14,"id":524288,"line":23,"name":"main","source":{"name":"main.cpp","path":"/Users/buildslave/jenkins/workspace/lldb-cmake-sanitized/llvm-project/lldb/test/API/tools/lldb-vscode/evaluate/main.cpp"}}],"totalFrames":2},"command":"stackTrace","request_seq":6,"seq":0,"success":true,"type":"response"} --> Content-Length: 113

Hide Details

{"command":"evaluate","type":"request","arguments":{"expression":"var1","context":null,"frameId":524288},"seq":7} <-- Content-Length: 138

Hide Details

{"body":{"result":"20","type":"int","variablesReference":0},"command":"evaluate","request_seq":7,"seq":0,"success":true,"type":"response"} --> Content-Length: 108

Hide Details

{"command":"stackTrace","type":"request","arguments":{"threadId":2085261,"startFrame":0,"levels":1},"seq":8} <-- Content-Length: 330

Hide Details

{"body":{"stackFrames":[{"column":14,"id":524288,"line":23,"name":"main","source":{"name":"main.cpp","path":"/Users/buildslave/jenkins/workspace/lldb-cmake-sanitized/llvm-project/lldb/test/API/tools/lldb-vscode/evaluate/main.cpp"}}],"totalFrames":2},"command":"stackTrace","request_seq":8,"seq":0,"success":true,"type":"response"} --> Content-Length: 113

Hide Details

{"command":"evaluate","type":"request","arguments":{"expression":"var2","context":null,"frameId":524288},"seq":9} <-- Content-Length: 138

Hide Details

{"body":{"result":"21","type":"int","variablesReference":0},"command":"evaluate","request_seq":9,"seq":0,"success":true,"type":"response"} --> Content-Length: 109

Hide Details

{"command":"stackTrace","type":"request","arguments":{"threadId":2085261,"startFrame":0,"levels":1},"seq":10} <-- Content-Length: 331

Hide Details

{"body":{"stackFrames":[{"column":14,"id":524288,"line":23,"name":"main","source":{"name":"main.cpp","path":"/Users/buildslave/jenkins/workspace/lldb-cmake-sanitized/llvm-project/lldb/test/API/tools/lldb-vscode/evaluate/main.cpp"}}],"totalFrames":2},"command":"stackTrace","request_seq":10,"seq":0,"success":true,"type":"response"} --> Content-Length: 120

Hide Details

{"command":"evaluate","type":"request","arguments":{"expression":"static_int","context":null,"frameId":524288},"seq":11} <-- Content-Length: 139

Hide Details

{"body":{"result":"42","type":"int","variablesReference":0},"command":"evaluate","request_seq":11,"seq":0,"success":true,"type":"response"} --> Content-Length: 109

Hide Details

{"command":"stackTrace","type":"request","arguments":{"threadId":2085261,"startFrame":0,"levels":1},"seq":12} <-- Content-Length: 331

Hide Details

{"body":{"stackFrames":[{"column":14,"id":524288,"line":23,"name":"main","source":{"name":"main.cpp","path":"/Users/buildslave/jenkins/workspace/lldb-cmake-sanitized/llvm-project/lldb/test/API/tools/lldb-vscode/evaluate/main.cpp"}}],"totalFrames":2},"command":"stackTrace","request_seq":12,"seq":0,"success":true,"type":"response"} --> Content-Length: 124

Hide Details

{"command":"evaluate","type":"request","arguments":{"expression":"non_static_int","context":null,"frameId":524288},"seq":13} <-- Content-Length: 139

Hide Details

{"body":{"result":"43","type":"int","variablesReference":0},"command":"evaluate","request_seq":13,"seq":0,"success":true,"type":"response"} --> Content-Length: 109

Hide Details

{"command":"stackTrace","type":"request","arguments":{"threadId":2085261,"startFrame":0,"levels":1},"seq":14} <-- Content-Length: 331

Hide Details

{"body":{"stackFrames":[{"column":14,"id":524288,"line":23,"name":"main","source":{"name":"main.cpp","path":"/Users/buildslave/jenkins/workspace/lldb-cmake-sanitized/llvm-project/lldb/test/API/tools/lldb-vscode/evaluate/main.cpp"}}],"totalFrames":2},"command":"stackTrace","request_seq":14,"seq":0,"success":true,"type":"response"} --> Content-Length: 117

Hide Details

{"command":"evaluate","type":"request","arguments":{"expression":"struct1","context":null,"frameId":524288},"seq":15} <-- Content-Length: 169

Hide Details

{"body":{"result":"my_struct @ 0x7ffeefbff7c8","type":"my_struct","variablesReference":4},"command":"evaluate","request_seq":15,"seq":0,"success":true,"type":"response"} --> Content-Length: 109

Hide Details

{"command":"stackTrace","type":"request","arguments":{"threadId":2085261,"startFrame":0,"levels":1},"seq":16} <-- Content-Length: 331

Hide Details

{"body":{"stackFrames":[{"column":14,"id":524288,"line":23,"name":"main","source":{"name":"main.cpp","path":"/Users/buildslave/jenkins/workspace/lldb-cmake-sanitized/llvm-project/lldb/test/API/tools/lldb-vscode/evaluate/main.cpp"}}],"totalFrames":2},"command":"stackTrace","request_seq":16,"seq":0,"success":true,"type":"response"} --> Content-Length: 121

Hide Details

{"command":"evaluate","type":"request","arguments":{"expression":"struct1.foo","context":null,"frameId":524288},"seq":17} <-- Content-Length: 139

Hide Details

{"body":{"result":"15","type":"int","variablesReference":0},"command":"evaluate","request_seq":17,"seq":0,"success":true,"type":"response"} --> Content-Length: 109

Hide Details

{"command":"stackTrace","type":"request","arguments":{"threadId":2085261,"startFrame":0,"levels":1},"seq":18} <-- Content-Length: 331

Hide Details

{"body":{"stackFrames":[{"column":14,"id":524288,"line":23,"name":"main","source":{"name":"main.cpp","path":"/Users/buildslave/jenkins/workspace/lldb-cmake-sanitized/llvm-project/lldb/test/API/tools/lldb-vscode/evaluate/main.cpp"}}],"totalFrames":2},"command":"stackTrace","request_seq":18,"seq":0,"success":true,"type":"response"} --> Content-Length: 122

Hide Details

{"command":"evaluate","type":"request","arguments":{"expression":"struct2->foo","context":null,"frameId":524288},"seq":19} <-- Content-Length: 139

Hide Details

{"body":{"result":"16","type":"int","variablesReference":0},"command":"evaluate","request_seq":19,"seq":0,"success":true,"type":"response"} --> Content-Length: 109

Hide Details

{"command":"stackTrace","type":"request","arguments":{"threadId":2085261,"startFrame":0,"levels":1},"seq":20} <-- Content-Length: 331

Hide Details

{"body":{"stackFrames":[{"column":14,"id":524288,"line":23,"name":"main","source":{"name":"main.cpp","path":"/Users/buildslave/jenkins/workspace/lldb-cmake-sanitized/llvm-project/lldb/test/API/tools/lldb-vscode/evaluate/main.cpp"}}],"totalFrames":2},"command":"stackTrace","request_seq":20,"seq":0,"success":true,"type":"response"} --> Content-Length: 113

Hide Details

{"command":"evaluate","type":"request","arguments":{"expression":"var","context":null,"frameId":524288},"seq":21} <-- Content-Length: 209

Hide Details

{"body":{},"command":"evaluate","message":"expression failed to parse:\nerror: <user expression 0>:1:1: use of undeclared identifier 'var'\nvar\n^\n","request_seq":21,"seq":0,"success":false,"type":"response"} --> Content-Length: 109

Hide Details

{"command":"stackTrace","type":"request","arguments":{"threadId":2085261,"startFrame":0,"levels":1},"seq":22} <-- Content-Length: 331

Hide Details

{"body":{"stackFrames":[{"column":14,"id":524288,"line":23,"name":"main","source":{"name":"main.cpp","path":"/Users/buildslave/jenkins/workspace/lldb-cmake-sanitized/llvm-project/lldb/test/API/tools/lldb-vscode/evaluate/main.cpp"}}],"totalFrames":2},"command":"stackTrace","request_seq":22,"seq":0,"success":true,"type":"response"} --> Content-Length: 119

Hide Details

{"command":"evaluate","type":"request","arguments":{"expression":"my_struct","context":null,"frameId":524288},"seq":23} <-- Content-Length: 311

Hide Details

{"body":{"category":"console","output":"/Users/buildslave/jenkins/workspace/lldb-cmake-sanitized/llvm-project/lldb/tools/lldb-vscode/ProgressEvent.cpp:89:64: runtime error: load of value 808464432, which is not a valid value for type 'lldb_vscode::ProgressEventType'\n"},"event":"output","seq":0,"type":"event"} <-- Content-Length: 261

Hide Details

{"body":{"category":"console","output":"SUMMARY: UndefinedBehaviorSanitizer: undefined-behavior /Users/buildslave/jenkins/workspace/lldb-cmake-sanitized/llvm-project/lldb/tools/lldb-vscode/ProgressEvent.cpp:89:64 in \n"},"event":"output","seq":0,"type":"event"} <-- Content-Length: 170

Hide Details

{"body":{"category":"console","output":"PLEASE submit a bug report to https://bugs.llvm.org/ and include the crash backtrace.\n"},"event":"output","seq":0,"type":"event"} <-- Content-Length: 117

Hide Details

{"body":{},"command":"evaluate","message":"unknown error","request_seq":23,"seq":0,"success":false,"type":"response"} --> Content-Length: 109

Hide Details

{"command":"stackTrace","type":"request","arguments":{"threadId":2085261,"startFrame":0,"levels":1},"seq":24} <-- Content-Length: 331

Hide Details

{"body":{"stackFrames":[{"column":14,"id":524288,"line":23,"name":"main","source":{"name":"main.cpp","path":"/Users/buildslave/jenkins/workspace/lldb-cmake-sanitized/llvm-project/lldb/test/API/tools/lldb-vscode/evaluate/main.cpp"}}],"totalFrames":2},"command":"stackTrace","request_seq":24,"seq":0,"success":true,"type":"response"} --> Content-Length: 113

Hide Details

{"command":"evaluate","type":"request","arguments":{"expression":"int","context":null,"frameId":524288},"seq":25}

Hide Details

========= END ========= ========= DEBUG ADAPTER PROTOCOL LOGS ========= --> Content-Length: 284

Hide Details

{"command":"initialize","type":"request","arguments":{"adapterID":"lldb-native","clientID":"vscode","columnsStartAt1":true,"linesStartAt1":true,"locale":"en-us","pathFormat":"path","supportsRunInTerminalRequest":true,"supportsVariablePaging":true,"supportsVariableType":true},"seq":1} <-- Content-Length: 1222

Hide Details

{"body":{"exceptionBreakpointFilters":[{"default":false,"filter":"cpp_catch","label":"C++ Catch"},{"default":false,"filter":"cpp_throw","label":"C++ Throw"},{"default":false,"filter":"objc_catch","label":"Objective C Catch"},{"default":false,"filter":"objc_throw","label":"Objective C Throw"},{"default":false,"filter":"swift_catch","label":"Swift Catch"},{"default":false,"filter":"swift_throw","label":"Swift Throw"}],"supportTerminateDebuggee":true,"supportsCompletionsRequest":false,"supportsConditionalBreakpoints":true,"supportsConfigurationDoneRequest":true,"supportsDelayedStackTraceLoading":true,"supportsEvaluateForHovers":true,"supportsExceptionInfoRequest":true,"supportsExceptionOptions":true,"supportsFunctionBreakpoints":true,"supportsGotoTargetsRequest":false,"supportsHitConditionalBreakpoints":true,"supportsLoadedSourcesRequest":false,"supportsModulesRequest":false,"supportsProgressReporting":true,"supportsRestartFrame":false,"supportsRestartRequest":false,"supportsRunInTerminalRequest":true,"supportsSetVariable":true,"supportsStepBack":false,"supportsStepInTargetsRequest":false,"supportsValueFormattingOptions":true},"command":"initialize","request_seq":1,"seq":0,"success":true,"type":"response"} --> Content-Length: 1041

Hide Details

{"command":"launch","type":"request","arguments":{"program":"/Users/buildslave/jenkins/workspace/lldb-cmake-sanitized/lldb-build/lldb-test-build.noindex/tools/lldb-vscode/evaluate/TestVSCode_evaluate.test_hover_evaluate_expressions/a.out","disableASLR":true,"initCommands":["settings clear -all","settings set symbols.enable-external-lookup false","settings set target.inherit-tcc true","settings set target.detach-on-error false","settings set target.auto-apply-fixits false","settings set plugin.process.gdb-remote.packet-timeout 60","settings set symbols.clang-modules-cache-path \"/Users/buildslave/jenkins/workspace/lldb-cmake-sanitized/lldb-build/lldb-test-build.noindex/module-cache-lldb/lldb-api\"","settings set use-color false","setting set target.prefer-dynamic-value no-dynamic-values","settings set target.env-vars ASAN_OPTIONS=detect_stack_use_after_return=1 DYLD_INSERT_LIBRARIES=/Users/buildslave/jenkins/workspace/lldb-cmake-sanitized/host-compiler/lib/clang/13.0.99/lib/darwin/libclang_rt.asan_osx_dynamic.dylib"]},"seq":2} <-- Content-Length: 923

Hide Details

{"body":{"category":"console","output":"Running initCommands:\n(lldb) settings clear -all\n(lldb) settings set symbols.enable-external-lookup false\n(lldb) settings set target.inherit-tcc true\n(lldb) settings set target.detach-on-error false\n(lldb) settings set target.auto-apply-fixits false\n(lldb) settings set plugin.process.gdb-remote.packet-timeout 60\n(lldb) settings set symbols.clang-modules-cache-path \"/Users/buildslave/jenkins/workspace/lldb-cmake-sanitized/lldb-build/lldb-test-build.noindex/module-cache-lldb/lldb-api\"\n(lldb) settings set use-color false\n(lldb) setting set target.prefer-dynamic-value no-dynamic-values\n(lldb) settings set target.env-vars ASAN_OPTIONS=detect_stack_use_after_return=1 DYLD_INSERT_LIBRARIES=/Users/buildslave/jenkins/workspace/lldb-cmake-sanitized/host-compiler/lib/clang/13.0.99/lib/darwin/libclang_rt.asan_osx_dynamic.dylib\n"},"event":"output","seq":0,"type":"event"} <-- Content-Length: 77

Hide Details

{"command":"launch","request_seq":2,"seq":0,"success":true,"type":"response"} <-- Content-Length: 306

Hide Details

{"body":{"isLocalProcess":true,"name":"/Users/buildslave/jenkins/workspace/lldb-cmake-sanitized/lldb-build/lldb-test-build.noindex/tools/lldb-vscode/evaluate/TestVSCode_evaluate.test_hover_evaluate_expressions/a.out","startMethod":"launch","systemProcessId":93675},"event":"process","seq":0,"type":"event"} <-- Content-Length: 46

Hide Details

{"event":"initialized","seq":0,"type":"event"} --> Content-Length: 276

Hide Details

{"command":"setBreakpoints","type":"request","arguments":{"source":{"name":"main.cpp","path":"main.cpp"},"sourceModified":false,"lines":"[23, 27, 11, 35, 40, 44, 45]","breakpoints":[{"line":23},{"line":27},{"line":11},{"line":35},{"line":40},{"line":44},{"line":45}]},"seq":3} <-- Content-Length: 684

Hide Details

{"body":{"breakpoints":[{"id":1,"line":23,"source":{"name":"main.cpp","path":"main.cpp"},"verified":true},{"id":2,"line":27,"source":{"name":"main.cpp","path":"main.cpp"},"verified":true},{"id":3,"line":11,"source":{"name":"main.cpp","path":"main.cpp"},"verified":true},{"id":4,"line":35,"source":{"name":"main.cpp","path":"main.cpp"},"verified":true},{"id":5,"line":40,"source":{"name":"main.cpp","path":"main.cpp"},"verified":true},{"id":6,"line":44,"source":{"name":"main.cpp","path":"main.cpp"},"verified":true},{"id":7,"line":45,"source":{"name":"main.cpp","path":"main.cpp"},"verified":true}]},"command":"setBreakpoints","request_seq":3,"seq":0,"success":true,"type":"response"} --> Content-Length: 71

Hide Details

{"command":"configurationDone","type":"request","arguments":{},"seq":4} <-- Content-Length: 88

Hide Details

{"command":"configurationDone","request_seq":4,"seq":0,"success":true,"type":"response"} <-- Content-Length: 199

Hide Details

{"body":{"allThreadsStopped":true,"description":"breakpoint 1.1","preserveFocusHint":false,"reason":"breakpoint","threadCausedFocus":true,"threadId":2085658},"event":"stopped","seq":0,"type":"event"} --> Content-Length: 61

Hide Details

{"command":"threads","type":"request","arguments":{},"seq":5} <-- Content-Length: 133

Hide Details

{"body":{"threads":[{"id":2085658,"name":"Thread #1"}]},"command":"threads","request_seq":5,"seq":0,"success":true,"type":"response"} --> Content-Length: 108

Hide Details

{"command":"stackTrace","type":"request","arguments":{"threadId":2085658,"startFrame":0,"levels":1},"seq":6} <-- Content-Length: 330

Hide Details

{"body":{"stackFrames":[{"column":14,"id":524288,"line":23,"name":"main","source":{"name":"main.cpp","path":"/Users/buildslave/jenkins/workspace/lldb-cmake-sanitized/llvm-project/lldb/test/API/tools/lldb-vscode/evaluate/main.cpp"}}],"totalFrames":2},"command":"stackTrace","request_seq":6,"seq":0,"success":true,"type":"response"} --> Content-Length: 116

Hide Details

{"command":"evaluate","type":"request","arguments":{"expression":"var1","context":"hover","frameId":524288},"seq":7} <-- Content-Length: 138

Hide Details

{"body":{"result":"20","type":"int","variablesReference":0},"command":"evaluate","request_seq":7,"seq":0,"success":true,"type":"response"} --> Content-Length: 108

Hide Details

{"command":"stackTrace","type":"request","arguments":{"threadId":2085658,"startFrame":0,"levels":1},"seq":8} <-- Content-Length: 330

Hide Details

{"body":{"stackFrames":[{"column":14,"id":524288,"line":23,"name":"main","source":{"name":"main.cpp","path":"/Users/buildslave/jenkins/workspace/lldb-cmake-sanitized/llvm-project/lldb/test/API/tools/lldb-vscode/evaluate/main.cpp"}}],"totalFrames":2},"command":"stackTrace","request_seq":8,"seq":0,"success":true,"type":"response"} --> Content-Length: 116

Hide Details

{"command":"evaluate","type":"request","arguments":{"expression":"var2","context":"hover","frameId":524288},"seq":9} <-- Content-Length: 138

Hide Details

{"body":{"result":"21","type":"int","variablesReference":0},"command":"evaluate","request_seq":9,"seq":0,"success":true,"type":"response"} --> Content-Length: 109

Hide Details

{"command":"stackTrace","type":"request","arguments":{"threadId":2085658,"startFrame":0,"levels":1},"seq":10} <-- Content-Length: 331

Hide Details

{"body":{"stackFrames":[{"column":14,"id":524288,"line":23,"name":"main","source":{"name":"main.cpp","path":"/Users/buildslave/jenkins/workspace/lldb-cmake-sanitized/llvm-project/lldb/test/API/tools/lldb-vscode/evaluate/main.cpp"}}],"totalFrames":2},"command":"stackTrace","request_seq":10,"seq":0,"success":true,"type":"response"} --> Content-Length: 123

Hide Details

{"command":"evaluate","type":"request","arguments":{"expression":"static_int","context":"hover","frameId":524288},"seq":11} <-- Content-Length: 139

Hide Details

{"body":{"result":"42","type":"int","variablesReference":0},"command":"evaluate","request_seq":11,"seq":0,"success":true,"type":"response"} --> Content-Length: 109

Hide Details

{"command":"stackTrace","type":"request","arguments":{"threadId":2085658,"startFrame":0,"levels":1},"seq":12} <-- Content-Length: 331

Hide Details

{"body":{"stackFrames":[{"column":14,"id":524288,"line":23,"name":"main","source":{"name":"main.cpp","path":"/Users/buildslave/jenkins/workspace/lldb-cmake-sanitized/llvm-project/lldb/test/API/tools/lldb-vscode/evaluate/main.cpp"}}],"totalFrames":2},"command":"stackTrace","request_seq":12,"seq":0,"success":true,"type":"response"} --> Content-Length: 127

Hide Details

{"command":"evaluate","type":"request","arguments":{"expression":"non_static_int","context":"hover","frameId":524288},"seq":13} <-- Content-Length: 139

Hide Details

{"body":{"result":"43","type":"int","variablesReference":0},"command":"evaluate","request_seq":13,"seq":0,"success":true,"type":"response"} --> Content-Length: 109

Hide Details

{"command":"stackTrace","type":"request","arguments":{"threadId":2085658,"startFrame":0,"levels":1},"seq":14} <-- Content-Length: 331

Hide Details

{"body":{"stackFrames":[{"column":14,"id":524288,"line":23,"name":"main","source":{"name":"main.cpp","path":"/Users/buildslave/jenkins/workspace/lldb-cmake-sanitized/llvm-project/lldb/test/API/tools/lldb-vscode/evaluate/main.cpp"}}],"totalFrames":2},"command":"stackTrace","request_seq":14,"seq":0,"success":true,"type":"response"} --> Content-Length: 120

Hide Details

{"command":"evaluate","type":"request","arguments":{"expression":"struct1","context":"hover","frameId":524288},"seq":15} <-- Content-Length: 169

Hide Details

{"body":{"result":"my_struct @ 0x7ffeefbff7c8","type":"my_struct","variablesReference":4},"command":"evaluate","request_seq":15,"seq":0,"success":true,"type":"response"} --> Content-Length: 109

Hide Details

{"command":"stackTrace","type":"request","arguments":{"threadId":2085658,"startFrame":0,"levels":1},"seq":16} <-- Content-Length: 331

Hide Details

{"body":{"stackFrames":[{"column":14,"id":524288,"line":23,"name":"main","source":{"name":"main.cpp","path":"/Users/buildslave/jenkins/workspace/lldb-cmake-sanitized/llvm-project/lldb/test/API/tools/lldb-vscode/evaluate/main.cpp"}}],"totalFrames":2},"command":"stackTrace","request_seq":16,"seq":0,"success":true,"type":"response"} --> Content-Length: 124

Hide Details

{"command":"evaluate","type":"request","arguments":{"expression":"struct1.foo","context":"hover","frameId":524288},"seq":17} <-- Content-Length: 139

Hide Details

{"body":{"result":"15","type":"int","variablesReference":0},"command":"evaluate","request_seq":17,"seq":0,"success":true,"type":"response"} --> Content-Length: 109

Hide Details

{"command":"stackTrace","type":"request","arguments":{"threadId":2085658,"startFrame":0,"levels":1},"seq":18} <-- Content-Length: 331

Hide Details

{"body":{"stackFrames":[{"column":14,"id":524288,"line":23,"name":"main","source":{"name":"main.cpp","path":"/Users/buildslave/jenkins/workspace/lldb-cmake-sanitized/llvm-project/lldb/test/API/tools/lldb-vscode/evaluate/main.cpp"}}],"totalFrames":2},"command":"stackTrace","request_seq":18,"seq":0,"success":true,"type":"response"} --> Content-Length: 125

Hide Details

{"command":"evaluate","type":"request","arguments":{"expression":"struct2->foo","context":"hover","frameId":524288},"seq":19} <-- Content-Length: 139

Hide Details

{"body":{"result":"16","type":"int","variablesReference":0},"command":"evaluate","request_seq":19,"seq":0,"success":true,"type":"response"} --> Content-Length: 109

Hide Details

{"command":"stackTrace","type":"request","arguments":{"threadId":2085658,"startFrame":0,"levels":1},"seq":20} <-- Content-Length: 331

Hide Details

{"body":{"stackFrames":[{"column":14,"id":524288,"line":23,"name":"main","source":{"name":"main.cpp","path":"/Users/buildslave/jenkins/workspace/lldb-cmake-sanitized/llvm-project/lldb/test/API/tools/lldb-vscode/evaluate/main.cpp"}}],"totalFrames":2},"command":"stackTrace","request_seq":20,"seq":0,"success":true,"type":"response"} --> Content-Length: 116

Hide Details

{"command":"evaluate","type":"request","arguments":{"expression":"var","context":"hover","frameId":524288},"seq":21} <-- Content-Length: 119

Hide Details

{"body":{},"command":"evaluate","message":"error: No value","request_seq":21,"seq":0,"success":false,"type":"response"} --> Content-Length: 109

Hide Details

{"command":"stackTrace","type":"request","arguments":{"threadId":2085658,"startFrame":0,"levels":1},"seq":22} <-- Content-Length: 331

Hide Details

{"body":{"stackFrames":[{"column":14,"id":524288,"line":23,"name":"main","source":{"name":"main.cpp","path":"/Users/buildslave/jenkins/workspace/lldb-cmake-sanitized/llvm-project/lldb/test/API/tools/lldb-vscode/evaluate/main.cpp"}}],"totalFrames":2},"command":"stackTrace","request_seq":22,"seq":0,"success":true,"type":"response"} --> Content-Length: 122

Hide Details

{"command":"evaluate","type":"request","arguments":{"expression":"my_struct","context":"hover","frameId":524288},"seq":23} <-- Content-Length: 119

Hide Details

{"body":{},"command":"evaluate","message":"error: No value","request_seq":23,"seq":0,"success":false,"type":"response"} --> Content-Length: 109

Hide Details

{"command":"stackTrace","type":"request","arguments":{"threadId":2085658,"startFrame":0,"levels":1},"seq":24} <-- Content-Length: 331

Hide Details

{"body":{"stackFrames":[{"column":14,"id":524288,"line":23,"name":"main","source":{"name":"main.cpp","path":"/Users/buildslave/jenkins/workspace/lldb-cmake-sanitized/llvm-project/lldb/test/API/tools/lldb-vscode/evaluate/main.cpp"}}],"totalFrames":2},"command":"stackTrace","request_seq":24,"seq":0,"success":true,"type":"response"} --> Content-Length: 116

Hide Details

{"command":"evaluate","type":"request","arguments":{"expression":"int","context":"hover","frameId":524288},"seq":25} <-- Content-Length: 119

Hide Details

{"body":{},"command":"evaluate","message":"error: No value","request_seq":25,"seq":0,"success":false,"type":"response"} --> Content-Length: 109

Hide Details

{"command":"stackTrace","type":"request","arguments":{"threadId":2085658,"startFrame":0,"levels":1},"seq":26} <-- Content-Length: 331

Hide Details

{"body":{"stackFrames":[{"column":14,"id":524288,"line":23,"name":"main","source":{"name":"main.cpp","path":"/Users/buildslave/jenkins/workspace/lldb-cmake-sanitized/llvm-project/lldb/test/API/tools/lldb-vscode/evaluate/main.cpp"}}],"totalFrames":2},"command":"stackTrace","request_seq":26,"seq":0,"success":true,"type":"response"} --> Content-Length: 116

Hide Details

{"command":"evaluate","type":"request","arguments":{"expression":"foo","context":"hover","frameId":524288},"seq":27} <-- Content-Length: 119

Hide Details

{"body":{},"command":"evaluate","message":"error: No value","request_seq":27,"seq":0,"success":false,"type":"response"} --> Content-Length: 109

Hide Details

{"command":"stackTrace","type":"request","arguments":{"threadId":2085658,"startFrame":0,"levels":1},"seq":28} <-- Content-Length: 331

Hide Details

{"body":{"stackFrames":[{"column":14,"id":524288,"line":23,"name":"main","source":{"name":"main.cpp","path":"/Users/buildslave/jenkins/workspace/lldb-cmake-sanitized/llvm-project/lldb/test/API/tools/lldb-vscode/evaluate/main.cpp"}}],"totalFrames":2},"command":"stackTrace","request_seq":28,"seq":0,"success":true,"type":"response"} --> Content-Length: 123

Hide Details

{"command":"evaluate","type":"request","arguments":{"expression":"a_function","context":"hover","frameId":524288},"seq":29} <-- Content-Length: 119

Hide Details

{"body":{},"command":"evaluate","message":"error: No value","request_seq":29,"seq":0,"success":false,"type":"response"} --> Content-Length: 109

Hide Details

{"command":"stackTrace","type":"request","arguments":{"threadId":2085658,"startFrame":0,"levels":1},"seq":30} <-- Content-Length: 331

Hide Details

{"body":{"stackFrames":[{"column":14,"id":524288,"line":23,"name":"main","source":{"name":"main.cpp","path":"/Users/buildslave/jenkins/workspace/lldb-cmake-sanitized/llvm-project/lldb/test/API/tools/lldb-vscode/evaluate/main.cpp"}}],"totalFrames":2},"command":"stackTrace","request_seq":30,"seq":0,"success":true,"type":"response"} --> Content-Length: 126

Hide Details

{"command":"evaluate","type":"request","arguments":{"expression":"a_function(1)","context":"hover","frameId":524288},"seq":31} <-- Content-Length: 119

Hide Details

{"body":{},"command":"evaluate","message":"error: No value","request_seq":31,"seq":0,"success":false,"type":"response"} --> Content-Length: 109

Hide Details

{"command":"stackTrace","type":"request","arguments":{"threadId":2085658,"startFrame":0,"levels":1},"seq":32} <-- Content-Length: 331

Hide Details

{"body":{"stackFrames":[{"column":14,"id":524288,"line":23,"name":"main","source":{"name":"main.cpp","path":"/Users/buildslave/jenkins/workspace/lldb-cmake-sanitized/llvm-project/lldb/test/API/tools/lldb-vscode/evaluate/main.cpp"}}],"totalFrames":2},"command":"stackTrace","request_seq":32,"seq":0,"success":true,"type":"response"} --> Content-Length: 131

Hide Details

{"command":"evaluate","type":"request","arguments":{"expression":"var2 + struct1.foo","context":"hover","frameId":524288},"seq":33} <-- Content-Length: 119

Hide Details

{"body":{},"command":"evaluate","message":"error: No value","request_seq":33,"seq":0,"success":false,"type":"response"} --> Content-Length: 109

Hide Details

{"command":"stackTrace","type":"request","arguments":{"threadId":2085658,"startFrame":0,"levels":1},"seq":34} <-- Content-Length: 331

Hide Details

{"body":{"stackFrames":[{"column":14,"id":524288,"line":23,"name":"main","source":{"name":"main.cpp","path":"/Users/buildslave/jenkins/workspace/lldb-cmake-sanitized/llvm-project/lldb/test/API/tools/lldb-vscode/evaluate/main.cpp"}}],"totalFrames":2},"command":"stackTrace","request_seq":34,"seq":0,"success":true,"type":"response"} --> Content-Length: 121

Hide Details

{"command":"evaluate","type":"request","arguments":{"expression":"foo_func","context":"hover","frameId":524288},"seq":35} <-- Content-Length: 119

Hide Details

{"body":{},"command":"evaluate","message":"error: No value","request_seq":35,"seq":0,"success":false,"type":"response"} --> Content-Length: 109

Hide Details

{"command":"stackTrace","type":"request","arguments":{"threadId":2085658,"startFrame":0,"levels":1},"seq":36} <-- Content-Length: 331

Hide Details

{"body":{"stackFrames":[{"column":14,"id":524288,"line":23,"name":"main","source":{"name":"main.cpp","path":"/Users/buildslave/jenkins/workspace/lldb-cmake-sanitized/llvm-project/lldb/test/API/tools/lldb-vscode/evaluate/main.cpp"}}],"totalFrames":2},"command":"stackTrace","request_seq":36,"seq":0,"success":true,"type":"response"} --> Content-Length: 120

Hide Details

{"command":"evaluate","type":"request","arguments":{"expression":"foo_var","context":"hover","frameId":524288},"seq":37} <-- Content-Length: 119

Hide Details

{"body":{},"command":"evaluate","message":"error: No value","request_seq":37,"seq":0,"success":false,"type":"response"} --> Content-Length: 81

Hide Details

{"command":"continue","type":"request","arguments":{"threadId":2085658},"seq":38} <-- Content-Length: 116

Hide Details

{"body":{"allThreadsContinued":true},"command":"continue","request_seq":38,"seq":0,"success":true,"type":"response"} <-- Content-Length: 199

Hide Details

{"body":{"allThreadsStopped":true,"description":"breakpoint 2.1","preserveFocusHint":false,"reason":"breakpoint","threadCausedFocus":true,"threadId":2085658},"event":"stopped","seq":0,"type":"event"} --> Content-Length: 62

Hide Details

{"command":"threads","type":"request","arguments":{},"seq":39} <-- Content-Length: 134

Hide Details

{"body":{"threads":[{"id":2085658,"name":"Thread #1"}]},"command":"threads","request_seq":39,"seq":0,"success":true,"type":"response"} --> Content-Length: 109

Hide Details

{"command":"stackTrace","type":"request","arguments":{"threadId":2085658,"startFrame":0,"levels":1},"seq":40} <-- Content-Length: 331

Hide Details

{"body":{"stackFrames":[{"column":16,"id":524288,"line":27,"name":"main","source":{"name":"main.cpp","path":"/Users/buildslave/jenkins/workspace/lldb-cmake-sanitized/llvm-project/lldb/test/API/tools/lldb-vscode/evaluate/main.cpp"}}],"totalFrames":2},"command":"stackTrace","request_seq":40,"seq":0,"success":true,"type":"response"} --> Content-Length: 117

Hide Details

{"command":"evaluate","type":"request","arguments":{"expression":"var1","context":"hover","frameId":524288},"seq":41} <-- Content-Length: 139

Hide Details

{"body":{"result":"20","type":"int","variablesReference":0},"command":"evaluate","request_seq":41,"seq":0,"success":true,"type":"response"} --> Content-Length: 109

Hide Details

{"command":"stackTrace","type":"request","arguments":{"threadId":2085658,"startFrame":0,"levels":1},"seq":42} <-- Content-Length: 331

Hide Details

{"body":{"stackFrames":[{"column":16,"id":524288,"line":27,"name":"main","source":{"name":"main.cpp","path":"/Users/buildslave/jenkins/workspace/lldb-cmake-sanitized/llvm-project/lldb/test/API/tools/lldb-vscode/evaluate/main.cpp"}}],"totalFrames":2},"command":"stackTrace","request_seq":42,"seq":0,"success":true,"type":"response"} --> Content-Length: 117

Hide Details

{"command":"evaluate","type":"request","arguments":{"expression":"var2","context":"hover","frameId":524288},"seq":43} <-- Content-Length: 138

Hide Details

{"body":{"result":"2","type":"int","variablesReference":0},"command":"evaluate","request_seq":43,"seq":0,"success":true,"type":"response"} --> Content-Length: 109

Hide Details

{"command":"stackTrace","type":"request","arguments":{"threadId":2085658,"startFrame":0,"levels":1},"seq":44} <-- Content-Length: 331

Hide Details

{"body":{"stackFrames":[{"column":16,"id":524288,"line":27,"name":"main","source":{"name":"main.cpp","path":"/Users/buildslave/jenkins/workspace/lldb-cmake-sanitized/llvm-project/lldb/test/API/tools/lldb-vscode/evaluate/main.cpp"}}],"totalFrames":2},"command":"stackTrace","request_seq":44,"seq":0,"success":true,"type":"response"} --> Content-Length: 123

Hide Details

{"command":"evaluate","type":"request","arguments":{"expression":"static_int","context":"hover","frameId":524288},"seq":45} <-- Content-Length: 139

Hide Details

{"body":{"result":"42","type":"int","variablesReference":0},"command":"evaluate","request_seq":45,"seq":0,"success":true,"type":"response"} --> Content-Length: 109

Hide Details

{"command":"stackTrace","type":"request","arguments":{"threadId":2085658,"startFrame":0,"levels":1},"seq":46} <-- Content-Length: 331

Hide Details

{"body":{"stackFrames":[{"column":16,"id":524288,"line":27,"name":"main","source":{"name":"main.cpp","path":"/Users/buildslave/jenkins/workspace/lldb-cmake-sanitized/llvm-project/lldb/test/API/tools/lldb-vscode/evaluate/main.cpp"}}],"totalFrames":2},"command":"stackTrace","request_seq":46,"seq":0,"success":true,"type":"response"} --> Content-Length: 127

Hide Details

{"command":"evaluate","type":"request","arguments":{"expression":"non_static_int","context":"hover","frameId":524288},"seq":47} <-- Content-Length: 139

Hide Details

{"body":{"result":"10","type":"int","variablesReference":0},"command":"evaluate","request_seq":47,"seq":0,"success":true,"type":"response"} --> Content-Length: 109

Hide Details

{"command":"stackTrace","type":"request","arguments":{"threadId":2085658,"startFrame":0,"levels":1},"seq":48} <-- Content-Length: 331

Hide Details

{"body":{"stackFrames":[{"column":16,"id":524288,"line":27,"name":"main","source":{"name":"main.cpp","path":"/Users/buildslave/jenkins/workspace/lldb-cmake-sanitized/llvm-project/lldb/test/API/tools/lldb-vscode/evaluate/main.cpp"}}],"totalFrames":2},"command":"stackTrace","request_seq":48,"seq":0,"success":true,"type":"response"} --> Content-Length: 120

Hide Details

{"command":"evaluate","type":"request","arguments":{"expression":"struct1","context":"hover","frameId":524288},"seq":49} <-- Content-Length: 169

Hide Details

{"body":{"result":"my_struct @ 0x7ffeefbff7c8","type":"my_struct","variablesReference":5},"command":"evaluate","request_seq":49,"seq":0,"success":true,"type":"response"} --> Content-Length: 109

Hide Details

{"command":"stackTrace","type":"request","arguments":{"threadId":2085658,"startFrame":0,"levels":1},"seq":50} <-- Content-Length: 331

Hide Details

{"body":{"stackFrames":[{"column":16,"id":524288,"line":27,"name":"main","source":{"name":"main.cpp","path":"/Users/buildslave/jenkins/workspace/lldb-cmake-sanitized/llvm-project/lldb/test/API/tools/lldb-vscode/evaluate/main.cpp"}}],"totalFrames":2},"command":"stackTrace","request_seq":50,"seq":0,"success":true,"type":"response"} --> Content-Length: 124

Hide Details

{"command":"evaluate","type":"request","arguments":{"expression":"struct1.foo","context":"hover","frameId":524288},"seq":51} <-- Content-Length: 139

Hide Details

{"body":{"result":"15","type":"int","variablesReference":0},"command":"evaluate","request_seq":51,"seq":0,"success":true,"type":"response"} --> Content-Length: 109

Hide Details

{"command":"stackTrace","type":"request","arguments":{"threadId":2085658,"startFrame":0,"levels":1},"seq":52} <-- Content-Length: 331

Hide Details

{"body":{"stackFrames":[{"column":16,"id":524288,"line":27,"name":"main","source":{"name":"main.cpp","path":"/Users/buildslave/jenkins/workspace/lldb-cmake-sanitized/llvm-project/lldb/test/API/tools/lldb-vscode/evaluate/main.cpp"}}],"totalFrames":2},"command":"stackTrace","request_seq":52,"seq":0,"success":true,"type":"response"} --> Content-Length: 125

Hide Details

{"command":"evaluate","type":"request","arguments":{"expression":"struct2->foo","context":"hover","frameId":524288},"seq":53} <-- Content-Length: 139

Hide Details

{"body":{"result":"16","type":"int","variablesReference":0},"command":"evaluate","request_seq":53,"seq":0,"success":true,"type":"response"} --> Content-Length: 109

Hide Details

{"command":"stackTrace","type":"request","arguments":{"threadId":2085658,"startFrame":0,"levels":1},"seq":54} <-- Content-Length: 331

Hide Details

{"body":{"stackFrames":[{"column":16,"id":524288,"line":27,"name":"main","source":{"name":"main.cpp","path":"/Users/buildslave/jenkins/workspace/lldb-cmake-sanitized/llvm-project/lldb/test/API/tools/lldb-vscode/evaluate/main.cpp"}}],"totalFrames":2},"command":"stackTrace","request_seq":54,"seq":0,"success":true,"type":"response"} --> Content-Length: 123

Hide Details

{"command":"evaluate","type":"request","arguments":{"expression":"a_function","context":"hover","frameId":524288},"seq":55} <-- Content-Length: 119

Hide Details

{"body":{},"command":"evaluate","message":"error: No value","request_seq":55,"seq":0,"success":false,"type":"response"} --> Content-Length: 109

Hide Details

{"command":"stackTrace","type":"request","arguments":{"threadId":2085658,"startFrame":0,"levels":1},"seq":56} <-- Content-Length: 331

Hide Details

{"body":{"stackFrames":[{"column":16,"id":524288,"line":27,"name":"main","source":{"name":"main.cpp","path":"/Users/buildslave/jenkins/workspace/lldb-cmake-sanitized/llvm-project/lldb/test/API/tools/lldb-vscode/evaluate/main.cpp"}}],"totalFrames":2},"command":"stackTrace","request_seq":56,"seq":0,"success":true,"type":"response"} --> Content-Length: 126

Hide Details

{"command":"evaluate","type":"request","arguments":{"expression":"a_function(1)","context":"hover","frameId":524288},"seq":57} <-- Content-Length: 119

Hide Details

{"body":{},"command":"evaluate","message":"error: No value","request_seq":57,"seq":0,"success":false,"type":"response"} --> Content-Length: 109

Hide Details

{"command":"stackTrace","type":"request","arguments":{"threadId":2085658,"startFrame":0,"levels":1},"seq":58} <-- Content-Length: 331

Hide Details

{"body":{"stackFrames":[{"column":16,"id":524288,"line":27,"name":"main","source":{"name":"main.cpp","path":"/Users/buildslave/jenkins/workspace/lldb-cmake-sanitized/llvm-project/lldb/test/API/tools/lldb-vscode/evaluate/main.cpp"}}],"totalFrames":2},"command":"stackTrace","request_seq":58,"seq":0,"success":true,"type":"response"} --> Content-Length: 131

Hide Details

{"command":"evaluate","type":"request","arguments":{"expression":"var2 + struct1.foo","context":"hover","frameId":524288},"seq":59} <-- Content-Length: 119

Hide Details

{"body":{},"command":"evaluate","message":"error: No value","request_seq":59,"seq":0,"success":false,"type":"response"} --> Content-Length: 109

Hide Details

{"command":"stackTrace","type":"request","arguments":{"threadId":2085658,"startFrame":0,"levels":1},"seq":60} <-- Content-Length: 331

Hide Details

{"body":{"stackFrames":[{"column":16,"id":524288,"line":27,"name":"main","source":{"name":"main.cpp","path":"/Users/buildslave/jenkins/workspace/lldb-cmake-sanitized/llvm-project/lldb/test/API/tools/lldb-vscode/evaluate/main.cpp"}}],"totalFrames":2},"command":"stackTrace","request_seq":60,"seq":0,"success":true,"type":"response"} --> Content-Length: 121

Hide Details

{"command":"evaluate","type":"request","arguments":{"expression":"foo_func","context":"hover","frameId":524288},"seq":61} <-- Content-Length: 119

Hide Details

{"body":{},"command":"evaluate","message":"error: No value","request_seq":61,"seq":0,"success":false,"type":"response"} --> Content-Length: 109

Hide Details

{"command":"stackTrace","type":"request","arguments":{"threadId":2085658,"startFrame":0,"levels":1},"seq":62} <-- Content-Length: 331

Hide Details

{"body":{"stackFrames":[{"column":16,"id":524288,"line":27,"name":"main","source":{"name":"main.cpp","path":"/Users/buildslave/jenkins/workspace/lldb-cmake-sanitized/llvm-project/lldb/test/API/tools/lldb-vscode/evaluate/main.cpp"}}],"totalFrames":2},"command":"stackTrace","request_seq":62,"seq":0,"success":true,"type":"response"} --> Content-Length: 120

Hide Details

{"command":"evaluate","type":"request","arguments":{"expression":"foo_var","context":"hover","frameId":524288},"seq":63} <-- Content-Length: 119

Hide Details

{"body":{},"command":"evaluate","message":"error: No value","request_seq":63,"seq":0,"success":false,"type":"response"} --> Content-Length: 81

Hide Details

{"command":"continue","type":"request","arguments":{"threadId":2085658},"seq":64} <-- Content-Length: 116

Hide Details

{"body":{"allThreadsContinued":true},"command":"continue","request_seq":64,"seq":0,"success":true,"type":"response"} <-- Content-Length: 199

Hide Details

{"body":{"allThreadsStopped":true,"description":"breakpoint 3.1","preserveFocusHint":false,"reason":"breakpoint","threadCausedFocus":true,"threadId":2085658},"event":"stopped","seq":0,"type":"event"} --> Content-Length: 62

Hide Details

{"command":"threads","type":"request","arguments":{},"seq":65} <-- Content-Length: 134

Hide Details

{"body":{"threads":[{"id":2085658,"name":"Thread #1"}]},"command":"threads","request_seq":65,"seq":0,"success":true,"type":"response"} --> Content-Length: 109

Hide Details

{"command":"stackTrace","type":"request","arguments":{"threadId":2085658,"startFrame":0,"levels":1},"seq":66} <-- Content-Length: 342

Hide Details

{"body":{"stackFrames":[{"column":10,"id":524288,"line":11,"name":"a_function(int)","source":{"name":"main.cpp","path":"/Users/buildslave/jenkins/workspace/lldb-cmake-sanitized/llvm-project/lldb/test/API/tools/lldb-vscode/evaluate/main.cpp"}}],"totalFrames":3},"command":"stackTrace","request_seq":66,"seq":0,"success":true,"type":"response"} --> Content-Length: 116

Hide Details

{"command":"evaluate","type":"request","arguments":{"expression":"var","context":"hover","frameId":524288},"seq":67} <-- Content-Length: 139

Hide Details

{"body":{"result":"42","type":"int","variablesReference":0},"command":"evaluate","request_seq":67,"seq":0,"success":true,"type":"response"} --> Content-Length: 109

Hide Details

{"command":"stackTrace","type":"request","arguments":{"threadId":2085658,"startFrame":0,"levels":1},"seq":68} <-- Content-Length: 342

Hide Details

{"body":{"stackFrames":[{"column":10,"id":524288,"line":11,"name":"a_function(int)","source":{"name":"main.cpp","path":"/Users/buildslave/jenkins/workspace/lldb-cmake-sanitized/llvm-project/lldb/test/API/tools/lldb-vscode/evaluate/main.cpp"}}],"totalFrames":3},"command":"stackTrace","request_seq":68,"seq":0,"success":true,"type":"response"} --> Content-Length: 123

Hide Details

{"command":"evaluate","type":"request","arguments":{"expression":"static_int","context":"hover","frameId":524288},"seq":69} <-- Content-Length: 139

Hide Details

{"body":{"result":"42","type":"int","variablesReference":0},"command":"evaluate","request_seq":69,"seq":0,"success":true,"type":"response"} --> Content-Length: 109

Hide Details

{"command":"stackTrace","type":"request","arguments":{"threadId":2085658,"startFrame":0,"levels":1},"seq":70} <-- Content-Length: 342

Hide Details

{"body":{"stackFrames":[{"column":10,"id":524288,"line":11,"name":"a_function(int)","source":{"name":"main.cpp","path":"/Users/buildslave/jenkins/workspace/lldb-cmake-sanitized/llvm-project/lldb/test/API/tools/lldb-vscode/evaluate/main.cpp"}}],"totalFrames":3},"command":"stackTrace","request_seq":70,"seq":0,"success":true,"type":"response"} --> Content-Length: 127

Hide Details

{"command":"evaluate","type":"request","arguments":{"expression":"non_static_int","context":"hover","frameId":524288},"seq":71} <-- Content-Length: 139

Hide Details

{"body":{"result":"43","type":"int","variablesReference":0},"command":"evaluate","request_seq":71,"seq":0,"success":true,"type":"response"} --> Content-Length: 109

Hide Details

{"command":"stackTrace","type":"request","arguments":{"threadId":2085658,"startFrame":0,"levels":1},"seq":72} <-- Content-Length: 342

Hide Details

{"body":{"stackFrames":[{"column":10,"id":524288,"line":11,"name":"a_function(int)","source":{"name":"main.cpp","path":"/Users/buildslave/jenkins/workspace/lldb-cmake-sanitized/llvm-project/lldb/test/API/tools/lldb-vscode/evaluate/main.cpp"}}],"totalFrames":3},"command":"stackTrace","request_seq":72,"seq":0,"success":true,"type":"response"} --> Content-Length: 117

Hide Details

{"command":"evaluate","type":"request","arguments":{"expression":"var1","context":"hover","frameId":524288},"seq":73} <-- Content-Length: 119

Hide Details

{"body":{},"command":"evaluate","message":"error: No value","request_seq":73,"seq":0,"success":false,"type":"response"} --> Content-Length: 109

Hide Details

{"command":"stackTrace","type":"request","arguments":{"threadId":2085658,"startFrame":0,"levels":1},"seq":74} <-- Content-Length: 342

Hide Details

{"body":{"stackFrames":[{"column":10,"id":524288,"line":11,"name":"a_function(int)","source":{"name":"main.cpp","path":"/Users/buildslave/jenkins/workspace/lldb-cmake-sanitized/llvm-project/lldb/test/API/tools/lldb-vscode/evaluate/main.cpp"}}],"totalFrames":3},"command":"stackTrace","request_seq":74,"seq":0,"success":true,"type":"response"} --> Content-Length: 117

Hide Details

{"command":"evaluate","type":"request","arguments":{"expression":"var2","context":"hover","frameId":524288},"seq":75} <-- Content-Length: 119

Hide Details

{"body":{},"command":"evaluate","message":"error: No value","request_seq":75,"seq":0,"success":false,"type":"response"} --> Content-Length: 109

Hide Details

{"command":"stackTrace","type":"request","arguments":{"threadId":2085658,"startFrame":0,"levels":1},"seq":76} <-- Content-Length: 342

Hide Details

{"body":{"stackFrames":[{"column":10,"id":524288,"line":11,"name":"a_function(int)","source":{"name":"main.cpp","path":"/Users/buildslave/jenkins/workspace/lldb-cmake-sanitized/llvm-project/lldb/test/API/tools/lldb-vscode/evaluate/main.cpp"}}],"totalFrames":3},"command":"stackTrace","request_seq":76,"seq":0,"success":true,"type":"response"} --> Content-Length: 120

Hide Details

{"command":"evaluate","type":"request","arguments":{"expression":"struct1","context":"hover","frameId":524288},"seq":77} <-- Content-Length: 119

Hide Details

{"body":{},"command":"evaluate","message":"error: No value","request_seq":77,"seq":0,"success":false,"type":"response"} --> Content-Length: 109

Hide Details

{"command":"stackTrace","type":"request","arguments":{"threadId":2085658,"startFrame":0,"levels":1},"seq":78} <-- Content-Length: 342

Hide Details

{"body":{"stackFrames":[{"column":10,"id":524288,"line":11,"name":"a_function(int)","source":{"name":"main.cpp","path":"/Users/buildslave/jenkins/workspace/lldb-cmake-sanitized/llvm-project/lldb/test/API/tools/lldb-vscode/evaluate/main.cpp"}}],"totalFrames":3},"command":"stackTrace","request_seq":78,"seq":0,"success":true,"type":"response"} --> Content-Length: 124

Hide Details

{"command":"evaluate","type":"request","arguments":{"expression":"struct1.foo","context":"hover","frameId":524288},"seq":79} <-- Content-Length: 119

Hide Details

{"body":{},"command":"evaluate","message":"error: No value","request_seq":79,"seq":0,"success":false,"type":"response"} --> Content-Length: 109

Hide Details

{"command":"stackTrace","type":"request","arguments":{"threadId":2085658,"startFrame":0,"levels":1},"seq":80} <-- Content-Length: 342

Hide Details

{"body":{"stackFrames":[{"column":10,"id":524288,"line":11,"name":"a_function(int)","source":{"name":"main.cpp","path":"/Users/buildslave/jenkins/workspace/lldb-cmake-sanitized/llvm-project/lldb/test/API/tools/lldb-vscode/evaluate/main.cpp"}}],"totalFrames":3},"command":"stackTrace","request_seq":80,"seq":0,"success":true,"type":"response"} --> Content-Length: 125

Hide Details

{"command":"evaluate","type":"request","arguments":{"expression":"struct2->foo","context":"hover","frameId":524288},"seq":81} <-- Content-Length: 119

Hide Details

{"body":{},"command":"evaluate","message":"error: No value","request_seq":81,"seq":0,"success":false,"type":"response"} --> Content-Length: 109

Hide Details

{"command":"stackTrace","type":"request","arguments":{"threadId":2085658,"startFrame":0,"levels":1},"seq":82} <-- Content-Length: 342

Hide Details

{"body":{"stackFrames":[{"column":10,"id":524288,"line":11,"name":"a_function(int)","source":{"name":"main.cpp","path":"/Users/buildslave/jenkins/workspace/lldb-cmake-sanitized/llvm-project/lldb/test/API/tools/lldb-vscode/evaluate/main.cpp"}}],"totalFrames":3},"command":"stackTrace","request_seq":82,"seq":0,"success":true,"type":"response"} --> Content-Length: 131

Hide Details

{"command":"evaluate","type":"request","arguments":{"expression":"var2 + struct1.foo","context":"hover","frameId":524288},"seq":83} <-- Content-Length: 119

Hide Details

{"body":{},"command":"evaluate","message":"error: No value","request_seq":83,"seq":0,"success":false,"type":"response"} --> Content-Length: 109

Hide Details

{"command":"stackTrace","type":"request","arguments":{"threadId":2085658,"startFrame":0,"levels":1},"seq":84} <-- Content-Length: 342

Hide Details

{"body":{"stackFrames":[{"column":10,"id":524288,"line":11,"name":"a_function(int)","source":{"name":"main.cpp","path":"/Users/buildslave/jenkins/workspace/lldb-cmake-sanitized/llvm-project/lldb/test/API/tools/lldb-vscode/evaluate/main.cpp"}}],"totalFrames":3},"command":"stackTrace","request_seq":84,"seq":0,"success":true,"type":"response"} --> Content-Length: 123

Hide Details

{"command":"evaluate","type":"request","arguments":{"expression":"a_function","context":"hover","frameId":524288},"seq":85} <-- Content-Length: 119

Hide Details

{"body":{},"command":"evaluate","message":"error: No value","request_seq":85,"seq":0,"success":false,"type":"response"} --> Content-Length: 109

Hide Details

{"command":"stackTrace","type":"request","arguments":{"threadId":2085658,"startFrame":0,"levels":1},"seq":86} <-- Content-Length: 342

Hide Details

{"body":{"stackFrames":[{"column":10,"id":524288,"line":11,"name":"a_function(int)","source":{"name":"main.cpp","path":"/Users/buildslave/jenkins/workspace/lldb-cmake-sanitized/llvm-project/lldb/test/API/tools/lldb-vscode/evaluate/main.cpp"}}],"totalFrames":3},"command":"stackTrace","request_seq":86,"seq":0,"success":true,"type":"response"} --> Content-Length: 126

Hide Details

{"command":"evaluate","type":"request","arguments":{"expression":"a_function(1)","context":"hover","frameId":524288},"seq":87} <-- Content-Length: 119

Hide Details

{"body":{},"command":"evaluate","message":"error: No value","request_seq":87,"seq":0,"success":false,"type":"response"} --> Content-Length: 109

Hide Details

{"command":"stackTrace","type":"request","arguments":{"threadId":2085658,"startFrame":0,"levels":1},"seq":88} <-- Content-Length: 342

Hide Details

{"body":{"stackFrames":[{"column":10,"id":524288,"line":11,"name":"a_function(int)","source":{"name":"main.cpp","path":"/Users/buildslave/jenkins/workspace/lldb-cmake-sanitized/llvm-project/lldb/test/API/tools/lldb-vscode/evaluate/main.cpp"}}],"totalFrames":3},"command":"stackTrace","request_seq":88,"seq":0,"success":true,"type":"response"} --> Content-Length: 120

Hide Details

{"command":"evaluate","type":"request","arguments":{"expression":"var + 1","context":"hover","frameId":524288},"seq":89} <-- Content-Length: 119

Hide Details

{"body":{},"command":"evaluate","message":"error: No value","request_seq":89,"seq":0,"success":false,"type":"response"} --> Content-Length: 109

Hide Details

{"command":"stackTrace","type":"request","arguments":{"threadId":2085658,"startFrame":0,"levels":1},"seq":90} <-- Content-Length: 342

Hide Details

{"body":{"stackFrames":[{"column":10,"id":524288,"line":11,"name":"a_function(int)","source":{"name":"main.cpp","path":"/Users/buildslave/jenkins/workspace/lldb-cmake-sanitized/llvm-project/lldb/test/API/tools/lldb-vscode/evaluate/main.cpp"}}],"totalFrames":3},"command":"stackTrace","request_seq":90,"seq":0,"success":true,"type":"response"} --> Content-Length: 121

Hide Details

{"command":"evaluate","type":"request","arguments":{"expression":"foo_func","context":"hover","frameId":524288},"seq":91} <-- Content-Length: 119

Hide Details

{"body":{},"command":"evaluate","message":"error: No value","request_seq":91,"seq":0,"success":false,"type":"response"} --> Content-Length: 109

Hide Details

{"command":"stackTrace","type":"request","arguments":{"threadId":2085658,"startFrame":0,"levels":1},"seq":92} <-- Content-Length: 342

Hide Details

{"body":{"stackFrames":[{"column":10,"id":524288,"line":11,"name":"a_function(int)","source":{"name":"main.cpp","path":"/Users/buildslave/jenkins/workspace/lldb-cmake-sanitized/llvm-project/lldb/test/API/tools/lldb-vscode/evaluate/main.cpp"}}],"totalFrames":3},"command":"stackTrace","request_seq":92,"seq":0,"success":true,"type":"response"} --> Content-Length: 120

Hide Details

{"command":"evaluate","type":"request","arguments":{"expression":"foo_var","context":"hover","frameId":524288},"seq":93} <-- Content-Length: 119

Hide Details

{"body":{},"command":"evaluate","message":"error: No value","request_seq":93,"seq":0,"success":false,"type":"response"} --> Content-Length: 81

Hide Details

{"command":"continue","type":"request","arguments":{"threadId":2085658},"seq":94} <-- Content-Length: 116

Hide Details

{"body":{"allThreadsContinued":true},"command":"continue","request_seq":94,"seq":0,"success":true,"type":"response"} <-- Content-Length: 199

Hide Details

{"body":{"allThreadsStopped":true,"description":"breakpoint 4.1","preserveFocusHint":false,"reason":"breakpoint","threadCausedFocus":true,"threadId":2085658},"event":"stopped","seq":0,"type":"event"} --> Content-Length: 62

Hide Details

{"command":"threads","type":"request","arguments":{},"seq":95} <-- Content-Length: 134

Hide Details

{"body":{"threads":[{"id":2085658,"name":"Thread #1"}]},"command":"threads","request_seq":95,"seq":0,"success":true,"type":"response"} --> Content-Length: 109

Hide Details

{"command":"stackTrace","type":"request","arguments":{"threadId":2085658,"startFrame":0,"levels":1},"seq":96} <-- Content-Length: 331

Hide Details

{"body":{"stackFrames":[{"column":20,"id":524288,"line":35,"name":"main","source":{"name":"main.cpp","path":"/Users/buildslave/jenkins/workspace/lldb-cmake-sanitized/llvm-project/lldb/test/API/tools/lldb-vscode/evaluate/main.cpp"}}],"totalFrames":2},"command":"stackTrace","request_seq":96,"seq":0,"success":true,"type":"response"} --> Content-Length: 119

Hide Details

{"command":"evaluate","type":"request","arguments":{"expression":"my_vec","context":"hover","frameId":524288},"seq":97} <-- Content-Length: 179

Hide Details

{"body":{"result":" size=2","type":"std::vector<int, std::allocator<int> >","variablesReference":6},"command":"evaluate","request_seq":97,"seq":0,"success":true,"type":"response"} --> Content-Length: 81

Hide Details

{"command":"continue","type":"request","arguments":{"threadId":2085658},"seq":98} <-- Content-Length: 116

Hide Details

{"body":{"allThreadsContinued":true},"command":"continue","request_seq":98,"seq":0,"success":true,"type":"response"} <-- Content-Length: 199

Hide Details

{"body":{"allThreadsStopped":true,"description":"breakpoint 5.1","preserveFocusHint":false,"reason":"breakpoint","threadCausedFocus":true,"threadId":2085658},"event":"stopped","seq":0,"type":"event"} --> Content-Length: 62

Hide Details

{"command":"threads","type":"request","arguments":{},"seq":99} <-- Content-Length: 134

Hide Details

{"body":{"threads":[{"id":2085658,"name":"Thread #1"}]},"command":"threads","request_seq":99,"seq":0,"success":true,"type":"response"} --> Content-Length: 110

Hide Details

{"command":"stackTrace","type":"request","arguments":{"threadId":2085658,"startFrame":0,"levels":1},"seq":100} <-- Content-Length: 332

Hide Details

{"body":{"stackFrames":[{"column":10,"id":524288,"line":40,"name":"main","source":{"name":"main.cpp","path":"/Users/buildslave/jenkins/workspace/lldb-cmake-sanitized/llvm-project/lldb/test/API/tools/lldb-vscode/evaluate/main.cpp"}}],"totalFrames":2},"command":"stackTrace","request_seq":100,"seq":0,"success":true,"type":"response"} --> Content-Length: 120

Hide Details

{"command":"evaluate","type":"request","arguments":{"expression":"my_vec","context":"hover","frameId":524288},"seq":101} <-- Content-Length: 180

Hide Details

{"body":{"result":" size=3","type":"std::vector<int, std::allocator<int> >","variablesReference":7},"command":"evaluate","request_seq":101,"seq":0,"success":true,"type":"response"} --> Content-Length: 110

Hide Details

{"command":"stackTrace","type":"request","arguments":{"threadId":2085658,"startFrame":0,"levels":1},"seq":102} <-- Content-Length: 332

Hide Details

{"body":{"stackFrames":[{"column":10,"id":524288,"line":40,"name":"main","source":{"name":"main.cpp","path":"/Users/buildslave/jenkins/workspace/lldb-cmake-sanitized/llvm-project/lldb/test/API/tools/lldb-vscode/evaluate/main.cpp"}}],"totalFrames":2},"command":"stackTrace","request_seq":102,"seq":0,"success":true,"type":"response"} --> Content-Length: 120

Hide Details

{"command":"evaluate","type":"request","arguments":{"expression":"my_map","context":"hover","frameId":524288},"seq":103} <-- Content-Length: 221

Hide Details

{"body":{"result":" size=2","type":"std::map<int, int, std::less<int>, std::allocator<std::pair<const int, int> > >","variablesReference":8},"command":"evaluate","request_seq":103,"seq":0,"success":true,"type":"response"} --> Content-Length: 82

Hide Details

{"command":"continue","type":"request","arguments":{"threadId":2085658},"seq":104} <-- Content-Length: 117

Hide Details

{"body":{"allThreadsContinued":true},"command":"continue","request_seq":104,"seq":0,"success":true,"type":"response"} <-- Content-Length: 199

Hide Details

{"body":{"allThreadsStopped":true,"description":"breakpoint 6.1","preserveFocusHint":false,"reason":"breakpoint","threadCausedFocus":true,"threadId":2085658},"event":"stopped","seq":0,"type":"event"} --> Content-Length: 63

Hide Details

{"command":"threads","type":"request","arguments":{},"seq":105} <-- Content-Length: 135

Hide Details

{"body":{"threads":[{"id":2085658,"name":"Thread #1"}]},"command":"threads","request_seq":105,"seq":0,"success":true,"type":"response"} --> Content-Length: 110

Hide Details

{"command":"stackTrace","type":"request","arguments":{"threadId":2085658,"startFrame":0,"levels":1},"seq":106} <-- Content-Length: 332

Hide Details

{"body":{"stackFrames":[{"column":25,"id":524288,"line":44,"name":"main","source":{"name":"main.cpp","path":"/Users/buildslave/jenkins/workspace/lldb-cmake-sanitized/llvm-project/lldb/test/API/tools/lldb-vscode/evaluate/main.cpp"}}],"totalFrames":2},"command":"stackTrace","request_seq":106,"seq":0,"success":true,"type":"response"} --> Content-Length: 120

Hide Details

{"command":"evaluate","type":"request","arguments":{"expression":"my_map","context":"hover","frameId":524288},"seq":107} <-- Content-Length: 221

Hide Details

{"body":{"result":" size=3","type":"std::map<int, int, std::less<int>, std::allocator<std::pair<const int, int> > >","variablesReference":9},"command":"evaluate","request_seq":107,"seq":0,"success":true,"type":"response"} --> Content-Length: 110

Hide Details

{"command":"stackTrace","type":"request","arguments":{"threadId":2085658,"startFrame":0,"levels":1},"seq":108} <-- Content-Length: 332

Hide Details

{"body":{"stackFrames":[{"column":25,"id":524288,"line":44,"name":"main","source":{"name":"main.cpp","path":"/Users/buildslave/jenkins/workspace/lldb-cmake-sanitized/llvm-project/lldb/test/API/tools/lldb-vscode/evaluate/main.cpp"}}],"totalFrames":2},"command":"stackTrace","request_seq":108,"seq":0,"success":true,"type":"response"} --> Content-Length: 125

Hide Details

{"command":"evaluate","type":"request","arguments":{"expression":"my_bool_vec","context":"hover","frameId":524288},"seq":109} <-- Content-Length: 183

Hide Details

{"body":{"result":" size=1","type":"std::vector<bool, std::allocator<bool> >","variablesReference":10},"command":"evaluate","request_seq":109,"seq":0,"success":true,"type":"response"} --> Content-Length: 82

Hide Details

{"command":"continue","type":"request","arguments":{"threadId":2085658},"seq":110} <-- Content-Length: 117

Hide Details

{"body":{"allThreadsContinued":true},"command":"continue","request_seq":110,"seq":0,"success":true,"type":"response"} <-- Content-Length: 199

Hide Details

{"body":{"allThreadsStopped":true,"description":"breakpoint 7.1","preserveFocusHint":false,"reason":"breakpoint","threadCausedFocus":true,"threadId":2085658},"event":"stopped","seq":0,"type":"event"} --> Content-Length: 63

Hide Details

{"command":"threads","type":"request","arguments":{},"seq":111} <-- Content-Length: 135

Hide Details

{"body":{"threads":[{"id":2085658,"name":"Thread #1"}]},"command":"threads","request_seq":111,"seq":0,"success":true,"type":"response"} --> Content-Length: 110

Hide Details

{"command":"stackTrace","type":"request","arguments":{"threadId":2085658,"startFrame":0,"levels":1},"seq":112} <-- Content-Length: 332

Hide Details

{"body":{"stackFrames":[{"column":25,"id":524288,"line":45,"name":"main","source":{"name":"main.cpp","path":"/Users/buildslave/jenkins/workspace/lldb-cmake-sanitized/llvm-project/lldb/test/API/tools/lldb-vscode/evaluate/main.cpp"}}],"totalFrames":2},"command":"stackTrace","request_seq":112,"seq":0,"success":true,"type":"response"} --> Content-Length: 125

Hide Details

{"command":"evaluate","type":"request","arguments":{"expression":"my_bool_vec","context":"hover","frameId":524288},"seq":113} <-- Content-Length: 183

Hide Details

{"body":{"result":" size=2","type":"std::vector<bool, std::allocator<bool> >","variablesReference":11},"command":"evaluate","request_seq":113,"seq":0,"success":true,"type":"response"} --> Content-Length: 90

Hide Details

{"command":"disconnect","type":"request","arguments":{"terminateDebuggee":true},"seq":114} <-- Content-Length: 45

Hide Details

{"event":"terminated","seq":0,"type":"event"} <-- Content-Length: 63

Hide Details

{"body":{"exitCode":9},"event":"exited","seq":0,"type":"event"} <-- Content-Length: 83

Hide Details

{"command":"disconnect","request_seq":114,"seq":0,"success":true,"type":"response"}

Hide Details

========= END ========= ========= DEBUG ADAPTER PROTOCOL LOGS ========= --> Content-Length: 284

Hide Details

{"command":"initialize","type":"request","arguments":{"adapterID":"lldb-native","clientID":"vscode","columnsStartAt1":true,"linesStartAt1":true,"locale":"en-us","pathFormat":"path","supportsRunInTerminalRequest":true,"supportsVariablePaging":true,"supportsVariableType":true},"seq":1} <-- Content-Length: 1222

Hide Details

{"body":{"exceptionBreakpointFilters":[{"default":false,"filter":"cpp_catch","label":"C++ Catch"},{"default":false,"filter":"cpp_throw","label":"C++ Throw"},{"default":false,"filter":"objc_catch","label":"Objective C Catch"},{"default":false,"filter":"objc_throw","label":"Objective C Throw"},{"default":false,"filter":"swift_catch","label":"Swift Catch"},{"default":false,"filter":"swift_throw","label":"Swift Throw"}],"supportTerminateDebuggee":true,"supportsCompletionsRequest":false,"supportsConditionalBreakpoints":true,"supportsConfigurationDoneRequest":true,"supportsDelayedStackTraceLoading":true,"supportsEvaluateForHovers":true,"supportsExceptionInfoRequest":true,"supportsExceptionOptions":true,"supportsFunctionBreakpoints":true,"supportsGotoTargetsRequest":false,"supportsHitConditionalBreakpoints":true,"supportsLoadedSourcesRequest":false,"supportsModulesRequest":false,"supportsProgressReporting":true,"supportsRestartFrame":false,"supportsRestartRequest":false,"supportsRunInTerminalRequest":true,"supportsSetVariable":true,"supportsStepBack":false,"supportsStepInTargetsRequest":false,"supportsValueFormattingOptions":true},"command":"initialize","request_seq":1,"seq":0,"success":true,"type":"response"} --> Content-Length: 1040

Hide Details

{"command":"launch","type":"request","arguments":{"program":"/Users/buildslave/jenkins/workspace/lldb-cmake-sanitized/lldb-build/lldb-test-build.noindex/tools/lldb-vscode/evaluate/TestVSCode_evaluate.test_repl_evaluate_expressions/a.out","disableASLR":true,"initCommands":["settings clear -all","settings set symbols.enable-external-lookup false","settings set target.inherit-tcc true","settings set target.detach-on-error false","settings set target.auto-apply-fixits false","settings set plugin.process.gdb-remote.packet-timeout 60","settings set symbols.clang-modules-cache-path \"/Users/buildslave/jenkins/workspace/lldb-cmake-sanitized/lldb-build/lldb-test-build.noindex/module-cache-lldb/lldb-api\"","settings set use-color false","setting set target.prefer-dynamic-value no-dynamic-values","settings set target.env-vars ASAN_OPTIONS=detect_stack_use_after_return=1 DYLD_INSERT_LIBRARIES=/Users/buildslave/jenkins/workspace/lldb-cmake-sanitized/host-compiler/lib/clang/13.0.99/lib/darwin/libclang_rt.asan_osx_dynamic.dylib"]},"seq":2} <-- Content-Length: 923

Hide Details

{"body":{"category":"console","output":"Running initCommands:\n(lldb) settings clear -all\n(lldb) settings set symbols.enable-external-lookup false\n(lldb) settings set target.inherit-tcc true\n(lldb) settings set target.detach-on-error false\n(lldb) settings set target.auto-apply-fixits false\n(lldb) settings set plugin.process.gdb-remote.packet-timeout 60\n(lldb) settings set symbols.clang-modules-cache-path \"/Users/buildslave/jenkins/workspace/lldb-cmake-sanitized/lldb-build/lldb-test-build.noindex/module-cache-lldb/lldb-api\"\n(lldb) settings set use-color false\n(lldb) setting set target.prefer-dynamic-value no-dynamic-values\n(lldb) settings set target.env-vars ASAN_OPTIONS=detect_stack_use_after_return=1 DYLD_INSERT_LIBRARIES=/Users/buildslave/jenkins/workspace/lldb-cmake-sanitized/host-compiler/lib/clang/13.0.99/lib/darwin/libclang_rt.asan_osx_dynamic.dylib\n"},"event":"output","seq":0,"type":"event"} <-- Content-Length: 77

Hide Details

{"command":"launch","request_seq":2,"seq":0,"success":true,"type":"response"} <-- Content-Length: 305

Hide Details

{"body":{"isLocalProcess":true,"name":"/Users/buildslave/jenkins/workspace/lldb-cmake-sanitized/lldb-build/lldb-test-build.noindex/tools/lldb-vscode/evaluate/TestVSCode_evaluate.test_repl_evaluate_expressions/a.out","startMethod":"launch","systemProcessId":93758},"event":"process","seq":0,"type":"event"} <-- Content-Length: 46

Hide Details

{"event":"initialized","seq":0,"type":"event"} --> Content-Length: 276

Hide Details

{"command":"setBreakpoints","type":"request","arguments":{"source":{"name":"main.cpp","path":"main.cpp"},"sourceModified":false,"lines":"[23, 27, 11, 35, 40, 44, 45]","breakpoints":[{"line":23},{"line":27},{"line":11},{"line":35},{"line":40},{"line":44},{"line":45}]},"seq":3} <-- Content-Length: 684

Hide Details

{"body":{"breakpoints":[{"id":1,"line":23,"source":{"name":"main.cpp","path":"main.cpp"},"verified":true},{"id":2,"line":27,"source":{"name":"main.cpp","path":"main.cpp"},"verified":true},{"id":3,"line":11,"source":{"name":"main.cpp","path":"main.cpp"},"verified":true},{"id":4,"line":35,"source":{"name":"main.cpp","path":"main.cpp"},"verified":true},{"id":5,"line":40,"source":{"name":"main.cpp","path":"main.cpp"},"verified":true},{"id":6,"line":44,"source":{"name":"main.cpp","path":"main.cpp"},"verified":true},{"id":7,"line":45,"source":{"name":"main.cpp","path":"main.cpp"},"verified":true}]},"command":"setBreakpoints","request_seq":3,"seq":0,"success":true,"type":"response"} --> Content-Length: 71

Hide Details

{"command":"configurationDone","type":"request","arguments":{},"seq":4} <-- Content-Length: 88

Hide Details

{"command":"configurationDone","request_seq":4,"seq":0,"success":true,"type":"response"} <-- Content-Length: 199

Hide Details

{"body":{"allThreadsStopped":true,"description":"breakpoint 1.1","preserveFocusHint":false,"reason":"breakpoint","threadCausedFocus":true,"threadId":2086069},"event":"stopped","seq":0,"type":"event"} --> Content-Length: 61

Hide Details

{"command":"threads","type":"request","arguments":{},"seq":5} <-- Content-Length: 133

Hide Details

{"body":{"threads":[{"id":2086069,"name":"Thread #1"}]},"command":"threads","request_seq":5,"seq":0,"success":true,"type":"response"} --> Content-Length: 108

Hide Details

{"command":"stackTrace","type":"request","arguments":{"threadId":2086069,"startFrame":0,"levels":1},"seq":6} <-- Content-Length: 330

Hide Details

{"body":{"stackFrames":[{"column":14,"id":524288,"line":23,"name":"main","source":{"name":"main.cpp","path":"/Users/buildslave/jenkins/workspace/lldb-cmake-sanitized/llvm-project/lldb/test/API/tools/lldb-vscode/evaluate/main.cpp"}}],"totalFrames":3},"command":"stackTrace","request_seq":6,"seq":0,"success":true,"type":"response"} --> Content-Length: 115

Hide Details

{"command":"evaluate","type":"request","arguments":{"expression":"var1","context":"repl","frameId":524288},"seq":7} <-- Content-Length: 138

Hide Details

{"body":{"result":"20","type":"int","variablesReference":0},"command":"evaluate","request_seq":7,"seq":0,"success":true,"type":"response"} --> Content-Length: 108

Hide Details

{"command":"stackTrace","type":"request","arguments":{"threadId":2086069,"startFrame":0,"levels":1},"seq":8} <-- Content-Length: 330

Hide Details

{"body":{"stackFrames":[{"column":14,"id":524288,"line":23,"name":"main","source":{"name":"main.cpp","path":"/Users/buildslave/jenkins/workspace/lldb-cmake-sanitized/llvm-project/lldb/test/API/tools/lldb-vscode/evaluate/main.cpp"}}],"totalFrames":3},"command":"stackTrace","request_seq":8,"seq":0,"success":true,"type":"response"} --> Content-Length: 115

Hide Details

{"command":"evaluate","type":"request","arguments":{"expression":"var2","context":"repl","frameId":524288},"seq":9} <-- Content-Length: 138

Hide Details

{"body":{"result":"21","type":"int","variablesReference":0},"command":"evaluate","request_seq":9,"seq":0,"success":true,"type":"response"} --> Content-Length: 109

Hide Details

{"command":"stackTrace","type":"request","arguments":{"threadId":2086069,"startFrame":0,"levels":1},"seq":10} <-- Content-Length: 331

Hide Details

{"body":{"stackFrames":[{"column":14,"id":524288,"line":23,"name":"main","source":{"name":"main.cpp","path":"/Users/buildslave/jenkins/workspace/lldb-cmake-sanitized/llvm-project/lldb/test/API/tools/lldb-vscode/evaluate/main.cpp"}}],"totalFrames":3},"command":"stackTrace","request_seq":10,"seq":0,"success":true,"type":"response"} --> Content-Length: 122

Hide Details

{"command":"evaluate","type":"request","arguments":{"expression":"static_int","context":"repl","frameId":524288},"seq":11} <-- Content-Length: 139

Hide Details

{"body":{"result":"42","type":"int","variablesReference":0},"command":"evaluate","request_seq":11,"seq":0,"success":true,"type":"response"} --> Content-Length: 109

Hide Details

{"command":"stackTrace","type":"request","arguments":{"threadId":2086069,"startFrame":0,"levels":1},"seq":12} <-- Content-Length: 331

Hide Details

{"body":{"stackFrames":[{"column":14,"id":524288,"line":23,"name":"main","source":{"name":"main.cpp","path":"/Users/buildslave/jenkins/workspace/lldb-cmake-sanitized/llvm-project/lldb/test/API/tools/lldb-vscode/evaluate/main.cpp"}}],"totalFrames":3},"command":"stackTrace","request_seq":12,"seq":0,"success":true,"type":"response"} --> Content-Length: 126

Hide Details

{"command":"evaluate","type":"request","arguments":{"expression":"non_static_int","context":"repl","frameId":524288},"seq":13} <-- Content-Length: 139

Hide Details

{"body":{"result":"43","type":"int","variablesReference":0},"command":"evaluate","request_seq":13,"seq":0,"success":true,"type":"response"} --> Content-Length: 109

Hide Details

{"command":"stackTrace","type":"request","arguments":{"threadId":2086069,"startFrame":0,"levels":1},"seq":14} <-- Content-Length: 331

Hide Details

{"body":{"stackFrames":[{"column":14,"id":524288,"line":23,"name":"main","source":{"name":"main.cpp","path":"/Users/buildslave/jenkins/workspace/lldb-cmake-sanitized/llvm-project/lldb/test/API/tools/lldb-vscode/evaluate/main.cpp"}}],"totalFrames":3},"command":"stackTrace","request_seq":14,"seq":0,"success":true,"type":"response"} --> Content-Length: 119

Hide Details

{"command":"evaluate","type":"request","arguments":{"expression":"struct1","context":"repl","frameId":524288},"seq":15} <-- Content-Length: 169

Hide Details

{"body":{"result":"my_struct @ 0x7ffeefbff7c8","type":"my_struct","variablesReference":4},"command":"evaluate","request_seq":15,"seq":0,"success":true,"type":"response"} --> Content-Length: 109

Hide Details

{"command":"stackTrace","type":"request","arguments":{"threadId":2086069,"startFrame":0,"levels":1},"seq":16} <-- Content-Length: 331

Hide Details

{"body":{"stackFrames":[{"column":14,"id":524288,"line":23,"name":"main","source":{"name":"main.cpp","path":"/Users/buildslave/jenkins/workspace/lldb-cmake-sanitized/llvm-project/lldb/test/API/tools/lldb-vscode/evaluate/main.cpp"}}],"totalFrames":3},"command":"stackTrace","request_seq":16,"seq":0,"success":true,"type":"response"} --> Content-Length: 123

Hide Details

{"command":"evaluate","type":"request","arguments":{"expression":"struct1.foo","context":"repl","frameId":524288},"seq":17} <-- Content-Length: 139

Hide Details

{"body":{"result":"15","type":"int","variablesReference":0},"command":"evaluate","request_seq":17,"seq":0,"success":true,"type":"response"} --> Content-Length: 109

Hide Details

{"command":"stackTrace","type":"request","arguments":{"threadId":2086069,"startFrame":0,"levels":1},"seq":18} <-- Content-Length: 331

Hide Details

{"body":{"stackFrames":[{"column":14,"id":524288,"line":23,"name":"main","source":{"name":"main.cpp","path":"/Users/buildslave/jenkins/workspace/lldb-cmake-sanitized/llvm-project/lldb/test/API/tools/lldb-vscode/evaluate/main.cpp"}}],"totalFrames":3},"command":"stackTrace","request_seq":18,"seq":0,"success":true,"type":"response"} --> Content-Length: 124

Hide Details

{"command":"evaluate","type":"request","arguments":{"expression":"struct2->foo","context":"repl","frameId":524288},"seq":19} <-- Content-Length: 139

Hide Details

{"body":{"result":"16","type":"int","variablesReference":0},"command":"evaluate","request_seq":19,"seq":0,"success":true,"type":"response"} --> Content-Length: 109

Hide Details

{"command":"stackTrace","type":"request","arguments":{"threadId":2086069,"startFrame":0,"levels":1},"seq":20} <-- Content-Length: 331

Hide Details

{"body":{"stackFrames":[{"column":14,"id":524288,"line":23,"name":"main","source":{"name":"main.cpp","path":"/Users/buildslave/jenkins/workspace/lldb-cmake-sanitized/llvm-project/lldb/test/API/tools/lldb-vscode/evaluate/main.cpp"}}],"totalFrames":3},"command":"stackTrace","request_seq":20,"seq":0,"success":true,"type":"response"} --> Content-Length: 115

Hide Details

{"command":"evaluate","type":"request","arguments":{"expression":"var","context":"repl","frameId":524288},"seq":21} <-- Content-Length: 209

Hide Details

{"body":{},"command":"evaluate","message":"expression failed to parse:\nerror: <user expression 0>:1:1: use of undeclared identifier 'var'\nvar\n^\n","request_seq":21,"seq":0,"success":false,"type":"response"} --> Content-Length: 109

Hide Details

{"command":"stackTrace","type":"request","arguments":{"threadId":2086069,"startFrame":0,"levels":1},"seq":22} <-- Content-Length: 331

Hide Details

{"body":{"stackFrames":[{"column":14,"id":524288,"line":23,"name":"main","source":{"name":"main.cpp","path":"/Users/buildslave/jenkins/workspace/lldb-cmake-sanitized/llvm-project/lldb/test/API/tools/lldb-vscode/evaluate/main.cpp"}}],"totalFrames":3},"command":"stackTrace","request_seq":22,"seq":0,"success":true,"type":"response"} --> Content-Length: 121

Hide Details

{"command":"evaluate","type":"request","arguments":{"expression":"my_struct","context":"repl","frameId":524288},"seq":23} <-- Content-Length: 311

Hide Details

{"body":{"category":"console","output":"/Users/buildslave/jenkins/workspace/lldb-cmake-sanitized/llvm-project/lldb/tools/lldb-vscode/ProgressEvent.cpp:89:64: runtime error: load of value 808464432, which is not a valid value for type 'lldb_vscode::ProgressEventType'\n"},"event":"output","seq":0,"type":"event"} <-- Content-Length: 261

Hide Details

{"body":{"category":"console","output":"SUMMARY: UndefinedBehaviorSanitizer: undefined-behavior /Users/buildslave/jenkins/workspace/lldb-cmake-sanitized/llvm-project/lldb/tools/lldb-vscode/ProgressEvent.cpp:89:64 in \n"},"event":"output","seq":0,"type":"event"} <-- Content-Length: 170

Hide Details

{"body":{"category":"console","output":"PLEASE submit a bug report to https://bugs.llvm.org/ and include the crash backtrace.\n"},"event":"output","seq":0,"type":"event"} <-- Content-Length: 117

Hide Details

{"body":{},"command":"evaluate","message":"unknown error","request_seq":23,"seq":0,"success":false,"type":"response"} --> Content-Length: 109

Hide Details

{"command":"stackTrace","type":"request","arguments":{"threadId":2086069,"startFrame":0,"levels":1},"seq":24} <-- Content-Length: 331

Hide Details

{"body":{"stackFrames":[{"column":14,"id":524288,"line":23,"name":"main","source":{"name":"main.cpp","path":"/Users/buildslave/jenkins/workspace/lldb-cmake-sanitized/llvm-project/lldb/test/API/tools/lldb-vscode/evaluate/main.cpp"}}],"totalFrames":3},"command":"stackTrace","request_seq":24,"seq":0,"success":true,"type":"response"} --> Content-Length: 115

Hide Details

{"command":"evaluate","type":"request","arguments":{"expression":"int","context":"repl","frameId":524288},"seq":25}

Hide Details

========= END ========= ========= DEBUG ADAPTER PROTOCOL LOGS ========= --> Content-Length: 284

Hide Details

{"command":"initialize","type":"request","arguments":{"adapterID":"lldb-native","clientID":"vscode","columnsStartAt1":true,"linesStartAt1":true,"locale":"en-us","pathFormat":"path","supportsRunInTerminalRequest":true,"supportsVariablePaging":true,"supportsVariableType":true},"seq":1} <-- Content-Length: 1222

Hide Details

{"body":{"exceptionBreakpointFilters":[{"default":false,"filter":"cpp_catch","label":"C++ Catch"},{"default":false,"filter":"cpp_throw","label":"C++ Throw"},{"default":false,"filter":"objc_catch","label":"Objective C Catch"},{"default":false,"filter":"objc_throw","label":"Objective C Throw"},{"default":false,"filter":"swift_catch","label":"Swift Catch"},{"default":false,"filter":"swift_throw","label":"Swift Throw"}],"supportTerminateDebuggee":true,"supportsCompletionsRequest":false,"supportsConditionalBreakpoints":true,"supportsConfigurationDoneRequest":true,"supportsDelayedStackTraceLoading":true,"supportsEvaluateForHovers":true,"supportsExceptionInfoRequest":true,"supportsExceptionOptions":true,"supportsFunctionBreakpoints":true,"supportsGotoTargetsRequest":false,"supportsHitConditionalBreakpoints":true,"supportsLoadedSourcesRequest":false,"supportsModulesRequest":false,"supportsProgressReporting":true,"supportsRestartFrame":false,"supportsRestartRequest":false,"supportsRunInTerminalRequest":true,"supportsSetVariable":true,"supportsStepBack":false,"supportsStepInTargetsRequest":false,"supportsValueFormattingOptions":true},"command":"initialize","request_seq":1,"seq":0,"success":true,"type":"response"} --> Content-Length: 1041

Hide Details

{"command":"launch","type":"request","arguments":{"program":"/Users/buildslave/jenkins/workspace/lldb-cmake-sanitized/lldb-build/lldb-test-build.noindex/tools/lldb-vscode/evaluate/TestVSCode_evaluate.test_watch_evaluate_expressions/a.out","disableASLR":true,"initCommands":["settings clear -all","settings set symbols.enable-external-lookup false","settings set target.inherit-tcc true","settings set target.detach-on-error false","settings set target.auto-apply-fixits false","settings set plugin.process.gdb-remote.packet-timeout 60","settings set symbols.clang-modules-cache-path \"/Users/buildslave/jenkins/workspace/lldb-cmake-sanitized/lldb-build/lldb-test-build.noindex/module-cache-lldb/lldb-api\"","settings set use-color false","setting set target.prefer-dynamic-value no-dynamic-values","settings set target.env-vars ASAN_OPTIONS=detect_stack_use_after_return=1 DYLD_INSERT_LIBRARIES=/Users/buildslave/jenkins/workspace/lldb-cmake-sanitized/host-compiler/lib/clang/13.0.99/lib/darwin/libclang_rt.asan_osx_dynamic.dylib"]},"seq":2} <-- Content-Length: 923

Hide Details

{"body":{"category":"console","output":"Running initCommands:\n(lldb) settings clear -all\n(lldb) settings set symbols.enable-external-lookup false\n(lldb) settings set target.inherit-tcc true\n(lldb) settings set target.detach-on-error false\n(lldb) settings set target.auto-apply-fixits false\n(lldb) settings set plugin.process.gdb-remote.packet-timeout 60\n(lldb) settings set symbols.clang-modules-cache-path \"/Users/buildslave/jenkins/workspace/lldb-cmake-sanitized/lldb-build/lldb-test-build.noindex/module-cache-lldb/lldb-api\"\n(lldb) settings set use-color false\n(lldb) setting set target.prefer-dynamic-value no-dynamic-values\n(lldb) settings set target.env-vars ASAN_OPTIONS=detect_stack_use_after_return=1 DYLD_INSERT_LIBRARIES=/Users/buildslave/jenkins/workspace/lldb-cmake-sanitized/host-compiler/lib/clang/13.0.99/lib/darwin/libclang_rt.asan_osx_dynamic.dylib\n"},"event":"output","seq":0,"type":"event"} <-- Content-Length: 77

Hide Details

{"command":"launch","request_seq":2,"seq":0,"success":true,"type":"response"} <-- Content-Length: 306

Hide Details

{"body":{"isLocalProcess":true,"name":"/Users/buildslave/jenkins/workspace/lldb-cmake-sanitized/lldb-build/lldb-test-build.noindex/tools/lldb-vscode/evaluate/TestVSCode_evaluate.test_watch_evaluate_expressions/a.out","startMethod":"launch","systemProcessId":93836},"event":"process","seq":0,"type":"event"} <-- Content-Length: 46

Hide Details

{"event":"initialized","seq":0,"type":"event"} --> Content-Length: 276

Hide Details

{"command":"setBreakpoints","type":"request","arguments":{"source":{"name":"main.cpp","path":"main.cpp"},"sourceModified":false,"lines":"[23, 27, 11, 35, 40, 44, 45]","breakpoints":[{"line":23},{"line":27},{"line":11},{"line":35},{"line":40},{"line":44},{"line":45}]},"seq":3} <-- Content-Length: 684

Hide Details

{"body":{"breakpoints":[{"id":1,"line":23,"source":{"name":"main.cpp","path":"main.cpp"},"verified":true},{"id":2,"line":27,"source":{"name":"main.cpp","path":"main.cpp"},"verified":true},{"id":3,"line":11,"source":{"name":"main.cpp","path":"main.cpp"},"verified":true},{"id":4,"line":35,"source":{"name":"main.cpp","path":"main.cpp"},"verified":true},{"id":5,"line":40,"source":{"name":"main.cpp","path":"main.cpp"},"verified":true},{"id":6,"line":44,"source":{"name":"main.cpp","path":"main.cpp"},"verified":true},{"id":7,"line":45,"source":{"name":"main.cpp","path":"main.cpp"},"verified":true}]},"command":"setBreakpoints","request_seq":3,"seq":0,"success":true,"type":"response"} --> Content-Length: 71

Hide Details

{"command":"configurationDone","type":"request","arguments":{},"seq":4} <-- Content-Length: 88

Hide Details

{"command":"configurationDone","request_seq":4,"seq":0,"success":true,"type":"response"} <-- Content-Length: 199

Hide Details

{"body":{"allThreadsStopped":true,"description":"breakpoint 1.1","preserveFocusHint":false,"reason":"breakpoint","threadCausedFocus":true,"threadId":2086363},"event":"stopped","seq":0,"type":"event"} --> Content-Length: 61

Hide Details

{"command":"threads","type":"request","arguments":{},"seq":5} <-- Content-Length: 133

Hide Details

{"body":{"threads":[{"id":2086363,"name":"Thread #1"}]},"command":"threads","request_seq":5,"seq":0,"success":true,"type":"response"} --> Content-Length: 108

Hide Details

{"command":"stackTrace","type":"request","arguments":{"threadId":2086363,"startFrame":0,"levels":1},"seq":6} <-- Content-Length: 330

Hide Details

{"body":{"stackFrames":[{"column":14,"id":524288,"line":23,"name":"main","source":{"name":"main.cpp","path":"/Users/buildslave/jenkins/workspace/lldb-cmake-sanitized/llvm-project/lldb/test/API/tools/lldb-vscode/evaluate/main.cpp"}}],"totalFrames":2},"command":"stackTrace","request_seq":6,"seq":0,"success":true,"type":"response"} --> Content-Length: 116

Hide Details

{"command":"evaluate","type":"request","arguments":{"expression":"var1","context":"watch","frameId":524288},"seq":7} <-- Content-Length: 138

Hide Details

{"body":{"result":"20","type":"int","variablesReference":0},"command":"evaluate","request_seq":7,"seq":0,"success":true,"type":"response"} --> Content-Length: 108

Hide Details

{"command":"stackTrace","type":"request","arguments":{"threadId":2086363,"startFrame":0,"levels":1},"seq":8} <-- Content-Length: 330

Hide Details

{"body":{"stackFrames":[{"column":14,"id":524288,"line":23,"name":"main","source":{"name":"main.cpp","path":"/Users/buildslave/jenkins/workspace/lldb-cmake-sanitized/llvm-project/lldb/test/API/tools/lldb-vscode/evaluate/main.cpp"}}],"totalFrames":2},"command":"stackTrace","request_seq":8,"seq":0,"success":true,"type":"response"} --> Content-Length: 116

Hide Details

{"command":"evaluate","type":"request","arguments":{"expression":"var2","context":"watch","frameId":524288},"seq":9} <-- Content-Length: 138

Hide Details

{"body":{"result":"21","type":"int","variablesReference":0},"command":"evaluate","request_seq":9,"seq":0,"success":true,"type":"response"} --> Content-Length: 109

Hide Details

{"command":"stackTrace","type":"request","arguments":{"threadId":2086363,"startFrame":0,"levels":1},"seq":10} <-- Content-Length: 331

Hide Details

{"body":{"stackFrames":[{"column":14,"id":524288,"line":23,"name":"main","source":{"name":"main.cpp","path":"/Users/buildslave/jenkins/workspace/lldb-cmake-sanitized/llvm-project/lldb/test/API/tools/lldb-vscode/evaluate/main.cpp"}}],"totalFrames":2},"command":"stackTrace","request_seq":10,"seq":0,"success":true,"type":"response"} --> Content-Length: 123

Hide Details

{"command":"evaluate","type":"request","arguments":{"expression":"static_int","context":"watch","frameId":524288},"seq":11} <-- Content-Length: 139

Hide Details

{"body":{"result":"42","type":"int","variablesReference":0},"command":"evaluate","request_seq":11,"seq":0,"success":true,"type":"response"} --> Content-Length: 109

Hide Details

{"command":"stackTrace","type":"request","arguments":{"threadId":2086363,"startFrame":0,"levels":1},"seq":12} <-- Content-Length: 331

Hide Details

{"body":{"stackFrames":[{"column":14,"id":524288,"line":23,"name":"main","source":{"name":"main.cpp","path":"/Users/buildslave/jenkins/workspace/lldb-cmake-sanitized/llvm-project/lldb/test/API/tools/lldb-vscode/evaluate/main.cpp"}}],"totalFrames":2},"command":"stackTrace","request_seq":12,"seq":0,"success":true,"type":"response"} --> Content-Length: 127

Hide Details

{"command":"evaluate","type":"request","arguments":{"expression":"non_static_int","context":"watch","frameId":524288},"seq":13} <-- Content-Length: 139

Hide Details

{"body":{"result":"43","type":"int","variablesReference":0},"command":"evaluate","request_seq":13,"seq":0,"success":true,"type":"response"} --> Content-Length: 109

Hide Details

{"command":"stackTrace","type":"request","arguments":{"threadId":2086363,"startFrame":0,"levels":1},"seq":14} <-- Content-Length: 331

Hide Details

{"body":{"stackFrames":[{"column":14,"id":524288,"line":23,"name":"main","source":{"name":"main.cpp","path":"/Users/buildslave/jenkins/workspace/lldb-cmake-sanitized/llvm-project/lldb/test/API/tools/lldb-vscode/evaluate/main.cpp"}}],"totalFrames":2},"command":"stackTrace","request_seq":14,"seq":0,"success":true,"type":"response"} --> Content-Length: 120

Hide Details

{"command":"evaluate","type":"request","arguments":{"expression":"struct1","context":"watch","frameId":524288},"seq":15} <-- Content-Length: 169

Hide Details

{"body":{"result":"my_struct @ 0x7ffeefbff7c8","type":"my_struct","variablesReference":4},"command":"evaluate","request_seq":15,"seq":0,"success":true,"type":"response"} --> Content-Length: 109

Hide Details

{"command":"stackTrace","type":"request","arguments":{"threadId":2086363,"startFrame":0,"levels":1},"seq":16} <-- Content-Length: 331

Hide Details

{"body":{"stackFrames":[{"column":14,"id":524288,"line":23,"name":"main","source":{"name":"main.cpp","path":"/Users/buildslave/jenkins/workspace/lldb-cmake-sanitized/llvm-project/lldb/test/API/tools/lldb-vscode/evaluate/main.cpp"}}],"totalFrames":2},"command":"stackTrace","request_seq":16,"seq":0,"success":true,"type":"response"} --> Content-Length: 124

Hide Details

{"command":"evaluate","type":"request","arguments":{"expression":"struct1.foo","context":"watch","frameId":524288},"seq":17} <-- Content-Length: 139

Hide Details

{"body":{"result":"15","type":"int","variablesReference":0},"command":"evaluate","request_seq":17,"seq":0,"success":true,"type":"response"} --> Content-Length: 109

Hide Details

{"command":"stackTrace","type":"request","arguments":{"threadId":2086363,"startFrame":0,"levels":1},"seq":18} <-- Content-Length: 331

Hide Details

{"body":{"stackFrames":[{"column":14,"id":524288,"line":23,"name":"main","source":{"name":"main.cpp","path":"/Users/buildslave/jenkins/workspace/lldb-cmake-sanitized/llvm-project/lldb/test/API/tools/lldb-vscode/evaluate/main.cpp"}}],"totalFrames":2},"command":"stackTrace","request_seq":18,"seq":0,"success":true,"type":"response"} --> Content-Length: 125

Hide Details

{"command":"evaluate","type":"request","arguments":{"expression":"struct2->foo","context":"watch","frameId":524288},"seq":19} <-- Content-Length: 139

Hide Details

{"body":{"result":"16","type":"int","variablesReference":0},"command":"evaluate","request_seq":19,"seq":0,"success":true,"type":"response"} --> Content-Length: 109

Hide Details

{"command":"stackTrace","type":"request","arguments":{"threadId":2086363,"startFrame":0,"levels":1},"seq":20} <-- Content-Length: 331

Hide Details

{"body":{"stackFrames":[{"column":14,"id":524288,"line":23,"name":"main","source":{"name":"main.cpp","path":"/Users/buildslave/jenkins/workspace/lldb-cmake-sanitized/llvm-project/lldb/test/API/tools/lldb-vscode/evaluate/main.cpp"}}],"totalFrames":2},"command":"stackTrace","request_seq":20,"seq":0,"success":true,"type":"response"} --> Content-Length: 116

Hide Details

{"command":"evaluate","type":"request","arguments":{"expression":"var","context":"watch","frameId":524288},"seq":21} <-- Content-Length: 209

Hide Details

{"body":{},"command":"evaluate","message":"expression failed to parse:\nerror: <user expression 0>:1:1: use of undeclared identifier 'var'\nvar\n^\n","request_seq":21,"seq":0,"success":false,"type":"response"} --> Content-Length: 109

Hide Details

{"command":"stackTrace","type":"request","arguments":{"threadId":2086363,"startFrame":0,"levels":1},"seq":22} <-- Content-Length: 331

Hide Details

{"body":{"stackFrames":[{"column":14,"id":524288,"line":23,"name":"main","source":{"name":"main.cpp","path":"/Users/buildslave/jenkins/workspace/lldb-cmake-sanitized/llvm-project/lldb/test/API/tools/lldb-vscode/evaluate/main.cpp"}}],"totalFrames":2},"command":"stackTrace","request_seq":22,"seq":0,"success":true,"type":"response"} --> Content-Length: 122

Hide Details

{"command":"evaluate","type":"request","arguments":{"expression":"my_struct","context":"watch","frameId":524288},"seq":23} <-- Content-Length: 311

Hide Details

{"body":{"category":"console","output":"/Users/buildslave/jenkins/workspace/lldb-cmake-sanitized/llvm-project/lldb/tools/lldb-vscode/ProgressEvent.cpp:89:64: runtime error: load of value 808464432, which is not a valid value for type 'lldb_vscode::ProgressEventType'\n"},"event":"output","seq":0,"type":"event"} <-- Content-Length: 261

Hide Details

{"body":{"category":"console","output":"SUMMARY: UndefinedBehaviorSanitizer: undefined-behavior /Users/buildslave/jenkins/workspace/lldb-cmake-sanitized/llvm-project/lldb/tools/lldb-vscode/ProgressEvent.cpp:89:64 in \n"},"event":"output","seq":0,"type":"event"} <-- Content-Length: 170

Hide Details

{"body":{"category":"console","output":"PLEASE submit a bug report to https://bugs.llvm.org/ and include the crash backtrace.\n"},"event":"output","seq":0,"type":"event"} <-- Content-Length: 117

Hide Details

{"body":{},"command":"evaluate","message":"unknown error","request_seq":23,"seq":0,"success":false,"type":"response"} --> Content-Length: 109

Hide Details

{"command":"stackTrace","type":"request","arguments":{"threadId":2086363,"startFrame":0,"levels":1},"seq":24} <-- Content-Length: 331

Hide Details

{"body":{"stackFrames":[{"column":14,"id":524288,"line":23,"name":"main","source":{"name":"main.cpp","path":"/Users/buildslave/jenkins/workspace/lldb-cmake-sanitized/llvm-project/lldb/test/API/tools/lldb-vscode/evaluate/main.cpp"}}],"totalFrames":2},"command":"stackTrace","request_seq":24,"seq":0,"success":true,"type":"response"} --> Content-Length: 116

Hide Details

{"command":"evaluate","type":"request","arguments":{"expression":"int","context":"watch","frameId":524288},"seq":25}

Hide Details

========= END =========

Hide Details

-- Command Output (stderr): -- Change dir to: /Users/buildslave/jenkins/workspace/lldb-cmake-sanitized/llvm-project/lldb/test/API/tools/lldb-vscode/evaluate runCmd: settings clear -all output:

Hide Details

runCmd: settings set symbols.enable-external-lookup false output:

Hide Details

runCmd: settings set target.inherit-tcc true output:

Hide Details

runCmd: settings set target.detach-on-error false output:

Hide Details

runCmd: settings set target.auto-apply-fixits false output:

Hide Details

runCmd: settings set plugin.process.gdb-remote.packet-timeout 60 output:

Hide Details

runCmd: settings set symbols.clang-modules-cache-path "/Users/buildslave/jenkins/workspace/lldb-cmake-sanitized/lldb-build/lldb-test-build.noindex/module-cache-lldb/lldb-api" output:

Hide Details

runCmd: settings set use-color false output:

Hide Details

runCmd: setting set target.prefer-dynamic-value no-dynamic-values output:

Hide Details

runCmd: settings set target.env-vars ASAN_OPTIONS=detect_stack_use_after_return=1 DYLD_INSERT_LIBRARIES=/Users/buildslave/jenkins/workspace/lldb-cmake-sanitized/host-compiler/lib/clang/13.0.99/lib/darwin/libclang_rt.asan_osx_dynamic.dylib output:

Hide Details

Adding tearDown hook: def cleanup(): if disconnectAutomatically: self.vscode.request_disconnect(terminateDebuggee=True) self.vscode.terminate()

Hide Details

Hide Details

FAIL: LLDB (/Users/buildslave/jenkins/workspace/lldb-cmake-sanitized/host-compiler/bin/clang-x86_64) :: test_generic_evaluate_expressions (TestVSCode_evaluate.TestVSCode_variables) Executing tearDown hook: def cleanup(): if disconnectAutomatically: self.vscode.request_disconnect(terminateDebuggee=True) self.vscode.terminate()

Hide Details

Hide Details

CLEANUP ERROR: LLDB (/Users/buildslave/jenkins/workspace/lldb-cmake-sanitized/host-compiler/bin/clang-x86_64) :: test_generic_evaluate_expressions (TestVSCode_evaluate.TestVSCode_variables) Traceback (most recent call last): File "/Users/buildslave/jenkins/workspace/lldb-cmake-sanitized/llvm-project/lldb/third_party/Python/module/unittest2/unittest2/case.py", line 386, in run self.tearDown() File "/Users/buildslave/jenkins/workspace/lldb-cmake-sanitized/llvm-project/lldb/packages/Python/lldbsuite/test/lldbtest.py", line 2095, in tearDown Base.tearDown(self) File "/Users/buildslave/jenkins/workspace/lldb-cmake-sanitized/llvm-project/lldb/packages/Python/lldbsuite/test/lldbtest.py", line 1065, in tearDown hook() # try the plain call and hope it works File "/Users/buildslave/jenkins/workspace/lldb-cmake-sanitized/llvm-project/lldb/packages/Python/lldbsuite/test/tools/lldb-vscode/lldbvscode_testcase.py", line 294, in cleanup self.vscode.request_disconnect(terminateDebuggee=True) File "/Users/buildslave/jenkins/workspace/lldb-cmake-sanitized/llvm-project/lldb/packages/Python/lldbsuite/test/tools/lldb-vscode/vscode.py", line 590, in request_disconnect return self.send_recv(command_dict) File "/Users/buildslave/jenkins/workspace/lldb-cmake-sanitized/llvm-project/lldb/packages/Python/lldbsuite/test/tools/lldb-vscode/vscode.py", line 315, in send_recv self.send_packet(command) File "/Users/buildslave/jenkins/workspace/lldb-cmake-sanitized/llvm-project/lldb/packages/Python/lldbsuite/test/tools/lldb-vscode/vscode.py", line 271, in send_packet self.send.flush() BrokenPipeError: [Errno 32] Broken pipe

Hide Details

runCmd: settings clear -all output:

Hide Details

runCmd: settings set symbols.enable-external-lookup false output:

Hide Details

runCmd: settings set target.inherit-tcc true output:

Hide Details

runCmd: settings set target.detach-on-error false output:

Hide Details

runCmd: settings set target.auto-apply-fixits false output:

Hide Details

runCmd: settings set plugin.process.gdb-remote.packet-timeout 60 output:

Hide Details

runCmd: settings set symbols.clang-modules-cache-path "/Users/buildslave/jenkins/workspace/lldb-cmake-sanitized/lldb-build/lldb-test-build.noindex/module-cache-lldb/lldb-api" output:

Hide Details

runCmd: settings set use-color false output:

Hide Details

runCmd: setting set target.prefer-dynamic-value no-dynamic-values output:

Hide Details

runCmd: settings set target.env-vars ASAN_OPTIONS=detect_stack_use_after_return=1 DYLD_INSERT_LIBRARIES=/Users/buildslave/jenkins/workspace/lldb-cmake-sanitized/host-compiler/lib/clang/13.0.99/lib/darwin/libclang_rt.asan_osx_dynamic.dylib output:

Hide Details

Adding tearDown hook: def cleanup(): if disconnectAutomatically: self.vscode.request_disconnect(terminateDebuggee=True) self.vscode.terminate()

Hide Details

Hide Details

Executing tearDown hook: def cleanup(): if disconnectAutomatically: self.vscode.request_disconnect(terminateDebuggee=True) self.vscode.terminate()

Hide Details

Hide Details

PASS: LLDB (/Users/buildslave/jenkins/workspace/lldb-cmake-sanitized/host-compiler/bin/clang-x86_64) :: test_hover_evaluate_expressions (TestVSCode_evaluate.TestVSCode_variables) runCmd: settings clear -all output:

Hide Details

runCmd: settings set symbols.enable-external-lookup false output:

Hide Details

runCmd: settings set target.inherit-tcc true output:

Hide Details

runCmd: settings set target.detach-on-error false output:

Hide Details

runCmd: settings set target.auto-apply-fixits false output:

Hide Details

runCmd: settings set plugin.process.gdb-remote.packet-timeout 60 output:

Hide Details

runCmd: settings set symbols.clang-modules-cache-path "/Users/buildslave/jenkins/workspace/lldb-cmake-sanitized/lldb-build/lldb-test-build.noindex/module-cache-lldb/lldb-api" output:

Hide Details

runCmd: settings set use-color false output:

Hide Details

runCmd: setting set target.prefer-dynamic-value no-dynamic-values output:

Hide Details

runCmd: settings set target.env-vars ASAN_OPTIONS=detect_stack_use_after_return=1 DYLD_INSERT_LIBRARIES=/Users/buildslave/jenkins/workspace/lldb-cmake-sanitized/host-compiler/lib/clang/13.0.99/lib/darwin/libclang_rt.asan_osx_dynamic.dylib output:

Hide Details

Adding tearDown hook: def cleanup(): if disconnectAutomatically: self.vscode.request_disconnect(terminateDebuggee=True) self.vscode.terminate()

Hide Details

Hide Details

FAIL: LLDB (/Users/buildslave/jenkins/workspace/lldb-cmake-sanitized/host-compiler/bin/clang-x86_64) :: test_repl_evaluate_expressions (TestVSCode_evaluate.TestVSCode_variables) Executing tearDown hook: def cleanup(): if disconnectAutomatically: self.vscode.request_disconnect(terminateDebuggee=True) self.vscode.terminate()

Hide Details

Hide Details

CLEANUP ERROR: LLDB (/Users/buildslave/jenkins/workspace/lldb-cmake-sanitized/host-compiler/bin/clang-x86_64) :: test_repl_evaluate_expressions (TestVSCode_evaluate.TestVSCode_variables) Traceback (most recent call last): File "/Users/buildslave/jenkins/workspace/lldb-cmake-sanitized/llvm-project/lldb/third_party/Python/module/unittest2/unittest2/case.py", line 386, in run self.tearDown() File "/Users/buildslave/jenkins/workspace/lldb-cmake-sanitized/llvm-project/lldb/packages/Python/lldbsuite/test/lldbtest.py", line 2095, in tearDown Base.tearDown(self) File "/Users/buildslave/jenkins/workspace/lldb-cmake-sanitized/llvm-project/lldb/packages/Python/lldbsuite/test/lldbtest.py", line 1065, in tearDown hook() # try the plain call and hope it works File "/Users/buildslave/jenkins/workspace/lldb-cmake-sanitized/llvm-project/lldb/packages/Python/lldbsuite/test/tools/lldb-vscode/lldbvscode_testcase.py", line 294, in cleanup self.vscode.request_disconnect(terminateDebuggee=True) File "/Users/buildslave/jenkins/workspace/lldb-cmake-sanitized/llvm-project/lldb/packages/Python/lldbsuite/test/tools/lldb-vscode/vscode.py", line 590, in request_disconnect return self.send_recv(command_dict) File "/Users/buildslave/jenkins/workspace/lldb-cmake-sanitized/llvm-project/lldb/packages/Python/lldbsuite/test/tools/lldb-vscode/vscode.py", line 315, in send_recv self.send_packet(command) File "/Users/buildslave/jenkins/workspace/lldb-cmake-sanitized/llvm-project/lldb/packages/Python/lldbsuite/test/tools/lldb-vscode/vscode.py", line 271, in send_packet self.send.flush() BrokenPipeError: [Errno 32] Broken pipe

Hide Details

runCmd: settings clear -all output:

Hide Details

runCmd: settings set symbols.enable-external-lookup false output:

Hide Details

runCmd: settings set target.inherit-tcc true output:

Hide Details

runCmd: settings set target.detach-on-error false output:

Hide Details

runCmd: settings set target.auto-apply-fixits false output:

Hide Details

runCmd: settings set plugin.process.gdb-remote.packet-timeout 60 output:

Hide Details

runCmd: settings set symbols.clang-modules-cache-path "/Users/buildslave/jenkins/workspace/lldb-cmake-sanitized/lldb-build/lldb-test-build.noindex/module-cache-lldb/lldb-api" output:

Hide Details

runCmd: settings set use-color false output:

Hide Details

runCmd: setting set target.prefer-dynamic-value no-dynamic-values output:

Hide Details

runCmd: settings set target.env-vars ASAN_OPTIONS=detect_stack_use_after_return=1 DYLD_INSERT_LIBRARIES=/Users/buildslave/jenkins/workspace/lldb-cmake-sanitized/host-compiler/lib/clang/13.0.99/lib/darwin/libclang_rt.asan_osx_dynamic.dylib output:

Hide Details

Adding tearDown hook: def cleanup(): if disconnectAutomatically: self.vscode.request_disconnect(terminateDebuggee=True) self.vscode.terminate()

Hide Details

Hide Details

FAIL: LLDB (/Users/buildslave/jenkins/workspace/lldb-cmake-sanitized/host-compiler/bin/clang-x86_64) :: test_watch_evaluate_expressions (TestVSCode_evaluate.TestVSCode_variables) Executing tearDown hook: def cleanup(): if disconnectAutomatically: self.vscode.request_disconnect(terminateDebuggee=True) self.vscode.terminate()

Hide Details

Hide Details

CLEANUP ERROR: LLDB (/Users/buildslave/jenkins/workspace/lldb-cmake-sanitized/host-compiler/bin/clang-x86_64) :: test_watch_evaluate_expressions (TestVSCode_evaluate.TestVSCode_variables) Traceback (most recent call last): File "/Users/buildslave/jenkins/workspace/lldb-cmake-sanitized/llvm-project/lldb/third_party/Python/module/unittest2/unittest2/case.py", line 386, in run self.tearDown() File "/Users/buildslave/jenkins/workspace/lldb-cmake-sanitized/llvm-project/lldb/packages/Python/lldbsuite/test/lldbtest.py", line 2095, in tearDown Base.tearDown(self) File "/Users/buildslave/jenkins/workspace/lldb-cmake-sanitized/llvm-project/lldb/packages/Python/lldbsuite/test/lldbtest.py", line 1065, in tearDown hook() # try the plain call and hope it works File "/Users/buildslave/jenkins/workspace/lldb-cmake-sanitized/llvm-project/lldb/packages/Python/lldbsuite/test/tools/lldb-vscode/lldbvscode_testcase.py", line 294, in cleanup self.vscode.request_disconnect(terminateDebuggee=True) File "/Users/buildslave/jenkins/workspace/lldb-cmake-sanitized/llvm-project/lldb/packages/Python/lldbsuite/test/tools/lldb-vscode/vscode.py", line 590, in request_disconnect return self.send_recv(command_dict) File "/Users/buildslave/jenkins/workspace/lldb-cmake-sanitized/llvm-project/lldb/packages/Python/lldbsuite/test/tools/lldb-vscode/vscode.py", line 315, in send_recv self.send_packet(command) File "/Users/buildslave/jenkins/workspace/lldb-cmake-sanitized/llvm-project/lldb/packages/Python/lldbsuite/test/tools/lldb-vscode/vscode.py", line 271, in send_packet self.send.flush() BrokenPipeError: [Errno 32] Broken pipe

Hide Details

Restore dir to: /Users/buildslave/jenkins/workspace/lldb-cmake-sanitized/lldb-build/tools/lldb/test ====================================================================== ERROR: test_generic_evaluate_expressions (TestVSCode_evaluate.TestVSCode_variables) ---------------------------------------------------------------------- Traceback (most recent call last): File "/Users/buildslave/jenkins/workspace/lldb-cmake-sanitized/llvm-project/lldb/test/API/tools/lldb-vscode/evaluate/TestVSCode_evaluate.py", line 157, in test_generic_evaluate_expressions self.run_test_evaluate_expressions() File "/Users/buildslave/jenkins/workspace/lldb-cmake-sanitized/llvm-project/lldb/test/API/tools/lldb-vscode/evaluate/TestVSCode_evaluate.py", line 62, in run_test_evaluate_expressions self.assertEvaluateFailure("int") # type name File "/Users/buildslave/jenkins/workspace/lldb-cmake-sanitized/llvm-project/lldb/test/API/tools/lldb-vscode/evaluate/TestVSCode_evaluate.py", line 24, in assertEvaluateFailure self.vscode.request_evaluate(expression, context=self.context)['body']) File "/Users/buildslave/jenkins/workspace/lldb-cmake-sanitized/llvm-project/lldb/packages/Python/lldbsuite/test/tools/lldb-vscode/vscode.py", line 607, in request_evaluate return self.send_recv(command_dict) File "/Users/buildslave/jenkins/workspace/lldb-cmake-sanitized/llvm-project/lldb/packages/Python/lldbsuite/test/tools/lldb-vscode/vscode.py", line 321, in send_recv raise ValueError(desc) ValueError: no response for "evaluate" Config=x86_64-/Users/buildslave/jenkins/workspace/lldb-cmake-sanitized/host-compiler/bin/clang ====================================================================== ERROR: test_repl_evaluate_expressions (TestVSCode_evaluate.TestVSCode_variables) ---------------------------------------------------------------------- Traceback (most recent call last): File "/Users/buildslave/jenkins/workspace/lldb-cmake-sanitized/llvm-project/lldb/test/API/tools/lldb-vscode/evaluate/TestVSCode_evaluate.py", line 163, in test_repl_evaluate_expressions self.run_test_evaluate_expressions("repl") File "/Users/buildslave/jenkins/workspace/lldb-cmake-sanitized/llvm-project/lldb/test/API/tools/lldb-vscode/evaluate/TestVSCode_evaluate.py", line 62, in run_test_evaluate_expressions self.assertEvaluateFailure("int") # type name File "/Users/buildslave/jenkins/workspace/lldb-cmake-sanitized/llvm-project/lldb/test/API/tools/lldb-vscode/evaluate/TestVSCode_evaluate.py", line 24, in assertEvaluateFailure self.vscode.request_evaluate(expression, context=self.context)['body']) File "/Users/buildslave/jenkins/workspace/lldb-cmake-sanitized/llvm-project/lldb/packages/Python/lldbsuite/test/tools/lldb-vscode/vscode.py", line 607, in request_evaluate return self.send_recv(command_dict) File "/Users/buildslave/jenkins/workspace/lldb-cmake-sanitized/llvm-project/lldb/packages/Python/lldbsuite/test/tools/lldb-vscode/vscode.py", line 321, in send_recv raise ValueError(desc) ValueError: no response for "evaluate" Config=x86_64-/Users/buildslave/jenkins/workspace/lldb-cmake-sanitized/host-compiler/bin/clang ====================================================================== ERROR: test_watch_evaluate_expressions (TestVSCode_evaluate.TestVSCode_variables) ---------------------------------------------------------------------- Traceback (most recent call last): File "/Users/buildslave/jenkins/workspace/lldb-cmake-sanitized/llvm-project/lldb/test/API/tools/lldb-vscode/evaluate/TestVSCode_evaluate.py", line 169, in test_watch_evaluate_expressions self.run_test_evaluate_expressions("watch") File "/Users/buildslave/jenkins/workspace/lldb-cmake-sanitized/llvm-project/lldb/test/API/tools/lldb-vscode/evaluate/TestVSCode_evaluate.py", line 62, in run_test_evaluate_expressions self.assertEvaluateFailure("int") # type name File "/Users/buildslave/jenkins/workspace/lldb-cmake-sanitized/llvm-project/lldb/test/API/tools/lldb-vscode/evaluate/TestVSCode_evaluate.py", line 24, in assertEvaluateFailure self.vscode.request_evaluate(expression, context=self.context)['body']) File "/Users/buildslave/jenkins/workspace/lldb-cmake-sanitized/llvm-project/lldb/packages/Python/lldbsuite/test/tools/lldb-vscode/vscode.py", line 607, in request_evaluate return self.send_recv(command_dict) File "/Users/buildslave/jenkins/workspace/lldb-cmake-sanitized/llvm-project/lldb/packages/Python/lldbsuite/test/tools/lldb-vscode/vscode.py", line 321, in send_recv raise ValueError(desc) ValueError: no response for "evaluate" Config=x86_64-/Users/buildslave/jenkins/workspace/lldb-cmake-sanitized/host-compiler/bin/clang ---------------------------------------------------------------------- Ran 4 tests in 15.710s

Hide Details

RESULT: FAILED (1 passes, 0 failures, 3 errors, 0 skipped, 0 expected failures, 0 unexpected successes)

Hide Details

--

Hide Details

******************** PASS: lldb-shell :: SymbolFile/DWARF/x86/apple-index-is-used.cpp (2214 of 2354) PASS: lldb-api :: commands/frame/language/TestGuessLanguage.py (2215 of 2354) PASS: lldb-api :: lang/cpp/limit-debug-info/TestWithLimitDebugInfo.py (2216 of 2354) PASS: lldb-api :: functionalities/data-formatter/nsarraysynth/TestNSArraySynthetic.py (2217 of 2354) PASS: lldb-api :: commands/expression/char/TestExprsChar.py (2218 of 2354) UNSUPPORTED: lldb-shell :: Subprocess/vfork-follow-parent-wp.test (2219 of 2354) PASS: lldb-unit :: Process/minidump/./LLDBMinidumpTests/MinidumpParserTest.GetMemory (2220 of 2354) PASS: lldb-unit :: Process/gdb-remote/./ProcessGdbRemoteTests/GDBRemoteCommunicationServerTest.SendErrorResponse_ErrorNumber (2221 of 2354) PASS: lldb-api :: tools/lldb-server/inferior-crash/TestGdbRemoteAbort.py (2222 of 2354) PASS: lldb-api :: lang/cpp/pointer_to_member_type_depending_on_parent_size/TestPointerToMemberTypeDependingOnParentSize.py (2223 of 2354) PASS: lldb-unit :: Utility/./UtilityTests/ScalarTest.Scalar_512 (2224 of 2354) PASS: lldb-shell :: Reproducer/Functionalities/TestExpressionEvaluation.test (2225 of 2354) PASS: lldb-api :: lang/objc/modules-objc-property/TestModulesObjCProperty.py (2226 of 2354) PASS: lldb-api :: lang/cpp/namespace_conflicts/TestNamespaceConflicts.py (2227 of 2354) PASS: lldb-api :: tools/lldb-vscode/variables/TestVSCode_variables.py (2228 of 2354) PASS: lldb-unit :: Utility/./UtilityTests/StringListTest.GetMaxStringLengthDecreasingSize (2229 of 2354) PASS: lldb-shell :: Breakpoint/split-dwarf-5-addrbase.test (2230 of 2354) PASS: lldb-api :: commands/apropos/with-process/TestAproposWithProcess.py (2231 of 2354) UNSUPPORTED: lldb-api :: functionalities/asan/TestReportData.py (2232 of 2354) PASS: lldb-api :: functionalities/gdb_remote_client/TestProcessConnect.py (2233 of 2354) PASS: lldb-unit :: Core/./LLDBCoreTests/FormatEntity.LookupAllEntriesInTree (2234 of 2354) PASS: lldb-shell :: SymbolFile/NativePDB/ast-functions.cpp (2235 of 2354) PASS: lldb-unit :: Process/gdb-remote/./ProcessGdbRemoteTests/GDBRemoteClientBaseTest.SendPacketAndReceiveResponseWithOutputSupport (2236 of 2354) UNSUPPORTED: lldb-api :: functionalities/darwin_log/source/info/TestDarwinLogSourceInfo.py (2237 of 2354) PASS: lldb-unit :: Utility/./UtilityTests/ScalarTest.SetValueFromCString (2238 of 2354) PASS: lldb-unit :: ObjectFile/ELF/./ObjectFileELFTests/ObjectFileELFTest.GetModuleSpecifications_EarlySectionHeaders (2239 of 2354) PASS: lldb-unit :: Utility/./UtilityTests/StreamTest.PutHex64ByteOrderLittle (2240 of 2354) UNSUPPORTED: lldb-shell :: Register/x86-zmm-read.test (2241 of 2354) PASS: lldb-shell :: Register/x86-64-gp-read.test (2242 of 2354) PASS: lldb-unit :: Language/CPlusPlus/./LanguageCPlusPlusTests/CPlusPlusLanguage.CPlusPlusNameParser (2243 of 2354) PASS: lldb-shell :: Error/assert.test (2244 of 2354) PASS: lldb-api :: functionalities/thread/concurrent_events/TestConcurrentCrashWithBreak.py (2245 of 2354) PASS: lldb-unit :: Process/minidump/./LLDBMinidumpTests/MinidumpParserTest.MinidumpDuplicateModuleMappedFirst (2246 of 2354) PASS: lldb-api :: functionalities/object-file/TestImageListMultiArchitecture.py (2247 of 2354) PASS: lldb-unit :: Utility/./UtilityTests/VMRange.ContainsAddr (2248 of 2354) PASS: lldb-unit :: Utility/./UtilityTests/RangeTest.LessThan (2249 of 2354) PASS: lldb-shell :: SymbolFile/DWARF/x86/DW_AT_decl_file-DW_AT_specification-crosscu.s (2250 of 2354) PASS: lldb-api :: functionalities/wrong_commands/TestWrongCommands.py (2251 of 2354) PASS: lldb-unit :: UnwindAssembly/x86/./UnwindAssemblyx86Tests/Testx86AssemblyInspectionEngine.TestStackRealign32BitDisp_x86_64 (2252 of 2354) PASS: lldb-unit :: Utility/./UtilityTests/PassiveReplayTest.InstrumentedBarRef (2253 of 2354) PASS: lldb-unit :: Utility/./UtilityTests/StringExtractorTest.DecodeHexU8_Underflow2 (2254 of 2354) PASS: lldb-unit :: Symbol/./SymbolTests/TestTypeSystemClang.TestGetTypeClassTypeOfExpr (2255 of 2354) PASS: lldb-unit :: UnwindAssembly/x86/./UnwindAssemblyx86Tests/Testx86AssemblyInspectionEngine.TestStackRealign8BitDisp_i386 (2256 of 2354) PASS: lldb-shell :: Expr/TestIRMemoryMap.test (2257 of 2354) PASS: lldb-api :: lang/objc/bitfield_ivars/TestBitfieldIvars.py (2258 of 2354) PASS: lldb-api :: functionalities/testid/TestTestId.py (2259 of 2354) PASS: lldb-api :: functionalities/process_crash_info/TestProcessCrashInfo.py (2260 of 2354) PASS: lldb-api :: sample_test/TestSampleInlineTest.py (2261 of 2354) PASS: lldb-api :: commands/target/create-no-such-arch/TestNoSuchArch.py (2262 of 2354) PASS: lldb-unit :: Utility/./UtilityTests/StringListTest.InsertStringAtIndexOutOfBounds (2263 of 2354) PASS: lldb-unit :: Utility/./UtilityTests/StringListTest.ShiftMove (2264 of 2354) PASS: lldb-shell :: ObjectFile/wasm/embedded-debug-sections.yaml (2265 of 2354) PASS: lldb-api :: functionalities/thread/concurrent_events/TestConcurrentWatchBreak.py (2266 of 2354) PASS: lldb-shell :: SymbolFile/DWARF/x86/find-method.cpp (2267 of 2354) PASS: lldb-unit :: Process/Utility/./ProcessUtilityTests/ProcMapTests/LinuxProcMapsTestFixture.ParseMapRegions/4 (2268 of 2354) PASS: lldb-api :: functionalities/jitloader_gdb/TestJITLoaderGDB.py (2269 of 2354) PASS: lldb-unit :: SymbolFile/NativePDB/./SymbolFileNativePDBTests/PDBFPOProgramToDWARFExpressionTests.InvalidOpBinary (2270 of 2354) PASS: lldb-unit :: ScriptInterpreter/Python/./ScriptInterpreterPythonTests/PythonDataObjectsTest.TestPythonBytes (2271 of 2354) PASS: lldb-unit :: Expression/./ExpressionTests/CppModuleConfigurationTest.MissingLibCpp (2272 of 2354) PASS: lldb-unit :: SymbolFile/DWARF/./SymbolFileDWARFTests/SymbolFileDWARFTests.TestAbbrevOrder1Start5 (2273 of 2354) PASS: lldb-unit :: SymbolFile/DWARF/./SymbolFileDWARFTests/SymbolFileDWARFTests.TestAbbrevOrder1Start1 (2274 of 2354) PASS: lldb-api :: lang/cpp/modules-import/TestCXXModulesImport.py (2275 of 2354) UNSUPPORTED: lldb-api :: functionalities/darwin_log/filter/regex/message/TestDarwinLogFilterRegexMessage.py (2276 of 2354) PASS: lldb-api :: lang/objc/objc++/TestObjCXX.py (2277 of 2354) PASS: lldb-api :: commands/disassemble/basic/TestDisassembleBreakpoint.py (2278 of 2354) PASS: lldb-api :: lang/c/unicode/TestUnicodeSymbols.py (2279 of 2354) PASS: lldb-api :: commands/expression/rdar42038760/TestScalarURem.py (2280 of 2354) PASS: lldb-unit :: Host/./HostTests/SocketTests/SocketTest.DomainGetConnectURI/ipv4 (2281 of 2354) PASS: lldb-api :: lang/cpp/global_operators/TestCppGlobalOperators.py (2282 of 2354) PASS: lldb-api :: commands/expression/timeout/TestCallWithTimeout.py (2283 of 2354) PASS: lldb-unit :: Utility/./UtilityTests/StringListTest.GetSize (2284 of 2354) PASS: lldb-shell :: Heap/heap-cstr.test (2285 of 2354) PASS: lldb-api :: lang/cpp/breakpoint-commands/TestCPPBreakpointCommands.py (2286 of 2354) PASS: lldb-api :: tools/lldb-vscode/runInTerminal/TestVSCode_runInTerminal.py (2287 of 2354) UNSUPPORTED: lldb-api :: lang/c/typedef/Testtypedef.py (2288 of 2354) PASS: lldb-api :: lang/objc/rdar-11355592/TestRdar11355592.py (2289 of 2354) PASS: lldb-shell :: ScriptInterpreter/Python/Crashlog/parser_text.test (2290 of 2354) PASS: lldb-api :: functionalities/breakpoint/address_breakpoints/TestBadAddressBreakpoints.py (2291 of 2354) PASS: lldb-unit :: UnwindAssembly/x86/./UnwindAssemblyx86Tests/Testx86AssemblyInspectionEngine.TestCALLNextInsn (2292 of 2354) PASS: lldb-api :: functionalities/data-formatter/dump_dynamic/TestDumpDynamic.py (2293 of 2354) PASS: lldb-unit :: Host/./HostTests/PipeTest.CreateWithUniqueName (2294 of 2354) PASS: lldb-api :: functionalities/gdb_remote_client/TestHaltFails.py (2295 of 2354) PASS: lldb-api :: lang/cpp/virtual-functions/TestCppVirtualFunctions.py (2296 of 2354) PASS: lldb-api :: lang/cpp/extern_c/TestExternCSymbols.py (2297 of 2354) PASS: lldb-unit :: Utility/./UtilityTests/ProcessInstanceInfo.Dump (2298 of 2354) PASS: lldb-unit :: Utility/./UtilityTests/ScalarTest.ExtractBitfield (2299 of 2354) PASS: lldb-api :: macosx/load-kext/TestLoadKext.py (2300 of 2354) PASS: lldb-unit :: Utility/./UtilityTests/UriParserTest.SchemeHostSeparator (2301 of 2354) PASS: lldb-unit :: Utility/./UtilityTests/StringLexerTest.NextIf (2302 of 2354) PASS: lldb-unit :: Utility/./UtilityTests/ArgsTest.ReplaceArgumentAtIndexOutOfRange (2303 of 2354) PASS: lldb-unit :: ObjectFile/Breakpad/./ObjectFileBreakpadTests/FuncRecord.parse (2304 of 2354) PASS: lldb-api :: macosx/safe-to-func-call/TestSafeFuncCalls.py (2305 of 2354) PASS: lldb-unit :: Process/minidump/./LLDBMinidumpTests/MinidumpParserTest.GetThreadContext_x86_32 (2306 of 2354) PASS: lldb-api :: functionalities/load_lazy/TestLoadUsingLazyBind.py (2307 of 2354) PASS: lldb-shell :: Register/Core/x86-64-netbsd-addr.test (2308 of 2354) PASS: lldb-api :: functionalities/data-formatter/typedef_array/TestTypedefArray.py (2309 of 2354) PASS: lldb-unit :: Utility/./UtilityTests/UriParserTest.BracketedHostnameWithPortIPv4 (2310 of 2354) PASS: lldb-shell :: SymbolFile/DWARF/x86/DW_AT_loclists_base.s (2311 of 2354) PASS: lldb-api :: commands/expression/import-std-module/unique_ptr-dbg-info-content/TestUniquePtrDbgInfoContent.py (2312 of 2354) PASS: lldb-api :: functionalities/data-formatter/data-formatter-stl/libcxx/unordered/TestDataFormatterUnordered.py (2313 of 2354) PASS: lldb-api :: functionalities/thread/concurrent_events/TestConcurrentSignalWatch.py (2314 of 2354) UNSUPPORTED: lldb-shell :: Watchpoint/netbsd-nouserdbregs.test (2315 of 2354) PASS: lldb-api :: functionalities/breakpoint/breakpoint_locations/TestBreakpointLocations.py (2316 of 2354) PASS: lldb-unit :: Utility/./UtilityTests/BinaryStreamTest.PutSLEB128SixBytes (2317 of 2354) PASS: lldb-unit :: Utility/./UtilityTests/SerializationRountripTest.SerializeDeserializeCString (2318 of 2354) PASS: lldb-unit :: UnwindAssembly/x86/./UnwindAssemblyx86Tests/Testx86AssemblyInspectionEngine.TestPushEDI (2319 of 2354) PASS: lldb-shell :: Reproducer/Functionalities/TestDataFormatter.test (2320 of 2354) PASS: lldb-shell :: Unwind/eh-frame-dwarf-unwind.test (2321 of 2354) PASS: lldb-unit :: Expression/./ExpressionTests/DiagnosticManagerTest.GetStringNoDiags (2322 of 2354) PASS: lldb-unit :: Process/gdb-remote/./ProcessGdbRemoteTests/GDBRemoteCommunicationClientTest.GetModulesInfo (2323 of 2354) PASS: lldb-api :: lang/c/tls_globals/TestTlsGlobals.py (2324 of 2354) PASS: lldb-api :: lang/c/complex_int/TestComplexInt.py (2325 of 2354) PASS: lldb-api :: tools/lldb-server/TestGdbRemoteHostInfo.py (2326 of 2354) PASS: lldb-unit :: Utility/./UtilityTests/StringExtractorTest.GetHexU8_Exact (2327 of 2354) PASS: lldb-api :: commands/expression/import-std-module/weak_ptr-dbg-info-content/TestDbgInfoContentWeakPtrFromStdModule.py (2328 of 2354) PASS: lldb-unit :: Expression/./ExpressionTests/CppModuleConfigurationTest.AmbiguousCLib (2329 of 2354) PASS: lldb-shell :: SymbolFile/DWARF/x86/DW_AT_location-DW_AT_const_value.s (2330 of 2354) PASS: lldb-api :: python_api/process/read-mem-cstring/TestReadMemCString.py (2331 of 2354) PASS: lldb-unit :: ScriptInterpreter/Python/./ScriptInterpreterPythonTests/PythonDataObjectsTest.TestPythonStringToStr (2332 of 2354) PASS: lldb-unit :: Core/./LLDBCoreTests/SourceLocationSpecTest.Equal (2333 of 2354) PASS: lldb-unit :: Utility/./UtilityTests/StreamTeeTest.SetStreamAtIndexOutOfBounds (2334 of 2354) PASS: lldb-api :: functionalities/data-formatter/data-formatter-objc/TestDataFormatterObjCKVO.py (2335 of 2354) PASS: lldb-unit :: Language/Highlighting/./HighlighterTests/HighlighterTest.HighlighterSelectionType (2336 of 2354) PASS: lldb-unit :: Utility/./UtilityTests/StringExtractorTest.GetHexU8_Extra (2337 of 2354) PASS: lldb-unit :: Host/./HostTests/FileActionTest.Open (2338 of 2354) PASS: lldb-shell :: SymbolFile/DWARF/x86/DW_AT_declaration-with-children.s (2339 of 2354) PASS: lldb-api :: functionalities/data-formatter/data-formatter-stl/libcxx/function/TestLibCxxFunction.py (2340 of 2354) PASS: lldb-api :: commands/expression/import-std-module/list/TestListFromStdModule.py (2341 of 2354) PASS: lldb-shell :: ScriptInterpreter/Python/command_relative_import.test (2342 of 2354) PASS: lldb-unit :: ScriptInterpreter/Python/./ScriptInterpreterPythonTests/PythonDataObjectsTest.TestPythonListManipulation (2343 of 2354) PASS: lldb-api :: commands/watchpoints/multiple_hits/TestMultipleHits.py (2344 of 2354) PASS: lldb-unit :: Host/./HostTests/ConnectionFileDescriptorTest.TCPGetURIv4 (2345 of 2354) PASS: lldb-shell :: ObjectFile/PECOFF/basic-info-arm64.yaml (2346 of 2354) PASS: lldb-api :: tools/lldb-vscode/coreFile/TestVSCode_coreFile.py (2347 of 2354) PASS: lldb-unit :: Language/Highlighting/./HighlighterTests/HighlighterTest.Keywords (2348 of 2354) PASS: lldb-shell :: Breakpoint/debug_rnglist_offset_pair.test (2349 of 2354) PASS: lldb-unit :: Utility/./UtilityTests/ArgsTest.Yaml (2350 of 2354) PASS: lldb-unit :: Utility/./UtilityTests/StringLexerTest.Next (2351 of 2354) PASS: lldb-api :: commands/expression/completion/TestExprCompletion.py (2352 of 2354) PASS: lldb-shell :: Breakpoint/jit-loader_jitlink_elf.test (2353 of 2354) PASS: lldb-api :: functionalities/thread/step_out/TestThreadStepOut.py (2354 of 2354) Slowest Tests: -------------------------------------------------------------------------- 261.78s: lldb-api :: tools/lldb-server/TestLldbGdbServer.py 134.32s: lldb-api :: functionalities/memory-region/TestMemoryRegion.py 124.17s: lldb-api :: api/multithreaded/TestMultithreaded.py 110.73s: lldb-api :: macosx/skinny-corefile/TestSkinnyCorefile.py 91.31s: lldb-api :: functionalities/gdb_remote_client/TestWasm.py 88.90s: lldb-api :: commands/expression/import-std-module/queue/TestQueueFromStdModule.py 80.24s: lldb-api :: types/TestLongTypesExpr.py 73.21s: lldb-api :: lang/objc/exceptions/TestObjCExceptions.py 72.95s: lldb-api :: commands/expression/import-std-module/stack/TestStackFromStdModule.py 65.40s: lldb-api :: lang/objc/objc-new-syntax/TestObjCNewSyntaxLiteral.py 62.72s: lldb-api :: lang/cpp/namespace/TestNamespaceLookup.py 61.50s: lldb-api :: lang/objc/hidden-ivars/TestHiddenIvars.py 58.82s: lldb-api :: lang/objc/foundation/TestObjCMethods.py 56.32s: lldb-api :: commands/expression/import-std-module/vector/TestVectorFromStdModule.py 51.31s: lldb-api :: types/TestIntegerTypeExpr.py 50.34s: lldb-api :: python_api/target/TestTargetAPI.py 50.32s: lldb-api :: tools/lldb-server/TestGdbRemoteThreadsInStopReply.py 50.20s: lldb-api :: commands/expression/import-std-module/deque-basic/TestDequeFromStdModule.py 48.48s: lldb-api :: commands/expression/import-std-module/vector-dbg-info-content/TestDbgInfoContentVectorFromStdModule.py 48.33s: lldb-api :: lang/objc/objc-new-syntax/TestObjCNewSyntaxDictionary.py

Hide Details

Tests Times: -------------------------------------------------------------------------- [ Range ] :: [ Percentage ] :: [ Count ] -------------------------------------------------------------------------- [260s,280s) :: [ ] :: [ 1/2354] [240s,260s) :: [ ] :: [ 0/2354] [220s,240s) :: [ ] :: [ 0/2354] [200s,220s) :: [ ] :: [ 0/2354] [180s,200s) :: [ ] :: [ 0/2354] [160s,180s) :: [ ] :: [ 0/2354] [140s,160s) :: [ ] :: [ 1/2354] [120s,140s) :: [ ] :: [ 1/2354] [100s,120s) :: [ ] :: [ 1/2354] [ 80s,100s) :: [ ] :: [ 3/2354] [ 60s, 80s) :: [ ] :: [ 7/2354] [ 40s, 60s) :: [ ] :: [ 15/2354] [ 20s, 40s) :: [* ] :: [ 74/2354] [ 0s, 20s) :: [************************************** ] :: [2251/2354] -------------------------------------------------------------------------- ******************** Failed Tests (2): lldb-api :: tools/lldb-vscode/breakpoint/TestVSCode_setFunctionBreakpoints.py lldb-api :: tools/lldb-vscode/evaluate/TestVSCode_evaluate.py

Hide Details

Hide Details

Testing Time: 2400.28s Unsupported : 211 Passed : 2131 Expectedly Failed: 10 Failed : 2 FAILED: tools/lldb/test/CMakeFiles/check-lldb cd /Users/buildslave/jenkins/workspace/lldb-cmake-sanitized/lldb-build/tools/lldb/test && /usr/local/Frameworks/Python.framework/Versions/3.7/bin/python3.7 /Users/buildslave/jenkins/workspace/lldb-cmake-sanitized/lldb-build/./bin/llvm-lit -v --time-tests --shuffle --xunit-xml-output=/Users/buildslave/jenkins/workspace/lldb-cmake-sanitized/test/results.xml -v -j 4 --timeout 1200 /Users/buildslave/jenkins/workspace/lldb-cmake-sanitized/lldb-build/tools/lldb/test ninja: build stopped: subcommand failed. Command failed: Command '['/usr/bin/env', 'TERM=vt100', '/usr/local/bin/ninja', '-v', 'check-lldb']' returned non-zero exit status 1. Command: ['/usr/bin/env', 'TERM=vt100', '/usr/local/bin/ninja', '-v', 'check-lldb'] [Pipeline] } [Pipeline] // timeout [Pipeline] } [Pipeline] // stage [Pipeline] stage [Pipeline] { (Declarative: Post Actions) [Pipeline] scanForIssues [Clang (LLVM based)] Sleeping for 5 seconds due to JENKINS-32191... [Clang (LLVM based)] Parsing console log (workspace: '/Users/buildslave/jenkins/workspace/lldb-cmake-sanitized') [Clang (LLVM based)] Successfully parsed console log [Clang (LLVM based)] -> found 5 issues (skipped 2 duplicates) [Clang (LLVM based)] [-ERROR-] Can't create fingerprints for some files: [Clang (LLVM based)] [-ERROR-] - '/Users/buildslave/jenkins/workspace/lldb-cmake-sanitized/lldb-build/{"body":{"category":"console","output":"/Users/buildslave/jenkins/workspace/lldb-cmake-sanitized/llvm-project/lldb/tools/lldb-vscode/ProgressEvent.cpp', IO exception has been thrown: java.nio.file.NoSuchFileException: /Users/buildslave/jenkins/workspace/lldb-cmake-sanitized/lldb-build/{"body":{"category":"console","output":"/Users/buildslave/jenkins/workspace/lldb-cmake-sanitized/llvm-project/lldb/tools/lldb-vscode/ProgressEvent.cpp [Clang (LLVM based)] [-ERROR-] - '/Users/buildslave/jenkins/workspace/lldb-cmake-sanitized/lldb-build/{"body":{"category":"console","output":"/Users/buildslave/jenkins/workspace/lldb-cmake-sanitized/llvm-project/lldb/tools/lldb-vscode/ProgressEvent.cpp', IO exception has been thrown: java.nio.file.NoSuchFileException: /Users/buildslave/jenkins/workspace/lldb-cmake-sanitized/lldb-build/{"body":{"category":"console","output":"/Users/buildslave/jenkins/workspace/lldb-cmake-sanitized/llvm-project/lldb/tools/lldb-vscode/ProgressEvent.cpp [Clang (LLVM based)] Post processing issues on 'green-dragon-23' with source code encoding 'UTF-8' [Clang (LLVM based)] Creating SCM blamer to obtain author and commit information for affected files [Clang (LLVM based)] -> No blamer installed yet. You need to install the 'git-forensics' plugin to enable blaming for Git. [Clang (LLVM based)] Resolving file names for all issues in source directory '/Users/buildslave/jenkins/workspace/lldb-cmake-sanitized' [Clang (LLVM based)] -> resolved paths in source directory (3 found, 1 not found) [Clang (LLVM based)] Resolving module names from module definitions (build.xml, pom.xml, or Manifest.mf files) [Clang (LLVM based)] -> resolved module names for 5 issues [Clang (LLVM based)] Resolving package names (or namespaces) by parsing the affected files [Clang (LLVM based)] -> resolved package names of 4 affected files [Clang (LLVM based)] No filter has been set, publishing all 5 issues [Clang (LLVM based)] Creating fingerprints for all affected code blocks to track issues over different builds [Clang (LLVM based)] -> created fingerprints for 3 issues (skipped 2 issues) [Clang (LLVM based)] Copying affected files to Jenkins' build folder '/Users/Shared/Jenkins/Home/jobs/lldb-cmake-sanitized/builds/1896/files-with-issues' [Clang (LLVM based)] -> 3 copied, 0 not in workspace, 2 not-found, 0 with I/O error [Clang (LLVM based)] Repository miner is not configured, skipping repository mining [Pipeline] junit Recording test results [Checks API] No suitable checks publisher found. [Pipeline] } [Pipeline] // stage [Pipeline] } [Pipeline] // withEnv [Pipeline] } [Pipeline] // node [Pipeline] End of Pipeline ERROR: script returned exit code 1 Finished: FAILURE