Console Output

Skipping 9,537 KB.. Full Log
PASS: lldb-api :: lang/objc/exceptions/TestObjCExceptions.py (2086 of 2354)
PASS: lldb-unit :: Utility/./UtilityTests/GeneratorTest.GetOrCreate (2087 of 2354)
PASS: lldb-unit :: debugserver/./debugserverTests/RNBSocket.LoopBackListenIPv6 (2088 of 2354)
PASS: lldb-unit :: Utility/./UtilityTests/Flags.AnySet (2089 of 2354)
PASS: lldb-api :: lang/objc/foundation/TestObjCMethods.py (2090 of 2354)
PASS: lldb-unit :: Process/Utility/./ProcessUtilityTests/ProcSMapTests/LinuxProcSMapsTestFixture.ParseSMapRegions/5 (2091 of 2354)
PASS: lldb-api :: tools/lldb-server/TestGdbRemoteAttachWait.py (2092 of 2354)
PASS: lldb-unit :: Process/./ProcessEventDataTests/ProcessEventDataTest.DoOnRemoval (2093 of 2354)
PASS: lldb-api :: commands/frame/diagnose/bad-reference/TestBadReference.py (2094 of 2354)
PASS: lldb-shell :: SymbolFile/DWARF/x86/find-inline-method.s (2095 of 2354)
PASS: lldb-api :: lang/objc/objc-dyn-sbtype/TestObjCDynamicSBType.py (2096 of 2354)
PASS: lldb-unit :: Expression/./ExpressionTests/DWARFExpression.DW_OP_const (2097 of 2354)
PASS: lldb-api :: commands/expression/import-std-module/shared_ptr-dbg-info-content/TestSharedPtrDbgInfoContentFromStdModule.py (2098 of 2354)
PASS: lldb-api :: lang/cpp/overloaded-functions/TestOverloadedFunctions.py (2099 of 2354)
PASS: lldb-unit :: Expression/./ExpressionTests/CppModuleConfigurationTest.MissingLibCpp (2100 of 2354)
PASS: lldb-unit :: Utility/./UtilityTests/SerializationRountripTest.SerializeDeserializeCString (2101 of 2354)
PASS: lldb-unit :: Utility/./UtilityTests/SerializationRountripTest.SerializeDeserializePod (2102 of 2354)
PASS: lldb-api :: functionalities/breakpoint/breakpoint_locations/TestBreakpointLocations.py (2103 of 2354)
PASS: lldb-api :: commands/frame/recognizer/TestFrameRecognizer.py (2104 of 2354)
PASS: lldb-unit :: UnwindAssembly/x86/./UnwindAssemblyx86Tests/Testx86AssemblyInspectionEngine.TestMovRSPtoRBP (2105 of 2354)
UNSUPPORTED: lldb-api :: functionalities/darwin_log/filter/regex/category/TestDarwinLogFilterRegexCategory.py (2106 of 2354)
PASS: lldb-api :: functionalities/data-formatter/type_summary_list_arg/TestTypeSummaryListArg.py (2107 of 2354)
PASS: lldb-api :: functionalities/data-formatter/array_typedef/TestArrayTypedef.py (2108 of 2354)
PASS: lldb-api :: commands/frame/var/TestFrameVar.py (2109 of 2354)
PASS: lldb-unit :: Utility/./UtilityTests/ArgsTest.TestSingleQuotedArgWithSpace (2110 of 2354)
PASS: lldb-api :: commands/frame/diagnose/local-variable/TestLocalVariable.py (2111 of 2354)
PASS: lldb-unit :: Interpreter/./InterpreterTests/CompletionTest.DirCompletionAbsolute (2112 of 2354)
PASS: lldb-unit :: ObjectFile/Breakpad/./ObjectFileBreakpadTests/StackCFIRecord.parse (2113 of 2354)
PASS: lldb-unit :: Symbol/./SymbolTests/TestCreateClassTemplateDecl.FindExistingTemplatesWithParameterPack (2114 of 2354)
PASS: lldb-shell :: SymbolFile/DWARF/x86/debug_ranges_and_rnglists.test (2115 of 2354)
PASS: lldb-unit :: Host/./HostTests/FileSystemTest.Resolve (2116 of 2354)
PASS: lldb-shell :: Reproducer/Functionalities/TestDataFormatter.test (2117 of 2354)
UNSUPPORTED: lldb-api :: iohandler/resize/TestIOHandlerResize.py (2118 of 2354)
PASS: lldb-api :: python_api/value/change_values/TestChangeValueAPI.py (2119 of 2354)
PASS: lldb-unit :: ScriptInterpreter/Python/./ScriptInterpreterPythonTests/PythonDataObjectsTest.TestExceptions (2120 of 2354)
PASS: lldb-unit :: Utility/./UtilityTests/RegularExpression.CopyAssignment (2121 of 2354)
PASS: lldb-shell :: Expr/TestIRMemoryMap.test (2122 of 2354)
PASS: lldb-api :: lang/cpp/dereferencing_references/TestCPPDereferencingReferences.py (2123 of 2354)
PASS: lldb-api :: lang/cpp/char8_t/TestCxxChar8_t.py (2124 of 2354)
PASS: lldb-api :: assert_messages_test/TestAssertMessages.py (2125 of 2354)
PASS: lldb-api :: python_api/symbol-context/two-files/TestSymbolContextTwoFiles.py (2126 of 2354)
PASS: lldb-unit :: Utility/./UtilityTests/RangeTest.Equal (2127 of 2354)
PASS: lldb-api :: lang/cpp/trivial_abi/TestTrivialABI.py (2128 of 2354)
PASS: lldb-unit :: Process/minidump/./LLDBMinidumpTests/MinidumpParserTest.MinidumpModuleOrder (2129 of 2354)
PASS: lldb-api :: functionalities/data-formatter/data-formatter-caching/TestDataFormatterCaching.py (2130 of 2354)
PASS: lldb-unit :: Utility/./UtilityTests/DataExtractorTest.GetMaxU64_unchecked (2131 of 2354)
PASS: lldb-unit :: Core/./LLDBCoreTests/DumpDataExtractorTest.StartOffset (2132 of 2354)
PASS: lldb-shell :: Breakpoint/breakpoint-command.test (2133 of 2354)
FAIL: lldb-api :: macosx/dyld-trie-symbols/TestDyldTrieSymbols.py (2134 of 2354)
******************** TEST 'lldb-api :: macosx/dyld-trie-symbols/TestDyldTrieSymbols.py' FAILED ********************
Script:
--
/Users/buildslave/jenkins/workspace/lldb-cmake-sanitized/lldb-build/lldb-test-build.noindex/copied-python /Users/buildslave/jenkins/workspace/lldb-cmake-sanitized/llvm-project/lldb/test/API/dotest.py -u CXXFLAGS -u CFLAGS --codesign-identity lldb_codesign --arch x86_64 --build-dir /Users/buildslave/jenkins/workspace/lldb-cmake-sanitized/lldb-build/lldb-test-build.noindex -t --env TERM=vt100 --env LLVM_LIBS_DIR=/Users/buildslave/jenkins/workspace/lldb-cmake-sanitized/lldb-build/./lib --inferior-env ASAN_OPTIONS=detect_stack_use_after_return=1 --inferior-env DYLD_INSERT_LIBRARIES=/Users/buildslave/jenkins/workspace/lldb-cmake-sanitized/host-compiler/lib/clang/13.0.99/lib/darwin/libclang_rt.asan_osx_dynamic.dylib --arch x86_64 --build-dir /Users/buildslave/jenkins/workspace/lldb-cmake-sanitized/lldb-build/lldb-test-build.noindex --lldb-module-cache-dir /Users/buildslave/jenkins/workspace/lldb-cmake-sanitized/lldb-build/lldb-test-build.noindex/module-cache-lldb/lldb-api --clang-module-cache-dir /Users/buildslave/jenkins/workspace/lldb-cmake-sanitized/lldb-build/lldb-test-build.noindex/module-cache-clang/lldb-api --executable /Users/buildslave/jenkins/workspace/lldb-cmake-sanitized/lldb-build/./bin/lldb --compiler /Users/buildslave/jenkins/workspace/lldb-cmake-sanitized/host-compiler/bin/clang --dsymutil /Users/buildslave/jenkins/workspace/lldb-cmake-sanitized/lldb-build/./bin/dsymutil --llvm-tools-dir /Users/buildslave/jenkins/workspace/lldb-cmake-sanitized/lldb-build/./bin --lldb-libs-dir /Users/buildslave/jenkins/workspace/lldb-cmake-sanitized/lldb-build/./lib /Users/buildslave/jenkins/workspace/lldb-cmake-sanitized/llvm-project/lldb/test/API/macosx/dyld-trie-symbols -p TestDyldTrieSymbols.py
--
Exit Code: 1

Hide Details

Command Output (stdout): -- lldb version 13.0.99 (http://labmaster3.local/git/llvm-project.git revision c94c8d8b5d999c97ea424b35a1cb540d2a1d3bc6) clang revision c94c8d8b5d999c97ea424b35a1cb540d2a1d3bc6 llvm revision c94c8d8b5d999c97ea424b35a1cb540d2a1d3bc6 Skipping the following test categories: ['darwin-log', 'libstdcxx', 'dwo', 'llgs', 'fork']

Hide Details

-- Command Output (stderr): -- Change dir to: /Users/buildslave/jenkins/workspace/lldb-cmake-sanitized/llvm-project/lldb/test/API/macosx/dyld-trie-symbols runCmd: settings clear -all output:

Hide Details

runCmd: settings set symbols.enable-external-lookup false output:

Hide Details

runCmd: settings set target.inherit-tcc true output:

Hide Details

runCmd: settings set target.detach-on-error false output:

Hide Details

runCmd: settings set target.auto-apply-fixits false output:

Hide Details

runCmd: settings set plugin.process.gdb-remote.packet-timeout 60 output:

Hide Details

runCmd: settings set symbols.clang-modules-cache-path "/Users/buildslave/jenkins/workspace/lldb-cmake-sanitized/lldb-build/lldb-test-build.noindex/module-cache-lldb/lldb-api" output:

Hide Details

runCmd: settings set use-color false output:

Hide Details

runCmd: setting set target.prefer-dynamic-value no-dynamic-values output:

Hide Details

runCmd: settings set target.env-vars ASAN_OPTIONS=detect_stack_use_after_return=1 DYLD_INSERT_LIBRARIES=/Users/buildslave/jenkins/workspace/lldb-cmake-sanitized/host-compiler/lib/clang/13.0.99/lib/darwin/libclang_rt.asan_osx_dynamic.dylib output:

Hide Details

FAIL: LLDB (/Users/buildslave/jenkins/workspace/lldb-cmake-sanitized/host-compiler/bin/clang-x86_64) :: test_dyld_trie_symbols (TestDyldTrieSymbols.DyldTrieSymbolsTestCase) Restore dir to: /Users/buildslave/jenkins/workspace/lldb-cmake-sanitized/lldb-build/tools/lldb/test ====================================================================== FAIL: test_dyld_trie_symbols (TestDyldTrieSymbols.DyldTrieSymbolsTestCase) Test that we make create symbol table entries from the dyld trie data structure. ---------------------------------------------------------------------- Traceback (most recent call last): File "/Users/buildslave/jenkins/workspace/lldb-cmake-sanitized/llvm-project/lldb/test/API/macosx/dyld-trie-symbols/TestDyldTrieSymbols.py", line 66, in test_dyld_trie_symbols self.assertEqual(stripped_bazval_symbols.GetSize(), 1) AssertionError: 0 != 1 Config=x86_64-/Users/buildslave/jenkins/workspace/lldb-cmake-sanitized/host-compiler/bin/clang ---------------------------------------------------------------------- Ran 1 test in 3.056s

Hide Details

RESULT: FAILED (0 passes, 1 failures, 0 errors, 0 skipped, 0 expected failures, 0 unexpected successes)

Hide Details

--

Hide Details

******************** PASS: lldb-api :: functionalities/breakpoint/breakpoint_ids/TestBreakpointIDs.py (2135 of 2354) PASS: lldb-api :: lang/objc/foundation/TestObjCMethodsString.py (2136 of 2354) PASS: lldb-unit :: Utility/./UtilityTests/RangeTest.ContainsEndInclusive (2137 of 2354) PASS: lldb-api :: functionalities/data-formatter/data-formatter-stl/libcxx/variant/TestDataFormatterLibcxxVariant.py (2138 of 2354) PASS: lldb-unit :: Utility/./UtilityTests/ConstStringTest.MangledCounterpart (2139 of 2354) PASS: lldb-api :: lang/cpp/unique-types/TestUniqueTypes.py (2140 of 2354) PASS: lldb-unit :: Core/./LLDBCoreTests/FormatEntityTest.DefinitionConstructionNameAndType (2141 of 2354) PASS: lldb-unit :: Utility/./UtilityTests/ConstStringTest.UpdateMangledCounterpart (2142 of 2354) PASS: lldb-api :: lang/objc/objc-stepping/TestObjCStepping.py (2143 of 2354) PASS: lldb-unit :: Utility/./UtilityTests/RegisterValueTest.GetScalarValue (2144 of 2354) PASS: lldb-unit :: Core/./LLDBCoreTests/RichManglingContextTest.SwitchProvider (2145 of 2354) PASS: lldb-unit :: Host/./HostTests/PipeTest.OpenAsReader (2146 of 2354) PASS: lldb-unit :: Utility/./UtilityTests/BinaryStreamTest.PutSLEB128FourBytes (2147 of 2354) PASS: lldb-shell :: ObjectFile/ELF/PT_LOAD-overlap.yaml (2148 of 2354) PASS: lldb-unit :: Symbol/./SymbolTests/Type.CompilerContextPattern (2149 of 2354) UNSUPPORTED: lldb-shell :: Register/arm-fp-read.test (2150 of 2354) PASS: lldb-api :: commands/expression/top-level/TestTopLevelExprs.py (2151 of 2354) PASS: lldb-api :: lang/c/stepping/TestStepAndBreakpoints.py (2152 of 2354) UNSUPPORTED: lldb-api :: functionalities/gdb_remote_client/TestWasm.py (2153 of 2354) PASS: lldb-api :: python_api/frame/TestFrames.py (2154 of 2354) PASS: lldb-unit :: Utility/./UtilityTests/StringListTest.GetMaxStringLengthDecreasingSize (2155 of 2354) PASS: lldb-unit :: UnwindAssembly/x86/./UnwindAssemblyx86Tests/Testx86AssemblyInspectionEngine.TestPushR13 (2156 of 2354) PASS: lldb-shell :: ObjectFile/PECOFF/sections-names.yaml (2157 of 2354) PASS: lldb-unit :: UnwindAssembly/x86/./UnwindAssemblyx86Tests/Testx86AssemblyInspectionEngine.TestAddRSP (2158 of 2354) PASS: lldb-unit :: Utility/./UtilityTests/AnsiTerminal.KnownPrefix (2159 of 2354) PASS: lldb-shell :: SymbolFile/NativePDB/global-classes.cpp (2160 of 2354) PASS: lldb-shell :: SymbolFile/DWARF/x86/debug_ranges-missing-section.s (2161 of 2354) PASS: lldb-unit :: Language/Highlighting/./HighlighterTests/HighlighterTest.ClangEmptyInput (2162 of 2354) PASS: lldb-api :: commands/frame/diagnose/complicated-expression/TestComplicatedExpression.py (2163 of 2354) PASS: lldb-api :: commands/command/script/TestCommandScript.py (2164 of 2354) PASS: lldb-shell :: Breakpoint/debug_rnglistx_rlex.test (2165 of 2354) PASS: lldb-api :: functionalities/inferior-crashing/recursive-inferior/TestRecursiveInferior.py (2166 of 2354) PASS: lldb-api :: functionalities/data-formatter/varscript_formatting/TestDataFormatterVarScriptFormatting.py (2167 of 2354) PASS: lldb-api :: functionalities/target-new-solib-notifications/TestModuleLoadedNotifys.py (2168 of 2354) PASS: lldb-api :: lang/cpp/gmodules-templates/TestGModules.py (2169 of 2354) PASS: lldb-api :: commands/watchpoints/watchpoint_events/TestWatchpointEvents.py (2170 of 2354) PASS: lldb-api :: functionalities/signal/TestSendSignal.py (2171 of 2354) PASS: lldb-unit :: Utility/./UtilityTests/StringListTest.Clear (2172 of 2354) PASS: lldb-unit :: SymbolFile/NativePDB/./SymbolFileNativePDBTests/PDBFPOProgramToDWARFExpressionTests.UnresolvedCyclicRegisterAssignmentReference (2173 of 2354) PASS: lldb-unit :: Utility/./UtilityTests/StringExtractorTest.GetNameColonValueNoColon (2174 of 2354) PASS: lldb-api :: commands/breakpoint/command/list/TestBreakpointCommandList.py (2175 of 2354) PASS: lldb-unit :: Language/Highlighting/./HighlighterTests/HighlighterTest.ClangIdentifiers (2176 of 2354) PASS: lldb-shell :: Driver/TestUseColor.test (2177 of 2354) PASS: lldb-unit :: Host/./HostTests/NativeProcessProtocolTest.ReadCStringFromMemory_CrossPageBoundary (2178 of 2354) PASS: lldb-unit :: SymbolFile/DWARF/./SymbolFileDWARFTests/SymbolFileDWARFTests.ParseArangesWithMultipleTerminators (2179 of 2354) PASS: lldb-unit :: Expression/./ExpressionTests/DiagnosticManagerTest.AppendMessageAttachToLastDiag (2180 of 2354) PASS: lldb-unit :: Process/Utility/./ProcessUtilityTests/ProcMapTests/LinuxProcMapsTestFixture.ParseMapRegions/5 (2181 of 2354) PASS: lldb-shell :: ObjectFile/ELF/null-jmprel.yaml (2182 of 2354) PASS: lldb-api :: lang/cpp/breakpoint_in_member_func_w_non_primitive_params/TestBreakpointInMemberFuncWNonPrimitiveParams.py (2183 of 2354) PASS: lldb-api :: functionalities/dead-strip/TestDeadStrip.py (2184 of 2354) PASS: lldb-shell :: VSCode/TestOptions.test (2185 of 2354) PASS: lldb-api :: python_api/formatters/TestFormattersSBAPI.py (2186 of 2354) PASS: lldb-api :: functionalities/breakpoint/source_regexp/TestSourceRegexBreakpoints.py (2187 of 2354) PASS: lldb-unit :: Utility/./UtilityTests/ProcessInstanceInfoList.Yaml (2188 of 2354) PASS: lldb-api :: lang/objc/objc-ivar-offsets/TestObjCIvarOffsets.py (2189 of 2354) PASS: lldb-unit :: Core/./LLDBCoreTests/RichManglingContextTest.Basic (2190 of 2354) UNSUPPORTED: lldb-api :: functionalities/darwin_log/filter/exact_match/subsystem/TestDarwinLogFilterMatchSubsystem.py (2191 of 2354) PASS: lldb-shell :: SymbolFile/NativePDB/ast-types.cpp (2192 of 2354) PASS: lldb-unit :: Utility/./UtilityTests/SerializationRountripTest.SerializeDeserializePodPointers (2193 of 2354) PASS: lldb-unit :: ScriptInterpreter/Python/./ScriptInterpreterPythonTests/PythonDataObjectsTest.TestPythonBytes (2194 of 2354) PASS: lldb-shell :: Breakpoint/case-sensitive.test (2195 of 2354) PASS: lldb-api :: python_api/watchpoint/condition/TestWatchpointConditionAPI.py (2196 of 2354) PASS: lldb-shell :: Reproducer/Modules/TestModuleCXX.test (2197 of 2354) PASS: lldb-unit :: Core/./LLDBCoreTests/MangledTest.NameIndexes_FindFunctionSymbols (2198 of 2354) FAIL: lldb-api :: tools/lldb-vscode/evaluate/TestVSCode_evaluate.py (2199 of 2354) ******************** TEST 'lldb-api :: tools/lldb-vscode/evaluate/TestVSCode_evaluate.py' FAILED ******************** Script: -- /Users/buildslave/jenkins/workspace/lldb-cmake-sanitized/lldb-build/lldb-test-build.noindex/copied-python /Users/buildslave/jenkins/workspace/lldb-cmake-sanitized/llvm-project/lldb/test/API/dotest.py -u CXXFLAGS -u CFLAGS --codesign-identity lldb_codesign --arch x86_64 --build-dir /Users/buildslave/jenkins/workspace/lldb-cmake-sanitized/lldb-build/lldb-test-build.noindex -t --env TERM=vt100 --env LLVM_LIBS_DIR=/Users/buildslave/jenkins/workspace/lldb-cmake-sanitized/lldb-build/./lib --inferior-env ASAN_OPTIONS=detect_stack_use_after_return=1 --inferior-env DYLD_INSERT_LIBRARIES=/Users/buildslave/jenkins/workspace/lldb-cmake-sanitized/host-compiler/lib/clang/13.0.99/lib/darwin/libclang_rt.asan_osx_dynamic.dylib --arch x86_64 --build-dir /Users/buildslave/jenkins/workspace/lldb-cmake-sanitized/lldb-build/lldb-test-build.noindex --lldb-module-cache-dir /Users/buildslave/jenkins/workspace/lldb-cmake-sanitized/lldb-build/lldb-test-build.noindex/module-cache-lldb/lldb-api --clang-module-cache-dir /Users/buildslave/jenkins/workspace/lldb-cmake-sanitized/lldb-build/lldb-test-build.noindex/module-cache-clang/lldb-api --executable /Users/buildslave/jenkins/workspace/lldb-cmake-sanitized/lldb-build/./bin/lldb --compiler /Users/buildslave/jenkins/workspace/lldb-cmake-sanitized/host-compiler/bin/clang --dsymutil /Users/buildslave/jenkins/workspace/lldb-cmake-sanitized/lldb-build/./bin/dsymutil --llvm-tools-dir /Users/buildslave/jenkins/workspace/lldb-cmake-sanitized/lldb-build/./bin --lldb-libs-dir /Users/buildslave/jenkins/workspace/lldb-cmake-sanitized/lldb-build/./lib /Users/buildslave/jenkins/workspace/lldb-cmake-sanitized/llvm-project/lldb/test/API/tools/lldb-vscode/evaluate -p TestVSCode_evaluate.py -- Exit Code: 1

Hide Details

Command Output (stdout): -- lldb version 13.0.99 (http://labmaster3.local/git/llvm-project.git revision c94c8d8b5d999c97ea424b35a1cb540d2a1d3bc6) clang revision c94c8d8b5d999c97ea424b35a1cb540d2a1d3bc6 llvm revision c94c8d8b5d999c97ea424b35a1cb540d2a1d3bc6 Skipping the following test categories: ['darwin-log', 'libstdcxx', 'dwo', 'llgs', 'fork'] ========= DEBUG ADAPTER PROTOCOL LOGS ========= --> Content-Length: 284

Hide Details

{"command":"initialize","type":"request","arguments":{"adapterID":"lldb-native","clientID":"vscode","columnsStartAt1":true,"linesStartAt1":true,"locale":"en-us","pathFormat":"path","supportsRunInTerminalRequest":true,"supportsVariablePaging":true,"supportsVariableType":true},"seq":1} <-- Content-Length: 1222

Hide Details

{"body":{"exceptionBreakpointFilters":[{"default":false,"filter":"cpp_catch","label":"C++ Catch"},{"default":false,"filter":"cpp_throw","label":"C++ Throw"},{"default":false,"filter":"objc_catch","label":"Objective C Catch"},{"default":false,"filter":"objc_throw","label":"Objective C Throw"},{"default":false,"filter":"swift_catch","label":"Swift Catch"},{"default":false,"filter":"swift_throw","label":"Swift Throw"}],"supportTerminateDebuggee":true,"supportsCompletionsRequest":false,"supportsConditionalBreakpoints":true,"supportsConfigurationDoneRequest":true,"supportsDelayedStackTraceLoading":true,"supportsEvaluateForHovers":true,"supportsExceptionInfoRequest":true,"supportsExceptionOptions":true,"supportsFunctionBreakpoints":true,"supportsGotoTargetsRequest":false,"supportsHitConditionalBreakpoints":true,"supportsLoadedSourcesRequest":false,"supportsModulesRequest":false,"supportsProgressReporting":true,"supportsRestartFrame":false,"supportsRestartRequest":false,"supportsRunInTerminalRequest":true,"supportsSetVariable":true,"supportsStepBack":false,"supportsStepInTargetsRequest":false,"supportsValueFormattingOptions":true},"command":"initialize","request_seq":1,"seq":0,"success":true,"type":"response"} --> Content-Length: 1043

Hide Details

{"command":"launch","type":"request","arguments":{"program":"/Users/buildslave/jenkins/workspace/lldb-cmake-sanitized/lldb-build/lldb-test-build.noindex/tools/lldb-vscode/evaluate/TestVSCode_evaluate.test_generic_evaluate_expressions/a.out","disableASLR":true,"initCommands":["settings clear -all","settings set symbols.enable-external-lookup false","settings set target.inherit-tcc true","settings set target.detach-on-error false","settings set target.auto-apply-fixits false","settings set plugin.process.gdb-remote.packet-timeout 60","settings set symbols.clang-modules-cache-path \"/Users/buildslave/jenkins/workspace/lldb-cmake-sanitized/lldb-build/lldb-test-build.noindex/module-cache-lldb/lldb-api\"","settings set use-color false","setting set target.prefer-dynamic-value no-dynamic-values","settings set target.env-vars ASAN_OPTIONS=detect_stack_use_after_return=1 DYLD_INSERT_LIBRARIES=/Users/buildslave/jenkins/workspace/lldb-cmake-sanitized/host-compiler/lib/clang/13.0.99/lib/darwin/libclang_rt.asan_osx_dynamic.dylib"]},"seq":2} <-- Content-Length: 923

Hide Details

{"body":{"category":"console","output":"Running initCommands:\n(lldb) settings clear -all\n(lldb) settings set symbols.enable-external-lookup false\n(lldb) settings set target.inherit-tcc true\n(lldb) settings set target.detach-on-error false\n(lldb) settings set target.auto-apply-fixits false\n(lldb) settings set plugin.process.gdb-remote.packet-timeout 60\n(lldb) settings set symbols.clang-modules-cache-path \"/Users/buildslave/jenkins/workspace/lldb-cmake-sanitized/lldb-build/lldb-test-build.noindex/module-cache-lldb/lldb-api\"\n(lldb) settings set use-color false\n(lldb) setting set target.prefer-dynamic-value no-dynamic-values\n(lldb) settings set target.env-vars ASAN_OPTIONS=detect_stack_use_after_return=1 DYLD_INSERT_LIBRARIES=/Users/buildslave/jenkins/workspace/lldb-cmake-sanitized/host-compiler/lib/clang/13.0.99/lib/darwin/libclang_rt.asan_osx_dynamic.dylib\n"},"event":"output","seq":0,"type":"event"} <-- Content-Length: 77

Hide Details

{"command":"launch","request_seq":2,"seq":0,"success":true,"type":"response"} <-- Content-Length: 308

Hide Details

{"body":{"isLocalProcess":true,"name":"/Users/buildslave/jenkins/workspace/lldb-cmake-sanitized/lldb-build/lldb-test-build.noindex/tools/lldb-vscode/evaluate/TestVSCode_evaluate.test_generic_evaluate_expressions/a.out","startMethod":"launch","systemProcessId":64798},"event":"process","seq":0,"type":"event"} <-- Content-Length: 46

Hide Details

{"event":"initialized","seq":0,"type":"event"} --> Content-Length: 276

Hide Details

{"command":"setBreakpoints","type":"request","arguments":{"source":{"name":"main.cpp","path":"main.cpp"},"sourceModified":false,"lines":"[23, 27, 11, 35, 40, 44, 45]","breakpoints":[{"line":23},{"line":27},{"line":11},{"line":35},{"line":40},{"line":44},{"line":45}]},"seq":3} <-- Content-Length: 684

Hide Details

{"body":{"breakpoints":[{"id":1,"line":23,"source":{"name":"main.cpp","path":"main.cpp"},"verified":true},{"id":2,"line":27,"source":{"name":"main.cpp","path":"main.cpp"},"verified":true},{"id":3,"line":11,"source":{"name":"main.cpp","path":"main.cpp"},"verified":true},{"id":4,"line":35,"source":{"name":"main.cpp","path":"main.cpp"},"verified":true},{"id":5,"line":40,"source":{"name":"main.cpp","path":"main.cpp"},"verified":true},{"id":6,"line":44,"source":{"name":"main.cpp","path":"main.cpp"},"verified":true},{"id":7,"line":45,"source":{"name":"main.cpp","path":"main.cpp"},"verified":true}]},"command":"setBreakpoints","request_seq":3,"seq":0,"success":true,"type":"response"} --> Content-Length: 71

Hide Details

{"command":"configurationDone","type":"request","arguments":{},"seq":4} <-- Content-Length: 88

Hide Details

{"command":"configurationDone","request_seq":4,"seq":0,"success":true,"type":"response"} <-- Content-Length: 198

Hide Details

{"body":{"allThreadsStopped":true,"description":"breakpoint 1.1","preserveFocusHint":false,"reason":"breakpoint","threadCausedFocus":true,"threadId":278520},"event":"stopped","seq":0,"type":"event"} --> Content-Length: 61

Hide Details

{"command":"threads","type":"request","arguments":{},"seq":5} <-- Content-Length: 132

Hide Details

{"body":{"threads":[{"id":278520,"name":"Thread #1"}]},"command":"threads","request_seq":5,"seq":0,"success":true,"type":"response"} --> Content-Length: 107

Hide Details

{"command":"stackTrace","type":"request","arguments":{"threadId":278520,"startFrame":0,"levels":1},"seq":6} <-- Content-Length: 330

Hide Details

{"body":{"stackFrames":[{"column":14,"id":524288,"line":23,"name":"main","source":{"name":"main.cpp","path":"/Users/buildslave/jenkins/workspace/lldb-cmake-sanitized/llvm-project/lldb/test/API/tools/lldb-vscode/evaluate/main.cpp"}}],"totalFrames":3},"command":"stackTrace","request_seq":6,"seq":0,"success":true,"type":"response"} --> Content-Length: 113

Hide Details

{"command":"evaluate","type":"request","arguments":{"expression":"var1","context":null,"frameId":524288},"seq":7} <-- Content-Length: 138

Hide Details

{"body":{"result":"20","type":"int","variablesReference":0},"command":"evaluate","request_seq":7,"seq":0,"success":true,"type":"response"} --> Content-Length: 107

Hide Details

{"command":"stackTrace","type":"request","arguments":{"threadId":278520,"startFrame":0,"levels":1},"seq":8} <-- Content-Length: 330

Hide Details

{"body":{"stackFrames":[{"column":14,"id":524288,"line":23,"name":"main","source":{"name":"main.cpp","path":"/Users/buildslave/jenkins/workspace/lldb-cmake-sanitized/llvm-project/lldb/test/API/tools/lldb-vscode/evaluate/main.cpp"}}],"totalFrames":3},"command":"stackTrace","request_seq":8,"seq":0,"success":true,"type":"response"} --> Content-Length: 113

Hide Details

{"command":"evaluate","type":"request","arguments":{"expression":"var2","context":null,"frameId":524288},"seq":9} <-- Content-Length: 138

Hide Details

{"body":{"result":"21","type":"int","variablesReference":0},"command":"evaluate","request_seq":9,"seq":0,"success":true,"type":"response"} --> Content-Length: 108

Hide Details

{"command":"stackTrace","type":"request","arguments":{"threadId":278520,"startFrame":0,"levels":1},"seq":10} <-- Content-Length: 331

Hide Details

{"body":{"stackFrames":[{"column":14,"id":524288,"line":23,"name":"main","source":{"name":"main.cpp","path":"/Users/buildslave/jenkins/workspace/lldb-cmake-sanitized/llvm-project/lldb/test/API/tools/lldb-vscode/evaluate/main.cpp"}}],"totalFrames":3},"command":"stackTrace","request_seq":10,"seq":0,"success":true,"type":"response"} --> Content-Length: 120

Hide Details

{"command":"evaluate","type":"request","arguments":{"expression":"static_int","context":null,"frameId":524288},"seq":11} <-- Content-Length: 139

Hide Details

{"body":{"result":"42","type":"int","variablesReference":0},"command":"evaluate","request_seq":11,"seq":0,"success":true,"type":"response"} --> Content-Length: 108

Hide Details

{"command":"stackTrace","type":"request","arguments":{"threadId":278520,"startFrame":0,"levels":1},"seq":12} <-- Content-Length: 331

Hide Details

{"body":{"stackFrames":[{"column":14,"id":524288,"line":23,"name":"main","source":{"name":"main.cpp","path":"/Users/buildslave/jenkins/workspace/lldb-cmake-sanitized/llvm-project/lldb/test/API/tools/lldb-vscode/evaluate/main.cpp"}}],"totalFrames":3},"command":"stackTrace","request_seq":12,"seq":0,"success":true,"type":"response"} --> Content-Length: 124

Hide Details

{"command":"evaluate","type":"request","arguments":{"expression":"non_static_int","context":null,"frameId":524288},"seq":13} <-- Content-Length: 139

Hide Details

{"body":{"result":"43","type":"int","variablesReference":0},"command":"evaluate","request_seq":13,"seq":0,"success":true,"type":"response"} --> Content-Length: 108

Hide Details

{"command":"stackTrace","type":"request","arguments":{"threadId":278520,"startFrame":0,"levels":1},"seq":14} <-- Content-Length: 331

Hide Details

{"body":{"stackFrames":[{"column":14,"id":524288,"line":23,"name":"main","source":{"name":"main.cpp","path":"/Users/buildslave/jenkins/workspace/lldb-cmake-sanitized/llvm-project/lldb/test/API/tools/lldb-vscode/evaluate/main.cpp"}}],"totalFrames":3},"command":"stackTrace","request_seq":14,"seq":0,"success":true,"type":"response"} --> Content-Length: 117

Hide Details

{"command":"evaluate","type":"request","arguments":{"expression":"struct1","context":null,"frameId":524288},"seq":15} <-- Content-Length: 169

Hide Details

{"body":{"result":"my_struct @ 0x7ffeefbff7c8","type":"my_struct","variablesReference":4},"command":"evaluate","request_seq":15,"seq":0,"success":true,"type":"response"} --> Content-Length: 108

Hide Details

{"command":"stackTrace","type":"request","arguments":{"threadId":278520,"startFrame":0,"levels":1},"seq":16} <-- Content-Length: 331

Hide Details

{"body":{"stackFrames":[{"column":14,"id":524288,"line":23,"name":"main","source":{"name":"main.cpp","path":"/Users/buildslave/jenkins/workspace/lldb-cmake-sanitized/llvm-project/lldb/test/API/tools/lldb-vscode/evaluate/main.cpp"}}],"totalFrames":3},"command":"stackTrace","request_seq":16,"seq":0,"success":true,"type":"response"} --> Content-Length: 121

Hide Details

{"command":"evaluate","type":"request","arguments":{"expression":"struct1.foo","context":null,"frameId":524288},"seq":17} <-- Content-Length: 139

Hide Details

{"body":{"result":"15","type":"int","variablesReference":0},"command":"evaluate","request_seq":17,"seq":0,"success":true,"type":"response"} --> Content-Length: 108

Hide Details

{"command":"stackTrace","type":"request","arguments":{"threadId":278520,"startFrame":0,"levels":1},"seq":18} <-- Content-Length: 331

Hide Details

{"body":{"stackFrames":[{"column":14,"id":524288,"line":23,"name":"main","source":{"name":"main.cpp","path":"/Users/buildslave/jenkins/workspace/lldb-cmake-sanitized/llvm-project/lldb/test/API/tools/lldb-vscode/evaluate/main.cpp"}}],"totalFrames":3},"command":"stackTrace","request_seq":18,"seq":0,"success":true,"type":"response"} --> Content-Length: 122

Hide Details

{"command":"evaluate","type":"request","arguments":{"expression":"struct2->foo","context":null,"frameId":524288},"seq":19} <-- Content-Length: 139

Hide Details

{"body":{"result":"16","type":"int","variablesReference":0},"command":"evaluate","request_seq":19,"seq":0,"success":true,"type":"response"} --> Content-Length: 108

Hide Details

{"command":"stackTrace","type":"request","arguments":{"threadId":278520,"startFrame":0,"levels":1},"seq":20} <-- Content-Length: 331

Hide Details

{"body":{"stackFrames":[{"column":14,"id":524288,"line":23,"name":"main","source":{"name":"main.cpp","path":"/Users/buildslave/jenkins/workspace/lldb-cmake-sanitized/llvm-project/lldb/test/API/tools/lldb-vscode/evaluate/main.cpp"}}],"totalFrames":3},"command":"stackTrace","request_seq":20,"seq":0,"success":true,"type":"response"} --> Content-Length: 113

Hide Details

{"command":"evaluate","type":"request","arguments":{"expression":"var","context":null,"frameId":524288},"seq":21} <-- Content-Length: 209

Hide Details

{"body":{},"command":"evaluate","message":"expression failed to parse:\nerror: <user expression 0>:1:1: use of undeclared identifier 'var'\nvar\n^\n","request_seq":21,"seq":0,"success":false,"type":"response"} --> Content-Length: 108

Hide Details

{"command":"stackTrace","type":"request","arguments":{"threadId":278520,"startFrame":0,"levels":1},"seq":22} <-- Content-Length: 331

Hide Details

{"body":{"stackFrames":[{"column":14,"id":524288,"line":23,"name":"main","source":{"name":"main.cpp","path":"/Users/buildslave/jenkins/workspace/lldb-cmake-sanitized/llvm-project/lldb/test/API/tools/lldb-vscode/evaluate/main.cpp"}}],"totalFrames":3},"command":"stackTrace","request_seq":22,"seq":0,"success":true,"type":"response"} --> Content-Length: 119

Hide Details

{"command":"evaluate","type":"request","arguments":{"expression":"my_struct","context":null,"frameId":524288},"seq":23} <-- Content-Length: 311

Hide Details

{"body":{"category":"console","output":"/Users/buildslave/jenkins/workspace/lldb-cmake-sanitized/llvm-project/lldb/tools/lldb-vscode/ProgressEvent.cpp:89:64: runtime error: load of value 808464432, which is not a valid value for type 'lldb_vscode::ProgressEventType'\n"},"event":"output","seq":0,"type":"event"} <-- Content-Length: 261

Hide Details

{"body":{"category":"console","output":"SUMMARY: UndefinedBehaviorSanitizer: undefined-behavior /Users/buildslave/jenkins/workspace/lldb-cmake-sanitized/llvm-project/lldb/tools/lldb-vscode/ProgressEvent.cpp:89:64 in \n"},"event":"output","seq":0,"type":"event"} <-- Content-Length: 170

Hide Details

{"body":{"category":"console","output":"PLEASE submit a bug report to https://bugs.llvm.org/ and include the crash backtrace.\n"},"event":"output","seq":0,"type":"event"} <-- Content-Length: 117

Hide Details

{"body":{},"command":"evaluate","message":"unknown error","request_seq":23,"seq":0,"success":false,"type":"response"} --> Content-Length: 108

Hide Details

{"command":"stackTrace","type":"request","arguments":{"threadId":278520,"startFrame":0,"levels":1},"seq":24} <-- Content-Length: 331

Hide Details

{"body":{"stackFrames":[{"column":14,"id":524288,"line":23,"name":"main","source":{"name":"main.cpp","path":"/Users/buildslave/jenkins/workspace/lldb-cmake-sanitized/llvm-project/lldb/test/API/tools/lldb-vscode/evaluate/main.cpp"}}],"totalFrames":3},"command":"stackTrace","request_seq":24,"seq":0,"success":true,"type":"response"} --> Content-Length: 113

Hide Details

{"command":"evaluate","type":"request","arguments":{"expression":"int","context":null,"frameId":524288},"seq":25}

Hide Details

========= END ========= ========= DEBUG ADAPTER PROTOCOL LOGS ========= --> Content-Length: 284

Hide Details

{"command":"initialize","type":"request","arguments":{"adapterID":"lldb-native","clientID":"vscode","columnsStartAt1":true,"linesStartAt1":true,"locale":"en-us","pathFormat":"path","supportsRunInTerminalRequest":true,"supportsVariablePaging":true,"supportsVariableType":true},"seq":1} <-- Content-Length: 1222

Hide Details

{"body":{"exceptionBreakpointFilters":[{"default":false,"filter":"cpp_catch","label":"C++ Catch"},{"default":false,"filter":"cpp_throw","label":"C++ Throw"},{"default":false,"filter":"objc_catch","label":"Objective C Catch"},{"default":false,"filter":"objc_throw","label":"Objective C Throw"},{"default":false,"filter":"swift_catch","label":"Swift Catch"},{"default":false,"filter":"swift_throw","label":"Swift Throw"}],"supportTerminateDebuggee":true,"supportsCompletionsRequest":false,"supportsConditionalBreakpoints":true,"supportsConfigurationDoneRequest":true,"supportsDelayedStackTraceLoading":true,"supportsEvaluateForHovers":true,"supportsExceptionInfoRequest":true,"supportsExceptionOptions":true,"supportsFunctionBreakpoints":true,"supportsGotoTargetsRequest":false,"supportsHitConditionalBreakpoints":true,"supportsLoadedSourcesRequest":false,"supportsModulesRequest":false,"supportsProgressReporting":true,"supportsRestartFrame":false,"supportsRestartRequest":false,"supportsRunInTerminalRequest":true,"supportsSetVariable":true,"supportsStepBack":false,"supportsStepInTargetsRequest":false,"supportsValueFormattingOptions":true},"command":"initialize","request_seq":1,"seq":0,"success":true,"type":"response"} --> Content-Length: 1041

Hide Details

{"command":"launch","type":"request","arguments":{"program":"/Users/buildslave/jenkins/workspace/lldb-cmake-sanitized/lldb-build/lldb-test-build.noindex/tools/lldb-vscode/evaluate/TestVSCode_evaluate.test_hover_evaluate_expressions/a.out","disableASLR":true,"initCommands":["settings clear -all","settings set symbols.enable-external-lookup false","settings set target.inherit-tcc true","settings set target.detach-on-error false","settings set target.auto-apply-fixits false","settings set plugin.process.gdb-remote.packet-timeout 60","settings set symbols.clang-modules-cache-path \"/Users/buildslave/jenkins/workspace/lldb-cmake-sanitized/lldb-build/lldb-test-build.noindex/module-cache-lldb/lldb-api\"","settings set use-color false","setting set target.prefer-dynamic-value no-dynamic-values","settings set target.env-vars ASAN_OPTIONS=detect_stack_use_after_return=1 DYLD_INSERT_LIBRARIES=/Users/buildslave/jenkins/workspace/lldb-cmake-sanitized/host-compiler/lib/clang/13.0.99/lib/darwin/libclang_rt.asan_osx_dynamic.dylib"]},"seq":2} <-- Content-Length: 923

Hide Details

{"body":{"category":"console","output":"Running initCommands:\n(lldb) settings clear -all\n(lldb) settings set symbols.enable-external-lookup false\n(lldb) settings set target.inherit-tcc true\n(lldb) settings set target.detach-on-error false\n(lldb) settings set target.auto-apply-fixits false\n(lldb) settings set plugin.process.gdb-remote.packet-timeout 60\n(lldb) settings set symbols.clang-modules-cache-path \"/Users/buildslave/jenkins/workspace/lldb-cmake-sanitized/lldb-build/lldb-test-build.noindex/module-cache-lldb/lldb-api\"\n(lldb) settings set use-color false\n(lldb) setting set target.prefer-dynamic-value no-dynamic-values\n(lldb) settings set target.env-vars ASAN_OPTIONS=detect_stack_use_after_return=1 DYLD_INSERT_LIBRARIES=/Users/buildslave/jenkins/workspace/lldb-cmake-sanitized/host-compiler/lib/clang/13.0.99/lib/darwin/libclang_rt.asan_osx_dynamic.dylib\n"},"event":"output","seq":0,"type":"event"} <-- Content-Length: 77

Hide Details

{"command":"launch","request_seq":2,"seq":0,"success":true,"type":"response"} <-- Content-Length: 306

Hide Details

{"body":{"isLocalProcess":true,"name":"/Users/buildslave/jenkins/workspace/lldb-cmake-sanitized/lldb-build/lldb-test-build.noindex/tools/lldb-vscode/evaluate/TestVSCode_evaluate.test_hover_evaluate_expressions/a.out","startMethod":"launch","systemProcessId":64938},"event":"process","seq":0,"type":"event"} <-- Content-Length: 46

Hide Details

{"event":"initialized","seq":0,"type":"event"} --> Content-Length: 276

Hide Details

{"command":"setBreakpoints","type":"request","arguments":{"source":{"name":"main.cpp","path":"main.cpp"},"sourceModified":false,"lines":"[23, 27, 11, 35, 40, 44, 45]","breakpoints":[{"line":23},{"line":27},{"line":11},{"line":35},{"line":40},{"line":44},{"line":45}]},"seq":3} <-- Content-Length: 684

Hide Details

{"body":{"breakpoints":[{"id":1,"line":23,"source":{"name":"main.cpp","path":"main.cpp"},"verified":true},{"id":2,"line":27,"source":{"name":"main.cpp","path":"main.cpp"},"verified":true},{"id":3,"line":11,"source":{"name":"main.cpp","path":"main.cpp"},"verified":true},{"id":4,"line":35,"source":{"name":"main.cpp","path":"main.cpp"},"verified":true},{"id":5,"line":40,"source":{"name":"main.cpp","path":"main.cpp"},"verified":true},{"id":6,"line":44,"source":{"name":"main.cpp","path":"main.cpp"},"verified":true},{"id":7,"line":45,"source":{"name":"main.cpp","path":"main.cpp"},"verified":true}]},"command":"setBreakpoints","request_seq":3,"seq":0,"success":true,"type":"response"} --> Content-Length: 71

Hide Details

{"command":"configurationDone","type":"request","arguments":{},"seq":4} <-- Content-Length: 88

Hide Details

{"command":"configurationDone","request_seq":4,"seq":0,"success":true,"type":"response"} <-- Content-Length: 198

Hide Details

{"body":{"allThreadsStopped":true,"description":"breakpoint 1.1","preserveFocusHint":false,"reason":"breakpoint","threadCausedFocus":true,"threadId":279076},"event":"stopped","seq":0,"type":"event"} --> Content-Length: 61

Hide Details

{"command":"threads","type":"request","arguments":{},"seq":5} <-- Content-Length: 132

Hide Details

{"body":{"threads":[{"id":279076,"name":"Thread #1"}]},"command":"threads","request_seq":5,"seq":0,"success":true,"type":"response"} --> Content-Length: 107

Hide Details

{"command":"stackTrace","type":"request","arguments":{"threadId":279076,"startFrame":0,"levels":1},"seq":6} <-- Content-Length: 330

Hide Details

{"body":{"stackFrames":[{"column":14,"id":524288,"line":23,"name":"main","source":{"name":"main.cpp","path":"/Users/buildslave/jenkins/workspace/lldb-cmake-sanitized/llvm-project/lldb/test/API/tools/lldb-vscode/evaluate/main.cpp"}}],"totalFrames":2},"command":"stackTrace","request_seq":6,"seq":0,"success":true,"type":"response"} --> Content-Length: 116

Hide Details

{"command":"evaluate","type":"request","arguments":{"expression":"var1","context":"hover","frameId":524288},"seq":7} <-- Content-Length: 138

Hide Details

{"body":{"result":"20","type":"int","variablesReference":0},"command":"evaluate","request_seq":7,"seq":0,"success":true,"type":"response"} --> Content-Length: 107

Hide Details

{"command":"stackTrace","type":"request","arguments":{"threadId":279076,"startFrame":0,"levels":1},"seq":8} <-- Content-Length: 330

Hide Details

{"body":{"stackFrames":[{"column":14,"id":524288,"line":23,"name":"main","source":{"name":"main.cpp","path":"/Users/buildslave/jenkins/workspace/lldb-cmake-sanitized/llvm-project/lldb/test/API/tools/lldb-vscode/evaluate/main.cpp"}}],"totalFrames":2},"command":"stackTrace","request_seq":8,"seq":0,"success":true,"type":"response"} --> Content-Length: 116

Hide Details

{"command":"evaluate","type":"request","arguments":{"expression":"var2","context":"hover","frameId":524288},"seq":9} <-- Content-Length: 138

Hide Details

{"body":{"result":"21","type":"int","variablesReference":0},"command":"evaluate","request_seq":9,"seq":0,"success":true,"type":"response"} --> Content-Length: 108

Hide Details

{"command":"stackTrace","type":"request","arguments":{"threadId":279076,"startFrame":0,"levels":1},"seq":10} <-- Content-Length: 331

Hide Details

{"body":{"stackFrames":[{"column":14,"id":524288,"line":23,"name":"main","source":{"name":"main.cpp","path":"/Users/buildslave/jenkins/workspace/lldb-cmake-sanitized/llvm-project/lldb/test/API/tools/lldb-vscode/evaluate/main.cpp"}}],"totalFrames":2},"command":"stackTrace","request_seq":10,"seq":0,"success":true,"type":"response"} --> Content-Length: 123

Hide Details

{"command":"evaluate","type":"request","arguments":{"expression":"static_int","context":"hover","frameId":524288},"seq":11} <-- Content-Length: 139

Hide Details

{"body":{"result":"42","type":"int","variablesReference":0},"command":"evaluate","request_seq":11,"seq":0,"success":true,"type":"response"} --> Content-Length: 108

Hide Details

{"command":"stackTrace","type":"request","arguments":{"threadId":279076,"startFrame":0,"levels":1},"seq":12} <-- Content-Length: 331

Hide Details

{"body":{"stackFrames":[{"column":14,"id":524288,"line":23,"name":"main","source":{"name":"main.cpp","path":"/Users/buildslave/jenkins/workspace/lldb-cmake-sanitized/llvm-project/lldb/test/API/tools/lldb-vscode/evaluate/main.cpp"}}],"totalFrames":2},"command":"stackTrace","request_seq":12,"seq":0,"success":true,"type":"response"} --> Content-Length: 127

Hide Details

{"command":"evaluate","type":"request","arguments":{"expression":"non_static_int","context":"hover","frameId":524288},"seq":13} <-- Content-Length: 139

Hide Details

{"body":{"result":"43","type":"int","variablesReference":0},"command":"evaluate","request_seq":13,"seq":0,"success":true,"type":"response"} --> Content-Length: 108

Hide Details

{"command":"stackTrace","type":"request","arguments":{"threadId":279076,"startFrame":0,"levels":1},"seq":14} <-- Content-Length: 331

Hide Details

{"body":{"stackFrames":[{"column":14,"id":524288,"line":23,"name":"main","source":{"name":"main.cpp","path":"/Users/buildslave/jenkins/workspace/lldb-cmake-sanitized/llvm-project/lldb/test/API/tools/lldb-vscode/evaluate/main.cpp"}}],"totalFrames":2},"command":"stackTrace","request_seq":14,"seq":0,"success":true,"type":"response"} --> Content-Length: 120

Hide Details

{"command":"evaluate","type":"request","arguments":{"expression":"struct1","context":"hover","frameId":524288},"seq":15} <-- Content-Length: 169

Hide Details

{"body":{"result":"my_struct @ 0x7ffeefbff7c8","type":"my_struct","variablesReference":4},"command":"evaluate","request_seq":15,"seq":0,"success":true,"type":"response"} --> Content-Length: 108

Hide Details

{"command":"stackTrace","type":"request","arguments":{"threadId":279076,"startFrame":0,"levels":1},"seq":16} <-- Content-Length: 331

Hide Details

{"body":{"stackFrames":[{"column":14,"id":524288,"line":23,"name":"main","source":{"name":"main.cpp","path":"/Users/buildslave/jenkins/workspace/lldb-cmake-sanitized/llvm-project/lldb/test/API/tools/lldb-vscode/evaluate/main.cpp"}}],"totalFrames":2},"command":"stackTrace","request_seq":16,"seq":0,"success":true,"type":"response"} --> Content-Length: 124

Hide Details

{"command":"evaluate","type":"request","arguments":{"expression":"struct1.foo","context":"hover","frameId":524288},"seq":17} <-- Content-Length: 139

Hide Details

{"body":{"result":"15","type":"int","variablesReference":0},"command":"evaluate","request_seq":17,"seq":0,"success":true,"type":"response"} --> Content-Length: 108

Hide Details

{"command":"stackTrace","type":"request","arguments":{"threadId":279076,"startFrame":0,"levels":1},"seq":18} <-- Content-Length: 331

Hide Details

{"body":{"stackFrames":[{"column":14,"id":524288,"line":23,"name":"main","source":{"name":"main.cpp","path":"/Users/buildslave/jenkins/workspace/lldb-cmake-sanitized/llvm-project/lldb/test/API/tools/lldb-vscode/evaluate/main.cpp"}}],"totalFrames":2},"command":"stackTrace","request_seq":18,"seq":0,"success":true,"type":"response"} --> Content-Length: 125

Hide Details

{"command":"evaluate","type":"request","arguments":{"expression":"struct2->foo","context":"hover","frameId":524288},"seq":19} <-- Content-Length: 139

Hide Details

{"body":{"result":"16","type":"int","variablesReference":0},"command":"evaluate","request_seq":19,"seq":0,"success":true,"type":"response"} --> Content-Length: 108

Hide Details

{"command":"stackTrace","type":"request","arguments":{"threadId":279076,"startFrame":0,"levels":1},"seq":20} <-- Content-Length: 331

Hide Details

{"body":{"stackFrames":[{"column":14,"id":524288,"line":23,"name":"main","source":{"name":"main.cpp","path":"/Users/buildslave/jenkins/workspace/lldb-cmake-sanitized/llvm-project/lldb/test/API/tools/lldb-vscode/evaluate/main.cpp"}}],"totalFrames":2},"command":"stackTrace","request_seq":20,"seq":0,"success":true,"type":"response"} --> Content-Length: 116

Hide Details

{"command":"evaluate","type":"request","arguments":{"expression":"var","context":"hover","frameId":524288},"seq":21} <-- Content-Length: 119

Hide Details

{"body":{},"command":"evaluate","message":"error: No value","request_seq":21,"seq":0,"success":false,"type":"response"} --> Content-Length: 108

Hide Details

{"command":"stackTrace","type":"request","arguments":{"threadId":279076,"startFrame":0,"levels":1},"seq":22} <-- Content-Length: 331

Hide Details

{"body":{"stackFrames":[{"column":14,"id":524288,"line":23,"name":"main","source":{"name":"main.cpp","path":"/Users/buildslave/jenkins/workspace/lldb-cmake-sanitized/llvm-project/lldb/test/API/tools/lldb-vscode/evaluate/main.cpp"}}],"totalFrames":2},"command":"stackTrace","request_seq":22,"seq":0,"success":true,"type":"response"} --> Content-Length: 122

Hide Details

{"command":"evaluate","type":"request","arguments":{"expression":"my_struct","context":"hover","frameId":524288},"seq":23} <-- Content-Length: 119

Hide Details

{"body":{},"command":"evaluate","message":"error: No value","request_seq":23,"seq":0,"success":false,"type":"response"} --> Content-Length: 108

Hide Details

{"command":"stackTrace","type":"request","arguments":{"threadId":279076,"startFrame":0,"levels":1},"seq":24} <-- Content-Length: 331

Hide Details

{"body":{"stackFrames":[{"column":14,"id":524288,"line":23,"name":"main","source":{"name":"main.cpp","path":"/Users/buildslave/jenkins/workspace/lldb-cmake-sanitized/llvm-project/lldb/test/API/tools/lldb-vscode/evaluate/main.cpp"}}],"totalFrames":2},"command":"stackTrace","request_seq":24,"seq":0,"success":true,"type":"response"} --> Content-Length: 116

Hide Details

{"command":"evaluate","type":"request","arguments":{"expression":"int","context":"hover","frameId":524288},"seq":25} <-- Content-Length: 119

Hide Details

{"body":{},"command":"evaluate","message":"error: No value","request_seq":25,"seq":0,"success":false,"type":"response"} --> Content-Length: 108

Hide Details

{"command":"stackTrace","type":"request","arguments":{"threadId":279076,"startFrame":0,"levels":1},"seq":26} <-- Content-Length: 331

Hide Details

{"body":{"stackFrames":[{"column":14,"id":524288,"line":23,"name":"main","source":{"name":"main.cpp","path":"/Users/buildslave/jenkins/workspace/lldb-cmake-sanitized/llvm-project/lldb/test/API/tools/lldb-vscode/evaluate/main.cpp"}}],"totalFrames":2},"command":"stackTrace","request_seq":26,"seq":0,"success":true,"type":"response"} --> Content-Length: 116

Hide Details

{"command":"evaluate","type":"request","arguments":{"expression":"foo","context":"hover","frameId":524288},"seq":27} <-- Content-Length: 119

Hide Details

{"body":{},"command":"evaluate","message":"error: No value","request_seq":27,"seq":0,"success":false,"type":"response"} --> Content-Length: 108

Hide Details

{"command":"stackTrace","type":"request","arguments":{"threadId":279076,"startFrame":0,"levels":1},"seq":28} <-- Content-Length: 331

Hide Details

{"body":{"stackFrames":[{"column":14,"id":524288,"line":23,"name":"main","source":{"name":"main.cpp","path":"/Users/buildslave/jenkins/workspace/lldb-cmake-sanitized/llvm-project/lldb/test/API/tools/lldb-vscode/evaluate/main.cpp"}}],"totalFrames":2},"command":"stackTrace","request_seq":28,"seq":0,"success":true,"type":"response"} --> Content-Length: 123

Hide Details

{"command":"evaluate","type":"request","arguments":{"expression":"a_function","context":"hover","frameId":524288},"seq":29} <-- Content-Length: 119

Hide Details

{"body":{},"command":"evaluate","message":"error: No value","request_seq":29,"seq":0,"success":false,"type":"response"} --> Content-Length: 108

Hide Details

{"command":"stackTrace","type":"request","arguments":{"threadId":279076,"startFrame":0,"levels":1},"seq":30} <-- Content-Length: 331

Hide Details

{"body":{"stackFrames":[{"column":14,"id":524288,"line":23,"name":"main","source":{"name":"main.cpp","path":"/Users/buildslave/jenkins/workspace/lldb-cmake-sanitized/llvm-project/lldb/test/API/tools/lldb-vscode/evaluate/main.cpp"}}],"totalFrames":2},"command":"stackTrace","request_seq":30,"seq":0,"success":true,"type":"response"} --> Content-Length: 126

Hide Details

{"command":"evaluate","type":"request","arguments":{"expression":"a_function(1)","context":"hover","frameId":524288},"seq":31} <-- Content-Length: 119

Hide Details

{"body":{},"command":"evaluate","message":"error: No value","request_seq":31,"seq":0,"success":false,"type":"response"} --> Content-Length: 108

Hide Details

{"command":"stackTrace","type":"request","arguments":{"threadId":279076,"startFrame":0,"levels":1},"seq":32} <-- Content-Length: 331

Hide Details

{"body":{"stackFrames":[{"column":14,"id":524288,"line":23,"name":"main","source":{"name":"main.cpp","path":"/Users/buildslave/jenkins/workspace/lldb-cmake-sanitized/llvm-project/lldb/test/API/tools/lldb-vscode/evaluate/main.cpp"}}],"totalFrames":2},"command":"stackTrace","request_seq":32,"seq":0,"success":true,"type":"response"} --> Content-Length: 131

Hide Details

{"command":"evaluate","type":"request","arguments":{"expression":"var2 + struct1.foo","context":"hover","frameId":524288},"seq":33} <-- Content-Length: 119

Hide Details

{"body":{},"command":"evaluate","message":"error: No value","request_seq":33,"seq":0,"success":false,"type":"response"} --> Content-Length: 108

Hide Details

{"command":"stackTrace","type":"request","arguments":{"threadId":279076,"startFrame":0,"levels":1},"seq":34} <-- Content-Length: 331

Hide Details

{"body":{"stackFrames":[{"column":14,"id":524288,"line":23,"name":"main","source":{"name":"main.cpp","path":"/Users/buildslave/jenkins/workspace/lldb-cmake-sanitized/llvm-project/lldb/test/API/tools/lldb-vscode/evaluate/main.cpp"}}],"totalFrames":2},"command":"stackTrace","request_seq":34,"seq":0,"success":true,"type":"response"} --> Content-Length: 121

Hide Details

{"command":"evaluate","type":"request","arguments":{"expression":"foo_func","context":"hover","frameId":524288},"seq":35} <-- Content-Length: 119

Hide Details

{"body":{},"command":"evaluate","message":"error: No value","request_seq":35,"seq":0,"success":false,"type":"response"} --> Content-Length: 108

Hide Details

{"command":"stackTrace","type":"request","arguments":{"threadId":279076,"startFrame":0,"levels":1},"seq":36} <-- Content-Length: 331

Hide Details

{"body":{"stackFrames":[{"column":14,"id":524288,"line":23,"name":"main","source":{"name":"main.cpp","path":"/Users/buildslave/jenkins/workspace/lldb-cmake-sanitized/llvm-project/lldb/test/API/tools/lldb-vscode/evaluate/main.cpp"}}],"totalFrames":2},"command":"stackTrace","request_seq":36,"seq":0,"success":true,"type":"response"} --> Content-Length: 120

Hide Details

{"command":"evaluate","type":"request","arguments":{"expression":"foo_var","context":"hover","frameId":524288},"seq":37} <-- Content-Length: 119

Hide Details

{"body":{},"command":"evaluate","message":"error: No value","request_seq":37,"seq":0,"success":false,"type":"response"} --> Content-Length: 80

Hide Details

{"command":"continue","type":"request","arguments":{"threadId":279076},"seq":38} <-- Content-Length: 116

Hide Details

{"body":{"allThreadsContinued":true},"command":"continue","request_seq":38,"seq":0,"success":true,"type":"response"} <-- Content-Length: 198

Hide Details

{"body":{"allThreadsStopped":true,"description":"breakpoint 2.1","preserveFocusHint":false,"reason":"breakpoint","threadCausedFocus":true,"threadId":279076},"event":"stopped","seq":0,"type":"event"} --> Content-Length: 62

Hide Details

{"command":"threads","type":"request","arguments":{},"seq":39} <-- Content-Length: 133

Hide Details

{"body":{"threads":[{"id":279076,"name":"Thread #1"}]},"command":"threads","request_seq":39,"seq":0,"success":true,"type":"response"} --> Content-Length: 108

Hide Details

{"command":"stackTrace","type":"request","arguments":{"threadId":279076,"startFrame":0,"levels":1},"seq":40} <-- Content-Length: 331

Hide Details

{"body":{"stackFrames":[{"column":16,"id":524288,"line":27,"name":"main","source":{"name":"main.cpp","path":"/Users/buildslave/jenkins/workspace/lldb-cmake-sanitized/llvm-project/lldb/test/API/tools/lldb-vscode/evaluate/main.cpp"}}],"totalFrames":2},"command":"stackTrace","request_seq":40,"seq":0,"success":true,"type":"response"} --> Content-Length: 117

Hide Details

{"command":"evaluate","type":"request","arguments":{"expression":"var1","context":"hover","frameId":524288},"seq":41} <-- Content-Length: 139

Hide Details

{"body":{"result":"20","type":"int","variablesReference":0},"command":"evaluate","request_seq":41,"seq":0,"success":true,"type":"response"} --> Content-Length: 108

Hide Details

{"command":"stackTrace","type":"request","arguments":{"threadId":279076,"startFrame":0,"levels":1},"seq":42} <-- Content-Length: 331

Hide Details

{"body":{"stackFrames":[{"column":16,"id":524288,"line":27,"name":"main","source":{"name":"main.cpp","path":"/Users/buildslave/jenkins/workspace/lldb-cmake-sanitized/llvm-project/lldb/test/API/tools/lldb-vscode/evaluate/main.cpp"}}],"totalFrames":2},"command":"stackTrace","request_seq":42,"seq":0,"success":true,"type":"response"} --> Content-Length: 117

Hide Details

{"command":"evaluate","type":"request","arguments":{"expression":"var2","context":"hover","frameId":524288},"seq":43} <-- Content-Length: 138

Hide Details

{"body":{"result":"2","type":"int","variablesReference":0},"command":"evaluate","request_seq":43,"seq":0,"success":true,"type":"response"} --> Content-Length: 108

Hide Details

{"command":"stackTrace","type":"request","arguments":{"threadId":279076,"startFrame":0,"levels":1},"seq":44} <-- Content-Length: 331

Hide Details

{"body":{"stackFrames":[{"column":16,"id":524288,"line":27,"name":"main","source":{"name":"main.cpp","path":"/Users/buildslave/jenkins/workspace/lldb-cmake-sanitized/llvm-project/lldb/test/API/tools/lldb-vscode/evaluate/main.cpp"}}],"totalFrames":2},"command":"stackTrace","request_seq":44,"seq":0,"success":true,"type":"response"} --> Content-Length: 123

Hide Details

{"command":"evaluate","type":"request","arguments":{"expression":"static_int","context":"hover","frameId":524288},"seq":45} <-- Content-Length: 139

Hide Details

{"body":{"result":"42","type":"int","variablesReference":0},"command":"evaluate","request_seq":45,"seq":0,"success":true,"type":"response"} --> Content-Length: 108

Hide Details

{"command":"stackTrace","type":"request","arguments":{"threadId":279076,"startFrame":0,"levels":1},"seq":46} <-- Content-Length: 331

Hide Details

{"body":{"stackFrames":[{"column":16,"id":524288,"line":27,"name":"main","source":{"name":"main.cpp","path":"/Users/buildslave/jenkins/workspace/lldb-cmake-sanitized/llvm-project/lldb/test/API/tools/lldb-vscode/evaluate/main.cpp"}}],"totalFrames":2},"command":"stackTrace","request_seq":46,"seq":0,"success":true,"type":"response"} --> Content-Length: 127

Hide Details

{"command":"evaluate","type":"request","arguments":{"expression":"non_static_int","context":"hover","frameId":524288},"seq":47} <-- Content-Length: 139

Hide Details

{"body":{"result":"10","type":"int","variablesReference":0},"command":"evaluate","request_seq":47,"seq":0,"success":true,"type":"response"} --> Content-Length: 108

Hide Details

{"command":"stackTrace","type":"request","arguments":{"threadId":279076,"startFrame":0,"levels":1},"seq":48} <-- Content-Length: 331

Hide Details

{"body":{"stackFrames":[{"column":16,"id":524288,"line":27,"name":"main","source":{"name":"main.cpp","path":"/Users/buildslave/jenkins/workspace/lldb-cmake-sanitized/llvm-project/lldb/test/API/tools/lldb-vscode/evaluate/main.cpp"}}],"totalFrames":2},"command":"stackTrace","request_seq":48,"seq":0,"success":true,"type":"response"} --> Content-Length: 120

Hide Details

{"command":"evaluate","type":"request","arguments":{"expression":"struct1","context":"hover","frameId":524288},"seq":49} <-- Content-Length: 169

Hide Details

{"body":{"result":"my_struct @ 0x7ffeefbff7c8","type":"my_struct","variablesReference":5},"command":"evaluate","request_seq":49,"seq":0,"success":true,"type":"response"} --> Content-Length: 108

Hide Details

{"command":"stackTrace","type":"request","arguments":{"threadId":279076,"startFrame":0,"levels":1},"seq":50} <-- Content-Length: 331

Hide Details

{"body":{"stackFrames":[{"column":16,"id":524288,"line":27,"name":"main","source":{"name":"main.cpp","path":"/Users/buildslave/jenkins/workspace/lldb-cmake-sanitized/llvm-project/lldb/test/API/tools/lldb-vscode/evaluate/main.cpp"}}],"totalFrames":2},"command":"stackTrace","request_seq":50,"seq":0,"success":true,"type":"response"} --> Content-Length: 124

Hide Details

{"command":"evaluate","type":"request","arguments":{"expression":"struct1.foo","context":"hover","frameId":524288},"seq":51} <-- Content-Length: 139

Hide Details

{"body":{"result":"15","type":"int","variablesReference":0},"command":"evaluate","request_seq":51,"seq":0,"success":true,"type":"response"} --> Content-Length: 108

Hide Details

{"command":"stackTrace","type":"request","arguments":{"threadId":279076,"startFrame":0,"levels":1},"seq":52} <-- Content-Length: 331

Hide Details

{"body":{"stackFrames":[{"column":16,"id":524288,"line":27,"name":"main","source":{"name":"main.cpp","path":"/Users/buildslave/jenkins/workspace/lldb-cmake-sanitized/llvm-project/lldb/test/API/tools/lldb-vscode/evaluate/main.cpp"}}],"totalFrames":2},"command":"stackTrace","request_seq":52,"seq":0,"success":true,"type":"response"} --> Content-Length: 125

Hide Details

{"command":"evaluate","type":"request","arguments":{"expression":"struct2->foo","context":"hover","frameId":524288},"seq":53} <-- Content-Length: 139

Hide Details

{"body":{"result":"16","type":"int","variablesReference":0},"command":"evaluate","request_seq":53,"seq":0,"success":true,"type":"response"} --> Content-Length: 108

Hide Details

{"command":"stackTrace","type":"request","arguments":{"threadId":279076,"startFrame":0,"levels":1},"seq":54} <-- Content-Length: 331

Hide Details

{"body":{"stackFrames":[{"column":16,"id":524288,"line":27,"name":"main","source":{"name":"main.cpp","path":"/Users/buildslave/jenkins/workspace/lldb-cmake-sanitized/llvm-project/lldb/test/API/tools/lldb-vscode/evaluate/main.cpp"}}],"totalFrames":2},"command":"stackTrace","request_seq":54,"seq":0,"success":true,"type":"response"} --> Content-Length: 123

Hide Details

{"command":"evaluate","type":"request","arguments":{"expression":"a_function","context":"hover","frameId":524288},"seq":55} <-- Content-Length: 119

Hide Details

{"body":{},"command":"evaluate","message":"error: No value","request_seq":55,"seq":0,"success":false,"type":"response"} --> Content-Length: 108

Hide Details

{"command":"stackTrace","type":"request","arguments":{"threadId":279076,"startFrame":0,"levels":1},"seq":56} <-- Content-Length: 331

Hide Details

{"body":{"stackFrames":[{"column":16,"id":524288,"line":27,"name":"main","source":{"name":"main.cpp","path":"/Users/buildslave/jenkins/workspace/lldb-cmake-sanitized/llvm-project/lldb/test/API/tools/lldb-vscode/evaluate/main.cpp"}}],"totalFrames":2},"command":"stackTrace","request_seq":56,"seq":0,"success":true,"type":"response"} --> Content-Length: 126

Hide Details

{"command":"evaluate","type":"request","arguments":{"expression":"a_function(1)","context":"hover","frameId":524288},"seq":57} <-- Content-Length: 119

Hide Details

{"body":{},"command":"evaluate","message":"error: No value","request_seq":57,"seq":0,"success":false,"type":"response"} --> Content-Length: 108

Hide Details

{"command":"stackTrace","type":"request","arguments":{"threadId":279076,"startFrame":0,"levels":1},"seq":58} <-- Content-Length: 331

Hide Details

{"body":{"stackFrames":[{"column":16,"id":524288,"line":27,"name":"main","source":{"name":"main.cpp","path":"/Users/buildslave/jenkins/workspace/lldb-cmake-sanitized/llvm-project/lldb/test/API/tools/lldb-vscode/evaluate/main.cpp"}}],"totalFrames":2},"command":"stackTrace","request_seq":58,"seq":0,"success":true,"type":"response"} --> Content-Length: 131

Hide Details

{"command":"evaluate","type":"request","arguments":{"expression":"var2 + struct1.foo","context":"hover","frameId":524288},"seq":59} <-- Content-Length: 119

Hide Details

{"body":{},"command":"evaluate","message":"error: No value","request_seq":59,"seq":0,"success":false,"type":"response"} --> Content-Length: 108

Hide Details

{"command":"stackTrace","type":"request","arguments":{"threadId":279076,"startFrame":0,"levels":1},"seq":60} <-- Content-Length: 331

Hide Details

{"body":{"stackFrames":[{"column":16,"id":524288,"line":27,"name":"main","source":{"name":"main.cpp","path":"/Users/buildslave/jenkins/workspace/lldb-cmake-sanitized/llvm-project/lldb/test/API/tools/lldb-vscode/evaluate/main.cpp"}}],"totalFrames":2},"command":"stackTrace","request_seq":60,"seq":0,"success":true,"type":"response"} --> Content-Length: 121

Hide Details

{"command":"evaluate","type":"request","arguments":{"expression":"foo_func","context":"hover","frameId":524288},"seq":61} <-- Content-Length: 119

Hide Details

{"body":{},"command":"evaluate","message":"error: No value","request_seq":61,"seq":0,"success":false,"type":"response"} --> Content-Length: 108

Hide Details

{"command":"stackTrace","type":"request","arguments":{"threadId":279076,"startFrame":0,"levels":1},"seq":62} <-- Content-Length: 331

Hide Details

{"body":{"stackFrames":[{"column":16,"id":524288,"line":27,"name":"main","source":{"name":"main.cpp","path":"/Users/buildslave/jenkins/workspace/lldb-cmake-sanitized/llvm-project/lldb/test/API/tools/lldb-vscode/evaluate/main.cpp"}}],"totalFrames":2},"command":"stackTrace","request_seq":62,"seq":0,"success":true,"type":"response"} --> Content-Length: 120

Hide Details

{"command":"evaluate","type":"request","arguments":{"expression":"foo_var","context":"hover","frameId":524288},"seq":63} <-- Content-Length: 119

Hide Details

{"body":{},"command":"evaluate","message":"error: No value","request_seq":63,"seq":0,"success":false,"type":"response"} --> Content-Length: 80

Hide Details

{"command":"continue","type":"request","arguments":{"threadId":279076},"seq":64} <-- Content-Length: 116

Hide Details

{"body":{"allThreadsContinued":true},"command":"continue","request_seq":64,"seq":0,"success":true,"type":"response"} <-- Content-Length: 198

Hide Details

{"body":{"allThreadsStopped":true,"description":"breakpoint 3.1","preserveFocusHint":false,"reason":"breakpoint","threadCausedFocus":true,"threadId":279076},"event":"stopped","seq":0,"type":"event"} --> Content-Length: 62

Hide Details

{"command":"threads","type":"request","arguments":{},"seq":65} <-- Content-Length: 133

Hide Details

{"body":{"threads":[{"id":279076,"name":"Thread #1"}]},"command":"threads","request_seq":65,"seq":0,"success":true,"type":"response"} --> Content-Length: 108

Hide Details

{"command":"stackTrace","type":"request","arguments":{"threadId":279076,"startFrame":0,"levels":1},"seq":66} <-- Content-Length: 342

Hide Details

{"body":{"stackFrames":[{"column":10,"id":524288,"line":11,"name":"a_function(int)","source":{"name":"main.cpp","path":"/Users/buildslave/jenkins/workspace/lldb-cmake-sanitized/llvm-project/lldb/test/API/tools/lldb-vscode/evaluate/main.cpp"}}],"totalFrames":3},"command":"stackTrace","request_seq":66,"seq":0,"success":true,"type":"response"} --> Content-Length: 116

Hide Details

{"command":"evaluate","type":"request","arguments":{"expression":"var","context":"hover","frameId":524288},"seq":67} <-- Content-Length: 139

Hide Details

{"body":{"result":"42","type":"int","variablesReference":0},"command":"evaluate","request_seq":67,"seq":0,"success":true,"type":"response"} --> Content-Length: 108

Hide Details

{"command":"stackTrace","type":"request","arguments":{"threadId":279076,"startFrame":0,"levels":1},"seq":68} <-- Content-Length: 342

Hide Details

{"body":{"stackFrames":[{"column":10,"id":524288,"line":11,"name":"a_function(int)","source":{"name":"main.cpp","path":"/Users/buildslave/jenkins/workspace/lldb-cmake-sanitized/llvm-project/lldb/test/API/tools/lldb-vscode/evaluate/main.cpp"}}],"totalFrames":3},"command":"stackTrace","request_seq":68,"seq":0,"success":true,"type":"response"} --> Content-Length: 123

Hide Details

{"command":"evaluate","type":"request","arguments":{"expression":"static_int","context":"hover","frameId":524288},"seq":69} <-- Content-Length: 139

Hide Details

{"body":{"result":"42","type":"int","variablesReference":0},"command":"evaluate","request_seq":69,"seq":0,"success":true,"type":"response"} --> Content-Length: 108

Hide Details

{"command":"stackTrace","type":"request","arguments":{"threadId":279076,"startFrame":0,"levels":1},"seq":70} <-- Content-Length: 342

Hide Details

{"body":{"stackFrames":[{"column":10,"id":524288,"line":11,"name":"a_function(int)","source":{"name":"main.cpp","path":"/Users/buildslave/jenkins/workspace/lldb-cmake-sanitized/llvm-project/lldb/test/API/tools/lldb-vscode/evaluate/main.cpp"}}],"totalFrames":3},"command":"stackTrace","request_seq":70,"seq":0,"success":true,"type":"response"} --> Content-Length: 127

Hide Details

{"command":"evaluate","type":"request","arguments":{"expression":"non_static_int","context":"hover","frameId":524288},"seq":71} <-- Content-Length: 139

Hide Details

{"body":{"result":"43","type":"int","variablesReference":0},"command":"evaluate","request_seq":71,"seq":0,"success":true,"type":"response"} --> Content-Length: 108

Hide Details

{"command":"stackTrace","type":"request","arguments":{"threadId":279076,"startFrame":0,"levels":1},"seq":72} <-- Content-Length: 342

Hide Details

{"body":{"stackFrames":[{"column":10,"id":524288,"line":11,"name":"a_function(int)","source":{"name":"main.cpp","path":"/Users/buildslave/jenkins/workspace/lldb-cmake-sanitized/llvm-project/lldb/test/API/tools/lldb-vscode/evaluate/main.cpp"}}],"totalFrames":3},"command":"stackTrace","request_seq":72,"seq":0,"success":true,"type":"response"} --> Content-Length: 117

Hide Details

{"command":"evaluate","type":"request","arguments":{"expression":"var1","context":"hover","frameId":524288},"seq":73} <-- Content-Length: 119

Hide Details

{"body":{},"command":"evaluate","message":"error: No value","request_seq":73,"seq":0,"success":false,"type":"response"} --> Content-Length: 108

Hide Details

{"command":"stackTrace","type":"request","arguments":{"threadId":279076,"startFrame":0,"levels":1},"seq":74} <-- Content-Length: 342

Hide Details

{"body":{"stackFrames":[{"column":10,"id":524288,"line":11,"name":"a_function(int)","source":{"name":"main.cpp","path":"/Users/buildslave/jenkins/workspace/lldb-cmake-sanitized/llvm-project/lldb/test/API/tools/lldb-vscode/evaluate/main.cpp"}}],"totalFrames":3},"command":"stackTrace","request_seq":74,"seq":0,"success":true,"type":"response"} --> Content-Length: 117

Hide Details

{"command":"evaluate","type":"request","arguments":{"expression":"var2","context":"hover","frameId":524288},"seq":75} <-- Content-Length: 119

Hide Details

{"body":{},"command":"evaluate","message":"error: No value","request_seq":75,"seq":0,"success":false,"type":"response"} --> Content-Length: 108

Hide Details

{"command":"stackTrace","type":"request","arguments":{"threadId":279076,"startFrame":0,"levels":1},"seq":76} <-- Content-Length: 342

Hide Details

{"body":{"stackFrames":[{"column":10,"id":524288,"line":11,"name":"a_function(int)","source":{"name":"main.cpp","path":"/Users/buildslave/jenkins/workspace/lldb-cmake-sanitized/llvm-project/lldb/test/API/tools/lldb-vscode/evaluate/main.cpp"}}],"totalFrames":3},"command":"stackTrace","request_seq":76,"seq":0,"success":true,"type":"response"} --> Content-Length: 120

Hide Details

{"command":"evaluate","type":"request","arguments":{"expression":"struct1","context":"hover","frameId":524288},"seq":77} <-- Content-Length: 119

Hide Details

{"body":{},"command":"evaluate","message":"error: No value","request_seq":77,"seq":0,"success":false,"type":"response"} --> Content-Length: 108

Hide Details

{"command":"stackTrace","type":"request","arguments":{"threadId":279076,"startFrame":0,"levels":1},"seq":78} <-- Content-Length: 342

Hide Details

{"body":{"stackFrames":[{"column":10,"id":524288,"line":11,"name":"a_function(int)","source":{"name":"main.cpp","path":"/Users/buildslave/jenkins/workspace/lldb-cmake-sanitized/llvm-project/lldb/test/API/tools/lldb-vscode/evaluate/main.cpp"}}],"totalFrames":3},"command":"stackTrace","request_seq":78,"seq":0,"success":true,"type":"response"} --> Content-Length: 124

Hide Details

{"command":"evaluate","type":"request","arguments":{"expression":"struct1.foo","context":"hover","frameId":524288},"seq":79} <-- Content-Length: 119

Hide Details

{"body":{},"command":"evaluate","message":"error: No value","request_seq":79,"seq":0,"success":false,"type":"response"} --> Content-Length: 108

Hide Details

{"command":"stackTrace","type":"request","arguments":{"threadId":279076,"startFrame":0,"levels":1},"seq":80} <-- Content-Length: 342

Hide Details

{"body":{"stackFrames":[{"column":10,"id":524288,"line":11,"name":"a_function(int)","source":{"name":"main.cpp","path":"/Users/buildslave/jenkins/workspace/lldb-cmake-sanitized/llvm-project/lldb/test/API/tools/lldb-vscode/evaluate/main.cpp"}}],"totalFrames":3},"command":"stackTrace","request_seq":80,"seq":0,"success":true,"type":"response"} --> Content-Length: 125

Hide Details

{"command":"evaluate","type":"request","arguments":{"expression":"struct2->foo","context":"hover","frameId":524288},"seq":81} <-- Content-Length: 119

Hide Details

{"body":{},"command":"evaluate","message":"error: No value","request_seq":81,"seq":0,"success":false,"type":"response"} --> Content-Length: 108

Hide Details

{"command":"stackTrace","type":"request","arguments":{"threadId":279076,"startFrame":0,"levels":1},"seq":82} <-- Content-Length: 342

Hide Details

{"body":{"stackFrames":[{"column":10,"id":524288,"line":11,"name":"a_function(int)","source":{"name":"main.cpp","path":"/Users/buildslave/jenkins/workspace/lldb-cmake-sanitized/llvm-project/lldb/test/API/tools/lldb-vscode/evaluate/main.cpp"}}],"totalFrames":3},"command":"stackTrace","request_seq":82,"seq":0,"success":true,"type":"response"} --> Content-Length: 131

Hide Details

{"command":"evaluate","type":"request","arguments":{"expression":"var2 + struct1.foo","context":"hover","frameId":524288},"seq":83} <-- Content-Length: 119

Hide Details

{"body":{},"command":"evaluate","message":"error: No value","request_seq":83,"seq":0,"success":false,"type":"response"} --> Content-Length: 108

Hide Details

{"command":"stackTrace","type":"request","arguments":{"threadId":279076,"startFrame":0,"levels":1},"seq":84} <-- Content-Length: 342

Hide Details

{"body":{"stackFrames":[{"column":10,"id":524288,"line":11,"name":"a_function(int)","source":{"name":"main.cpp","path":"/Users/buildslave/jenkins/workspace/lldb-cmake-sanitized/llvm-project/lldb/test/API/tools/lldb-vscode/evaluate/main.cpp"}}],"totalFrames":3},"command":"stackTrace","request_seq":84,"seq":0,"success":true,"type":"response"} --> Content-Length: 123

Hide Details

{"command":"evaluate","type":"request","arguments":{"expression":"a_function","context":"hover","frameId":524288},"seq":85} <-- Content-Length: 119

Hide Details

{"body":{},"command":"evaluate","message":"error: No value","request_seq":85,"seq":0,"success":false,"type":"response"} --> Content-Length: 108

Hide Details

{"command":"stackTrace","type":"request","arguments":{"threadId":279076,"startFrame":0,"levels":1},"seq":86} <-- Content-Length: 342

Hide Details

{"body":{"stackFrames":[{"column":10,"id":524288,"line":11,"name":"a_function(int)","source":{"name":"main.cpp","path":"/Users/buildslave/jenkins/workspace/lldb-cmake-sanitized/llvm-project/lldb/test/API/tools/lldb-vscode/evaluate/main.cpp"}}],"totalFrames":3},"command":"stackTrace","request_seq":86,"seq":0,"success":true,"type":"response"} --> Content-Length: 126

Hide Details

{"command":"evaluate","type":"request","arguments":{"expression":"a_function(1)","context":"hover","frameId":524288},"seq":87} <-- Content-Length: 119

Hide Details

{"body":{},"command":"evaluate","message":"error: No value","request_seq":87,"seq":0,"success":false,"type":"response"} --> Content-Length: 108

Hide Details

{"command":"stackTrace","type":"request","arguments":{"threadId":279076,"startFrame":0,"levels":1},"seq":88} <-- Content-Length: 342

Hide Details

{"body":{"stackFrames":[{"column":10,"id":524288,"line":11,"name":"a_function(int)","source":{"name":"main.cpp","path":"/Users/buildslave/jenkins/workspace/lldb-cmake-sanitized/llvm-project/lldb/test/API/tools/lldb-vscode/evaluate/main.cpp"}}],"totalFrames":3},"command":"stackTrace","request_seq":88,"seq":0,"success":true,"type":"response"} --> Content-Length: 120

Hide Details

{"command":"evaluate","type":"request","arguments":{"expression":"var + 1","context":"hover","frameId":524288},"seq":89} <-- Content-Length: 119

Hide Details

{"body":{},"command":"evaluate","message":"error: No value","request_seq":89,"seq":0,"success":false,"type":"response"} --> Content-Length: 108

Hide Details

{"command":"stackTrace","type":"request","arguments":{"threadId":279076,"startFrame":0,"levels":1},"seq":90} <-- Content-Length: 342

Hide Details

{"body":{"stackFrames":[{"column":10,"id":524288,"line":11,"name":"a_function(int)","source":{"name":"main.cpp","path":"/Users/buildslave/jenkins/workspace/lldb-cmake-sanitized/llvm-project/lldb/test/API/tools/lldb-vscode/evaluate/main.cpp"}}],"totalFrames":3},"command":"stackTrace","request_seq":90,"seq":0,"success":true,"type":"response"} --> Content-Length: 121

Hide Details

{"command":"evaluate","type":"request","arguments":{"expression":"foo_func","context":"hover","frameId":524288},"seq":91} <-- Content-Length: 119

Hide Details

{"body":{},"command":"evaluate","message":"error: No value","request_seq":91,"seq":0,"success":false,"type":"response"} --> Content-Length: 108

Hide Details

{"command":"stackTrace","type":"request","arguments":{"threadId":279076,"startFrame":0,"levels":1},"seq":92} <-- Content-Length: 342

Hide Details

{"body":{"stackFrames":[{"column":10,"id":524288,"line":11,"name":"a_function(int)","source":{"name":"main.cpp","path":"/Users/buildslave/jenkins/workspace/lldb-cmake-sanitized/llvm-project/lldb/test/API/tools/lldb-vscode/evaluate/main.cpp"}}],"totalFrames":3},"command":"stackTrace","request_seq":92,"seq":0,"success":true,"type":"response"} --> Content-Length: 120

Hide Details

{"command":"evaluate","type":"request","arguments":{"expression":"foo_var","context":"hover","frameId":524288},"seq":93} <-- Content-Length: 119

Hide Details

{"body":{},"command":"evaluate","message":"error: No value","request_seq":93,"seq":0,"success":false,"type":"response"} --> Content-Length: 80

Hide Details

{"command":"continue","type":"request","arguments":{"threadId":279076},"seq":94} <-- Content-Length: 116

Hide Details

{"body":{"allThreadsContinued":true},"command":"continue","request_seq":94,"seq":0,"success":true,"type":"response"} <-- Content-Length: 198

Hide Details

{"body":{"allThreadsStopped":true,"description":"breakpoint 4.1","preserveFocusHint":false,"reason":"breakpoint","threadCausedFocus":true,"threadId":279076},"event":"stopped","seq":0,"type":"event"} --> Content-Length: 62

Hide Details

{"command":"threads","type":"request","arguments":{},"seq":95} <-- Content-Length: 133

Hide Details

{"body":{"threads":[{"id":279076,"name":"Thread #1"}]},"command":"threads","request_seq":95,"seq":0,"success":true,"type":"response"} --> Content-Length: 108

Hide Details

{"command":"stackTrace","type":"request","arguments":{"threadId":279076,"startFrame":0,"levels":1},"seq":96} <-- Content-Length: 331

Hide Details

{"body":{"stackFrames":[{"column":20,"id":524288,"line":35,"name":"main","source":{"name":"main.cpp","path":"/Users/buildslave/jenkins/workspace/lldb-cmake-sanitized/llvm-project/lldb/test/API/tools/lldb-vscode/evaluate/main.cpp"}}],"totalFrames":2},"command":"stackTrace","request_seq":96,"seq":0,"success":true,"type":"response"} --> Content-Length: 119

Hide Details

{"command":"evaluate","type":"request","arguments":{"expression":"my_vec","context":"hover","frameId":524288},"seq":97} <-- Content-Length: 179

Hide Details

{"body":{"result":" size=2","type":"std::vector<int, std::allocator<int> >","variablesReference":6},"command":"evaluate","request_seq":97,"seq":0,"success":true,"type":"response"} --> Content-Length: 80

Hide Details

{"command":"continue","type":"request","arguments":{"threadId":279076},"seq":98} <-- Content-Length: 116

Hide Details

{"body":{"allThreadsContinued":true},"command":"continue","request_seq":98,"seq":0,"success":true,"type":"response"} <-- Content-Length: 198

Hide Details

{"body":{"allThreadsStopped":true,"description":"breakpoint 5.1","preserveFocusHint":false,"reason":"breakpoint","threadCausedFocus":true,"threadId":279076},"event":"stopped","seq":0,"type":"event"} --> Content-Length: 62

Hide Details

{"command":"threads","type":"request","arguments":{},"seq":99} <-- Content-Length: 133

Hide Details

{"body":{"threads":[{"id":279076,"name":"Thread #1"}]},"command":"threads","request_seq":99,"seq":0,"success":true,"type":"response"} --> Content-Length: 109

Hide Details

{"command":"stackTrace","type":"request","arguments":{"threadId":279076,"startFrame":0,"levels":1},"seq":100} <-- Content-Length: 332

Hide Details

{"body":{"stackFrames":[{"column":10,"id":524288,"line":40,"name":"main","source":{"name":"main.cpp","path":"/Users/buildslave/jenkins/workspace/lldb-cmake-sanitized/llvm-project/lldb/test/API/tools/lldb-vscode/evaluate/main.cpp"}}],"totalFrames":2},"command":"stackTrace","request_seq":100,"seq":0,"success":true,"type":"response"} --> Content-Length: 120

Hide Details

{"command":"evaluate","type":"request","arguments":{"expression":"my_vec","context":"hover","frameId":524288},"seq":101} <-- Content-Length: 180

Hide Details

{"body":{"result":" size=3","type":"std::vector<int, std::allocator<int> >","variablesReference":7},"command":"evaluate","request_seq":101,"seq":0,"success":true,"type":"response"} --> Content-Length: 109

Hide Details

{"command":"stackTrace","type":"request","arguments":{"threadId":279076,"startFrame":0,"levels":1},"seq":102} <-- Content-Length: 332

Hide Details

{"body":{"stackFrames":[{"column":10,"id":524288,"line":40,"name":"main","source":{"name":"main.cpp","path":"/Users/buildslave/jenkins/workspace/lldb-cmake-sanitized/llvm-project/lldb/test/API/tools/lldb-vscode/evaluate/main.cpp"}}],"totalFrames":2},"command":"stackTrace","request_seq":102,"seq":0,"success":true,"type":"response"} --> Content-Length: 120

Hide Details

{"command":"evaluate","type":"request","arguments":{"expression":"my_map","context":"hover","frameId":524288},"seq":103} <-- Content-Length: 221

Hide Details

{"body":{"result":" size=2","type":"std::map<int, int, std::less<int>, std::allocator<std::pair<const int, int> > >","variablesReference":8},"command":"evaluate","request_seq":103,"seq":0,"success":true,"type":"response"} --> Content-Length: 81

Hide Details

{"command":"continue","type":"request","arguments":{"threadId":279076},"seq":104} <-- Content-Length: 117

Hide Details

{"body":{"allThreadsContinued":true},"command":"continue","request_seq":104,"seq":0,"success":true,"type":"response"} <-- Content-Length: 198

Hide Details

{"body":{"allThreadsStopped":true,"description":"breakpoint 6.1","preserveFocusHint":false,"reason":"breakpoint","threadCausedFocus":true,"threadId":279076},"event":"stopped","seq":0,"type":"event"} --> Content-Length: 63

Hide Details

{"command":"threads","type":"request","arguments":{},"seq":105} <-- Content-Length: 134

Hide Details

{"body":{"threads":[{"id":279076,"name":"Thread #1"}]},"command":"threads","request_seq":105,"seq":0,"success":true,"type":"response"} --> Content-Length: 109

Hide Details

{"command":"stackTrace","type":"request","arguments":{"threadId":279076,"startFrame":0,"levels":1},"seq":106} <-- Content-Length: 332

Hide Details

{"body":{"stackFrames":[{"column":25,"id":524288,"line":44,"name":"main","source":{"name":"main.cpp","path":"/Users/buildslave/jenkins/workspace/lldb-cmake-sanitized/llvm-project/lldb/test/API/tools/lldb-vscode/evaluate/main.cpp"}}],"totalFrames":2},"command":"stackTrace","request_seq":106,"seq":0,"success":true,"type":"response"} --> Content-Length: 120

Hide Details

{"command":"evaluate","type":"request","arguments":{"expression":"my_map","context":"hover","frameId":524288},"seq":107} <-- Content-Length: 221

Hide Details

{"body":{"result":" size=3","type":"std::map<int, int, std::less<int>, std::allocator<std::pair<const int, int> > >","variablesReference":9},"command":"evaluate","request_seq":107,"seq":0,"success":true,"type":"response"} --> Content-Length: 109

Hide Details

{"command":"stackTrace","type":"request","arguments":{"threadId":279076,"startFrame":0,"levels":1},"seq":108} <-- Content-Length: 332

Hide Details

{"body":{"stackFrames":[{"column":25,"id":524288,"line":44,"name":"main","source":{"name":"main.cpp","path":"/Users/buildslave/jenkins/workspace/lldb-cmake-sanitized/llvm-project/lldb/test/API/tools/lldb-vscode/evaluate/main.cpp"}}],"totalFrames":2},"command":"stackTrace","request_seq":108,"seq":0,"success":true,"type":"response"} --> Content-Length: 125

Hide Details

{"command":"evaluate","type":"request","arguments":{"expression":"my_bool_vec","context":"hover","frameId":524288},"seq":109} <-- Content-Length: 183

Hide Details

{"body":{"result":" size=1","type":"std::vector<bool, std::allocator<bool> >","variablesReference":10},"command":"evaluate","request_seq":109,"seq":0,"success":true,"type":"response"} --> Content-Length: 81

Hide Details

{"command":"continue","type":"request","arguments":{"threadId":279076},"seq":110} <-- Content-Length: 117

Hide Details

{"body":{"allThreadsContinued":true},"command":"continue","request_seq":110,"seq":0,"success":true,"type":"response"} <-- Content-Length: 198

Hide Details

{"body":{"allThreadsStopped":true,"description":"breakpoint 7.1","preserveFocusHint":false,"reason":"breakpoint","threadCausedFocus":true,"threadId":279076},"event":"stopped","seq":0,"type":"event"} --> Content-Length: 63

Hide Details

{"command":"threads","type":"request","arguments":{},"seq":111} <-- Content-Length: 134

Hide Details

{"body":{"threads":[{"id":279076,"name":"Thread #1"}]},"command":"threads","request_seq":111,"seq":0,"success":true,"type":"response"} --> Content-Length: 109

Hide Details

{"command":"stackTrace","type":"request","arguments":{"threadId":279076,"startFrame":0,"levels":1},"seq":112} <-- Content-Length: 332

Hide Details

{"body":{"stackFrames":[{"column":25,"id":524288,"line":45,"name":"main","source":{"name":"main.cpp","path":"/Users/buildslave/jenkins/workspace/lldb-cmake-sanitized/llvm-project/lldb/test/API/tools/lldb-vscode/evaluate/main.cpp"}}],"totalFrames":2},"command":"stackTrace","request_seq":112,"seq":0,"success":true,"type":"response"} --> Content-Length: 125

Hide Details

{"command":"evaluate","type":"request","arguments":{"expression":"my_bool_vec","context":"hover","frameId":524288},"seq":113} <-- Content-Length: 183

Hide Details

{"body":{"result":" size=2","type":"std::vector<bool, std::allocator<bool> >","variablesReference":11},"command":"evaluate","request_seq":113,"seq":0,"success":true,"type":"response"} --> Content-Length: 90

Hide Details

{"command":"disconnect","type":"request","arguments":{"terminateDebuggee":true},"seq":114} <-- Content-Length: 45

Hide Details

{"event":"terminated","seq":0,"type":"event"} <-- Content-Length: 63

Hide Details

{"body":{"exitCode":9},"event":"exited","seq":0,"type":"event"} <-- Content-Length: 83

Hide Details

{"command":"disconnect","request_seq":114,"seq":0,"success":true,"type":"response"}

Hide Details

========= END ========= ========= DEBUG ADAPTER PROTOCOL LOGS ========= --> Content-Length: 284

Hide Details

{"command":"initialize","type":"request","arguments":{"adapterID":"lldb-native","clientID":"vscode","columnsStartAt1":true,"linesStartAt1":true,"locale":"en-us","pathFormat":"path","supportsRunInTerminalRequest":true,"supportsVariablePaging":true,"supportsVariableType":true},"seq":1} <-- Content-Length: 1222

Hide Details

{"body":{"exceptionBreakpointFilters":[{"default":false,"filter":"cpp_catch","label":"C++ Catch"},{"default":false,"filter":"cpp_throw","label":"C++ Throw"},{"default":false,"filter":"objc_catch","label":"Objective C Catch"},{"default":false,"filter":"objc_throw","label":"Objective C Throw"},{"default":false,"filter":"swift_catch","label":"Swift Catch"},{"default":false,"filter":"swift_throw","label":"Swift Throw"}],"supportTerminateDebuggee":true,"supportsCompletionsRequest":false,"supportsConditionalBreakpoints":true,"supportsConfigurationDoneRequest":true,"supportsDelayedStackTraceLoading":true,"supportsEvaluateForHovers":true,"supportsExceptionInfoRequest":true,"supportsExceptionOptions":true,"supportsFunctionBreakpoints":true,"supportsGotoTargetsRequest":false,"supportsHitConditionalBreakpoints":true,"supportsLoadedSourcesRequest":false,"supportsModulesRequest":false,"supportsProgressReporting":true,"supportsRestartFrame":false,"supportsRestartRequest":false,"supportsRunInTerminalRequest":true,"supportsSetVariable":true,"supportsStepBack":false,"supportsStepInTargetsRequest":false,"supportsValueFormattingOptions":true},"command":"initialize","request_seq":1,"seq":0,"success":true,"type":"response"} --> Content-Length: 1040

Hide Details

{"command":"launch","type":"request","arguments":{"program":"/Users/buildslave/jenkins/workspace/lldb-cmake-sanitized/lldb-build/lldb-test-build.noindex/tools/lldb-vscode/evaluate/TestVSCode_evaluate.test_repl_evaluate_expressions/a.out","disableASLR":true,"initCommands":["settings clear -all","settings set symbols.enable-external-lookup false","settings set target.inherit-tcc true","settings set target.detach-on-error false","settings set target.auto-apply-fixits false","settings set plugin.process.gdb-remote.packet-timeout 60","settings set symbols.clang-modules-cache-path \"/Users/buildslave/jenkins/workspace/lldb-cmake-sanitized/lldb-build/lldb-test-build.noindex/module-cache-lldb/lldb-api\"","settings set use-color false","setting set target.prefer-dynamic-value no-dynamic-values","settings set target.env-vars ASAN_OPTIONS=detect_stack_use_after_return=1 DYLD_INSERT_LIBRARIES=/Users/buildslave/jenkins/workspace/lldb-cmake-sanitized/host-compiler/lib/clang/13.0.99/lib/darwin/libclang_rt.asan_osx_dynamic.dylib"]},"seq":2} <-- Content-Length: 923

Hide Details

{"body":{"category":"console","output":"Running initCommands:\n(lldb) settings clear -all\n(lldb) settings set symbols.enable-external-lookup false\n(lldb) settings set target.inherit-tcc true\n(lldb) settings set target.detach-on-error false\n(lldb) settings set target.auto-apply-fixits false\n(lldb) settings set plugin.process.gdb-remote.packet-timeout 60\n(lldb) settings set symbols.clang-modules-cache-path \"/Users/buildslave/jenkins/workspace/lldb-cmake-sanitized/lldb-build/lldb-test-build.noindex/module-cache-lldb/lldb-api\"\n(lldb) settings set use-color false\n(lldb) setting set target.prefer-dynamic-value no-dynamic-values\n(lldb) settings set target.env-vars ASAN_OPTIONS=detect_stack_use_after_return=1 DYLD_INSERT_LIBRARIES=/Users/buildslave/jenkins/workspace/lldb-cmake-sanitized/host-compiler/lib/clang/13.0.99/lib/darwin/libclang_rt.asan_osx_dynamic.dylib\n"},"event":"output","seq":0,"type":"event"} <-- Content-Length: 77

Hide Details

{"command":"launch","request_seq":2,"seq":0,"success":true,"type":"response"} <-- Content-Length: 305

Hide Details

{"body":{"isLocalProcess":true,"name":"/Users/buildslave/jenkins/workspace/lldb-cmake-sanitized/lldb-build/lldb-test-build.noindex/tools/lldb-vscode/evaluate/TestVSCode_evaluate.test_repl_evaluate_expressions/a.out","startMethod":"launch","systemProcessId":65057},"event":"process","seq":0,"type":"event"} <-- Content-Length: 46

Hide Details

{"event":"initialized","seq":0,"type":"event"} --> Content-Length: 276

Hide Details

{"command":"setBreakpoints","type":"request","arguments":{"source":{"name":"main.cpp","path":"main.cpp"},"sourceModified":false,"lines":"[23, 27, 11, 35, 40, 44, 45]","breakpoints":[{"line":23},{"line":27},{"line":11},{"line":35},{"line":40},{"line":44},{"line":45}]},"seq":3} <-- Content-Length: 684

Hide Details

{"body":{"breakpoints":[{"id":1,"line":23,"source":{"name":"main.cpp","path":"main.cpp"},"verified":true},{"id":2,"line":27,"source":{"name":"main.cpp","path":"main.cpp"},"verified":true},{"id":3,"line":11,"source":{"name":"main.cpp","path":"main.cpp"},"verified":true},{"id":4,"line":35,"source":{"name":"main.cpp","path":"main.cpp"},"verified":true},{"id":5,"line":40,"source":{"name":"main.cpp","path":"main.cpp"},"verified":true},{"id":6,"line":44,"source":{"name":"main.cpp","path":"main.cpp"},"verified":true},{"id":7,"line":45,"source":{"name":"main.cpp","path":"main.cpp"},"verified":true}]},"command":"setBreakpoints","request_seq":3,"seq":0,"success":true,"type":"response"} --> Content-Length: 71

Hide Details

{"command":"configurationDone","type":"request","arguments":{},"seq":4} <-- Content-Length: 88

Hide Details

{"command":"configurationDone","request_seq":4,"seq":0,"success":true,"type":"response"} <-- Content-Length: 198

Hide Details

{"body":{"allThreadsStopped":true,"description":"breakpoint 1.1","preserveFocusHint":false,"reason":"breakpoint","threadCausedFocus":true,"threadId":280066},"event":"stopped","seq":0,"type":"event"} --> Content-Length: 61

Hide Details

{"command":"threads","type":"request","arguments":{},"seq":5} <-- Content-Length: 132

Hide Details

{"body":{"threads":[{"id":280066,"name":"Thread #1"}]},"command":"threads","request_seq":5,"seq":0,"success":true,"type":"response"} --> Content-Length: 107

Hide Details

{"command":"stackTrace","type":"request","arguments":{"threadId":280066,"startFrame":0,"levels":1},"seq":6} <-- Content-Length: 330

Hide Details

{"body":{"stackFrames":[{"column":14,"id":524288,"line":23,"name":"main","source":{"name":"main.cpp","path":"/Users/buildslave/jenkins/workspace/lldb-cmake-sanitized/llvm-project/lldb/test/API/tools/lldb-vscode/evaluate/main.cpp"}}],"totalFrames":3},"command":"stackTrace","request_seq":6,"seq":0,"success":true,"type":"response"} --> Content-Length: 115

Hide Details

{"command":"evaluate","type":"request","arguments":{"expression":"var1","context":"repl","frameId":524288},"seq":7} <-- Content-Length: 138

Hide Details

{"body":{"result":"20","type":"int","variablesReference":0},"command":"evaluate","request_seq":7,"seq":0,"success":true,"type":"response"} --> Content-Length: 107

Hide Details

{"command":"stackTrace","type":"request","arguments":{"threadId":280066,"startFrame":0,"levels":1},"seq":8} <-- Content-Length: 330

Hide Details

{"body":{"stackFrames":[{"column":14,"id":524288,"line":23,"name":"main","source":{"name":"main.cpp","path":"/Users/buildslave/jenkins/workspace/lldb-cmake-sanitized/llvm-project/lldb/test/API/tools/lldb-vscode/evaluate/main.cpp"}}],"totalFrames":3},"command":"stackTrace","request_seq":8,"seq":0,"success":true,"type":"response"} --> Content-Length: 115

Hide Details

{"command":"evaluate","type":"request","arguments":{"expression":"var2","context":"repl","frameId":524288},"seq":9} <-- Content-Length: 138

Hide Details

{"body":{"result":"21","type":"int","variablesReference":0},"command":"evaluate","request_seq":9,"seq":0,"success":true,"type":"response"} --> Content-Length: 108

Hide Details

{"command":"stackTrace","type":"request","arguments":{"threadId":280066,"startFrame":0,"levels":1},"seq":10} <-- Content-Length: 331

Hide Details

{"body":{"stackFrames":[{"column":14,"id":524288,"line":23,"name":"main","source":{"name":"main.cpp","path":"/Users/buildslave/jenkins/workspace/lldb-cmake-sanitized/llvm-project/lldb/test/API/tools/lldb-vscode/evaluate/main.cpp"}}],"totalFrames":3},"command":"stackTrace","request_seq":10,"seq":0,"success":true,"type":"response"} --> Content-Length: 122

Hide Details

{"command":"evaluate","type":"request","arguments":{"expression":"static_int","context":"repl","frameId":524288},"seq":11} <-- Content-Length: 139

Hide Details

{"body":{"result":"42","type":"int","variablesReference":0},"command":"evaluate","request_seq":11,"seq":0,"success":true,"type":"response"} --> Content-Length: 108

Hide Details

{"command":"stackTrace","type":"request","arguments":{"threadId":280066,"startFrame":0,"levels":1},"seq":12} <-- Content-Length: 331

Hide Details

{"body":{"stackFrames":[{"column":14,"id":524288,"line":23,"name":"main","source":{"name":"main.cpp","path":"/Users/buildslave/jenkins/workspace/lldb-cmake-sanitized/llvm-project/lldb/test/API/tools/lldb-vscode/evaluate/main.cpp"}}],"totalFrames":3},"command":"stackTrace","request_seq":12,"seq":0,"success":true,"type":"response"} --> Content-Length: 126

Hide Details

{"command":"evaluate","type":"request","arguments":{"expression":"non_static_int","context":"repl","frameId":524288},"seq":13} <-- Content-Length: 139

Hide Details

{"body":{"result":"43","type":"int","variablesReference":0},"command":"evaluate","request_seq":13,"seq":0,"success":true,"type":"response"} --> Content-Length: 108

Hide Details

{"command":"stackTrace","type":"request","arguments":{"threadId":280066,"startFrame":0,"levels":1},"seq":14} <-- Content-Length: 331

Hide Details

{"body":{"stackFrames":[{"column":14,"id":524288,"line":23,"name":"main","source":{"name":"main.cpp","path":"/Users/buildslave/jenkins/workspace/lldb-cmake-sanitized/llvm-project/lldb/test/API/tools/lldb-vscode/evaluate/main.cpp"}}],"totalFrames":3},"command":"stackTrace","request_seq":14,"seq":0,"success":true,"type":"response"} --> Content-Length: 119

Hide Details

{"command":"evaluate","type":"request","arguments":{"expression":"struct1","context":"repl","frameId":524288},"seq":15} <-- Content-Length: 169

Hide Details

{"body":{"result":"my_struct @ 0x7ffeefbff7c8","type":"my_struct","variablesReference":4},"command":"evaluate","request_seq":15,"seq":0,"success":true,"type":"response"} --> Content-Length: 108

Hide Details

{"command":"stackTrace","type":"request","arguments":{"threadId":280066,"startFrame":0,"levels":1},"seq":16} <-- Content-Length: 331

Hide Details

{"body":{"stackFrames":[{"column":14,"id":524288,"line":23,"name":"main","source":{"name":"main.cpp","path":"/Users/buildslave/jenkins/workspace/lldb-cmake-sanitized/llvm-project/lldb/test/API/tools/lldb-vscode/evaluate/main.cpp"}}],"totalFrames":3},"command":"stackTrace","request_seq":16,"seq":0,"success":true,"type":"response"} --> Content-Length: 123

Hide Details

{"command":"evaluate","type":"request","arguments":{"expression":"struct1.foo","context":"repl","frameId":524288},"seq":17} <-- Content-Length: 139

Hide Details

{"body":{"result":"15","type":"int","variablesReference":0},"command":"evaluate","request_seq":17,"seq":0,"success":true,"type":"response"} --> Content-Length: 108

Hide Details

{"command":"stackTrace","type":"request","arguments":{"threadId":280066,"startFrame":0,"levels":1},"seq":18} <-- Content-Length: 331

Hide Details

{"body":{"stackFrames":[{"column":14,"id":524288,"line":23,"name":"main","source":{"name":"main.cpp","path":"/Users/buildslave/jenkins/workspace/lldb-cmake-sanitized/llvm-project/lldb/test/API/tools/lldb-vscode/evaluate/main.cpp"}}],"totalFrames":3},"command":"stackTrace","request_seq":18,"seq":0,"success":true,"type":"response"} --> Content-Length: 124

Hide Details

{"command":"evaluate","type":"request","arguments":{"expression":"struct2->foo","context":"repl","frameId":524288},"seq":19} <-- Content-Length: 139

Hide Details

{"body":{"result":"16","type":"int","variablesReference":0},"command":"evaluate","request_seq":19,"seq":0,"success":true,"type":"response"} --> Content-Length: 108

Hide Details

{"command":"stackTrace","type":"request","arguments":{"threadId":280066,"startFrame":0,"levels":1},"seq":20} <-- Content-Length: 331

Hide Details

{"body":{"stackFrames":[{"column":14,"id":524288,"line":23,"name":"main","source":{"name":"main.cpp","path":"/Users/buildslave/jenkins/workspace/lldb-cmake-sanitized/llvm-project/lldb/test/API/tools/lldb-vscode/evaluate/main.cpp"}}],"totalFrames":3},"command":"stackTrace","request_seq":20,"seq":0,"success":true,"type":"response"} --> Content-Length: 115

Hide Details

{"command":"evaluate","type":"request","arguments":{"expression":"var","context":"repl","frameId":524288},"seq":21} <-- Content-Length: 209

Hide Details

{"body":{},"command":"evaluate","message":"expression failed to parse:\nerror: <user expression 0>:1:1: use of undeclared identifier 'var'\nvar\n^\n","request_seq":21,"seq":0,"success":false,"type":"response"} --> Content-Length: 108

Hide Details

{"command":"stackTrace","type":"request","arguments":{"threadId":280066,"startFrame":0,"levels":1},"seq":22} <-- Content-Length: 331

Hide Details

{"body":{"stackFrames":[{"column":14,"id":524288,"line":23,"name":"main","source":{"name":"main.cpp","path":"/Users/buildslave/jenkins/workspace/lldb-cmake-sanitized/llvm-project/lldb/test/API/tools/lldb-vscode/evaluate/main.cpp"}}],"totalFrames":3},"command":"stackTrace","request_seq":22,"seq":0,"success":true,"type":"response"} --> Content-Length: 121

Hide Details

{"command":"evaluate","type":"request","arguments":{"expression":"my_struct","context":"repl","frameId":524288},"seq":23} <-- Content-Length: 311

Hide Details

{"body":{"category":"console","output":"/Users/buildslave/jenkins/workspace/lldb-cmake-sanitized/llvm-project/lldb/tools/lldb-vscode/ProgressEvent.cpp:89:64: runtime error: load of value 808464432, which is not a valid value for type 'lldb_vscode::ProgressEventType'\n"},"event":"output","seq":0,"type":"event"} <-- Content-Length: 261

Hide Details

{"body":{"category":"console","output":"SUMMARY: UndefinedBehaviorSanitizer: undefined-behavior /Users/buildslave/jenkins/workspace/lldb-cmake-sanitized/llvm-project/lldb/tools/lldb-vscode/ProgressEvent.cpp:89:64 in \n"},"event":"output","seq":0,"type":"event"} <-- Content-Length: 170

Hide Details

{"body":{"category":"console","output":"PLEASE submit a bug report to https://bugs.llvm.org/ and include the crash backtrace.\n"},"event":"output","seq":0,"type":"event"} <-- Content-Length: 117

Hide Details

{"body":{},"command":"evaluate","message":"unknown error","request_seq":23,"seq":0,"success":false,"type":"response"} --> Content-Length: 108

Hide Details

{"command":"stackTrace","type":"request","arguments":{"threadId":280066,"startFrame":0,"levels":1},"seq":24} <-- Content-Length: 331

Hide Details

{"body":{"stackFrames":[{"column":14,"id":524288,"line":23,"name":"main","source":{"name":"main.cpp","path":"/Users/buildslave/jenkins/workspace/lldb-cmake-sanitized/llvm-project/lldb/test/API/tools/lldb-vscode/evaluate/main.cpp"}}],"totalFrames":3},"command":"stackTrace","request_seq":24,"seq":0,"success":true,"type":"response"} --> Content-Length: 115

Hide Details

{"command":"evaluate","type":"request","arguments":{"expression":"int","context":"repl","frameId":524288},"seq":25} <-- Content-Length: 117

Hide Details

{"body":{},"command":"evaluate","message":"unknown error","request_seq":25,"seq":0,"success":false,"type":"response"}

Hide Details

========= END ========= ========= DEBUG ADAPTER PROTOCOL LOGS ========= --> Content-Length: 284

Hide Details

{"command":"initialize","type":"request","arguments":{"adapterID":"lldb-native","clientID":"vscode","columnsStartAt1":true,"linesStartAt1":true,"locale":"en-us","pathFormat":"path","supportsRunInTerminalRequest":true,"supportsVariablePaging":true,"supportsVariableType":true},"seq":1} <-- Content-Length: 1222

Hide Details

{"body":{"exceptionBreakpointFilters":[{"default":false,"filter":"cpp_catch","label":"C++ Catch"},{"default":false,"filter":"cpp_throw","label":"C++ Throw"},{"default":false,"filter":"objc_catch","label":"Objective C Catch"},{"default":false,"filter":"objc_throw","label":"Objective C Throw"},{"default":false,"filter":"swift_catch","label":"Swift Catch"},{"default":false,"filter":"swift_throw","label":"Swift Throw"}],"supportTerminateDebuggee":true,"supportsCompletionsRequest":false,"supportsConditionalBreakpoints":true,"supportsConfigurationDoneRequest":true,"supportsDelayedStackTraceLoading":true,"supportsEvaluateForHovers":true,"supportsExceptionInfoRequest":true,"supportsExceptionOptions":true,"supportsFunctionBreakpoints":true,"supportsGotoTargetsRequest":false,"supportsHitConditionalBreakpoints":true,"supportsLoadedSourcesRequest":false,"supportsModulesRequest":false,"supportsProgressReporting":true,"supportsRestartFrame":false,"supportsRestartRequest":false,"supportsRunInTerminalRequest":true,"supportsSetVariable":true,"supportsStepBack":false,"supportsStepInTargetsRequest":false,"supportsValueFormattingOptions":true},"command":"initialize","request_seq":1,"seq":0,"success":true,"type":"response"} --> Content-Length: 1041

Hide Details

{"command":"launch","type":"request","arguments":{"program":"/Users/buildslave/jenkins/workspace/lldb-cmake-sanitized/lldb-build/lldb-test-build.noindex/tools/lldb-vscode/evaluate/TestVSCode_evaluate.test_watch_evaluate_expressions/a.out","disableASLR":true,"initCommands":["settings clear -all","settings set symbols.enable-external-lookup false","settings set target.inherit-tcc true","settings set target.detach-on-error false","settings set target.auto-apply-fixits false","settings set plugin.process.gdb-remote.packet-timeout 60","settings set symbols.clang-modules-cache-path \"/Users/buildslave/jenkins/workspace/lldb-cmake-sanitized/lldb-build/lldb-test-build.noindex/module-cache-lldb/lldb-api\"","settings set use-color false","setting set target.prefer-dynamic-value no-dynamic-values","settings set target.env-vars ASAN_OPTIONS=detect_stack_use_after_return=1 DYLD_INSERT_LIBRARIES=/Users/buildslave/jenkins/workspace/lldb-cmake-sanitized/host-compiler/lib/clang/13.0.99/lib/darwin/libclang_rt.asan_osx_dynamic.dylib"]},"seq":2} <-- Content-Length: 923

Hide Details

{"body":{"category":"console","output":"Running initCommands:\n(lldb) settings clear -all\n(lldb) settings set symbols.enable-external-lookup false\n(lldb) settings set target.inherit-tcc true\n(lldb) settings set target.detach-on-error false\n(lldb) settings set target.auto-apply-fixits false\n(lldb) settings set plugin.process.gdb-remote.packet-timeout 60\n(lldb) settings set symbols.clang-modules-cache-path \"/Users/buildslave/jenkins/workspace/lldb-cmake-sanitized/lldb-build/lldb-test-build.noindex/module-cache-lldb/lldb-api\"\n(lldb) settings set use-color false\n(lldb) setting set target.prefer-dynamic-value no-dynamic-values\n(lldb) settings set target.env-vars ASAN_OPTIONS=detect_stack_use_after_return=1 DYLD_INSERT_LIBRARIES=/Users/buildslave/jenkins/workspace/lldb-cmake-sanitized/host-compiler/lib/clang/13.0.99/lib/darwin/libclang_rt.asan_osx_dynamic.dylib\n"},"event":"output","seq":0,"type":"event"} <-- Content-Length: 77

Hide Details

{"command":"launch","request_seq":2,"seq":0,"success":true,"type":"response"} <-- Content-Length: 306

Hide Details

{"body":{"isLocalProcess":true,"name":"/Users/buildslave/jenkins/workspace/lldb-cmake-sanitized/lldb-build/lldb-test-build.noindex/tools/lldb-vscode/evaluate/TestVSCode_evaluate.test_watch_evaluate_expressions/a.out","startMethod":"launch","systemProcessId":65121},"event":"process","seq":0,"type":"event"} <-- Content-Length: 46

Hide Details

{"event":"initialized","seq":0,"type":"event"} --> Content-Length: 276

Hide Details

{"command":"setBreakpoints","type":"request","arguments":{"source":{"name":"main.cpp","path":"main.cpp"},"sourceModified":false,"lines":"[23, 27, 11, 35, 40, 44, 45]","breakpoints":[{"line":23},{"line":27},{"line":11},{"line":35},{"line":40},{"line":44},{"line":45}]},"seq":3} <-- Content-Length: 684

Hide Details

{"body":{"breakpoints":[{"id":1,"line":23,"source":{"name":"main.cpp","path":"main.cpp"},"verified":true},{"id":2,"line":27,"source":{"name":"main.cpp","path":"main.cpp"},"verified":true},{"id":3,"line":11,"source":{"name":"main.cpp","path":"main.cpp"},"verified":true},{"id":4,"line":35,"source":{"name":"main.cpp","path":"main.cpp"},"verified":true},{"id":5,"line":40,"source":{"name":"main.cpp","path":"main.cpp"},"verified":true},{"id":6,"line":44,"source":{"name":"main.cpp","path":"main.cpp"},"verified":true},{"id":7,"line":45,"source":{"name":"main.cpp","path":"main.cpp"},"verified":true}]},"command":"setBreakpoints","request_seq":3,"seq":0,"success":true,"type":"response"} --> Content-Length: 71

Hide Details

{"command":"configurationDone","type":"request","arguments":{},"seq":4} <-- Content-Length: 88

Hide Details

{"command":"configurationDone","request_seq":4,"seq":0,"success":true,"type":"response"} <-- Content-Length: 198

Hide Details

{"body":{"allThreadsStopped":true,"description":"breakpoint 1.1","preserveFocusHint":false,"reason":"breakpoint","threadCausedFocus":true,"threadId":280622},"event":"stopped","seq":0,"type":"event"} --> Content-Length: 61

Hide Details

{"command":"threads","type":"request","arguments":{},"seq":5} <-- Content-Length: 132

Hide Details

{"body":{"threads":[{"id":280622,"name":"Thread #1"}]},"command":"threads","request_seq":5,"seq":0,"success":true,"type":"response"} --> Content-Length: 107

Hide Details

{"command":"stackTrace","type":"request","arguments":{"threadId":280622,"startFrame":0,"levels":1},"seq":6} <-- Content-Length: 330

Hide Details

{"body":{"stackFrames":[{"column":14,"id":524288,"line":23,"name":"main","source":{"name":"main.cpp","path":"/Users/buildslave/jenkins/workspace/lldb-cmake-sanitized/llvm-project/lldb/test/API/tools/lldb-vscode/evaluate/main.cpp"}}],"totalFrames":2},"command":"stackTrace","request_seq":6,"seq":0,"success":true,"type":"response"} --> Content-Length: 116

Hide Details

{"command":"evaluate","type":"request","arguments":{"expression":"var1","context":"watch","frameId":524288},"seq":7} <-- Content-Length: 138

Hide Details

{"body":{"result":"20","type":"int","variablesReference":0},"command":"evaluate","request_seq":7,"seq":0,"success":true,"type":"response"} --> Content-Length: 107

Hide Details

{"command":"stackTrace","type":"request","arguments":{"threadId":280622,"startFrame":0,"levels":1},"seq":8} <-- Content-Length: 330

Hide Details

{"body":{"stackFrames":[{"column":14,"id":524288,"line":23,"name":"main","source":{"name":"main.cpp","path":"/Users/buildslave/jenkins/workspace/lldb-cmake-sanitized/llvm-project/lldb/test/API/tools/lldb-vscode/evaluate/main.cpp"}}],"totalFrames":2},"command":"stackTrace","request_seq":8,"seq":0,"success":true,"type":"response"} --> Content-Length: 116

Hide Details

{"command":"evaluate","type":"request","arguments":{"expression":"var2","context":"watch","frameId":524288},"seq":9} <-- Content-Length: 138

Hide Details

{"body":{"result":"21","type":"int","variablesReference":0},"command":"evaluate","request_seq":9,"seq":0,"success":true,"type":"response"} --> Content-Length: 108

Hide Details

{"command":"stackTrace","type":"request","arguments":{"threadId":280622,"startFrame":0,"levels":1},"seq":10} <-- Content-Length: 331

Hide Details

{"body":{"stackFrames":[{"column":14,"id":524288,"line":23,"name":"main","source":{"name":"main.cpp","path":"/Users/buildslave/jenkins/workspace/lldb-cmake-sanitized/llvm-project/lldb/test/API/tools/lldb-vscode/evaluate/main.cpp"}}],"totalFrames":2},"command":"stackTrace","request_seq":10,"seq":0,"success":true,"type":"response"} --> Content-Length: 123

Hide Details

{"command":"evaluate","type":"request","arguments":{"expression":"static_int","context":"watch","frameId":524288},"seq":11} <-- Content-Length: 139

Hide Details

{"body":{"result":"42","type":"int","variablesReference":0},"command":"evaluate","request_seq":11,"seq":0,"success":true,"type":"response"} --> Content-Length: 108

Hide Details

{"command":"stackTrace","type":"request","arguments":{"threadId":280622,"startFrame":0,"levels":1},"seq":12} <-- Content-Length: 331

Hide Details

{"body":{"stackFrames":[{"column":14,"id":524288,"line":23,"name":"main","source":{"name":"main.cpp","path":"/Users/buildslave/jenkins/workspace/lldb-cmake-sanitized/llvm-project/lldb/test/API/tools/lldb-vscode/evaluate/main.cpp"}}],"totalFrames":2},"command":"stackTrace","request_seq":12,"seq":0,"success":true,"type":"response"} --> Content-Length: 127

Hide Details

{"command":"evaluate","type":"request","arguments":{"expression":"non_static_int","context":"watch","frameId":524288},"seq":13} <-- Content-Length: 139

Hide Details

{"body":{"result":"43","type":"int","variablesReference":0},"command":"evaluate","request_seq":13,"seq":0,"success":true,"type":"response"} --> Content-Length: 108

Hide Details

{"command":"stackTrace","type":"request","arguments":{"threadId":280622,"startFrame":0,"levels":1},"seq":14} <-- Content-Length: 331

Hide Details

{"body":{"stackFrames":[{"column":14,"id":524288,"line":23,"name":"main","source":{"name":"main.cpp","path":"/Users/buildslave/jenkins/workspace/lldb-cmake-sanitized/llvm-project/lldb/test/API/tools/lldb-vscode/evaluate/main.cpp"}}],"totalFrames":2},"command":"stackTrace","request_seq":14,"seq":0,"success":true,"type":"response"} --> Content-Length: 120

Hide Details

{"command":"evaluate","type":"request","arguments":{"expression":"struct1","context":"watch","frameId":524288},"seq":15} <-- Content-Length: 169

Hide Details

{"body":{"result":"my_struct @ 0x7ffeefbff7c8","type":"my_struct","variablesReference":4},"command":"evaluate","request_seq":15,"seq":0,"success":true,"type":"response"} --> Content-Length: 108

Hide Details

{"command":"stackTrace","type":"request","arguments":{"threadId":280622,"startFrame":0,"levels":1},"seq":16} <-- Content-Length: 331

Hide Details

{"body":{"stackFrames":[{"column":14,"id":524288,"line":23,"name":"main","source":{"name":"main.cpp","path":"/Users/buildslave/jenkins/workspace/lldb-cmake-sanitized/llvm-project/lldb/test/API/tools/lldb-vscode/evaluate/main.cpp"}}],"totalFrames":2},"command":"stackTrace","request_seq":16,"seq":0,"success":true,"type":"response"} --> Content-Length: 124

Hide Details

{"command":"evaluate","type":"request","arguments":{"expression":"struct1.foo","context":"watch","frameId":524288},"seq":17} <-- Content-Length: 139

Hide Details

{"body":{"result":"15","type":"int","variablesReference":0},"command":"evaluate","request_seq":17,"seq":0,"success":true,"type":"response"} --> Content-Length: 108

Hide Details

{"command":"stackTrace","type":"request","arguments":{"threadId":280622,"startFrame":0,"levels":1},"seq":18} <-- Content-Length: 331

Hide Details

{"body":{"stackFrames":[{"column":14,"id":524288,"line":23,"name":"main","source":{"name":"main.cpp","path":"/Users/buildslave/jenkins/workspace/lldb-cmake-sanitized/llvm-project/lldb/test/API/tools/lldb-vscode/evaluate/main.cpp"}}],"totalFrames":2},"command":"stackTrace","request_seq":18,"seq":0,"success":true,"type":"response"} --> Content-Length: 125

Hide Details

{"command":"evaluate","type":"request","arguments":{"expression":"struct2->foo","context":"watch","frameId":524288},"seq":19} <-- Content-Length: 139

Hide Details

{"body":{"result":"16","type":"int","variablesReference":0},"command":"evaluate","request_seq":19,"seq":0,"success":true,"type":"response"} --> Content-Length: 108

Hide Details

{"command":"stackTrace","type":"request","arguments":{"threadId":280622,"startFrame":0,"levels":1},"seq":20} <-- Content-Length: 331

Hide Details

{"body":{"stackFrames":[{"column":14,"id":524288,"line":23,"name":"main","source":{"name":"main.cpp","path":"/Users/buildslave/jenkins/workspace/lldb-cmake-sanitized/llvm-project/lldb/test/API/tools/lldb-vscode/evaluate/main.cpp"}}],"totalFrames":2},"command":"stackTrace","request_seq":20,"seq":0,"success":true,"type":"response"} --> Content-Length: 116

Hide Details

{"command":"evaluate","type":"request","arguments":{"expression":"var","context":"watch","frameId":524288},"seq":21} <-- Content-Length: 209

Hide Details

{"body":{},"command":"evaluate","message":"expression failed to parse:\nerror: <user expression 0>:1:1: use of undeclared identifier 'var'\nvar\n^\n","request_seq":21,"seq":0,"success":false,"type":"response"} --> Content-Length: 108

Hide Details

{"command":"stackTrace","type":"request","arguments":{"threadId":280622,"startFrame":0,"levels":1},"seq":22} <-- Content-Length: 331

Hide Details

{"body":{"stackFrames":[{"column":14,"id":524288,"line":23,"name":"main","source":{"name":"main.cpp","path":"/Users/buildslave/jenkins/workspace/lldb-cmake-sanitized/llvm-project/lldb/test/API/tools/lldb-vscode/evaluate/main.cpp"}}],"totalFrames":2},"command":"stackTrace","request_seq":22,"seq":0,"success":true,"type":"response"} --> Content-Length: 122

Hide Details

{"command":"evaluate","type":"request","arguments":{"expression":"my_struct","context":"watch","frameId":524288},"seq":23} <-- Content-Length: 311

Hide Details

{"body":{"category":"console","output":"/Users/buildslave/jenkins/workspace/lldb-cmake-sanitized/llvm-project/lldb/tools/lldb-vscode/ProgressEvent.cpp:89:64: runtime error: load of value 808464432, which is not a valid value for type 'lldb_vscode::ProgressEventType'\n"},"event":"output","seq":0,"type":"event"} <-- Content-Length: 261

Hide Details

{"body":{"category":"console","output":"SUMMARY: UndefinedBehaviorSanitizer: undefined-behavior /Users/buildslave/jenkins/workspace/lldb-cmake-sanitized/llvm-project/lldb/tools/lldb-vscode/ProgressEvent.cpp:89:64 in \n"},"event":"output","seq":0,"type":"event"} <-- Content-Length: 170

Hide Details

{"body":{"category":"console","output":"PLEASE submit a bug report to https://bugs.llvm.org/ and include the crash backtrace.\n"},"event":"output","seq":0,"type":"event"} <-- Content-Length: 117

Hide Details

{"body":{},"command":"evaluate","message":"unknown error","request_seq":23,"seq":0,"success":false,"type":"response"} --> Content-Length: 108

Hide Details

{"command":"stackTrace","type":"request","arguments":{"threadId":280622,"startFrame":0,"levels":1},"seq":24} <-- Content-Length: 331

Hide Details

{"body":{"stackFrames":[{"column":14,"id":524288,"line":23,"name":"main","source":{"name":"main.cpp","path":"/Users/buildslave/jenkins/workspace/lldb-cmake-sanitized/llvm-project/lldb/test/API/tools/lldb-vscode/evaluate/main.cpp"}}],"totalFrames":2},"command":"stackTrace","request_seq":24,"seq":0,"success":true,"type":"response"} --> Content-Length: 116

Hide Details

{"command":"evaluate","type":"request","arguments":{"expression":"int","context":"watch","frameId":524288},"seq":25}

Hide Details

========= END =========

Hide Details

-- Command Output (stderr): -- Change dir to: /Users/buildslave/jenkins/workspace/lldb-cmake-sanitized/llvm-project/lldb/test/API/tools/lldb-vscode/evaluate runCmd: settings clear -all output:

Hide Details

runCmd: settings set symbols.enable-external-lookup false output:

Hide Details

runCmd: settings set target.inherit-tcc true output:

Hide Details

runCmd: settings set target.detach-on-error false output:

Hide Details

runCmd: settings set target.auto-apply-fixits false output:

Hide Details

runCmd: settings set plugin.process.gdb-remote.packet-timeout 60 output:

Hide Details

runCmd: settings set symbols.clang-modules-cache-path "/Users/buildslave/jenkins/workspace/lldb-cmake-sanitized/lldb-build/lldb-test-build.noindex/module-cache-lldb/lldb-api" output:

Hide Details

runCmd: settings set use-color false output:

Hide Details

runCmd: setting set target.prefer-dynamic-value no-dynamic-values output:

Hide Details

runCmd: settings set target.env-vars ASAN_OPTIONS=detect_stack_use_after_return=1 DYLD_INSERT_LIBRARIES=/Users/buildslave/jenkins/workspace/lldb-cmake-sanitized/host-compiler/lib/clang/13.0.99/lib/darwin/libclang_rt.asan_osx_dynamic.dylib output:

Hide Details

Adding tearDown hook: def cleanup(): if disconnectAutomatically: self.vscode.request_disconnect(terminateDebuggee=True) self.vscode.terminate()

Hide Details

Hide Details

FAIL: LLDB (/Users/buildslave/jenkins/workspace/lldb-cmake-sanitized/host-compiler/bin/clang-x86_64) :: test_generic_evaluate_expressions (TestVSCode_evaluate.TestVSCode_variables) Executing tearDown hook: def cleanup(): if disconnectAutomatically: self.vscode.request_disconnect(terminateDebuggee=True) self.vscode.terminate()

Hide Details

Hide Details

CLEANUP ERROR: LLDB (/Users/buildslave/jenkins/workspace/lldb-cmake-sanitized/host-compiler/bin/clang-x86_64) :: test_generic_evaluate_expressions (TestVSCode_evaluate.TestVSCode_variables) Traceback (most recent call last): File "/Users/buildslave/jenkins/workspace/lldb-cmake-sanitized/llvm-project/lldb/third_party/Python/module/unittest2/unittest2/case.py", line 386, in run self.tearDown() File "/Users/buildslave/jenkins/workspace/lldb-cmake-sanitized/llvm-project/lldb/packages/Python/lldbsuite/test/lldbtest.py", line 2095, in tearDown Base.tearDown(self) File "/Users/buildslave/jenkins/workspace/lldb-cmake-sanitized/llvm-project/lldb/packages/Python/lldbsuite/test/lldbtest.py", line 1065, in tearDown hook() # try the plain call and hope it works File "/Users/buildslave/jenkins/workspace/lldb-cmake-sanitized/llvm-project/lldb/packages/Python/lldbsuite/test/tools/lldb-vscode/lldbvscode_testcase.py", line 294, in cleanup self.vscode.request_disconnect(terminateDebuggee=True) File "/Users/buildslave/jenkins/workspace/lldb-cmake-sanitized/llvm-project/lldb/packages/Python/lldbsuite/test/tools/lldb-vscode/vscode.py", line 590, in request_disconnect return self.send_recv(command_dict) File "/Users/buildslave/jenkins/workspace/lldb-cmake-sanitized/llvm-project/lldb/packages/Python/lldbsuite/test/tools/lldb-vscode/vscode.py", line 315, in send_recv self.send_packet(command) File "/Users/buildslave/jenkins/workspace/lldb-cmake-sanitized/llvm-project/lldb/packages/Python/lldbsuite/test/tools/lldb-vscode/vscode.py", line 271, in send_packet self.send.flush() BrokenPipeError: [Errno 32] Broken pipe

Hide Details

runCmd: settings clear -all output:

Hide Details

runCmd: settings set symbols.enable-external-lookup false output:

Hide Details

runCmd: settings set target.inherit-tcc true output:

Hide Details

runCmd: settings set target.detach-on-error false output:

Hide Details

runCmd: settings set target.auto-apply-fixits false output:

Hide Details

runCmd: settings set plugin.process.gdb-remote.packet-timeout 60 output:

Hide Details

runCmd: settings set symbols.clang-modules-cache-path "/Users/buildslave/jenkins/workspace/lldb-cmake-sanitized/lldb-build/lldb-test-build.noindex/module-cache-lldb/lldb-api" output:

Hide Details

runCmd: settings set use-color false output:

Hide Details

runCmd: setting set target.prefer-dynamic-value no-dynamic-values output:

Hide Details

runCmd: settings set target.env-vars ASAN_OPTIONS=detect_stack_use_after_return=1 DYLD_INSERT_LIBRARIES=/Users/buildslave/jenkins/workspace/lldb-cmake-sanitized/host-compiler/lib/clang/13.0.99/lib/darwin/libclang_rt.asan_osx_dynamic.dylib output:

Hide Details

Adding tearDown hook: def cleanup(): if disconnectAutomatically: self.vscode.request_disconnect(terminateDebuggee=True) self.vscode.terminate()

Hide Details

Hide Details

Executing tearDown hook: def cleanup(): if disconnectAutomatically: self.vscode.request_disconnect(terminateDebuggee=True) self.vscode.terminate()

Hide Details

Hide Details

PASS: LLDB (/Users/buildslave/jenkins/workspace/lldb-cmake-sanitized/host-compiler/bin/clang-x86_64) :: test_hover_evaluate_expressions (TestVSCode_evaluate.TestVSCode_variables) runCmd: settings clear -all output:

Hide Details

runCmd: settings set symbols.enable-external-lookup false output:

Hide Details

runCmd: settings set target.inherit-tcc true output:

Hide Details

runCmd: settings set target.detach-on-error false output:

Hide Details

runCmd: settings set target.auto-apply-fixits false output:

Hide Details

runCmd: settings set plugin.process.gdb-remote.packet-timeout 60 output:

Hide Details

runCmd: settings set symbols.clang-modules-cache-path "/Users/buildslave/jenkins/workspace/lldb-cmake-sanitized/lldb-build/lldb-test-build.noindex/module-cache-lldb/lldb-api" output:

Hide Details

runCmd: settings set use-color false output:

Hide Details

runCmd: setting set target.prefer-dynamic-value no-dynamic-values output:

Hide Details

runCmd: settings set target.env-vars ASAN_OPTIONS=detect_stack_use_after_return=1 DYLD_INSERT_LIBRARIES=/Users/buildslave/jenkins/workspace/lldb-cmake-sanitized/host-compiler/lib/clang/13.0.99/lib/darwin/libclang_rt.asan_osx_dynamic.dylib output:

Hide Details

Adding tearDown hook: def cleanup(): if disconnectAutomatically: self.vscode.request_disconnect(terminateDebuggee=True) self.vscode.terminate()

Hide Details

Hide Details

FAIL: LLDB (/Users/buildslave/jenkins/workspace/lldb-cmake-sanitized/host-compiler/bin/clang-x86_64) :: test_repl_evaluate_expressions (TestVSCode_evaluate.TestVSCode_variables) Executing tearDown hook: def cleanup(): if disconnectAutomatically: self.vscode.request_disconnect(terminateDebuggee=True) self.vscode.terminate()

Hide Details

Hide Details

CLEANUP ERROR: LLDB (/Users/buildslave/jenkins/workspace/lldb-cmake-sanitized/host-compiler/bin/clang-x86_64) :: test_repl_evaluate_expressions (TestVSCode_evaluate.TestVSCode_variables) Traceback (most recent call last): File "/Users/buildslave/jenkins/workspace/lldb-cmake-sanitized/llvm-project/lldb/third_party/Python/module/unittest2/unittest2/case.py", line 386, in run self.tearDown() File "/Users/buildslave/jenkins/workspace/lldb-cmake-sanitized/llvm-project/lldb/packages/Python/lldbsuite/test/lldbtest.py", line 2095, in tearDown Base.tearDown(self) File "/Users/buildslave/jenkins/workspace/lldb-cmake-sanitized/llvm-project/lldb/packages/Python/lldbsuite/test/lldbtest.py", line 1065, in tearDown hook() # try the plain call and hope it works File "/Users/buildslave/jenkins/workspace/lldb-cmake-sanitized/llvm-project/lldb/packages/Python/lldbsuite/test/tools/lldb-vscode/lldbvscode_testcase.py", line 294, in cleanup self.vscode.request_disconnect(terminateDebuggee=True) File "/Users/buildslave/jenkins/workspace/lldb-cmake-sanitized/llvm-project/lldb/packages/Python/lldbsuite/test/tools/lldb-vscode/vscode.py", line 590, in request_disconnect return self.send_recv(command_dict) File "/Users/buildslave/jenkins/workspace/lldb-cmake-sanitized/llvm-project/lldb/packages/Python/lldbsuite/test/tools/lldb-vscode/vscode.py", line 315, in send_recv self.send_packet(command) File "/Users/buildslave/jenkins/workspace/lldb-cmake-sanitized/llvm-project/lldb/packages/Python/lldbsuite/test/tools/lldb-vscode/vscode.py", line 271, in send_packet self.send.flush() BrokenPipeError: [Errno 32] Broken pipe

Hide Details

runCmd: settings clear -all output:

Hide Details

runCmd: settings set symbols.enable-external-lookup false output:

Hide Details

runCmd: settings set target.inherit-tcc true output:

Hide Details

runCmd: settings set target.detach-on-error false output:

Hide Details

runCmd: settings set target.auto-apply-fixits false output:

Hide Details

runCmd: settings set plugin.process.gdb-remote.packet-timeout 60 output:

Hide Details

runCmd: settings set symbols.clang-modules-cache-path "/Users/buildslave/jenkins/workspace/lldb-cmake-sanitized/lldb-build/lldb-test-build.noindex/module-cache-lldb/lldb-api" output:

Hide Details

runCmd: settings set use-color false output:

Hide Details

runCmd: setting set target.prefer-dynamic-value no-dynamic-values output:

Hide Details

runCmd: settings set target.env-vars ASAN_OPTIONS=detect_stack_use_after_return=1 DYLD_INSERT_LIBRARIES=/Users/buildslave/jenkins/workspace/lldb-cmake-sanitized/host-compiler/lib/clang/13.0.99/lib/darwin/libclang_rt.asan_osx_dynamic.dylib output:

Hide Details

Adding tearDown hook: def cleanup(): if disconnectAutomatically: self.vscode.request_disconnect(terminateDebuggee=True) self.vscode.terminate()

Hide Details

Hide Details

FAIL: LLDB (/Users/buildslave/jenkins/workspace/lldb-cmake-sanitized/host-compiler/bin/clang-x86_64) :: test_watch_evaluate_expressions (TestVSCode_evaluate.TestVSCode_variables) Executing tearDown hook: def cleanup(): if disconnectAutomatically: self.vscode.request_disconnect(terminateDebuggee=True) self.vscode.terminate()

Hide Details

Hide Details

CLEANUP ERROR: LLDB (/Users/buildslave/jenkins/workspace/lldb-cmake-sanitized/host-compiler/bin/clang-x86_64) :: test_watch_evaluate_expressions (TestVSCode_evaluate.TestVSCode_variables) Traceback (most recent call last): File "/Users/buildslave/jenkins/workspace/lldb-cmake-sanitized/llvm-project/lldb/third_party/Python/module/unittest2/unittest2/case.py", line 386, in run self.tearDown() File "/Users/buildslave/jenkins/workspace/lldb-cmake-sanitized/llvm-project/lldb/packages/Python/lldbsuite/test/lldbtest.py", line 2095, in tearDown Base.tearDown(self) File "/Users/buildslave/jenkins/workspace/lldb-cmake-sanitized/llvm-project/lldb/packages/Python/lldbsuite/test/lldbtest.py", line 1065, in tearDown hook() # try the plain call and hope it works File "/Users/buildslave/jenkins/workspace/lldb-cmake-sanitized/llvm-project/lldb/packages/Python/lldbsuite/test/tools/lldb-vscode/lldbvscode_testcase.py", line 294, in cleanup self.vscode.request_disconnect(terminateDebuggee=True) File "/Users/buildslave/jenkins/workspace/lldb-cmake-sanitized/llvm-project/lldb/packages/Python/lldbsuite/test/tools/lldb-vscode/vscode.py", line 590, in request_disconnect return self.send_recv(command_dict) File "/Users/buildslave/jenkins/workspace/lldb-cmake-sanitized/llvm-project/lldb/packages/Python/lldbsuite/test/tools/lldb-vscode/vscode.py", line 315, in send_recv self.send_packet(command) File "/Users/buildslave/jenkins/workspace/lldb-cmake-sanitized/llvm-project/lldb/packages/Python/lldbsuite/test/tools/lldb-vscode/vscode.py", line 271, in send_packet self.send.flush() BrokenPipeError: [Errno 32] Broken pipe

Hide Details

Restore dir to: /Users/buildslave/jenkins/workspace/lldb-cmake-sanitized/lldb-build/tools/lldb/test ====================================================================== ERROR: test_generic_evaluate_expressions (TestVSCode_evaluate.TestVSCode_variables) ---------------------------------------------------------------------- Traceback (most recent call last): File "/Users/buildslave/jenkins/workspace/lldb-cmake-sanitized/llvm-project/lldb/test/API/tools/lldb-vscode/evaluate/TestVSCode_evaluate.py", line 157, in test_generic_evaluate_expressions self.run_test_evaluate_expressions() File "/Users/buildslave/jenkins/workspace/lldb-cmake-sanitized/llvm-project/lldb/test/API/tools/lldb-vscode/evaluate/TestVSCode_evaluate.py", line 62, in run_test_evaluate_expressions self.assertEvaluateFailure("int") # type name File "/Users/buildslave/jenkins/workspace/lldb-cmake-sanitized/llvm-project/lldb/test/API/tools/lldb-vscode/evaluate/TestVSCode_evaluate.py", line 24, in assertEvaluateFailure self.vscode.request_evaluate(expression, context=self.context)['body']) File "/Users/buildslave/jenkins/workspace/lldb-cmake-sanitized/llvm-project/lldb/packages/Python/lldbsuite/test/tools/lldb-vscode/vscode.py", line 607, in request_evaluate return self.send_recv(command_dict) File "/Users/buildslave/jenkins/workspace/lldb-cmake-sanitized/llvm-project/lldb/packages/Python/lldbsuite/test/tools/lldb-vscode/vscode.py", line 321, in send_recv raise ValueError(desc) ValueError: no response for "evaluate" Config=x86_64-/Users/buildslave/jenkins/workspace/lldb-cmake-sanitized/host-compiler/bin/clang ====================================================================== ERROR: test_repl_evaluate_expressions (TestVSCode_evaluate.TestVSCode_variables) ---------------------------------------------------------------------- Traceback (most recent call last): File "/Users/buildslave/jenkins/workspace/lldb-cmake-sanitized/llvm-project/lldb/test/API/tools/lldb-vscode/evaluate/TestVSCode_evaluate.py", line 163, in test_repl_evaluate_expressions self.run_test_evaluate_expressions("repl") File "/Users/buildslave/jenkins/workspace/lldb-cmake-sanitized/llvm-project/lldb/test/API/tools/lldb-vscode/evaluate/TestVSCode_evaluate.py", line 63, in run_test_evaluate_expressions self.assertEvaluateFailure("foo") # member of my_struct File "/Users/buildslave/jenkins/workspace/lldb-cmake-sanitized/llvm-project/lldb/test/API/tools/lldb-vscode/evaluate/TestVSCode_evaluate.py", line 24, in assertEvaluateFailure self.vscode.request_evaluate(expression, context=self.context)['body']) File "/Users/buildslave/jenkins/workspace/lldb-cmake-sanitized/llvm-project/lldb/packages/Python/lldbsuite/test/tools/lldb-vscode/vscode.py", line 594, in request_evaluate threadId=threadId) File "/Users/buildslave/jenkins/workspace/lldb-cmake-sanitized/llvm-project/lldb/packages/Python/lldbsuite/test/tools/lldb-vscode/vscode.py", line 408, in get_stackFrame levels=1) File "/Users/buildslave/jenkins/workspace/lldb-cmake-sanitized/llvm-project/lldb/packages/Python/lldbsuite/test/tools/lldb-vscode/vscode.py", line 849, in request_stackTrace response = self.send_recv(command_dict) File "/Users/buildslave/jenkins/workspace/lldb-cmake-sanitized/llvm-project/lldb/packages/Python/lldbsuite/test/tools/lldb-vscode/vscode.py", line 321, in send_recv raise ValueError(desc) ValueError: no response for "stackTrace" Config=x86_64-/Users/buildslave/jenkins/workspace/lldb-cmake-sanitized/host-compiler/bin/clang ====================================================================== ERROR: test_watch_evaluate_expressions (TestVSCode_evaluate.TestVSCode_variables) ---------------------------------------------------------------------- Traceback (most recent call last): File "/Users/buildslave/jenkins/workspace/lldb-cmake-sanitized/llvm-project/lldb/test/API/tools/lldb-vscode/evaluate/TestVSCode_evaluate.py", line 169, in test_watch_evaluate_expressions self.run_test_evaluate_expressions("watch") File "/Users/buildslave/jenkins/workspace/lldb-cmake-sanitized/llvm-project/lldb/test/API/tools/lldb-vscode/evaluate/TestVSCode_evaluate.py", line 62, in run_test_evaluate_expressions self.assertEvaluateFailure("int") # type name File "/Users/buildslave/jenkins/workspace/lldb-cmake-sanitized/llvm-project/lldb/test/API/tools/lldb-vscode/evaluate/TestVSCode_evaluate.py", line 24, in assertEvaluateFailure self.vscode.request_evaluate(expression, context=self.context)['body']) File "/Users/buildslave/jenkins/workspace/lldb-cmake-sanitized/llvm-project/lldb/packages/Python/lldbsuite/test/tools/lldb-vscode/vscode.py", line 607, in request_evaluate return self.send_recv(command_dict) File "/Users/buildslave/jenkins/workspace/lldb-cmake-sanitized/llvm-project/lldb/packages/Python/lldbsuite/test/tools/lldb-vscode/vscode.py", line 321, in send_recv raise ValueError(desc) ValueError: no response for "evaluate" Config=x86_64-/Users/buildslave/jenkins/workspace/lldb-cmake-sanitized/host-compiler/bin/clang ---------------------------------------------------------------------- Ran 4 tests in 15.928s

Hide Details

RESULT: FAILED (1 passes, 0 failures, 3 errors, 0 skipped, 0 expected failures, 0 unexpected successes)

Hide Details

--

Hide Details

******************** PASS: lldb-unit :: Process/gdb-remote/./ProcessGdbRemoteTests/GDBRemoteClientBaseTest.SendContinueAndAsyncPacket (2200 of 2354) PASS: lldb-unit :: Utility/./UtilityTests/BinaryStreamTest.PutULEB128ThreeBytes (2201 of 2354) PASS: lldb-unit :: Utility/./UtilityTests/ArgsTest.TestSingleArg (2202 of 2354) PASS: lldb-api :: python_api/sbstructureddata/TestStructuredDataAPI.py (2203 of 2354) PASS: lldb-unit :: Platform/./LLDBPlatformTests/PlatformDarwinTest.TestParseVersionBuildDir (2204 of 2354) PASS: lldb-shell :: SymbolFile/DWARF/x86/win-i386-line-table.s (2205 of 2354) PASS: lldb-api :: lang/c/complex/TestComplexC99.py (2206 of 2354) PASS: lldb-unit :: ScriptInterpreter/Python/./ScriptInterpreterPythonTests/PythonDataObjectsTest.TestCallable (2207 of 2354) PASS: lldb-unit :: Host/./HostTests/FileSystemTest.EmptyTest (2208 of 2354) PASS: lldb-shell :: Recognizer/assert.test (2209 of 2354) PASS: lldb-shell :: ObjectFile/ELF/many-sections.s (2210 of 2354) PASS: lldb-api :: commands/expression/no-deadlock/TestExprDoesntBlock.py (2211 of 2354) UNSUPPORTED: lldb-api :: functionalities/tsan/cpp_global_location/TestTsanCPPGlobalLocation.py (2212 of 2354) PASS: lldb-api :: functionalities/gdb_remote_client/TestWriteMemory.py (2213 of 2354) PASS: lldb-api :: commands/expression/scoped_enums/TestScopedEnumType.py (2214 of 2354) PASS: lldb-api :: functionalities/data-formatter/data-formatter-stl/libcxx/function/TestLibCxxFunction.py (2215 of 2354) PASS: lldb-shell :: Breakpoint/single-file-split-dwarf.test (2216 of 2354) PASS: lldb-api :: lang/c/blocks/TestBlocks.py (2217 of 2354) PASS: lldb-unit :: Target/./TargetTests/StackFrameRecognizerTest.NullModuleRegex (2218 of 2354) PASS: lldb-api :: tools/lldb-server/TestGdbRemote_vCont.py (2219 of 2354) PASS: lldb-unit :: Utility/./UtilityTests/LogChannelEnabledTest.LLDB_LOG_ERROR (2220 of 2354) PASS: lldb-unit :: Utility/./UtilityTests/StreamTeeTest.Constructor1Stream (2221 of 2354) PASS: lldb-api :: functionalities/unwind/noreturn/module-end/TestNoReturnModuleEnd.py (2222 of 2354) UNSUPPORTED: lldb-shell :: Minidump/Windows/arm-fp-unwind.test (2223 of 2354) PASS: lldb-unit :: Core/./LLDBCoreTests/SourceFileCache.FindSourceFileNotFound (2224 of 2354) PASS: lldb-api :: lang/objc/modules-compile-error/TestModulesCompileError.py (2225 of 2354) PASS: lldb-unit :: Core/./LLDBCoreTests/SourceLocationSpecTest.Equal (2226 of 2354) PASS: lldb-unit :: UnwindAssembly/x86/./UnwindAssemblyx86Tests/Testx86AssemblyInspectionEngine.TestStackRealign8BitDisp_i386 (2227 of 2354) UNSUPPORTED: lldb-api :: commands/expression/macros/TestMacros.py (2228 of 2354) PASS: lldb-unit :: Utility/./UtilityTests/StreamTest.ShiftOperatorPtr (2229 of 2354) PASS: lldb-api :: terminal/TestSTTYBeforeAndAfter.py (2230 of 2354) PASS: lldb-unit :: Utility/./UtilityTests/UriParserTest.SchemeHostSeparator (2231 of 2354) PASS: lldb-api :: commands/watchpoints/multiple_hits/TestMultipleHits.py (2232 of 2354) PASS: lldb-api :: functionalities/scripted_process/TestScriptedProcess.py (2233 of 2354) PASS: lldb-api :: commands/reproducer/invalid-args/TestInvalidArgsReproducer.py (2234 of 2354) PASS: lldb-api :: functionalities/type_completion/TestTypeCompletion.py (2235 of 2354) PASS: lldb-shell :: Register/Core/x86-64-netbsd-fp.test (2236 of 2354) PASS: lldb-shell :: ScriptInterpreter/Python/scripted_breakpoint_lua.test (2237 of 2354) PASS: lldb-api :: commands/expression/regression-access-function-template-in-record/TestRegressionAccessFunctionTemplateInRecord.py (2238 of 2354) PASS: lldb-api :: commands/target/dump-symtab-demangle/TestDumpSymtabDemangle.py (2239 of 2354) PASS: lldb-api :: tools/lldb-vscode/attach/TestVSCode_attach.py (2240 of 2354) PASS: lldb-unit :: Utility/./UtilityTests/PassiveReplayTest.InstrumentedBarRef (2241 of 2354) PASS: lldb-api :: functionalities/breakpoint/breakpoint_ignore_count/TestBreakpointIgnoreCount.py (2242 of 2354) PASS: lldb-unit :: Utility/./UtilityTests/UriParserTest.LongPath (2243 of 2354) PASS: lldb-unit :: Symbol/./SymbolTests/TestTypeSystemClang.TestGetTypeClassNested (2244 of 2354) PASS: lldb-unit :: Utility/./UtilityTests/AnsiTerminal.Empty (2245 of 2354) PASS: lldb-api :: commands/session/save/TestSessionSave.py (2246 of 2354) PASS: lldb-unit :: Symbol/./SymbolTests/TestClangASTImporter.CompleteFwdDeclWithOtherOrigin (2247 of 2354) PASS: lldb-unit :: Host/./HostTests/ConnectionFileDescriptorTest.TCPGetURIv4 (2248 of 2354) PASS: lldb-unit :: Utility/./UtilityTests/StringListTest.JoinMultiCharSeparator (2249 of 2354) PASS: lldb-api :: commands/log/basic/TestLogging.py (2250 of 2354) PASS: lldb-api :: lang/cpp/multiple-inheritance/TestCppMultipleInheritance.py (2251 of 2354) PASS: lldb-unit :: Host/./HostTests/HostInfoTestInitialization.InitTwice (2252 of 2354) PASS: lldb-unit :: UnwindAssembly/x86/./UnwindAssemblyx86Tests/Testx86AssemblyInspectionEngine.TestPushR12 (2253 of 2354) PASS: lldb-unit :: Utility/./UtilityTests/StringExtractorTest.GetU64BigEndian (2254 of 2354) PASS: lldb-unit :: UnwindAssembly/x86/./UnwindAssemblyx86Tests/Testx86AssemblyInspectionEngine.TestPushECX (2255 of 2354) PASS: lldb-unit :: DataFormatter/./LLDBFormatterTests/TypeMatcherTests.CreatedBySameMatchString (2256 of 2354) PASS: lldb-api :: lang/cpp/char1632_t/TestChar1632T.py (2257 of 2354) PASS: lldb-unit :: UnwindAssembly/x86/./UnwindAssemblyx86Tests/Testx86AssemblyInspectionEngine.TestPushEDI (2258 of 2354) PASS: lldb-api :: commands/expression/import-std-module/vector-dbg-info-content/TestDbgInfoContentVectorFromStdModule.py (2259 of 2354) PASS: lldb-unit :: SymbolFile/NativePDB/./SymbolFileNativePDBTests/PDBFPOProgramToDWARFExpressionTests.SingleAssignmentRegisterRef (2260 of 2354) PASS: lldb-shell :: SymbolFile/DWARF/clang-ast-from-dwarf-unamed-and-anon-structs.cpp (2261 of 2354) PASS: lldb-api :: lang/objcxx/cpp_keywords_enabled/TestObjCppKeywordsEnabled.py (2262 of 2354) PASS: lldb-unit :: Language/Highlighting/./HighlighterTests/HighlighterTest.ClangCursorPos (2263 of 2354) PASS: lldb-unit :: Utility/./UtilityTests/UriParserTest.Minimal (2264 of 2354) PASS: lldb-api :: commands/command/source/TestCommandSource.py (2265 of 2354) PASS: lldb-api :: lang/c/enum_types/TestEnumTypes.py (2266 of 2354) PASS: lldb-unit :: Utility/./UtilityTests/PassiveReplayTest.InstrumentedFoo (2267 of 2354) PASS: lldb-unit :: Utility/./UtilityTests/StreamTest.PutChar (2268 of 2354) PASS: lldb-unit :: Utility/./UtilityTests/StreamTest.AddressRangeSize (2269 of 2354) PASS: lldb-shell :: SymbolFile/DWARF/x86/debug_ranges.s (2270 of 2354) PASS: lldb-shell :: Reproducer/TestProcessList.test (2271 of 2354) PASS: lldb-unit :: Target/./TargetTests/ExecutionContextTest.GetByteOrderTarget (2272 of 2354) PASS: lldb-unit :: Utility/./UtilityTests/StreamTeeTest.CopyConstructor (2273 of 2354) PASS: lldb-api :: functionalities/data-formatter/data-formatter-stl/libcxx/atomic/TestLibCxxAtomic.py (2274 of 2354) PASS: lldb-unit :: UnwindAssembly/x86/./UnwindAssemblyx86Tests/Testx86AssemblyInspectionEngine.TestCALLNextInsn (2275 of 2354) PASS: lldb-api :: commands/expression/options/TestExprOptions.py (2276 of 2354) PASS: lldb-api :: commands/expression/import-std-module/weak_ptr-dbg-info-content/TestDbgInfoContentWeakPtrFromStdModule.py (2277 of 2354) PASS: lldb-unit :: Utility/./UtilityTests/LogChannelTest.Disable (2278 of 2354) PASS: lldb-unit :: Utility/./UtilityTests/StringExtractorTest.GetHexU8_Underflow (2279 of 2354) PASS: lldb-api :: functionalities/breakpoint/breakpoint_hit_count/TestBreakpointHitCount.py (2280 of 2354) PASS: lldb-shell :: SymbolFile/DWARF/x86/debug_aranges-empty-section.s (2281 of 2354) PASS: lldb-unit :: Utility/./UtilityTests/DataExtractorTest.GetDoubleUnaligned (2282 of 2354) PASS: lldb-unit :: Utility/./UtilityTests/ArgsTest.TestTrailingBackslash (2283 of 2354) PASS: lldb-unit :: Utility/./UtilityTests/TimeoutTest.Construction (2284 of 2354) UNSUPPORTED: lldb-api :: functionalities/darwin_log/filter/regex/activity-chain/TestDarwinLogFilterRegexActivityChain.py (2285 of 2354) PASS: lldb-api :: lang/cpp/class-template-non-type-parameter-pack/TestClassTemplateNonTypeParameterPack.py (2286 of 2354) PASS: lldb-shell :: Process/Optimization.test (2287 of 2354) PASS: lldb-api :: functionalities/avoids-fd-leak/TestFdLeak.py (2288 of 2354) PASS: lldb-shell :: Unwind/trap_frame_sym_ctx.test (2289 of 2354) PASS: lldb-api :: lang/cpp/class-template-type-parameter-pack/TestClassTemplateTypeParameterPack.py (2290 of 2354) PASS: lldb-shell :: SymbolFile/NativePDB/break-by-line.cpp (2291 of 2354) PASS: lldb-unit :: Host/./HostTests/SocketTests/SocketTest.DecodeHostAndPort/ipv4 (2292 of 2354) PASS: lldb-shell :: Settings/TestSettingsSet.test (2293 of 2354) PASS: lldb-unit :: Utility/./UtilityTests/ScalarTest.GetValue (2294 of 2354) PASS: lldb-unit :: Utility/./UtilityTests/RangeDataVector.FindEntryThatContains_Overlap (2295 of 2354) PASS: lldb-shell :: Minidump/Windows/find-module.test (2296 of 2354) PASS: lldb-unit :: Utility/./UtilityTests/StreamTeeTest.GetStreamAtIndexOutOfBounds (2297 of 2354) PASS: lldb-unit :: Utility/./UtilityTests/ArchSpecTest.Compatibility (2298 of 2354) PASS: lldb-unit :: ScriptInterpreter/Python/./ScriptInterpreterPythonTests/PythonDataObjectsTest.TestPythonDictionaryValueEquality (2299 of 2354) PASS: lldb-api :: tools/lldb-server/TestGdbRemoteExpeditedRegisters.py (2300 of 2354) UNSUPPORTED: lldb-api :: functionalities/darwin_log/filter/exact_match/activity/TestDarwinLogFilterMatchActivity.py (2301 of 2354) PASS: lldb-unit :: Language/Highlighting/./HighlighterTests/HighlighterTest.Keywords (2302 of 2354) PASS: lldb-shell :: ExecControl/StopHook/stop-hook.test (2303 of 2354) PASS: lldb-unit :: Utility/./UtilityTests/StringExtractorTest.GetHexU8_Extra (2304 of 2354) PASS: lldb-unit :: Utility/./UtilityTests/XcodeSDKTest.SDKSupportsSwift (2305 of 2354) PASS: lldb-api :: lang/cpp/global_variables/TestCPPGlobalVariables.py (2306 of 2354) PASS: lldb-shell :: ObjectFile/ELF/build-id-case.yaml (2307 of 2354) UNSUPPORTED: lldb-shell :: Watchpoint/netbsd-nouserdbregs.test (2308 of 2354) PASS: lldb-shell :: Register/Core/x86-32-linux-addr.test (2309 of 2354) PASS: lldb-unit :: Process/gdb-remote/./ProcessGdbRemoteTests/GDBRemoteCommunicationServerTest.SendErrorResponse_StringError (2310 of 2354) PASS: lldb-api :: functionalities/recursion/TestValueObjectRecursion.py (2311 of 2354) UNSUPPORTED: lldb-shell :: SymbolFile/PDB/func-symbols.test (2312 of 2354) PASS: lldb-shell :: SymbolFile/DWARF/x86/dwo-type-in-main-file.s (2313 of 2354) PASS: lldb-unit :: ScriptInterpreter/Python/./ScriptInterpreterPythonTests/PythonDataObjectsTest.TestPythonListValueEquality (2314 of 2354) PASS: lldb-unit :: Process/gdb-remote/./ProcessGdbRemoteTests/GDBRemoteClientBaseTest.SendContinueAndInterrupt2PacketBug (2315 of 2354) UNSUPPORTED: lldb-shell :: Register/x86-zmm-read.test (2316 of 2354) PASS: lldb-unit :: Process/gdb-remote/./ProcessGdbRemoteTests/GDBRemoteCommunicationClientTest.GetModulesInfoInvalidResponse (2317 of 2354) PASS: lldb-unit :: UnwindAssembly/x86/./UnwindAssemblyx86Tests/Testx86AssemblyInspectionEngine.TestStackRealign32BitDisp_x86_64 (2318 of 2354) PASS: lldb-shell :: ScriptInterpreter/Python/eof.test (2319 of 2354) PASS: lldb-unit :: Platform/./LLDBPlatformTests/PlatformDarwinTest.FindComponentInPath (2320 of 2354) PASS: lldb-unit :: Utility/./UtilityTests/StringExtractorTest.GetHexU8_InvalidHex_NoEof (2321 of 2354) PASS: lldb-api :: python_api/function_symbol/TestSymbolAPI.py (2322 of 2354) PASS: lldb-unit :: Utility/./UtilityTests/FileSpecTest.GetPath (2323 of 2354) PASS: lldb-unit :: Utility/./UtilityTests/StreamTeeTest.AppendStream (2324 of 2354) PASS: lldb-shell :: Commands/command-target-modules-dump-sections.yaml (2325 of 2354) PASS: lldb-api :: commands/watchpoints/watchpoint_commands/condition/TestWatchpointConditionCmd.py (2326 of 2354) PASS: lldb-unit :: Utility/./UtilityTests/StringExtractorTest.GetHexBytes (2327 of 2354) PASS: lldb-api :: functionalities/object-file/TestImageListMultiArchitecture.py (2328 of 2354) PASS: lldb-unit :: Process/Utility/./ProcessUtilityTests/ProcSMapTests/LinuxProcSMapsTestFixture.ParseSMapRegions/1 (2329 of 2354) PASS: lldb-unit :: Utility/./UtilityTests/LogTest.Register (2330 of 2354) PASS: lldb-unit :: Expression/./ExpressionTests/DWARFExpression.DW_OP_convert (2331 of 2354) PASS: lldb-api :: commands/target/stop-hook/disable/TestTargetStopHookDisable.py (2332 of 2354) PASS: lldb-shell :: SymbolFile/Breakpad/line-table-edgecases.test (2333 of 2354) PASS: lldb-api :: sanity/TestSettingSkipping.py (2334 of 2354) PASS: lldb-unit :: Utility/./UtilityTests/BinaryStreamTest.PutSLEB128OneByte (2335 of 2354) PASS: lldb-api :: functionalities/fat_archives/TestFatArchives.py (2336 of 2354) PASS: lldb-unit :: Utility/./UtilityTests/StreamTest.AddressSuffix (2337 of 2354) PASS: lldb-api :: functionalities/target_var/no_vars/TestTargetVarNoVars.py (2338 of 2354) PASS: lldb-unit :: Utility/./UtilityTests/Flags.GetBitSize (2339 of 2354) UNSUPPORTED: lldb-shell :: SymbolFile/DWARF/x86/dwarf5-line-strp.s (2340 of 2354) PASS: lldb-api :: python_api/watchpoint/watchlocation/TestSetWatchlocation.py (2341 of 2354) PASS: lldb-api :: python_api/debugger/TestDebuggerAPI.py (2342 of 2354) PASS: lldb-unit :: Utility/./UtilityTests/ProcessInstanceInfo.DumpTable (2343 of 2354) PASS: lldb-unit :: Utility/./UtilityTests/StringExtractorTest.GetHexBytes_Partial (2344 of 2354) PASS: lldb-shell :: SymbolFile/DWARF/x86/find-basic-namespace.cpp (2345 of 2354) PASS: lldb-unit :: Symbol/./SymbolTests/TestTypeSystemClang.TestIsClangType (2346 of 2354) UNSUPPORTED: lldb-api :: lang/c/typedef/Testtypedef.py (2347 of 2354) PASS: lldb-unit :: Utility/./UtilityTests/StringExtractorTest.GetHexU8_Extra_NoEof (2348 of 2354) PASS: lldb-unit :: Process/minidump/./LLDBMinidumpTests/MinidumpParserTest.GetThreadContext_x86_32_wow64 (2349 of 2354) PASS: lldb-unit :: Utility/./UtilityTests/RangeTest.ContainsRange (2350 of 2354) PASS: lldb-api :: commands/expression/import-std-module/list-dbg-info-content/TestDbgInfoContentListFromStdModule.py (2351 of 2354) PASS: lldb-api :: functionalities/thread/state_after_expression/TestStateAfterExpression.py (2352 of 2354) PASS: lldb-api :: functionalities/breakpoint/breakpoint_by_file_colon_line/TestBreakpointByFileColonLine.py (2353 of 2354) PASS: lldb-api :: commands/expression/completion/TestExprCompletion.py (2354 of 2354) Slowest Tests: -------------------------------------------------------------------------- 263.48s: lldb-api :: tools/lldb-server/TestLldbGdbServer.py 137.12s: lldb-api :: functionalities/memory-region/TestMemoryRegion.py 129.79s: lldb-api :: api/multithreaded/TestMultithreaded.py 112.24s: lldb-api :: macosx/skinny-corefile/TestSkinnyCorefile.py 91.27s: lldb-api :: functionalities/gdb_remote_client/TestWasm.py 89.70s: lldb-api :: lang/objc/objc-new-syntax/TestObjCNewSyntaxLiteral.py 84.22s: lldb-api :: types/TestLongTypesExpr.py 72.84s: lldb-api :: commands/expression/import-std-module/queue/TestQueueFromStdModule.py 70.69s: lldb-api :: lang/objc/exceptions/TestObjCExceptions.py 68.64s: lldb-api :: commands/expression/import-std-module/stack/TestStackFromStdModule.py 63.23s: lldb-api :: lang/objc/hidden-ivars/TestHiddenIvars.py 59.83s: lldb-api :: lang/cpp/namespace/TestNamespaceLookup.py 56.51s: lldb-api :: commands/expression/import-std-module/vector/TestVectorFromStdModule.py 54.68s: lldb-api :: lang/objc/foundation/TestObjCMethods.py 51.83s: lldb-api :: types/TestIntegerTypeExpr.py 50.16s: lldb-api :: tools/lldb-server/TestGdbRemoteThreadsInStopReply.py 49.96s: lldb-api :: python_api/target/TestTargetAPI.py 48.17s: lldb-api :: commands/expression/import-std-module/deque-basic/TestDequeFromStdModule.py 47.72s: lldb-api :: commands/expression/import-std-module/vector-dbg-info-content/TestDbgInfoContentVectorFromStdModule.py 47.46s: lldb-api :: lang/objc/objc-new-syntax/TestObjCNewSyntaxArray.py

Hide Details

Tests Times: -------------------------------------------------------------------------- [ Range ] :: [ Percentage ] :: [ Count ] -------------------------------------------------------------------------- [260s,280s) :: [ ] :: [ 1/2354] [240s,260s) :: [ ] :: [ 0/2354] [220s,240s) :: [ ] :: [ 0/2354] [200s,220s) :: [ ] :: [ 0/2354] [180s,200s) :: [ ] :: [ 0/2354] [160s,180s) :: [ ] :: [ 0/2354] [140s,160s) :: [ ] :: [ 1/2354] [120s,140s) :: [ ] :: [ 1/2354] [100s,120s) :: [ ] :: [ 1/2354] [ 80s,100s) :: [ ] :: [ 3/2354] [ 60s, 80s) :: [ ] :: [ 6/2354] [ 40s, 60s) :: [ ] :: [ 17/2354] [ 20s, 40s) :: [* ] :: [ 66/2354] [ 0s, 20s) :: [************************************** ] :: [2258/2354] -------------------------------------------------------------------------- ******************** Failed Tests (6): lldb-api :: lang/cpp/member-and-local-vars-with-same-name/TestMembersAndLocalsWithSameName.py lldb-api :: macosx/dyld-trie-symbols/TestDyldTrieSymbols.py lldb-api :: macosx/function-starts/TestFunctionStarts.py lldb-api :: tools/lldb-vscode/breakpoint/TestVSCode_setFunctionBreakpoints.py lldb-api :: tools/lldb-vscode/evaluate/TestVSCode_evaluate.py lldb-unit :: ObjectFile/ELF/./ObjectFileELFTests/ObjectFileELFTest.GetSymtab_NoSymEntryPointArmThumbAddressClass

Hide Details

Hide Details

Testing Time: 2399.04s Unsupported : 211 Passed : 2127 Expectedly Failed: 10 Failed : 6 FAILED: tools/lldb/test/CMakeFiles/check-lldb cd /Users/buildslave/jenkins/workspace/lldb-cmake-sanitized/lldb-build/tools/lldb/test && /usr/local/Frameworks/Python.framework/Versions/3.7/bin/python3.7 /Users/buildslave/jenkins/workspace/lldb-cmake-sanitized/lldb-build/./bin/llvm-lit -v --time-tests --shuffle --xunit-xml-output=/Users/buildslave/jenkins/workspace/lldb-cmake-sanitized/test/results.xml -v -j 4 --timeout 1200 /Users/buildslave/jenkins/workspace/lldb-cmake-sanitized/lldb-build/tools/lldb/test ninja: build stopped: subcommand failed. Command failed: Command '['/usr/bin/env', 'TERM=vt100', '/usr/local/bin/ninja', '-v', 'check-lldb']' returned non-zero exit status 1. Command: ['/usr/bin/env', 'TERM=vt100', '/usr/local/bin/ninja', '-v', 'check-lldb'] [Pipeline] } [Pipeline] // timeout [Pipeline] } [Pipeline] // stage [Pipeline] stage [Pipeline] { (Declarative: Post Actions) [Pipeline] scanForIssues [Clang (LLVM based)] Sleeping for 5 seconds due to JENKINS-32191... [Clang (LLVM based)] Parsing console log (workspace: '/Users/buildslave/jenkins/workspace/lldb-cmake-sanitized') [Clang (LLVM based)] Successfully parsed console log [Clang (LLVM based)] -> found 5 issues (skipped 2 duplicates) [Clang (LLVM based)] [-ERROR-] Can't create fingerprints for some files: [Clang (LLVM based)] [-ERROR-] - '/Users/buildslave/jenkins/workspace/lldb-cmake-sanitized/lldb-build/{"body":{"category":"console","output":"/Users/buildslave/jenkins/workspace/lldb-cmake-sanitized/llvm-project/lldb/tools/lldb-vscode/ProgressEvent.cpp', IO exception has been thrown: java.nio.file.NoSuchFileException: /Users/buildslave/jenkins/workspace/lldb-cmake-sanitized/lldb-build/{"body":{"category":"console","output":"/Users/buildslave/jenkins/workspace/lldb-cmake-sanitized/llvm-project/lldb/tools/lldb-vscode/ProgressEvent.cpp [Clang (LLVM based)] [-ERROR-] - '/Users/buildslave/jenkins/workspace/lldb-cmake-sanitized/lldb-build/{"body":{"category":"console","output":"/Users/buildslave/jenkins/workspace/lldb-cmake-sanitized/llvm-project/lldb/tools/lldb-vscode/ProgressEvent.cpp', IO exception has been thrown: java.nio.file.NoSuchFileException: /Users/buildslave/jenkins/workspace/lldb-cmake-sanitized/lldb-build/{"body":{"category":"console","output":"/Users/buildslave/jenkins/workspace/lldb-cmake-sanitized/llvm-project/lldb/tools/lldb-vscode/ProgressEvent.cpp [Clang (LLVM based)] Post processing issues on 'green-dragon-23' with source code encoding 'UTF-8' [Clang (LLVM based)] Creating SCM blamer to obtain author and commit information for affected files [Clang (LLVM based)] -> No blamer installed yet. You need to install the 'git-forensics' plugin to enable blaming for Git. [Clang (LLVM based)] Resolving file names for all issues in source directory '/Users/buildslave/jenkins/workspace/lldb-cmake-sanitized' [Clang (LLVM based)] -> resolved paths in source directory (3 found, 1 not found) [Clang (LLVM based)] Resolving module names from module definitions (build.xml, pom.xml, or Manifest.mf files) [Clang (LLVM based)] -> resolved module names for 5 issues [Clang (LLVM based)] Resolving package names (or namespaces) by parsing the affected files [Clang (LLVM based)] -> resolved package names of 4 affected files [Clang (LLVM based)] No filter has been set, publishing all 5 issues [Clang (LLVM based)] Creating fingerprints for all affected code blocks to track issues over different builds [Clang (LLVM based)] -> created fingerprints for 3 issues (skipped 2 issues) [Clang (LLVM based)] Copying affected files to Jenkins' build folder '/Users/Shared/Jenkins/Home/jobs/lldb-cmake-sanitized/builds/1897/files-with-issues' [Clang (LLVM based)] -> 3 copied, 0 not in workspace, 2 not-found, 0 with I/O error [Clang (LLVM based)] Repository miner is not configured, skipping repository mining [Pipeline] junit Recording test results [Checks API] No suitable checks publisher found. [Pipeline] } [Pipeline] // stage [Pipeline] } [Pipeline] // withEnv [Pipeline] } [Pipeline] // node [Pipeline] End of Pipeline ERROR: script returned exit code 1 Finished: FAILURE