Regression

lldb-unit.ObjectFile/ELF/_/ObjectFileELFTests.ObjectFileELFTest.GetSymtab_NoSymEntryPointArmThumbAddressClass (from lldb-unit)

Failing for the past 1 build (Since #1897 )
Took 0.17 sec.

Stacktrace

Script:
--
/Users/buildslave/jenkins/workspace/lldb-cmake-sanitized/lldb-build/tools/lldb/unittests/ObjectFile/ELF/./ObjectFileELFTests --gtest_filter=ObjectFileELFTest.GetSymtab_NoSymEntryPointArmThumbAddressClass
--
Note: Google Test filter = ObjectFileELFTest.GetSymtab_NoSymEntryPointArmThumbAddressClass
[==========] Running 1 test from 1 test suite.
[----------] Global test environment set-up.
[----------] 1 test from ObjectFileELFTest
[ RUN      ] ObjectFileELFTest.GetSymtab_NoSymEntryPointArmThumbAddressClass
/Users/buildslave/jenkins/workspace/lldb-cmake-sanitized/llvm-project/lldb/unittests/ObjectFile/ELF/TestObjectFileELF.cpp:220: Failure
Expected equality of these values:
  entry_point_addr.GetAddressClass()
    Which is: 4-byte object <01-00 00-00>
  AddressClass::eCodeAlternateISA
    Which is: 4-byte object <03-00 00-00>
[  FAILED  ] ObjectFileELFTest.GetSymtab_NoSymEntryPointArmThumbAddressClass (4 ms)
[----------] 1 test from ObjectFileELFTest (4 ms total)

[----------] Global test environment tear-down
[==========] 1 test from 1 test suite ran. (4 ms total)
[  PASSED  ] 0 tests.
[  FAILED  ] 1 test, listed below:
[  FAILED  ] ObjectFileELFTest.GetSymtab_NoSymEntryPointArmThumbAddressClass

 1 FAILED TEST