Console Output

Skipping 9,575 KB.. Full Log
PASS: lldb-unit :: Utility/./UtilityTests/StreamTest.AddressEmptyPrefix (1365 of 2355)
PASS: lldb-api :: python_api/lldbutil/iter/TestRegistersIterator.py (1366 of 2355)
PASS: lldb-api :: lang/objc/modules-non-objc-target/TestObjCModulesNonObjCTarget.py (1367 of 2355)
PASS: lldb-unit :: Utility/./UtilityTests/RecordReplayTest.InstrumentedBarRef (1368 of 2355)
UNSUPPORTED: lldb-shell :: Register/x86-ymm-write.test (1369 of 2355)
UNSUPPORTED: lldb-shell :: SymbolFile/PDB/vbases.test (1370 of 2355)
PASS: lldb-shell :: ObjectFile/PECOFF/symbol.yaml (1371 of 2355)
PASS: lldb-unit :: Utility/./UtilityTests/DeserializerTest.HasData (1372 of 2355)
PASS: lldb-unit :: Utility/./UtilityTests/StreamTest.AddressRange (1373 of 2355)
PASS: lldb-unit :: UnwindAssembly/x86/./UnwindAssemblyx86Tests/Testx86AssemblyInspectionEngine.TestStackRealignMSVC_i386 (1374 of 2355)
PASS: lldb-unit :: Utility/./UtilityTests/StreamTest.PutHex8 (1375 of 2355)
PASS: lldb-unit :: Symbol/./SymbolTests/LineEntryTest.GetSameLineContiguousAddressRangeOneInline (1376 of 2355)
PASS: lldb-unit :: Utility/./UtilityTests/StateTest.Formatv (1377 of 2355)
PASS: lldb-api :: lang/cpp/bitfields/TestCppBitfields.py (1378 of 2355)
PASS: lldb-api :: commands/watchpoints/watchpoint_count/TestWatchpointCount.py (1379 of 2355)
PASS: lldb-unit :: Utility/./UtilityTests/ArchSpecTest.TestParseMachCPUDashSubtypeTripleExtra (1380 of 2355)
UNSUPPORTED: lldb-api :: commands/trace/TestTraceDumpInstructions.py (1381 of 2355)
PASS: lldb-unit :: Utility/./UtilityTests/Flags.AnyClear (1382 of 2355)
PASS: lldb-api :: functionalities/data-formatter/builtin-formats/TestBuiltinFormats.py (1383 of 2355)
UNSUPPORTED: lldb-shell :: ScriptInterpreter/Lua/lua-python.test (1384 of 2355)
PASS: lldb-shell :: Register/Core/x86-32-linux-fp.test (1385 of 2355)
PASS: lldb-shell :: Settings/TestDisassemblyFormat.test (1386 of 2355)
PASS: lldb-api :: functionalities/data-formatter/data-formatter-named-summaries/TestDataFormatterNamedSummaries.py (1387 of 2355)
PASS: lldb-unit :: Utility/./UtilityTests/BinaryStreamTest.PutSLEB128SixBytes (1388 of 2355)
UNSUPPORTED: lldb-shell :: ScriptInterpreter/Lua/lua.test (1389 of 2355)
PASS: lldb-api :: functionalities/data-formatter/data-formatter-stl/libcxx/atomic/TestLibCxxAtomic.py (1390 of 2355)
PASS: lldb-api :: commands/command/delete/TestCommandDelete.py (1391 of 2355)
PASS: lldb-unit :: ObjectFile/Breakpad/./ObjectFileBreakpadTests/LineRecord.parse (1392 of 2355)
PASS: lldb-api :: functionalities/load_unload/TestLoadUnload.py (1393 of 2355)
PASS: lldb-unit :: Utility/./UtilityTests/StringListTest.InsertStringAtIndexEnd (1394 of 2355)
PASS: lldb-api :: python_api/target/TestTargetAPI.py (1395 of 2355)
PASS: lldb-unit :: Utility/./UtilityTests/StreamTeeTest.Flush (1396 of 2355)
PASS: lldb-api :: lang/cpp/char1632_t/TestChar1632T.py (1397 of 2355)
PASS: lldb-api :: python_api/get-value-32bit-int/TestGetValue32BitInt.py (1398 of 2355)
PASS: lldb-api :: functionalities/value_md5_crash/TestValueMD5Crash.py (1399 of 2355)
PASS: lldb-unit :: Core/./LLDBCoreTests/StreamCallbackTest.Callback (1400 of 2355)
PASS: lldb-unit :: Utility/./UtilityTests/BinaryStreamTest.PutSLEB128One (1401 of 2355)
PASS: lldb-api :: types/TestCharTypeExpr.py (1402 of 2355)
PASS: lldb-shell :: SymbolFile/DWARF/x86/DW_TAG_variable-DW_AT_const_value.s (1403 of 2355)
PASS: lldb-unit :: Utility/./UtilityTests/ArgsTest.AppendArguments (1404 of 2355)
PASS: lldb-api :: functionalities/memory/tag/TestMemoryTag.py (1405 of 2355)
PASS: lldb-api :: python_api/module_section/TestModuleAndSection.py (1406 of 2355)
PASS: lldb-unit :: API/./APITests/SBCommandInterpreterTest.SingleWordCommand (1407 of 2355)
PASS: lldb-unit :: Expression/./ExpressionTests/CppModuleConfigurationTest.MissingLibCpp (1408 of 2355)
PASS: lldb-unit :: Target/./TargetTests/StackFrameRecognizerTest.NullModuleRegex (1409 of 2355)
PASS: lldb-api :: lang/objc/foundation/TestObjCMethods2.py (1410 of 2355)
PASS: lldb-api :: functionalities/gdb_remote_client/TestPartialGPacket.py (1411 of 2355)
PASS: lldb-unit :: Utility/./UtilityTests/StringListTest.PopBack (1412 of 2355)
PASS: lldb-unit :: SymbolFile/DWARF/./SymbolFileDWARFTests/DWARFASTParserClangTests.EnsureAllDIEsInDeclContextHaveBeenParsedParsesOnlyMatchingEntries (1413 of 2355)
PASS: lldb-unit :: Host/./HostTests/MainLoopTest.ReadObject (1414 of 2355)
PASS: lldb-api :: functionalities/thread/state_after_expression/TestStateAfterExpression.py (1415 of 2355)
UNSUPPORTED: lldb-shell :: Register/x86-64-ymm16-write.test (1416 of 2355)
PASS: lldb-unit :: Utility/./UtilityTests/StreamTest.PutRawBytesToBigEndian (1417 of 2355)
PASS: lldb-api :: tools/lldb-vscode/coreFile/TestVSCode_coreFile.py (1418 of 2355)
PASS: lldb-api :: lang/cpp/virtual-functions/TestCppVirtualFunctions.py (1419 of 2355)
PASS: lldb-unit :: Symbol/./SymbolTests/PostfixExpression.ToDWARF (1420 of 2355)
PASS: lldb-unit :: SymbolFile/NativePDB/./SymbolFileNativePDBTests/PDBFPOProgramToDWARFExpressionTests.InvalidOpBinary (1421 of 2355)
PASS: lldb-unit :: Host/./HostTests/SocketTests/SocketTest.TCPGetAddress/ipv4 (1422 of 2355)
PASS: lldb-api :: lang/c/function_types/TestFunctionTypes.py (1423 of 2355)
PASS: lldb-api :: functionalities/thread/num_threads/TestNumThreads.py (1424 of 2355)
PASS: lldb-unit :: Language/Highlighting/./HighlighterTests/HighlighterTest.ClangCursorPosEndOfLine (1425 of 2355)
PASS: lldb-api :: lang/objc/foundation/TestObjCMethodsNSError.py (1426 of 2355)
PASS: lldb-unit :: Host/./HostTests/FileSystemTest.EmptyTest (1427 of 2355)
PASS: lldb-unit :: Process/minidump/./LLDBMinidumpTests/MinidumpParserTest.MinidumpDuplicateModuleMappedSecondHigh (1428 of 2355)
PASS: lldb-unit :: Host/./HostTests/ConnectionFileDescriptorTest.TCPGetURIv6 (1429 of 2355)
UNSUPPORTED: lldb-api :: macosx/posix_spawn/TestLaunchProcessPosixSpawn.py (1430 of 2355)
PASS: lldb-unit :: Language/CPlusPlus/./LanguageCPlusPlusTests/CPlusPlusLanguage.MethodNameParsing (1431 of 2355)
UNSUPPORTED: lldb-api :: iohandler/resize/TestIOHandlerResize.py (1432 of 2355)
PASS: lldb-shell :: SymbolFile/DWARF/x86/dwarf5-split.s (1433 of 2355)
PASS: lldb-unit :: Host/./HostTests/FileSystemTest.Resolve (1434 of 2355)
PASS: lldb-shell :: Reproducer/TestDiscard.test (1435 of 2355)
UNSUPPORTED: lldb-shell :: Register/x86-64-zmm-write.test (1436 of 2355)
PASS: lldb-shell :: Settings/TestFrameFormatNoColor.test (1437 of 2355)
PASS: lldb-api :: lang/cpp/class_types/TestClassTypesDisassembly.py (1438 of 2355)
PASS: lldb-api :: functionalities/breakpoint/breakpoint_conditions/TestBreakpointConditions.py (1439 of 2355)
PASS: lldb-api :: functionalities/data-formatter/data-formatter-caching/TestDataFormatterCaching.py (1440 of 2355)
PASS: lldb-shell :: BuildScript/toolchain-clang.test (1441 of 2355)
PASS: lldb-api :: lang/cpp/dereferencing_references/TestCPPDereferencingReferences.py (1442 of 2355)
PASS: lldb-api :: python_api/symbol-context/TestSymbolContext.py (1443 of 2355)
PASS: lldb-api :: functionalities/gdb_remote_client/TestMemoryRegionDirtyPages.py (1444 of 2355)
PASS: lldb-unit :: Host/./HostTests/NativeProcessProtocolTest.ReadCStringFromMemory_CrossPageBoundary (1445 of 2355)
PASS: lldb-unit :: Utility/./UtilityTests/StatusTest.ErrorCodeConstructor (1446 of 2355)
PASS: lldb-unit :: ScriptInterpreter/Python/./ScriptInterpreterPythonTests/PythonDataObjectsTest.TestPythonIntegerToStructuredInteger (1447 of 2355)
PASS: lldb-unit :: Symbol/./SymbolTests/TestClangASTImporter.CopyTypeTagDecl (1448 of 2355)
PASS: lldb-api :: lang/c/blocks/TestBlocks.py (1449 of 2355)
PASS: lldb-unit :: Expression/./ExpressionTests/DWARFExpression.DW_OP_unknown (1450 of 2355)
PASS: lldb-shell :: Commands/command-script-import.test (1451 of 2355)
PASS: lldb-unit :: Utility/./UtilityTests/VMRange.Ordering (1452 of 2355)
PASS: lldb-unit :: Utility/./UtilityTests/DataExtractorTest.GetFloat (1453 of 2355)
PASS: lldb-api :: tools/lldb-server/TestAppleSimulatorOSType.py (1454 of 2355)
PASS: lldb-shell :: ObjectFile/Breakpad/sections.test (1455 of 2355)
PASS: lldb-unit :: Utility/./UtilityTests/StreamTest.PutMaxHex64ByteOrderLittle (1456 of 2355)
PASS: lldb-api :: lang/objc/orderedset/TestOrderedSet.py (1457 of 2355)
PASS: lldb-unit :: ScriptInterpreter/Python/./ScriptInterpreterPythonTests/PythonDataObjectsTest.TestPythonStringToStructuredString (1458 of 2355)
PASS: lldb-unit :: Symbol/./SymbolTests/SymbolsTest.LocateExecutableSymbolFileForUnknownExecutableAndMissingSymbolFile (1459 of 2355)
PASS: lldb-unit :: Language/Highlighting/./HighlighterTests/HighlighterTest.ClangCursorPosAfterOtherToken (1460 of 2355)
PASS: lldb-unit :: Utility/./UtilityTests/ScalarTest.Getters (1461 of 2355)
PASS: lldb-unit :: Process/minidump/./LLDBMinidumpTests/MinidumpParserTest.GetArchitecture (1462 of 2355)
PASS: lldb-api :: functionalities/postmortem/minidump-new/TestMiniDumpUUID.py (1463 of 2355)
UNSUPPORTED: lldb-api :: commands/register/register/intel_xtended_registers/mpx_bound_violation/TestBoundViolation.py (1464 of 2355)
PASS: lldb-unit :: ScriptInterpreter/Python/./ScriptInterpreterPythonTests/PythonDataObjectsTest.TestPythonIntegerToStr (1465 of 2355)
PASS: lldb-api :: lang/objc/single-entry-dictionary/TestObjCSingleEntryDictionary.py (1466 of 2355)
PASS: lldb-unit :: UnwindAssembly/x86/./UnwindAssemblyx86Tests/Testx86AssemblyInspectionEngine.TestSimple32bitFrameFunction (1467 of 2355)
PASS: lldb-shell :: ScriptInterpreter/None/none.test (1468 of 2355)
PASS: lldb-api :: functionalities/thread/backtrace_limit/TestBacktraceLimit.py (1469 of 2355)
PASS: lldb-shell :: Process/UnsupportedLanguage.test (1470 of 2355)
PASS: lldb-api :: functionalities/plugins/python_os_plugin/stepping_plugin_threads/TestOSPluginStepping.py (1471 of 2355)
PASS: lldb-api :: functionalities/data-formatter/data-formatter-stl/libcxx/vector/TestDataFormatterLibcxxVector.py (1472 of 2355)
PASS: lldb-shell :: Breakpoint/case-sensitive.test (1473 of 2355)
PASS: lldb-unit :: Utility/./UtilityTests/Predicate.WaitForValueNotEqualTo (1474 of 2355)
PASS: lldb-unit :: Core/./LLDBCoreTests/SourceLocationSpecTest.FileLineColumnComponents (1475 of 2355)
PASS: lldb-unit :: Utility/./UtilityTests/XcodeSDKTest.ParseTest (1476 of 2355)
PASS: lldb-unit :: Process/Utility/./ProcessUtilityTests/RegisterContext_x86Test.FullToAbridgedTagWord (1477 of 2355)
PASS: lldb-unit :: Utility/./UtilityTests/ScalarTest.GetBytes (1478 of 2355)
PASS: lldb-api :: commands/frame/var/TestFrameVar.py (1479 of 2355)
PASS: lldb-api :: lang/objc/modules-incomplete/TestIncompleteModules.py (1480 of 2355)
PASS: lldb-api :: functionalities/breakpoint/breakpoint_by_file_colon_line/TestBreakpointByFileColonLine.py (1481 of 2355)
PASS: lldb-shell :: Commands/CommandScriptImmediateOutput/CommandScriptImmediateOutputConsole.test (1482 of 2355)
PASS: lldb-shell :: SymbolFile/DWARF/x86/debug_ranges.s (1483 of 2355)
PASS: lldb-shell :: Driver/TestNoUseColor.test (1484 of 2355)
PASS: lldb-api :: python_api/interpreter/TestCommandInterpreterAPI.py (1485 of 2355)
PASS: lldb-unit :: Utility/./UtilityTests/StringExtractorTest.GetHexBytes_Underflow (1486 of 2355)
PASS: lldb-api :: functionalities/data-formatter/ostypeformatting/TestFormattersOsType.py (1487 of 2355)
PASS: lldb-shell :: SymbolFile/DWARF/x86/debug_loc-aslr.s (1488 of 2355)
PASS: lldb-unit :: Symbol/./SymbolTests/TestTypeSystemClang.TestGetBasicTypeFromEnum (1489 of 2355)
PASS: lldb-unit :: Utility/./UtilityTests/CompletionRequest.TryCompleteCurrentArgBad (1490 of 2355)
UNSUPPORTED: lldb-api :: functionalities/data-formatter/data-formatter-stl/libstdcpp/map/TestDataFormatterStdMap.py (1491 of 2355)
PASS: lldb-unit :: Utility/./UtilityTests/StreamTest.AddressSuffix (1492 of 2355)
PASS: lldb-api :: lang/cpp/this_class_type_mixing/TestThisClassTypeMixing.py (1493 of 2355)
PASS: lldb-unit :: Expression/./ExpressionTests/DWARFExpression.DW_OP_piece (1494 of 2355)
PASS: lldb-unit :: ObjectFile/Breakpad/./ObjectFileBreakpadTests/StackCFIRecord.parse (1495 of 2355)
PASS: lldb-unit :: Symbol/./SymbolTests/TestTypeSystemClang.TestUnifyAccessSpecifiers (1496 of 2355)
PASS: lldb-api :: commands/process/signal/TestProcessSignal.py (1497 of 2355)
PASS: lldb-api :: lang/objc/cpp_keyword_identifiers/TestCppKeywordsAsObjCIdentifiers.py (1498 of 2355)
PASS: lldb-unit :: SymbolFile/DWARF/./SymbolFileDWARFTests/SymbolFileDWARFTests.TestAbbrevOutOfOrder (1499 of 2355)
PASS: lldb-shell :: Register/Core/x86-32-netbsd-gp.test (1500 of 2355)
PASS: lldb-api :: functionalities/gdb_remote_client/TestGDBRemoteLoad.py (1501 of 2355)
UNSUPPORTED: lldb-api :: functionalities/breakpoint/breakpoint_in_delayslot/TestAvoidBreakpointInDelaySlot.py (1502 of 2355)
PASS: lldb-unit :: Utility/./UtilityTests/BinaryStreamTest.PutULEB128TwoBytes (1503 of 2355)
PASS: lldb-api :: lang/cpp/break-on-initializers/TestBreakOnCPP11Initializers.py (1504 of 2355)
PASS: lldb-api :: functionalities/thread/concurrent_events/TestConcurrentSignalDelayBreak.py (1505 of 2355)
PASS: lldb-unit :: Utility/./UtilityTests/OptionsWithRawTest.EmptyArgsOnlySuffix (1506 of 2355)
PASS: lldb-shell :: SymbolFile/NativePDB/global-classes.cpp (1507 of 2355)
PASS: lldb-shell :: Driver/TestCommands.test (1508 of 2355)
PASS: lldb-unit :: Host/./HostTests/HostInfoTestInitialization.InitTwice (1509 of 2355)
PASS: lldb-unit :: Symbol/./SymbolTests/TestTypeSystemClang.TestGetEnumIntegerTypeUnexpectedType (1510 of 2355)
PASS: lldb-api :: python_api/exprpath_synthetic/TestExprPathSynthetic.py (1511 of 2355)
PASS: lldb-unit :: Utility/./UtilityTests/FileSpecTest.Yaml (1512 of 2355)
FAIL: lldb-api :: tools/lldb-vscode/breakpoint/TestVSCode_setBreakpoints.py (1513 of 2355)
******************** TEST 'lldb-api :: tools/lldb-vscode/breakpoint/TestVSCode_setBreakpoints.py' FAILED ********************
Script:
--
/Users/buildslave/jenkins/workspace/lldb-cmake-sanitized/lldb-build/lldb-test-build.noindex/copied-python /Users/buildslave/jenkins/workspace/lldb-cmake-sanitized/llvm-project/lldb/test/API/dotest.py -u CXXFLAGS -u CFLAGS --codesign-identity lldb_codesign --arch x86_64 --build-dir /Users/buildslave/jenkins/workspace/lldb-cmake-sanitized/lldb-build/lldb-test-build.noindex -t --env TERM=vt100 --env LLVM_LIBS_DIR=/Users/buildslave/jenkins/workspace/lldb-cmake-sanitized/lldb-build/./lib --inferior-env ASAN_OPTIONS=detect_stack_use_after_return=1 --inferior-env DYLD_INSERT_LIBRARIES=/Users/buildslave/jenkins/workspace/lldb-cmake-sanitized/host-compiler/lib/clang/13.0.99/lib/darwin/libclang_rt.asan_osx_dynamic.dylib --arch x86_64 --build-dir /Users/buildslave/jenkins/workspace/lldb-cmake-sanitized/lldb-build/lldb-test-build.noindex --lldb-module-cache-dir /Users/buildslave/jenkins/workspace/lldb-cmake-sanitized/lldb-build/lldb-test-build.noindex/module-cache-lldb/lldb-api --clang-module-cache-dir /Users/buildslave/jenkins/workspace/lldb-cmake-sanitized/lldb-build/lldb-test-build.noindex/module-cache-clang/lldb-api --executable /Users/buildslave/jenkins/workspace/lldb-cmake-sanitized/lldb-build/./bin/lldb --compiler /Users/buildslave/jenkins/workspace/lldb-cmake-sanitized/host-compiler/bin/clang --dsymutil /Users/buildslave/jenkins/workspace/lldb-cmake-sanitized/lldb-build/./bin/dsymutil --llvm-tools-dir /Users/buildslave/jenkins/workspace/lldb-cmake-sanitized/lldb-build/./bin --lldb-libs-dir /Users/buildslave/jenkins/workspace/lldb-cmake-sanitized/lldb-build/./lib /Users/buildslave/jenkins/workspace/lldb-cmake-sanitized/llvm-project/lldb/test/API/tools/lldb-vscode/breakpoint -p TestVSCode_setBreakpoints.py
--
Exit Code: 1

Hide Details

Command Output (stdout): -- lldb version 13.0.99 (http://labmaster3.local/git/llvm-project.git revision 338a3f495ea4765b05612598e732c0d45dff3edc) clang revision 338a3f495ea4765b05612598e732c0d45dff3edc llvm revision 338a3f495ea4765b05612598e732c0d45dff3edc Skipping the following test categories: ['darwin-log', 'libstdcxx', 'dwo', 'llgs', 'fork'] ========= DEBUG ADAPTER PROTOCOL LOGS ========= --> Content-Length: 284

Hide Details

{"command":"initialize","type":"request","arguments":{"adapterID":"lldb-native","clientID":"vscode","columnsStartAt1":true,"linesStartAt1":true,"locale":"en-us","pathFormat":"path","supportsRunInTerminalRequest":true,"supportsVariablePaging":true,"supportsVariableType":true},"seq":1} <-- Content-Length: 1222

Hide Details

{"body":{"exceptionBreakpointFilters":[{"default":false,"filter":"cpp_catch","label":"C++ Catch"},{"default":false,"filter":"cpp_throw","label":"C++ Throw"},{"default":false,"filter":"objc_catch","label":"Objective C Catch"},{"default":false,"filter":"objc_throw","label":"Objective C Throw"},{"default":false,"filter":"swift_catch","label":"Swift Catch"},{"default":false,"filter":"swift_throw","label":"Swift Throw"}],"supportTerminateDebuggee":true,"supportsCompletionsRequest":false,"supportsConditionalBreakpoints":true,"supportsConfigurationDoneRequest":true,"supportsDelayedStackTraceLoading":true,"supportsEvaluateForHovers":true,"supportsExceptionInfoRequest":true,"supportsExceptionOptions":true,"supportsFunctionBreakpoints":true,"supportsGotoTargetsRequest":false,"supportsHitConditionalBreakpoints":true,"supportsLoadedSourcesRequest":false,"supportsModulesRequest":false,"supportsProgressReporting":true,"supportsRestartFrame":false,"supportsRestartRequest":false,"supportsRunInTerminalRequest":true,"supportsSetVariable":true,"supportsStepBack":false,"supportsStepInTargetsRequest":false,"supportsValueFormattingOptions":true},"command":"initialize","request_seq":1,"seq":0,"success":true,"type":"response"} --> Content-Length: 1058

Hide Details

{"command":"launch","type":"request","arguments":{"program":"/Users/buildslave/jenkins/workspace/lldb-cmake-sanitized/lldb-build/lldb-test-build.noindex/tools/lldb-vscode/breakpoint/TestVSCode_setBreakpoints.test_clear_breakpoints_unset_breakpoints/a.out","disableASLR":true,"initCommands":["settings clear -all","settings set symbols.enable-external-lookup false","settings set target.inherit-tcc true","settings set target.detach-on-error false","settings set target.auto-apply-fixits false","settings set plugin.process.gdb-remote.packet-timeout 60","settings set symbols.clang-modules-cache-path \"/Users/buildslave/jenkins/workspace/lldb-cmake-sanitized/lldb-build/lldb-test-build.noindex/module-cache-lldb/lldb-api\"","settings set use-color false","setting set target.prefer-dynamic-value no-dynamic-values","settings set target.env-vars ASAN_OPTIONS=detect_stack_use_after_return=1 DYLD_INSERT_LIBRARIES=/Users/buildslave/jenkins/workspace/lldb-cmake-sanitized/host-compiler/lib/clang/13.0.99/lib/darwin/libclang_rt.asan_osx_dynamic.dylib"]},"seq":2} <-- Content-Length: 923

Hide Details

{"body":{"category":"console","output":"Running initCommands:\n(lldb) settings clear -all\n(lldb) settings set symbols.enable-external-lookup false\n(lldb) settings set target.inherit-tcc true\n(lldb) settings set target.detach-on-error false\n(lldb) settings set target.auto-apply-fixits false\n(lldb) settings set plugin.process.gdb-remote.packet-timeout 60\n(lldb) settings set symbols.clang-modules-cache-path \"/Users/buildslave/jenkins/workspace/lldb-cmake-sanitized/lldb-build/lldb-test-build.noindex/module-cache-lldb/lldb-api\"\n(lldb) settings set use-color false\n(lldb) setting set target.prefer-dynamic-value no-dynamic-values\n(lldb) settings set target.env-vars ASAN_OPTIONS=detect_stack_use_after_return=1 DYLD_INSERT_LIBRARIES=/Users/buildslave/jenkins/workspace/lldb-cmake-sanitized/host-compiler/lib/clang/13.0.99/lib/darwin/libclang_rt.asan_osx_dynamic.dylib\n"},"event":"output","seq":0,"type":"event"} <-- Content-Length: 77

Hide Details

{"command":"launch","request_seq":2,"seq":0,"success":true,"type":"response"} <-- Content-Length: 323

Hide Details

{"body":{"isLocalProcess":true,"name":"/Users/buildslave/jenkins/workspace/lldb-cmake-sanitized/lldb-build/lldb-test-build.noindex/tools/lldb-vscode/breakpoint/TestVSCode_setBreakpoints.test_clear_breakpoints_unset_breakpoints/a.out","startMethod":"launch","systemProcessId":50355},"event":"process","seq":0,"type":"event"} <-- Content-Length: 46

Hide Details

{"event":"initialized","seq":0,"type":"event"} --> Content-Length: 392

Hide Details

{"command":"setBreakpoints","type":"request","arguments":{"source":{"name":"main-copy.cpp","path":"/Users/buildslave/jenkins/workspace/lldb-cmake-sanitized/lldb-build/lldb-test-build.noindex/tools/lldb-vscode/breakpoint/TestVSCode_setBreakpoints.test_clear_breakpoints_unset_breakpoints/main-copy.cpp"},"sourceModified":false,"lines":"[6, 10]","breakpoints":[{"line":6},{"line":10}]},"seq":3} <-- Content-Length: 669

Hide Details

{"body":{"breakpoints":[{"id":1,"line":6,"source":{"name":"main-copy.cpp","path":"/Users/buildslave/jenkins/workspace/lldb-cmake-sanitized/lldb-build/lldb-test-build.noindex/tools/lldb-vscode/breakpoint/TestVSCode_setBreakpoints.test_clear_breakpoints_unset_breakpoints/main-copy.cpp"},"verified":true},{"id":2,"line":10,"source":{"name":"main-copy.cpp","path":"/Users/buildslave/jenkins/workspace/lldb-cmake-sanitized/lldb-build/lldb-test-build.noindex/tools/lldb-vscode/breakpoint/TestVSCode_setBreakpoints.test_clear_breakpoints_unset_breakpoints/main-copy.cpp"},"verified":true}]},"command":"setBreakpoints","request_seq":3,"seq":0,"success":true,"type":"response"} --> Content-Length: 335

Hide Details

{"command":"setBreakpoints","type":"request","arguments":{"source":{"name":"main-copy.cpp","path":"/Users/buildslave/jenkins/workspace/lldb-cmake-sanitized/lldb-build/lldb-test-build.noindex/tools/lldb-vscode/breakpoint/TestVSCode_setBreakpoints.test_clear_breakpoints_unset_breakpoints/main-copy.cpp"},"sourceModified":false},"seq":4} <-- Content-Length: 111

Hide Details

{"body":{"breakpoints":[]},"command":"setBreakpoints","request_seq":4,"seq":0,"success":true,"type":"response"} --> Content-Length: 79

Hide Details

{"command":"_testGetTargetBreakpoints","type":"request","arguments":{},"seq":5} <-- Content-Length: 122

Hide Details

{"body":{"breakpoints":[]},"command":"_testGetTargetBreakpoints","request_seq":5,"seq":0,"success":true,"type":"response"} --> Content-Length: 88

Hide Details

{"command":"disconnect","type":"request","arguments":{"terminateDebuggee":true},"seq":6} <-- Content-Length: 45

Hide Details

{"event":"terminated","seq":0,"type":"event"} <-- Content-Length: 63

Hide Details

{"body":{"exitCode":9},"event":"exited","seq":0,"type":"event"} <-- Content-Length: 81

Hide Details

{"command":"disconnect","request_seq":6,"seq":0,"success":true,"type":"response"}

Hide Details

========= END ========= ========= DEBUG ADAPTER PROTOCOL LOGS ========= --> Content-Length: 284

Hide Details

{"command":"initialize","type":"request","arguments":{"adapterID":"lldb-native","clientID":"vscode","columnsStartAt1":true,"linesStartAt1":true,"locale":"en-us","pathFormat":"path","supportsRunInTerminalRequest":true,"supportsVariablePaging":true,"supportsVariableType":true},"seq":1} <-- Content-Length: 1222

Hide Details

{"body":{"exceptionBreakpointFilters":[{"default":false,"filter":"cpp_catch","label":"C++ Catch"},{"default":false,"filter":"cpp_throw","label":"C++ Throw"},{"default":false,"filter":"objc_catch","label":"Objective C Catch"},{"default":false,"filter":"objc_throw","label":"Objective C Throw"},{"default":false,"filter":"swift_catch","label":"Swift Catch"},{"default":false,"filter":"swift_throw","label":"Swift Throw"}],"supportTerminateDebuggee":true,"supportsCompletionsRequest":false,"supportsConditionalBreakpoints":true,"supportsConfigurationDoneRequest":true,"supportsDelayedStackTraceLoading":true,"supportsEvaluateForHovers":true,"supportsExceptionInfoRequest":true,"supportsExceptionOptions":true,"supportsFunctionBreakpoints":true,"supportsGotoTargetsRequest":false,"supportsHitConditionalBreakpoints":true,"supportsLoadedSourcesRequest":false,"supportsModulesRequest":false,"supportsProgressReporting":true,"supportsRestartFrame":false,"supportsRestartRequest":false,"supportsRunInTerminalRequest":true,"supportsSetVariable":true,"supportsStepBack":false,"supportsStepInTargetsRequest":false,"supportsValueFormattingOptions":true},"command":"initialize","request_seq":1,"seq":0,"success":true,"type":"response"} --> Content-Length: 1036

Hide Details

{"command":"launch","type":"request","arguments":{"program":"/Users/buildslave/jenkins/workspace/lldb-cmake-sanitized/lldb-build/lldb-test-build.noindex/tools/lldb-vscode/breakpoint/TestVSCode_setBreakpoints.test_functionality/a.out","disableASLR":true,"initCommands":["settings clear -all","settings set symbols.enable-external-lookup false","settings set target.inherit-tcc true","settings set target.detach-on-error false","settings set target.auto-apply-fixits false","settings set plugin.process.gdb-remote.packet-timeout 60","settings set symbols.clang-modules-cache-path \"/Users/buildslave/jenkins/workspace/lldb-cmake-sanitized/lldb-build/lldb-test-build.noindex/module-cache-lldb/lldb-api\"","settings set use-color false","setting set target.prefer-dynamic-value no-dynamic-values","settings set target.env-vars ASAN_OPTIONS=detect_stack_use_after_return=1 DYLD_INSERT_LIBRARIES=/Users/buildslave/jenkins/workspace/lldb-cmake-sanitized/host-compiler/lib/clang/13.0.99/lib/darwin/libclang_rt.asan_osx_dynamic.dylib"]},"seq":2} <-- Content-Length: 923

Hide Details

{"body":{"category":"console","output":"Running initCommands:\n(lldb) settings clear -all\n(lldb) settings set symbols.enable-external-lookup false\n(lldb) settings set target.inherit-tcc true\n(lldb) settings set target.detach-on-error false\n(lldb) settings set target.auto-apply-fixits false\n(lldb) settings set plugin.process.gdb-remote.packet-timeout 60\n(lldb) settings set symbols.clang-modules-cache-path \"/Users/buildslave/jenkins/workspace/lldb-cmake-sanitized/lldb-build/lldb-test-build.noindex/module-cache-lldb/lldb-api\"\n(lldb) settings set use-color false\n(lldb) setting set target.prefer-dynamic-value no-dynamic-values\n(lldb) settings set target.env-vars ASAN_OPTIONS=detect_stack_use_after_return=1 DYLD_INSERT_LIBRARIES=/Users/buildslave/jenkins/workspace/lldb-cmake-sanitized/host-compiler/lib/clang/13.0.99/lib/darwin/libclang_rt.asan_osx_dynamic.dylib\n"},"event":"output","seq":0,"type":"event"} <-- Content-Length: 77

Hide Details

{"command":"launch","request_seq":2,"seq":0,"success":true,"type":"response"} <-- Content-Length: 301

Hide Details

{"body":{"isLocalProcess":true,"name":"/Users/buildslave/jenkins/workspace/lldb-cmake-sanitized/lldb-build/lldb-test-build.noindex/tools/lldb-vscode/breakpoint/TestVSCode_setBreakpoints.test_functionality/a.out","startMethod":"launch","systemProcessId":50407},"event":"process","seq":0,"type":"event"} <-- Content-Length: 46

Hide Details

{"event":"initialized","seq":0,"type":"event"} --> Content-Length: 356

Hide Details

{"command":"setBreakpoints","type":"request","arguments":{"source":{"name":"main-copy.cpp","path":"/Users/buildslave/jenkins/workspace/lldb-cmake-sanitized/lldb-build/lldb-test-build.noindex/tools/lldb-vscode/breakpoint/TestVSCode_setBreakpoints.test_functionality/main-copy.cpp"},"sourceModified":false,"lines":"[39]","breakpoints":[{"line":39}]},"seq":3} <-- Content-Length: 368

Hide Details

{"body":{"breakpoints":[{"id":1,"line":39,"source":{"name":"main-copy.cpp","path":"/Users/buildslave/jenkins/workspace/lldb-cmake-sanitized/lldb-build/lldb-test-build.noindex/tools/lldb-vscode/breakpoint/TestVSCode_setBreakpoints.test_functionality/main-copy.cpp"},"verified":true}]},"command":"setBreakpoints","request_seq":3,"seq":0,"success":true,"type":"response"} --> Content-Length: 71

Hide Details

{"command":"configurationDone","type":"request","arguments":{},"seq":4} <-- Content-Length: 88

Hide Details

{"command":"configurationDone","request_seq":4,"seq":0,"success":true,"type":"response"} <-- Content-Length: 198

Hide Details

{"body":{"allThreadsStopped":true,"description":"breakpoint 1.1","preserveFocusHint":false,"reason":"breakpoint","threadCausedFocus":true,"threadId":243775},"event":"stopped","seq":0,"type":"event"} --> Content-Length: 61

Hide Details

{"command":"threads","type":"request","arguments":{},"seq":5} <-- Content-Length: 132

Hide Details

{"body":{"threads":[{"id":243775,"name":"Thread #1"}]},"command":"threads","request_seq":5,"seq":0,"success":true,"type":"response"} --> Content-Length: 107

Hide Details

{"command":"stackTrace","type":"request","arguments":{"threadId":243775,"startFrame":0,"levels":1},"seq":6} <-- Content-Length: 395

Hide Details

{"body":{"stackFrames":[{"column":20,"id":524288,"line":39,"name":"main","source":{"name":"main-copy.cpp","path":"/Users/buildslave/jenkins/workspace/lldb-cmake-sanitized/lldb-build/lldb-test-build.noindex/tools/lldb-vscode/breakpoint/TestVSCode_setBreakpoints.test_functionality/main-copy.cpp"}}],"totalFrames":2},"command":"stackTrace","request_seq":6,"seq":0,"success":true,"type":"response"} --> Content-Length: 76

Hide Details

{"command":"scopes","type":"request","arguments":{"frameId":524288},"seq":7} <-- Content-Length: 335

Hide Details

{"body":{"scopes":[{"expensive":false,"name":"Locals","namedVariables":7,"variablesReference":1},{"expensive":false,"name":"Globals","namedVariables":0,"variablesReference":2},{"expensive":false,"name":"Registers","namedVariables":3,"variablesReference":3}]},"command":"scopes","request_seq":7,"seq":0,"success":true,"type":"response"} --> Content-Length: 85

Hide Details

{"command":"variables","type":"request","arguments":{"variablesReference":1},"seq":8} <-- Content-Length: 919

Hide Details

{"body":{"variables":[{"evaluateName":"argc","id":0,"name":"argc","type":"int","value":"1","variablesReference":0},{"evaluateName":"argv","id":1,"name":"argv","type":"const char **","value":"0x00007ffeefbff810","variablesReference":5},{"evaluateName":"libother_name","id":2,"name":"libother_name","type":"const char *","value":"0x0000000100000f44 \"libother.dylib\"","variablesReference":6},{"evaluateName":"handle","id":3,"name":"handle","type":"void *","value":"0x000060f0000007c0","variablesReference":7},{"evaluateName":"foo","id":4,"name":"foo","type":"int (*)(int)","value":"0x000000010424af90 (libother.dylib`foo at other-copy.c:1)","variablesReference":8},{"evaluateName":"i","id":5,"name":"i","type":"int","value":"0","variablesReference":0},{"evaluateName":"x","id":6,"name":"x","type":"int","value":"0","variablesReference":0}]},"command":"variables","request_seq":8,"seq":0,"success":true,"type":"response"} --> Content-Length: 375

Hide Details

{"command":"setBreakpoints","type":"request","arguments":{"source":{"name":"main-copy.cpp","path":"/Users/buildslave/jenkins/workspace/lldb-cmake-sanitized/lldb-build/lldb-test-build.noindex/tools/lldb-vscode/breakpoint/TestVSCode_setBreakpoints.test_functionality/main-copy.cpp"},"sourceModified":false,"lines":"[39]","breakpoints":[{"line":39,"condition":"i==4"}]},"seq":9} <-- Content-Length: 368

Hide Details

{"body":{"breakpoints":[{"id":1,"line":39,"source":{"name":"main-copy.cpp","path":"/Users/buildslave/jenkins/workspace/lldb-cmake-sanitized/lldb-build/lldb-test-build.noindex/tools/lldb-vscode/breakpoint/TestVSCode_setBreakpoints.test_functionality/main-copy.cpp"},"verified":true}]},"command":"setBreakpoints","request_seq":9,"seq":0,"success":true,"type":"response"} --> Content-Length: 80

Hide Details

{"command":"continue","type":"request","arguments":{"threadId":243775},"seq":10} <-- Content-Length: 116

Hide Details

{"body":{"allThreadsContinued":true},"command":"continue","request_seq":10,"seq":0,"success":true,"type":"response"} <-- Content-Length: 311

Hide Details

{"body":{"category":"console","output":"/Users/buildslave/jenkins/workspace/lldb-cmake-sanitized/llvm-project/lldb/tools/lldb-vscode/ProgressEvent.cpp:89:64: runtime error: load of value 829960214, which is not a valid value for type 'lldb_vscode::ProgressEventType'\n"},"event":"output","seq":0,"type":"event"} <-- Content-Length: 261

Hide Details

{"body":{"category":"console","output":"SUMMARY: UndefinedBehaviorSanitizer: undefined-behavior /Users/buildslave/jenkins/workspace/lldb-cmake-sanitized/llvm-project/lldb/tools/lldb-vscode/ProgressEvent.cpp:89:64 in \n"},"event":"output","seq":0,"type":"event"} <-- Content-Length: 170

Hide Details

{"body":{"category":"console","output":"PLEASE submit a bug report to https://bugs.llvm.org/ and include the crash backtrace.\n"},"event":"output","seq":0,"type":"event"}

Hide Details

========= END ========= ========= DEBUG ADAPTER PROTOCOL LOGS ========= --> Content-Length: 284

Hide Details

{"command":"initialize","type":"request","arguments":{"adapterID":"lldb-native","clientID":"vscode","columnsStartAt1":true,"linesStartAt1":true,"locale":"en-us","pathFormat":"path","supportsRunInTerminalRequest":true,"supportsVariablePaging":true,"supportsVariableType":true},"seq":1} <-- Content-Length: 1222

Hide Details

{"body":{"exceptionBreakpointFilters":[{"default":false,"filter":"cpp_catch","label":"C++ Catch"},{"default":false,"filter":"cpp_throw","label":"C++ Throw"},{"default":false,"filter":"objc_catch","label":"Objective C Catch"},{"default":false,"filter":"objc_throw","label":"Objective C Throw"},{"default":false,"filter":"swift_catch","label":"Swift Catch"},{"default":false,"filter":"swift_throw","label":"Swift Throw"}],"supportTerminateDebuggee":true,"supportsCompletionsRequest":false,"supportsConditionalBreakpoints":true,"supportsConfigurationDoneRequest":true,"supportsDelayedStackTraceLoading":true,"supportsEvaluateForHovers":true,"supportsExceptionInfoRequest":true,"supportsExceptionOptions":true,"supportsFunctionBreakpoints":true,"supportsGotoTargetsRequest":false,"supportsHitConditionalBreakpoints":true,"supportsLoadedSourcesRequest":false,"supportsModulesRequest":false,"supportsProgressReporting":true,"supportsRestartFrame":false,"supportsRestartRequest":false,"supportsRunInTerminalRequest":true,"supportsSetVariable":true,"supportsStepBack":false,"supportsStepInTargetsRequest":false,"supportsValueFormattingOptions":true},"command":"initialize","request_seq":1,"seq":0,"success":true,"type":"response"} --> Content-Length: 1036

Hide Details

{"command":"launch","type":"request","arguments":{"program":"/Users/buildslave/jenkins/workspace/lldb-cmake-sanitized/lldb-build/lldb-test-build.noindex/tools/lldb-vscode/breakpoint/TestVSCode_setBreakpoints.test_set_and_clear/a.out","disableASLR":true,"initCommands":["settings clear -all","settings set symbols.enable-external-lookup false","settings set target.inherit-tcc true","settings set target.detach-on-error false","settings set target.auto-apply-fixits false","settings set plugin.process.gdb-remote.packet-timeout 60","settings set symbols.clang-modules-cache-path \"/Users/buildslave/jenkins/workspace/lldb-cmake-sanitized/lldb-build/lldb-test-build.noindex/module-cache-lldb/lldb-api\"","settings set use-color false","setting set target.prefer-dynamic-value no-dynamic-values","settings set target.env-vars ASAN_OPTIONS=detect_stack_use_after_return=1 DYLD_INSERT_LIBRARIES=/Users/buildslave/jenkins/workspace/lldb-cmake-sanitized/host-compiler/lib/clang/13.0.99/lib/darwin/libclang_rt.asan_osx_dynamic.dylib"]},"seq":2} <-- Content-Length: 923

Hide Details

{"body":{"category":"console","output":"Running initCommands:\n(lldb) settings clear -all\n(lldb) settings set symbols.enable-external-lookup false\n(lldb) settings set target.inherit-tcc true\n(lldb) settings set target.detach-on-error false\n(lldb) settings set target.auto-apply-fixits false\n(lldb) settings set plugin.process.gdb-remote.packet-timeout 60\n(lldb) settings set symbols.clang-modules-cache-path \"/Users/buildslave/jenkins/workspace/lldb-cmake-sanitized/lldb-build/lldb-test-build.noindex/module-cache-lldb/lldb-api\"\n(lldb) settings set use-color false\n(lldb) setting set target.prefer-dynamic-value no-dynamic-values\n(lldb) settings set target.env-vars ASAN_OPTIONS=detect_stack_use_after_return=1 DYLD_INSERT_LIBRARIES=/Users/buildslave/jenkins/workspace/lldb-cmake-sanitized/host-compiler/lib/clang/13.0.99/lib/darwin/libclang_rt.asan_osx_dynamic.dylib\n"},"event":"output","seq":0,"type":"event"} <-- Content-Length: 77

Hide Details

{"command":"launch","request_seq":2,"seq":0,"success":true,"type":"response"} <-- Content-Length: 301

Hide Details

{"body":{"isLocalProcess":true,"name":"/Users/buildslave/jenkins/workspace/lldb-cmake-sanitized/lldb-build/lldb-test-build.noindex/tools/lldb-vscode/breakpoint/TestVSCode_setBreakpoints.test_set_and_clear/a.out","startMethod":"launch","systemProcessId":50492},"event":"process","seq":0,"type":"event"} <-- Content-Length: 46

Hide Details

{"event":"initialized","seq":0,"type":"event"} --> Content-Length: 386

Hide Details

{"command":"setBreakpoints","type":"request","arguments":{"source":{"name":"main-copy.cpp","path":"/Users/buildslave/jenkins/workspace/lldb-cmake-sanitized/lldb-build/lldb-test-build.noindex/tools/lldb-vscode/breakpoint/TestVSCode_setBreakpoints.test_set_and_clear/main-copy.cpp"},"sourceModified":false,"lines":"[6, 15, 10]","breakpoints":[{"line":6},{"line":15},{"line":10}]},"seq":3} <-- Content-Length: 883

Hide Details

{"body":{"breakpoints":[{"id":1,"line":6,"source":{"name":"main-copy.cpp","path":"/Users/buildslave/jenkins/workspace/lldb-cmake-sanitized/lldb-build/lldb-test-build.noindex/tools/lldb-vscode/breakpoint/TestVSCode_setBreakpoints.test_set_and_clear/main-copy.cpp"},"verified":true},{"id":2,"line":15,"source":{"name":"main-copy.cpp","path":"/Users/buildslave/jenkins/workspace/lldb-cmake-sanitized/lldb-build/lldb-test-build.noindex/tools/lldb-vscode/breakpoint/TestVSCode_setBreakpoints.test_set_and_clear/main-copy.cpp"},"verified":true},{"id":3,"line":10,"source":{"name":"main-copy.cpp","path":"/Users/buildslave/jenkins/workspace/lldb-cmake-sanitized/lldb-build/lldb-test-build.noindex/tools/lldb-vscode/breakpoint/TestVSCode_setBreakpoints.test_set_and_clear/main-copy.cpp"},"verified":true}]},"command":"setBreakpoints","request_seq":3,"seq":0,"success":true,"type":"response"} --> Content-Length: 370

Hide Details

{"command":"setBreakpoints","type":"request","arguments":{"source":{"name":"main-copy.cpp","path":"/Users/buildslave/jenkins/workspace/lldb-cmake-sanitized/lldb-build/lldb-test-build.noindex/tools/lldb-vscode/breakpoint/TestVSCode_setBreakpoints.test_set_and_clear/main-copy.cpp"},"sourceModified":false,"lines":"[6, 15]","breakpoints":[{"line":6},{"line":15}]},"seq":4} <-- Content-Length: 625

Hide Details

{"body":{"breakpoints":[{"id":1,"line":6,"source":{"name":"main-copy.cpp","path":"/Users/buildslave/jenkins/workspace/lldb-cmake-sanitized/lldb-build/lldb-test-build.noindex/tools/lldb-vscode/breakpoint/TestVSCode_setBreakpoints.test_set_and_clear/main-copy.cpp"},"verified":true},{"id":2,"line":15,"source":{"name":"main-copy.cpp","path":"/Users/buildslave/jenkins/workspace/lldb-cmake-sanitized/lldb-build/lldb-test-build.noindex/tools/lldb-vscode/breakpoint/TestVSCode_setBreakpoints.test_set_and_clear/main-copy.cpp"},"verified":true}]},"command":"setBreakpoints","request_seq":4,"seq":0,"success":true,"type":"response"} --> Content-Length: 79

Hide Details

{"command":"_testGetTargetBreakpoints","type":"request","arguments":{},"seq":5} <-- Content-Length: 636

Hide Details

{"body":{"breakpoints":[{"id":1,"line":6,"source":{"name":"main-copy.cpp","path":"/Users/buildslave/jenkins/workspace/lldb-cmake-sanitized/lldb-build/lldb-test-build.noindex/tools/lldb-vscode/breakpoint/TestVSCode_setBreakpoints.test_set_and_clear/main-copy.cpp"},"verified":true},{"id":2,"line":15,"source":{"name":"main-copy.cpp","path":"/Users/buildslave/jenkins/workspace/lldb-cmake-sanitized/lldb-build/lldb-test-build.noindex/tools/lldb-vscode/breakpoint/TestVSCode_setBreakpoints.test_set_and_clear/main-copy.cpp"},"verified":true}]},"command":"_testGetTargetBreakpoints","request_seq":5,"seq":0,"success":true,"type":"response"} --> Content-Length: 343

Hide Details

{"command":"setBreakpoints","type":"request","arguments":{"source":{"name":"main-copy.cpp","path":"/Users/buildslave/jenkins/workspace/lldb-cmake-sanitized/lldb-build/lldb-test-build.noindex/tools/lldb-vscode/breakpoint/TestVSCode_setBreakpoints.test_set_and_clear/main-copy.cpp"},"sourceModified":false,"lines":"[]","breakpoints":[]},"seq":6} <-- Content-Length: 111

Hide Details

{"body":{"breakpoints":[]},"command":"setBreakpoints","request_seq":6,"seq":0,"success":true,"type":"response"} --> Content-Length: 79

Hide Details

{"command":"_testGetTargetBreakpoints","type":"request","arguments":{},"seq":7} <-- Content-Length: 122

Hide Details

{"body":{"breakpoints":[]},"command":"_testGetTargetBreakpoints","request_seq":7,"seq":0,"success":true,"type":"response"} --> Content-Length: 356

Hide Details

{"command":"setBreakpoints","type":"request","arguments":{"source":{"name":"main-copy.cpp","path":"/Users/buildslave/jenkins/workspace/lldb-cmake-sanitized/lldb-build/lldb-test-build.noindex/tools/lldb-vscode/breakpoint/TestVSCode_setBreakpoints.test_set_and_clear/main-copy.cpp"},"sourceModified":false,"lines":"[10]","breakpoints":[{"line":10}]},"seq":8} <-- Content-Length: 368

Hide Details

{"body":{"breakpoints":[{"id":4,"line":10,"source":{"name":"main-copy.cpp","path":"/Users/buildslave/jenkins/workspace/lldb-cmake-sanitized/lldb-build/lldb-test-build.noindex/tools/lldb-vscode/breakpoint/TestVSCode_setBreakpoints.test_set_and_clear/main-copy.cpp"},"verified":true}]},"command":"setBreakpoints","request_seq":8,"seq":0,"success":true,"type":"response"} --> Content-Length: 79

Hide Details

{"command":"_testGetTargetBreakpoints","type":"request","arguments":{},"seq":9} <-- Content-Length: 379

Hide Details

{"body":{"breakpoints":[{"id":4,"line":10,"source":{"name":"main-copy.cpp","path":"/Users/buildslave/jenkins/workspace/lldb-cmake-sanitized/lldb-build/lldb-test-build.noindex/tools/lldb-vscode/breakpoint/TestVSCode_setBreakpoints.test_set_and_clear/main-copy.cpp"},"verified":true}]},"command":"_testGetTargetBreakpoints","request_seq":9,"seq":0,"success":true,"type":"response"} --> Content-Length: 89

Hide Details

{"command":"disconnect","type":"request","arguments":{"terminateDebuggee":true},"seq":10} <-- Content-Length: 45

Hide Details

{"event":"terminated","seq":0,"type":"event"} <-- Content-Length: 63

Hide Details

{"body":{"exitCode":9},"event":"exited","seq":0,"type":"event"} <-- Content-Length: 82

Hide Details

{"command":"disconnect","request_seq":10,"seq":0,"success":true,"type":"response"}

Hide Details

========= END ========= ========= DEBUG ADAPTER PROTOCOL LOGS ========= --> Content-Length: 284

Hide Details

{"command":"initialize","type":"request","arguments":{"adapterID":"lldb-native","clientID":"vscode","columnsStartAt1":true,"linesStartAt1":true,"locale":"en-us","pathFormat":"path","supportsRunInTerminalRequest":true,"supportsVariablePaging":true,"supportsVariableType":true},"seq":1} <-- Content-Length: 1222

Hide Details

{"body":{"exceptionBreakpointFilters":[{"default":false,"filter":"cpp_catch","label":"C++ Catch"},{"default":false,"filter":"cpp_throw","label":"C++ Throw"},{"default":false,"filter":"objc_catch","label":"Objective C Catch"},{"default":false,"filter":"objc_throw","label":"Objective C Throw"},{"default":false,"filter":"swift_catch","label":"Swift Catch"},{"default":false,"filter":"swift_throw","label":"Swift Throw"}],"supportTerminateDebuggee":true,"supportsCompletionsRequest":false,"supportsConditionalBreakpoints":true,"supportsConfigurationDoneRequest":true,"supportsDelayedStackTraceLoading":true,"supportsEvaluateForHovers":true,"supportsExceptionInfoRequest":true,"supportsExceptionOptions":true,"supportsFunctionBreakpoints":true,"supportsGotoTargetsRequest":false,"supportsHitConditionalBreakpoints":true,"supportsLoadedSourcesRequest":false,"supportsModulesRequest":false,"supportsProgressReporting":true,"supportsRestartFrame":false,"supportsRestartRequest":false,"supportsRunInTerminalRequest":true,"supportsSetVariable":true,"supportsStepBack":false,"supportsStepInTargetsRequest":false,"supportsValueFormattingOptions":true},"command":"initialize","request_seq":1,"seq":0,"success":true,"type":"response"} --> Content-Length: 1734

Hide Details

{"command":"launch","type":"request","arguments":{"program":"/Users/buildslave/jenkins/workspace/lldb-cmake-sanitized/lldb-build/lldb-test-build.noindex/tools/lldb-vscode/breakpoint/TestVSCode_setBreakpoints.test_source_map/a.out","disableASLR":true,"initCommands":["settings clear -all","settings set symbols.enable-external-lookup false","settings set target.inherit-tcc true","settings set target.detach-on-error false","settings set target.auto-apply-fixits false","settings set plugin.process.gdb-remote.packet-timeout 60","settings set symbols.clang-modules-cache-path \"/Users/buildslave/jenkins/workspace/lldb-cmake-sanitized/lldb-build/lldb-test-build.noindex/module-cache-lldb/lldb-api\"","settings set use-color false","setting set target.prefer-dynamic-value no-dynamic-values","settings set target.env-vars ASAN_OPTIONS=detect_stack_use_after_return=1 DYLD_INSERT_LIBRARIES=/Users/buildslave/jenkins/workspace/lldb-cmake-sanitized/host-compiler/lib/clang/13.0.99/lib/darwin/libclang_rt.asan_osx_dynamic.dylib"],"sourceMap":[["/Users/buildslave/jenkins/workspace/lldb-cmake-sanitized/lldb-build/lldb-test-build.noindex/tools/lldb-vscode/breakpoint/TestVSCode_setBreakpoints.test_source_map","/Users/buildslave/jenkins/workspace/lldb-cmake-sanitized/lldb-build/lldb-test-build.noindex/tools/lldb-vscode/breakpoint/TestVSCode_setBreakpoints.test_source_map/moved_main"],["/Users/buildslave/jenkins/workspace/lldb-cmake-sanitized/lldb-build/lldb-test-build.noindex/tools/lldb-vscode/breakpoint/TestVSCode_setBreakpoints.test_source_map","/Users/buildslave/jenkins/workspace/lldb-cmake-sanitized/lldb-build/lldb-test-build.noindex/tools/lldb-vscode/breakpoint/TestVSCode_setBreakpoints.test_source_map/moved_other"]]},"seq":2} <-- Content-Length: 923

Hide Details

{"body":{"category":"console","output":"Running initCommands:\n(lldb) settings clear -all\n(lldb) settings set symbols.enable-external-lookup false\n(lldb) settings set target.inherit-tcc true\n(lldb) settings set target.detach-on-error false\n(lldb) settings set target.auto-apply-fixits false\n(lldb) settings set plugin.process.gdb-remote.packet-timeout 60\n(lldb) settings set symbols.clang-modules-cache-path \"/Users/buildslave/jenkins/workspace/lldb-cmake-sanitized/lldb-build/lldb-test-build.noindex/module-cache-lldb/lldb-api\"\n(lldb) settings set use-color false\n(lldb) setting set target.prefer-dynamic-value no-dynamic-values\n(lldb) settings set target.env-vars ASAN_OPTIONS=detect_stack_use_after_return=1 DYLD_INSERT_LIBRARIES=/Users/buildslave/jenkins/workspace/lldb-cmake-sanitized/host-compiler/lib/clang/13.0.99/lib/darwin/libclang_rt.asan_osx_dynamic.dylib\n"},"event":"output","seq":0,"type":"event"} <-- Content-Length: 835

Hide Details

{"body":{"category":"console","output":"Setting source map:\n(lldb) settings set target.source-map \"/Users/buildslave/jenkins/workspace/lldb-cmake-sanitized/lldb-build/lldb-test-build.noindex/tools/lldb-vscode/breakpoint/TestVSCode_setBreakpoints.test_source_map\" \"/Users/buildslave/jenkins/workspace/lldb-cmake-sanitized/lldb-build/lldb-test-build.noindex/tools/lldb-vscode/breakpoint/TestVSCode_setBreakpoints.test_source_map/moved_main\" \"/Users/buildslave/jenkins/workspace/lldb-cmake-sanitized/lldb-build/lldb-test-build.noindex/tools/lldb-vscode/breakpoint/TestVSCode_setBreakpoints.test_source_map\" \"/Users/buildslave/jenkins/workspace/lldb-cmake-sanitized/lldb-build/lldb-test-build.noindex/tools/lldb-vscode/breakpoint/TestVSCode_setBreakpoints.test_source_map/moved_other\" \n"},"event":"output","seq":0,"type":"event"} <-- Content-Length: 77

Hide Details

{"command":"launch","request_seq":2,"seq":0,"success":true,"type":"response"} <-- Content-Length: 298

Hide Details

{"body":{"isLocalProcess":true,"name":"/Users/buildslave/jenkins/workspace/lldb-cmake-sanitized/lldb-build/lldb-test-build.noindex/tools/lldb-vscode/breakpoint/TestVSCode_setBreakpoints.test_source_map/a.out","startMethod":"launch","systemProcessId":50546},"event":"process","seq":0,"type":"event"} <-- Content-Length: 46

Hide Details

{"event":"initialized","seq":0,"type":"event"} --> Content-Length: 362

Hide Details

{"command":"setBreakpoints","type":"request","arguments":{"source":{"name":"main-copy.cpp","path":"/Users/buildslave/jenkins/workspace/lldb-cmake-sanitized/lldb-build/lldb-test-build.noindex/tools/lldb-vscode/breakpoint/TestVSCode_setBreakpoints.test_source_map/moved_main/main-copy.cpp"},"sourceModified":false,"lines":"[6]","breakpoints":[{"line":6}]},"seq":3} <-- Content-Length: 375

Hide Details

{"body":{"breakpoints":[{"id":1,"line":6,"source":{"name":"main-copy.cpp","path":"/Users/buildslave/jenkins/workspace/lldb-cmake-sanitized/lldb-build/lldb-test-build.noindex/tools/lldb-vscode/breakpoint/TestVSCode_setBreakpoints.test_source_map/moved_main/main-copy.cpp"},"verified":true}]},"command":"setBreakpoints","request_seq":3,"seq":0,"success":true,"type":"response"} --> Content-Length: 361

Hide Details

{"command":"setBreakpoints","type":"request","arguments":{"source":{"name":"other-copy.c","path":"/Users/buildslave/jenkins/workspace/lldb-cmake-sanitized/lldb-build/lldb-test-build.noindex/tools/lldb-vscode/breakpoint/TestVSCode_setBreakpoints.test_source_map/moved_other/other-copy.c"},"sourceModified":false,"lines":"[2]","breakpoints":[{"line":2}]},"seq":4} <-- Content-Length: 375

Hide Details

{"body":{"breakpoints":[{"id":2,"line":2,"source":{"name":"other-copy.c","path":"/Users/buildslave/jenkins/workspace/lldb-cmake-sanitized/lldb-build/lldb-test-build.noindex/tools/lldb-vscode/breakpoint/TestVSCode_setBreakpoints.test_source_map/moved_other/other-copy.c"},"verified":false}]},"command":"setBreakpoints","request_seq":4,"seq":0,"success":true,"type":"response"} --> Content-Length: 71

Hide Details

{"command":"configurationDone","type":"request","arguments":{},"seq":5} <-- Content-Length: 88

Hide Details

{"command":"configurationDone","request_seq":5,"seq":0,"success":true,"type":"response"} <-- Content-Length: 120

Hide Details

{"body":{"breakpoint":{"id":2,"line":2,"verified":true},"reason":"changed"},"event":"breakpoint","seq":0,"type":"event"} <-- Content-Length: 198

Hide Details

{"body":{"allThreadsStopped":true,"description":"breakpoint 2.1","preserveFocusHint":false,"reason":"breakpoint","threadCausedFocus":true,"threadId":244265},"event":"stopped","seq":0,"type":"event"} --> Content-Length: 361

Hide Details

{"command":"setBreakpoints","type":"request","arguments":{"source":{"name":"other-copy.c","path":"/Users/buildslave/jenkins/workspace/lldb-cmake-sanitized/lldb-build/lldb-test-build.noindex/tools/lldb-vscode/breakpoint/TestVSCode_setBreakpoints.test_source_map/moved_other/other-copy.c"},"sourceModified":false,"lines":"[2]","breakpoints":[{"line":2}]},"seq":6} <-- Content-Length: 374

Hide Details

{"body":{"breakpoints":[{"id":2,"line":2,"source":{"name":"other-copy.c","path":"/Users/buildslave/jenkins/workspace/lldb-cmake-sanitized/lldb-build/lldb-test-build.noindex/tools/lldb-vscode/breakpoint/TestVSCode_setBreakpoints.test_source_map/moved_other/other-copy.c"},"verified":true}]},"command":"setBreakpoints","request_seq":6,"seq":0,"success":true,"type":"response"} --> Content-Length: 88

Hide Details

{"command":"disconnect","type":"request","arguments":{"terminateDebuggee":true},"seq":7} <-- Content-Length: 45

Hide Details

{"event":"terminated","seq":0,"type":"event"} <-- Content-Length: 63

Hide Details

{"body":{"exitCode":9},"event":"exited","seq":0,"type":"event"} <-- Content-Length: 81

Hide Details

{"command":"disconnect","request_seq":7,"seq":0,"success":true,"type":"response"}

Hide Details

========= END =========

Hide Details

-- Command Output (stderr): -- Change dir to: /Users/buildslave/jenkins/workspace/lldb-cmake-sanitized/llvm-project/lldb/test/API/tools/lldb-vscode/breakpoint runCmd: settings clear -all output:

Hide Details

runCmd: settings set symbols.enable-external-lookup false output:

Hide Details

runCmd: settings set target.inherit-tcc true output:

Hide Details

runCmd: settings set target.detach-on-error false output:

Hide Details

runCmd: settings set target.auto-apply-fixits false output:

Hide Details

runCmd: settings set plugin.process.gdb-remote.packet-timeout 60 output:

Hide Details

runCmd: settings set symbols.clang-modules-cache-path "/Users/buildslave/jenkins/workspace/lldb-cmake-sanitized/lldb-build/lldb-test-build.noindex/module-cache-lldb/lldb-api" output:

Hide Details

runCmd: settings set use-color false output:

Hide Details

runCmd: setting set target.prefer-dynamic-value no-dynamic-values output:

Hide Details

runCmd: settings set target.env-vars ASAN_OPTIONS=detect_stack_use_after_return=1 DYLD_INSERT_LIBRARIES=/Users/buildslave/jenkins/workspace/lldb-cmake-sanitized/host-compiler/lib/clang/13.0.99/lib/darwin/libclang_rt.asan_osx_dynamic.dylib output:

Hide Details

Adding tearDown hook: def cleanup(): if disconnectAutomatically: self.vscode.request_disconnect(terminateDebuggee=True) self.vscode.terminate()

Hide Details

Hide Details

Executing tearDown hook: def cleanup(): if disconnectAutomatically: self.vscode.request_disconnect(terminateDebuggee=True) self.vscode.terminate()

Hide Details

Hide Details

PASS: LLDB (/Users/buildslave/jenkins/workspace/lldb-cmake-sanitized/host-compiler/bin/clang-x86_64) :: test_clear_breakpoints_unset_breakpoints (TestVSCode_setBreakpoints.TestVSCode_setBreakpoints) runCmd: settings clear -all output:

Hide Details

runCmd: settings set symbols.enable-external-lookup false output:

Hide Details

runCmd: settings set target.inherit-tcc true output:

Hide Details

runCmd: settings set target.detach-on-error false output:

Hide Details

runCmd: settings set target.auto-apply-fixits false output:

Hide Details

runCmd: settings set plugin.process.gdb-remote.packet-timeout 60 output:

Hide Details

runCmd: settings set symbols.clang-modules-cache-path "/Users/buildslave/jenkins/workspace/lldb-cmake-sanitized/lldb-build/lldb-test-build.noindex/module-cache-lldb/lldb-api" output:

Hide Details

runCmd: settings set use-color false output:

Hide Details

runCmd: setting set target.prefer-dynamic-value no-dynamic-values output:

Hide Details

runCmd: settings set target.env-vars ASAN_OPTIONS=detect_stack_use_after_return=1 DYLD_INSERT_LIBRARIES=/Users/buildslave/jenkins/workspace/lldb-cmake-sanitized/host-compiler/lib/clang/13.0.99/lib/darwin/libclang_rt.asan_osx_dynamic.dylib output:

Hide Details

Adding tearDown hook: def cleanup(): if disconnectAutomatically: self.vscode.request_disconnect(terminateDebuggee=True) self.vscode.terminate()

Hide Details

Hide Details

FAIL: LLDB (/Users/buildslave/jenkins/workspace/lldb-cmake-sanitized/host-compiler/bin/clang-x86_64) :: test_functionality (TestVSCode_setBreakpoints.TestVSCode_setBreakpoints) Executing tearDown hook: def cleanup(): if disconnectAutomatically: self.vscode.request_disconnect(terminateDebuggee=True) self.vscode.terminate()

Hide Details

Hide Details

CLEANUP ERROR: LLDB (/Users/buildslave/jenkins/workspace/lldb-cmake-sanitized/host-compiler/bin/clang-x86_64) :: test_functionality (TestVSCode_setBreakpoints.TestVSCode_setBreakpoints) Traceback (most recent call last): File "/Users/buildslave/jenkins/workspace/lldb-cmake-sanitized/llvm-project/lldb/third_party/Python/module/unittest2/unittest2/case.py", line 386, in run self.tearDown() File "/Users/buildslave/jenkins/workspace/lldb-cmake-sanitized/llvm-project/lldb/packages/Python/lldbsuite/test/lldbtest.py", line 2095, in tearDown Base.tearDown(self) File "/Users/buildslave/jenkins/workspace/lldb-cmake-sanitized/llvm-project/lldb/packages/Python/lldbsuite/test/lldbtest.py", line 1065, in tearDown hook() # try the plain call and hope it works File "/Users/buildslave/jenkins/workspace/lldb-cmake-sanitized/llvm-project/lldb/packages/Python/lldbsuite/test/tools/lldb-vscode/lldbvscode_testcase.py", line 294, in cleanup self.vscode.request_disconnect(terminateDebuggee=True) File "/Users/buildslave/jenkins/workspace/lldb-cmake-sanitized/llvm-project/lldb/packages/Python/lldbsuite/test/tools/lldb-vscode/vscode.py", line 590, in request_disconnect return self.send_recv(command_dict) File "/Users/buildslave/jenkins/workspace/lldb-cmake-sanitized/llvm-project/lldb/packages/Python/lldbsuite/test/tools/lldb-vscode/vscode.py", line 315, in send_recv self.send_packet(command) File "/Users/buildslave/jenkins/workspace/lldb-cmake-sanitized/llvm-project/lldb/packages/Python/lldbsuite/test/tools/lldb-vscode/vscode.py", line 271, in send_packet self.send.flush() BrokenPipeError: [Errno 32] Broken pipe

Hide Details

runCmd: settings clear -all output:

Hide Details

runCmd: settings set symbols.enable-external-lookup false output:

Hide Details

runCmd: settings set target.inherit-tcc true output:

Hide Details

runCmd: settings set target.detach-on-error false output:

Hide Details

runCmd: settings set target.auto-apply-fixits false output:

Hide Details

runCmd: settings set plugin.process.gdb-remote.packet-timeout 60 output:

Hide Details

runCmd: settings set symbols.clang-modules-cache-path "/Users/buildslave/jenkins/workspace/lldb-cmake-sanitized/lldb-build/lldb-test-build.noindex/module-cache-lldb/lldb-api" output:

Hide Details

runCmd: settings set use-color false output:

Hide Details

runCmd: setting set target.prefer-dynamic-value no-dynamic-values output:

Hide Details

runCmd: settings set target.env-vars ASAN_OPTIONS=detect_stack_use_after_return=1 DYLD_INSERT_LIBRARIES=/Users/buildslave/jenkins/workspace/lldb-cmake-sanitized/host-compiler/lib/clang/13.0.99/lib/darwin/libclang_rt.asan_osx_dynamic.dylib output:

Hide Details

Adding tearDown hook: def cleanup(): if disconnectAutomatically: self.vscode.request_disconnect(terminateDebuggee=True) self.vscode.terminate()

Hide Details

Hide Details

Executing tearDown hook: def cleanup(): if disconnectAutomatically: self.vscode.request_disconnect(terminateDebuggee=True) self.vscode.terminate()

Hide Details

Hide Details

PASS: LLDB (/Users/buildslave/jenkins/workspace/lldb-cmake-sanitized/host-compiler/bin/clang-x86_64) :: test_set_and_clear (TestVSCode_setBreakpoints.TestVSCode_setBreakpoints) runCmd: settings clear -all output:

Hide Details

runCmd: settings set symbols.enable-external-lookup false output:

Hide Details

runCmd: settings set target.inherit-tcc true output:

Hide Details

runCmd: settings set target.detach-on-error false output:

Hide Details

runCmd: settings set target.auto-apply-fixits false output:

Hide Details

runCmd: settings set plugin.process.gdb-remote.packet-timeout 60 output:

Hide Details

runCmd: settings set symbols.clang-modules-cache-path "/Users/buildslave/jenkins/workspace/lldb-cmake-sanitized/lldb-build/lldb-test-build.noindex/module-cache-lldb/lldb-api" output:

Hide Details

runCmd: settings set use-color false output:

Hide Details

runCmd: setting set target.prefer-dynamic-value no-dynamic-values output:

Hide Details

runCmd: settings set target.env-vars ASAN_OPTIONS=detect_stack_use_after_return=1 DYLD_INSERT_LIBRARIES=/Users/buildslave/jenkins/workspace/lldb-cmake-sanitized/host-compiler/lib/clang/13.0.99/lib/darwin/libclang_rt.asan_osx_dynamic.dylib output:

Hide Details

Adding tearDown hook: def cleanup(): if disconnectAutomatically: self.vscode.request_disconnect(terminateDebuggee=True) self.vscode.terminate()

Hide Details

Hide Details

Executing tearDown hook: def cleanup(): if disconnectAutomatically: self.vscode.request_disconnect(terminateDebuggee=True) self.vscode.terminate()

Hide Details

Hide Details

PASS: LLDB (/Users/buildslave/jenkins/workspace/lldb-cmake-sanitized/host-compiler/bin/clang-x86_64) :: test_source_map (TestVSCode_setBreakpoints.TestVSCode_setBreakpoints) Restore dir to: /Users/buildslave/jenkins/workspace/lldb-cmake-sanitized/lldb-build/tools/lldb/test ====================================================================== FAIL: test_functionality (TestVSCode_setBreakpoints.TestVSCode_setBreakpoints) Tests hitting breakpoints and the functionality of a single ---------------------------------------------------------------------- Traceback (most recent call last): File "/Users/buildslave/jenkins/workspace/lldb-cmake-sanitized/llvm-project/lldb/test/API/tools/lldb-vscode/breakpoint/TestVSCode_setBreakpoints.py", line 294, in test_functionality self.continue_to_breakpoints(breakpoint_ids) File "/Users/buildslave/jenkins/workspace/lldb-cmake-sanitized/llvm-project/lldb/packages/Python/lldbsuite/test/tools/lldb-vscode/lldbvscode_testcase.py", line 233, in continue_to_breakpoints self.verify_breakpoint_hit(breakpoint_ids) File "/Users/buildslave/jenkins/workspace/lldb-cmake-sanitized/llvm-project/lldb/packages/Python/lldbsuite/test/tools/lldb-vscode/lldbvscode_testcase.py", line 92, in verify_breakpoint_hit self.assertTrue(False, "breakpoint not hit") AssertionError: False is not True : breakpoint not hit Config=x86_64-/Users/buildslave/jenkins/workspace/lldb-cmake-sanitized/host-compiler/bin/clang ---------------------------------------------------------------------- Ran 4 tests in 9.037s

Hide Details

RESULT: FAILED (3 passes, 1 failures, 0 errors, 0 skipped, 0 expected failures, 0 unexpected successes)

Hide Details

--

Hide Details

******************** PASS: lldb-unit :: Process/Utility/./ProcessUtilityTests/ProcSMapTests/LinuxProcSMapsTestFixture.ParseSMapRegions/1 (1514 of 2355) PASS: lldb-unit :: Utility/./UtilityTests/BinaryStreamTest.PutSLEB128Zero (1515 of 2355) PASS: lldb-unit :: Core/./LLDBCoreTests/SourceFileCache.FindSourceFileFound (1516 of 2355) PASS: lldb-unit :: Utility/./UtilityTests/StreamTest.SetIndentLevel (1517 of 2355) UNSUPPORTED: lldb-shell :: SymbolFile/target-symbols-add-unwind.test (1518 of 2355) PASS: lldb-api :: commands/target/stop-hook/delete/TestTargetStopHookDelete.py (1519 of 2355) PASS: lldb-unit :: Process/Utility/./ProcessUtilityTests/MemoryTagManagerAArch64MTETest.AddressDiff (1520 of 2355) PASS: lldb-unit :: Utility/./UtilityTests/BinaryStreamTest.PutULEB128Zero (1521 of 2355) PASS: lldb-api :: commands/expression/argument_passing_restrictions/TestArgumentPassingRestrictions.py (1522 of 2355) UNSUPPORTED: lldb-shell :: SymbolFile/PDB/compilands.test (1523 of 2355) PASS: lldb-api :: functionalities/data-formatter/format-propagation/TestFormatPropagation.py (1524 of 2355) PASS: lldb-api :: functionalities/unwind/sigtramp/TestSigtrampUnwind.py (1525 of 2355) PASS: lldb-unit :: Utility/./UtilityTests/StreamTest.ShiftOperatorChars (1526 of 2355) PASS: lldb-api :: macosx/find-dsym/bundle-with-dot-in-filename/TestBundleWithDotInFilename.py (1527 of 2355) PASS: lldb-unit :: Utility/./UtilityTests/ArgsTest.TestInsertArg (1528 of 2355) PASS: lldb-api :: commands/expression/import-std-module/forward_decl_from_module/TestForwardDeclFromStdModule.py (1529 of 2355) PASS: lldb-api :: lang/cpp/thread_local/TestThreadLocal.py (1530 of 2355) UNSUPPORTED: lldb-shell :: Register/x86-64-ymm16-read.test (1531 of 2355) PASS: lldb-unit :: Process/gdb-remote/./ProcessGdbRemoteTests/GDBRemoteCommunicationClientTest.SendTraceSupportedPacket (1532 of 2355) PASS: lldb-unit :: UnwindAssembly/x86/./UnwindAssemblyx86Tests/Testx86AssemblyInspectionEngine.TestPushRBPWithREX (1533 of 2355) PASS: lldb-unit :: Symbol/./SymbolTests/TestClangASTImporter.DeportTypeTagDecl (1534 of 2355) PASS: lldb-api :: types/TestShortType.py (1535 of 2355) PASS: lldb-api :: functionalities/breakpoint/address_breakpoints/TestBadAddressBreakpoints.py (1536 of 2355) PASS: lldb-unit :: Core/./LLDBCoreTests/RichManglingContextTest.SwitchProvider (1537 of 2355) PASS: lldb-api :: commands/command/script_alias/TestCommandScriptAlias.py (1538 of 2355) PASS: lldb-api :: lang/cpp/auto/TestCPPAuto.py (1539 of 2355) PASS: lldb-unit :: Process/gdb-remote/./ProcessGdbRemoteTests/GDBRemoteCommunicationServerTest.SendErrorResponse_ErrorList (1540 of 2355) PASS: lldb-unit :: UnwindAssembly/x86/./UnwindAssemblyx86Tests/Testx86AssemblyInspectionEngine.Test32bitFramelessSmallStackFrame (1541 of 2355) PASS: lldb-unit :: Utility/./UtilityTests/ArchSpecTest.OperatorBool (1542 of 2355) PASS: lldb-api :: commands/settings/use_source_cache/TestUseSourceCache.py (1543 of 2355) PASS: lldb-unit :: Expression/./ExpressionTests/CppModuleConfigurationTest.Sysroot (1544 of 2355) PASS: lldb-api :: lang/cpp/call-function/TestCallCPPFunction.py (1545 of 2355) PASS: lldb-unit :: Utility/./UtilityTests/RegisterValueTest.GetScalarValue (1546 of 2355) UNSUPPORTED: lldb-api :: lang/c/typedef/Testtypedef.py (1547 of 2355) PASS: lldb-shell :: SymbolFile/DWARF/x86/dwarf5-debug_line.s (1548 of 2355) UNSUPPORTED: lldb-api :: functionalities/unwind/standard/TestStandardUnwind.py (1549 of 2355) UNSUPPORTED: lldb-api :: functionalities/ubsan/user-expression/TestUbsanUserExpression.py (1550 of 2355) PASS: lldb-unit :: UnwindAssembly/x86/./UnwindAssemblyx86Tests/Testx86AssemblyInspectionEngine.Test64bitFramelessSmallStackFrame (1551 of 2355) PASS: lldb-api :: lang/objc/foundation/TestObjCMethods.py (1552 of 2355) PASS: lldb-unit :: Utility/./UtilityTests/StringLexerTest.AdvanceIf (1553 of 2355) PASS: lldb-unit :: Host/./HostTests/SocketTests/SocketTest.TCPListen0GetPort/ipv6 (1554 of 2355) UNSUPPORTED: lldb-shell :: SymbolFile/PDB/enums-layout.test (1555 of 2355) PASS: lldb-api :: commands/expression/completion-in-lambda-and-unnamed-class/TestCompletionInLambdaAndUnnamedClass.py (1556 of 2355) PASS: lldb-api :: functionalities/thread/step_out/TestThreadStepOut.py (1557 of 2355) PASS: lldb-unit :: Utility/./UtilityTests/UriParserTest.TypicalPortPathIPv4 (1558 of 2355) PASS: lldb-unit :: Utility/./UtilityTests/LogChannelTest.Enable (1559 of 2355) UNSUPPORTED: lldb-shell :: SymbolFile/NativePDB/typedefs.cpp (1560 of 2355) PASS: lldb-api :: lang/c/forward/TestForwardDeclaration.py (1561 of 2355) PASS: lldb-unit :: Utility/./UtilityTests/UUIDTest.RelationalOperators (1562 of 2355) PASS: lldb-shell :: Quit/TestQuitExitCodeNonInt.test (1563 of 2355) PASS: lldb-api :: tools/lldb-server/TestGdbRemoteKill.py (1564 of 2355) PASS: lldb-unit :: Utility/./UtilityTests/OptionsWithRawTest.MultiWordSuffix (1565 of 2355) PASS: lldb-unit :: Utility/./UtilityTests/StreamTest.PutHex16ByteOrderLittle (1566 of 2355) UNSUPPORTED: lldb-api :: benchmarks/startup/TestStartupDelays.py (1567 of 2355) PASS: lldb-api :: lang/cpp/non-type-template-param/TestCppNonTypeTemplateParam.py (1568 of 2355) PASS: lldb-api :: functionalities/thread/concurrent_events/TestConcurrentTwoWatchpointsOneSignal.py (1569 of 2355) UNSUPPORTED: lldb-api :: commands/trace/TestTraceStartStop.py (1570 of 2355) PASS: lldb-shell :: ObjectFile/PDB/object.test (1571 of 2355) PASS: lldb-api :: lang/c/cpp_keyword_identifiers/TestCppKeywordsAsCIdentifiers.py (1572 of 2355) PASS: lldb-shell :: Driver/TestError.test (1573 of 2355) PASS: lldb-api :: functionalities/breakpoint/breakpoint_locations/TestBreakpointLocations.py (1574 of 2355) PASS: lldb-shell :: SymbolFile/DWARF/clang-ast-from-dwarf-unamed-and-anon-structs.cpp (1575 of 2355) PASS: lldb-shell :: SymbolFile/DWARF/x86/module-ownership.mm (1576 of 2355) PASS: lldb-api :: tools/lldb-server/memory-allocation/TestGdbRemoteMemoryAllocation.py (1577 of 2355) PASS: lldb-unit :: debugserver/./debugserverTests/RNBSocket.LoopBackListenIPv6 (1578 of 2355) PASS: lldb-api :: lang/cpp/frame-var-anon-unions/TestFrameVariableAnonymousUnions.py (1579 of 2355) PASS: lldb-api :: commands/expression/import-std-module/missing-module-sources/TestStdModuleSourcesMissing.py (1580 of 2355) PASS: lldb-api :: functionalities/data-formatter/data-formatter-stl/libcxx/forward_list/TestDataFormatterLibcxxForwardList.py (1581 of 2355) UNSUPPORTED: lldb-shell :: ObjectFile/PECOFF/disassemble-thumb.yaml (1582 of 2355) PASS: lldb-unit :: Utility/./UtilityTests/BinaryStreamTest.PutULEB128ThreeBytes (1583 of 2355) PASS: lldb-api :: functionalities/thread/concurrent_events/TestConcurrentWatchBreakDelay.py (1584 of 2355) PASS: lldb-shell :: SymbolFile/Breakpad/symtab.test (1585 of 2355) PASS: lldb-unit :: Symbol/./SymbolTests/TestTypeSystemClang.TestFunctionTemplateConstruction (1586 of 2355) PASS: lldb-unit :: ScriptInterpreter/Python/./ScriptInterpreterPythonTests/PythonDataObjectsTest.TestOwnedReferences (1587 of 2355) PASS: lldb-api :: lang/cpp/global_variables/TestCPPGlobalVariables.py (1588 of 2355) UNSUPPORTED: lldb-shell :: SymbolFile/PDB/function-nested-block.test (1589 of 2355) PASS: lldb-api :: functionalities/data-formatter/var-in-aggregate-misuse/TestVarInAggregateMisuse.py (1590 of 2355) PASS: lldb-api :: arm/emulation/TestEmulations.py (1591 of 2355) PASS: lldb-api :: functionalities/signal/TestSendSignal.py (1592 of 2355) PASS: lldb-unit :: Utility/./UtilityTests/ConstStringTest.UpdateMangledCounterpart (1593 of 2355) PASS: lldb-unit :: Process/gdb-remote/./ProcessGdbRemoteTests/GDBRemoteCommunicationTest.ReadPacket_checksum (1594 of 2355) PASS: lldb-api :: macosx/safe-to-func-call/TestSafeFuncCalls.py (1595 of 2355) PASS: lldb-unit :: Process/gdb-remote/./ProcessGdbRemoteTests/GDBRemoteCommunicationClientTest.GetModulesInfo_UUID20 (1596 of 2355) PASS: lldb-unit :: Host/./HostTests/SocketAddressTest.GetAddressInfo (1597 of 2355) PASS: lldb-api :: commands/watchpoints/multiple_threads/TestWatchpointMultipleThreads.py (1598 of 2355) PASS: lldb-api :: lang/cpp/default-template-args/TestDefaultTemplateArgs.py (1599 of 2355) PASS: lldb-unit :: Host/./HostTests/HostInfoTest.GetHostname (1600 of 2355) PASS: lldb-unit :: Process/gdb-remote/./ProcessGdbRemoteTests/PortMapTest.FreePortForProcess (1601 of 2355) PASS: lldb-unit :: Host/./HostTests/PipeTest.CreateWithUniqueName (1602 of 2355) PASS: lldb-shell :: Breakpoint/debug_rnglistx_rlex.test (1603 of 2355) PASS: lldb-api :: lang/objc/foundation/TestObjCMethodsString.py (1604 of 2355) PASS: lldb-api :: lang/objcxx/class-name-clash/TestNameClash.py (1605 of 2355) PASS: lldb-api :: commands/target/create-no-such-arch/TestNoSuchArch.py (1606 of 2355) PASS: lldb-unit :: Utility/./UtilityTests/OptionsWithRawTest.TerminatedQuote (1607 of 2355) PASS: lldb-api :: lang/objc/objc-super/TestObjCSuper.py (1608 of 2355) UNSUPPORTED: lldb-api :: commands/trace/multiple-threads/TestTraceStartStopMultipleThreads.py (1609 of 2355) UNSUPPORTED: lldb-api :: functionalities/darwin_log/filter/regex/category/TestDarwinLogFilterRegexCategory.py (1610 of 2355) UNSUPPORTED: lldb-api :: functionalities/data-formatter/data-formatter-stl/libstdcpp/string/TestDataFormatterStdString.py (1611 of 2355) PASS: lldb-shell :: ObjectFile/MachO/lc_version_min.yaml (1612 of 2355) PASS: lldb-api :: python_api/frame/inlines/TestInlinedFrame.py (1613 of 2355) PASS: lldb-unit :: Utility/./UtilityTests/StringListTest.Join (1614 of 2355) PASS: lldb-api :: commands/expression/no-deadlock/TestExprDoesntBlock.py (1615 of 2355) PASS: lldb-unit :: Host/./HostTests/MainLoopTest.TwoSignalCallbacks (1616 of 2355) PASS: lldb-shell :: ObjectFile/wasm/stripped-debug-sections.yaml (1617 of 2355) PASS: lldb-unit :: Utility/./UtilityTests/StringListTest.RemoveBlankLines (1618 of 2355) PASS: lldb-shell :: Driver/TestConvenienceVariables.test (1619 of 2355) UNSUPPORTED: lldb-api :: functionalities/exec/TestExec.py (1620 of 2355) PASS: lldb-api :: commands/watchpoints/hello_watchpoint/TestMyFirstWatchpoint.py (1621 of 2355) PASS: lldb-unit :: Utility/./UtilityTests/StringListTest.ForRangeEmpty (1622 of 2355) UNSUPPORTED: lldb-api :: functionalities/data-formatter/data-formatter-stl/libstdcpp/unique_ptr/TestDataFormatterStdUniquePtr.py (1623 of 2355) PASS: lldb-api :: functionalities/data-formatter/data-formatter-objc/TestDataFormatterObjCKVO.py (1624 of 2355) PASS: lldb-unit :: Expression/./ExpressionTests/DWARFExpression.DW_OP_convert (1625 of 2355) PASS: lldb-unit :: Core/./LLDBCoreTests/ModuleSpecTest.InvalidInMemoryBufferValidFile (1626 of 2355) PASS: lldb-unit :: Utility/./UtilityTests/AnsiTerminal.WhiteSpace (1627 of 2355) PASS: lldb-unit :: Utility/./UtilityTests/ArgsTest.BareSingleQuote (1628 of 2355) PASS: lldb-api :: functionalities/source-map/TestTargetSourceMap.py (1629 of 2355) PASS: lldb-unit :: Utility/./UtilityTests/StringExtractorTest.GetHexBytes (1630 of 2355) PASS: lldb-unit :: Utility/./UtilityTests/XcodeSDKTest.SDKSupportsSwift (1631 of 2355) PASS: lldb-unit :: Core/./LLDBCoreTests/MangledTest.ResultForValidName (1632 of 2355) PASS: lldb-api :: tools/lldb-server/TestGdbRemoteThreadsInStopReply.py (1633 of 2355) PASS: lldb-api :: functionalities/thread/concurrent_events/TestConcurrentBreakpointOneDelayBreakpointThreads.py (1634 of 2355) PASS: lldb-shell :: lldb-server/TestGdbserverPort.test (1635 of 2355) PASS: lldb-unit :: Host/./HostTests/SocketTests/SocketTest.DomainGetConnectURI/ipv6 (1636 of 2355) PASS: lldb-unit :: Utility/./UtilityTests/StringExtractorTest.GetHexU8_Underflow2 (1637 of 2355) PASS: lldb-unit :: Expression/./ExpressionTests/DiagnosticManagerTest.AppendMessageNoDiag (1638 of 2355) PASS: lldb-shell :: ObjectFile/ELF/PT_LOAD-overlap-PT_INTERP.yaml (1639 of 2355) PASS: lldb-unit :: Utility/./UtilityTests/CompletionRequest.DuplicateFiltering (1640 of 2355) PASS: lldb-api :: lang/c/shared_lib/TestSharedLib.py (1641 of 2355) PASS: lldb-api :: tools/lldb-server/TestGdbRemoteProcessInfo.py (1642 of 2355) PASS: lldb-unit :: Utility/./UtilityTests/BinaryStreamTest.PutSLEB128FiveBytes (1643 of 2355) PASS: lldb-unit :: Utility/./UtilityTests/StringExtractorTest.GetHexBytesAvail (1644 of 2355) PASS: lldb-unit :: Language/Highlighting/./HighlighterTests/HighlighterTest.HighlighterSelectionType (1645 of 2355) PASS: lldb-shell :: SymbolFile/DWARF/x86/DW_AT_loclists_base.s (1646 of 2355) PASS: lldb-shell :: SymbolFile/DWARF/x86/dwarf5_tu_index_abbrev_offset.s (1647 of 2355) PASS: lldb-api :: commands/expression/dont_allow_jit/TestAllowJIT.py (1648 of 2355) PASS: lldb-api :: functionalities/data-formatter/nsdictionarysynth/TestNSDictionarySynthetic.py (1649 of 2355) PASS: lldb-api :: lang/objc/objc-property/TestObjCProperty.py (1650 of 2355) PASS: lldb-unit :: Utility/./UtilityTests/VMRange.ContainsAddr (1651 of 2355) PASS: lldb-api :: functionalities/postmortem/netbsd-core/TestNetBSDCore.py (1652 of 2355) PASS: lldb-api :: functionalities/data-formatter/data-formatter-enum-format/TestDataFormatterEnumFormat.py (1653 of 2355) PASS: lldb-unit :: Process/minidump/./LLDBMinidumpTests/MinidumpParserTest.GetMemoryRegionInfoFromMemory64List (1654 of 2355) PASS: lldb-unit :: Process/gdb-remote/./ProcessGdbRemoteTests/PortMapTest.AllowPort (1655 of 2355) PASS: lldb-shell :: Register/Core/x86-64-netbsd-fp.test (1656 of 2355) PASS: lldb-api :: python_api/process/read-mem-cstring/TestReadMemCString.py (1657 of 2355) PASS: lldb-api :: functionalities/breakpoint/breakpoint_ids/TestBreakpointIDs.py (1658 of 2355) PASS: lldb-unit :: UnwindAssembly/x86/./UnwindAssemblyx86Tests/Testx86AssemblyInspectionEngine.TestDisassemblyJunkBytes (1659 of 2355) PASS: lldb-unit :: Utility/./UtilityTests/StreamTest.AddressRangeEmptyRange (1660 of 2355) PASS: lldb-unit :: Utility/./UtilityTests/StringExtractorTest.GetNameColonValueContainsColon (1661 of 2355) UNSUPPORTED: lldb-shell :: SymbolFile/NativePDB/stack_unwinding01.cpp (1662 of 2355) PASS: lldb-unit :: Utility/./UtilityTests/VMRange.Clear (1663 of 2355) PASS: lldb-unit :: Utility/./UtilityTests/BinaryStreamTest.PutSLEB128FourBytes (1664 of 2355) PASS: lldb-api :: lang/cpp/constructors/TestCppConstructors.py (1665 of 2355) PASS: lldb-api :: functionalities/plugins/python_os_plugin/TestPythonOSPlugin.py (1666 of 2355) PASS: lldb-shell :: Minidump/memory-region-from-module.yaml (1667 of 2355) PASS: lldb-unit :: Utility/./UtilityTests/StringListTest.ShiftCString (1668 of 2355) PASS: lldb-api :: lang/cpp/const_this/TestConstThis.py (1669 of 2355) PASS: lldb-unit :: Utility/./UtilityTests/StructuredDataTest.ParseJSONFromFile (1670 of 2355) PASS: lldb-unit :: Host/./HostTests/File.GetStreamFromDescriptor (1671 of 2355) PASS: lldb-unit :: Utility/./UtilityTests/StreamTest.AddressRangeInvalidRange (1672 of 2355) PASS: lldb-unit :: ObjectFile/Breakpad/./ObjectFileBreakpadTests/Record.classify (1673 of 2355) PASS: lldb-api :: lang/objc/global_ptrs/TestGlobalObjects.py (1674 of 2355) PASS: lldb-shell :: ObjectFile/ELF/base-address.yaml (1675 of 2355) PASS: lldb-unit :: SymbolFile/DWARF/./SymbolFileDWARFTests/XcodeSDKModuleTests.TestModuleGetXcodeSDK (1676 of 2355) PASS: lldb-unit :: Utility/./UtilityTests/UriParserTest.BadPort2 (1677 of 2355) PASS: lldb-shell :: Breakpoint/single-file-split-dwarf.test (1678 of 2355) PASS: lldb-api :: functionalities/data-formatter/varscript_formatting/TestDataFormatterVarScriptFormatting.py (1679 of 2355) PASS: lldb-unit :: Utility/./UtilityTests/StreamTeeTest.Write (1680 of 2355) PASS: lldb-api :: lang/objc/modules-app-update/TestClangModulesAppUpdate.py (1681 of 2355) PASS: lldb-api :: functionalities/rerun/TestRerun.py (1682 of 2355) PASS: lldb-shell :: Settings/TestFrameFormatMangling.test (1683 of 2355) PASS: lldb-api :: terminal/TestSTTYBeforeAndAfter.py (1684 of 2355) PASS: lldb-api :: functionalities/thread/concurrent_events/TestConcurrentSignalDelayWatch.py (1685 of 2355) PASS: lldb-api :: functionalities/dynamic_value_child_count/TestDynamicValueChildCount.py (1686 of 2355) PASS: lldb-unit :: Utility/./UtilityTests/DataExtractorTest.GetBitfield (1687 of 2355) PASS: lldb-shell :: Register/Core/x86-64-linux-addr.test (1688 of 2355) UNSUPPORTED: lldb-api :: commands/trace/TestTraceLoad.py (1689 of 2355) PASS: lldb-unit :: UnwindAssembly/x86/./UnwindAssemblyx86Tests/Testx86AssemblyInspectionEngine.TestPopR15 (1690 of 2355) PASS: lldb-api :: types/TestIntegerType.py (1691 of 2355) PASS: lldb-shell :: ObjectFile/PECOFF/invalid-export-table.yaml (1692 of 2355) PASS: lldb-shell :: SymbolFile/DWARF/x86/DW_AT_const_value.s (1693 of 2355) PASS: lldb-api :: commands/expression/cast_int_to_anonymous_enum/TestCastIntToAnonymousEnum.py (1694 of 2355) PASS: lldb-api :: lang/cpp/lambdas/TestLambdas.py (1695 of 2355) PASS: lldb-shell :: SymbolFile/NativePDB/break-by-line.cpp (1696 of 2355) PASS: lldb-unit :: Utility/./UtilityTests/Flags.IsClear (1697 of 2355) PASS: lldb-shell :: Register/x86-multithread-write.test (1698 of 2355) PASS: lldb-api :: commands/expression/import-std-module/vector/TestVectorFromStdModule.py (1699 of 2355) PASS: lldb-api :: commands/expression/vector_of_enums/TestVectorOfEnums.py (1700 of 2355) PASS: lldb-unit :: Utility/./UtilityTests/FileSpecTest.Equal (1701 of 2355) UNSUPPORTED: lldb-api :: commands/watchpoints/hello_watchlocation/TestWatchLocation.py (1702 of 2355) PASS: lldb-api :: functionalities/thread/concurrent_events/TestConcurrentWatchpointDelayWatchpointOneBreakpoint.py (1703 of 2355) PASS: lldb-unit :: Expression/./ExpressionTests/ClangExpressionDeclMapTest.TestPersistentDeclLookup (1704 of 2355) PASS: lldb-api :: functionalities/abbreviation/TestCommonShortSpellings.py (1705 of 2355) PASS: lldb-unit :: Process/Utility/./ProcessUtilityTests/ProcMapTests/LinuxProcMapsTestFixture.ParseMapRegions/5 (1706 of 2355) PASS: lldb-shell :: Commands/command-disassemble.s (1707 of 2355) PASS: lldb-unit :: UnwindAssembly/x86/./UnwindAssemblyx86Tests/Testx86AssemblyInspectionEngine.TestPopR12 (1708 of 2355) PASS: lldb-api :: functionalities/thread/backtrace_all/TestBacktraceAll.py (1709 of 2355) PASS: lldb-api :: lang/objc/warnings-in-expr-parser/TestObjCWarningsInExprParser.py (1710 of 2355) PASS: lldb-unit :: Utility/./UtilityTests/OptionsWithRawTest.SingleWordSuffix (1711 of 2355) PASS: lldb-api :: functionalities/inferior-crashing/recursive-inferior/TestRecursiveInferiorStep.py (1712 of 2355) PASS: lldb-unit :: Host/./HostTests/NativeProcessProtocolTest.ReadMemoryWithoutTrap (1713 of 2355) PASS: lldb-unit :: ScriptInterpreter/Python/./ScriptInterpreterPythonTests/PythonDataObjectsTest.TestBorrowedReferences (1714 of 2355) PASS: lldb-api :: commands/expression/import-std-module/deque-dbg-info-content/TestDbgInfoContentDequeFromStdModule.py (1715 of 2355) PASS: lldb-unit :: SymbolFile/DWARF/./SymbolFileDWARFTests/SymbolFileDWARFTests.TestAbbrevValidAttrNullForm (1716 of 2355) PASS: lldb-unit :: debugserver/./debugserverTests/RNBSocket.LoopBackConnectIPv4 (1717 of 2355) PASS: lldb-shell :: Reproducer/TestMultipleTargets.test (1718 of 2355) PASS: lldb-unit :: UnwindAssembly/x86/./UnwindAssemblyx86Tests/Testx86AssemblyInspectionEngine.TestPushR12 (1719 of 2355) PASS: lldb-unit :: UnwindAssembly/x86/./UnwindAssemblyx86Tests/Testx86AssemblyInspectionEngine.TestPush0 (1720 of 2355) PASS: lldb-unit :: Utility/./UtilityTests/RecordReplayTest.InvalidSequence (1721 of 2355) PASS: lldb-unit :: Expression/./ExpressionTests/DiagnosticManagerTest.PutStringSeverities (1722 of 2355) PASS: lldb-api :: sample_test/TestSampleTest.py (1723 of 2355) PASS: lldb-api :: lang/cpp/multiple-inheritance/TestCppMultipleInheritance.py (1724 of 2355) PASS: lldb-api :: commands/target/dump-symtab-demangle/TestDumpSymtabDemangle.py (1725 of 2355) PASS: lldb-api :: python_api/lldbutil/iter/TestLLDBIterator.py (1726 of 2355) PASS: lldb-shell :: Settings/TestSettingsSet.test (1727 of 2355) PASS: lldb-unit :: SymbolFile/DWARF/./SymbolFileDWARFTests/SymbolFileDWARFTests.TestAbbrevOrder1Start1 (1728 of 2355) PASS: lldb-unit :: Host/./HostTests/SocketTests/SocketTest.UDPGetConnectURI/ipv4 (1729 of 2355) PASS: lldb-api :: commands/expression/import-std-module/vector-of-vectors/TestVectorOfVectorsFromStdModule.py (1730 of 2355) UNSUPPORTED: lldb-api :: benchmarks/continue/TestBenchmarkContinue.py (1731 of 2355) PASS: lldb-api :: functionalities/gdb_remote_client/TestGDBRemoteDiskFileCompletion.py (1732 of 2355) PASS: lldb-shell :: BuildScript/modes.test (1733 of 2355) UNSUPPORTED: lldb-shell :: ScriptInterpreter/Lua/print.test (1734 of 2355) PASS: lldb-unit :: Language/Highlighting/./HighlighterTests/HighlighterTest.Colons (1735 of 2355) PASS: lldb-unit :: Utility/./UtilityTests/StringExtractorTest.DecodeHexU8_InvalidHex (1736 of 2355) PASS: lldb-unit :: Utility/./UtilityTests/StringListTest.LongestCommonPrefixEmpty (1737 of 2355) PASS: lldb-shell :: Quit/TestQuitExitCodeImplicit0.test (1738 of 2355) PASS: lldb-unit :: ObjectFile/MachO/./ObjectFileMachOTests/ObjectFileMachOTest.ModuleFromSharedCacheInfo (1739 of 2355) PASS: lldb-api :: functionalities/inferior-crashing/TestInferiorCrashingStep.py (1740 of 2355) PASS: lldb-unit :: Utility/./UtilityTests/BinaryStreamTest.PutSLEB128NineBytes (1741 of 2355) PASS: lldb-api :: functionalities/wrong_commands/TestWrongCommands.py (1742 of 2355) PASS: lldb-unit :: Utility/./UtilityTests/Flags.AnySet (1743 of 2355) PASS: lldb-api :: commands/expression/unicode-in-variable/TestUnicodeInVariable.py (1744 of 2355) PASS: lldb-unit :: Utility/./UtilityTests/StringExtractorTest.GetHexBytesAvail_Underflow (1745 of 2355) PASS: lldb-api :: lang/c/local_variables/TestLocalVariables.py (1746 of 2355) PASS: lldb-api :: lang/c/step_over_no_deadlock/TestStepOverDoesntBlock.py (1747 of 2355) PASS: lldb-api :: python_api/sbvalue_const_addrof/TestSBValueConstAddrOf.py (1748 of 2355) PASS: lldb-api :: functionalities/thread/concurrent_events/TestConcurrentSignalWatchBreak.py (1749 of 2355) PASS: lldb-unit :: Utility/./UtilityTests/TimeoutTest.Format (1750 of 2355) PASS: lldb-api :: lang/objc/objc-struct-argument/TestObjCStructArgument.py (1751 of 2355) PASS: lldb-unit :: Symbol/./SymbolTests/DWARFCallFrameInfoTest.Basic_dwarf4 (1752 of 2355) UNSUPPORTED: lldb-shell :: Process/Windows/exception_access_violation.cpp (1753 of 2355) PASS: lldb-unit :: ScriptInterpreter/Python/./ScriptInterpreterPythonTests/PythonDataObjectsTest.TestResetting (1754 of 2355) PASS: lldb-api :: functionalities/data-formatter/data-formatter-objc/TestDataFormatterObjNSException.py (1755 of 2355) PASS: lldb-shell :: Breakpoint/debug_addrx.test (1756 of 2355) UNSUPPORTED: lldb-shell :: ScriptInterpreter/Lua/convenience_variables.test (1757 of 2355) PASS: lldb-api :: functionalities/data-formatter/poarray/TestPrintObjectArray.py (1758 of 2355) PASS: lldb-unit :: ScriptInterpreter/Python/./ScriptInterpreterPythonTests/PythonDataObjectsTest.TestGlobalNameResolutionNoDot (1759 of 2355) UNSUPPORTED: lldb-api :: linux/add-symbols/TestTargetSymbolsAddCommand.py (1760 of 2355) PASS: lldb-unit :: Utility/./UtilityTests/UriParserTest.BracketedHostnameWithPortIPv6 (1761 of 2355) PASS: lldb-api :: functionalities/target_var/TestTargetVar.py (1762 of 2355) PASS: lldb-unit :: Utility/./UtilityTests/StringLexerTest.PutBack (1763 of 2355) PASS: lldb-api :: functionalities/data-formatter/data-formatter-stl/libcxx/multimap/TestDataFormatterLibccMultiMap.py (1764 of 2355) PASS: lldb-unit :: Utility/./UtilityTests/StreamTest.AddressSize (1765 of 2355) PASS: lldb-unit :: SymbolFile/DWARF/./SymbolFileDWARFTests/SymbolFileDWARFTests.ParseArangesWithMultipleTerminators (1766 of 2355) PASS: lldb-shell :: Commands/command-thread-select.test (1767 of 2355) PASS: lldb-shell :: Breakpoint/split-dwarf-5-addrbase.test (1768 of 2355) PASS: lldb-shell :: Commands/command-image-lookup.yaml (1769 of 2355) PASS: lldb-unit :: Language/Highlighting/./HighlighterTests/HighlighterTest.ClangCursorPosBeforeOtherToken (1770 of 2355) PASS: lldb-unit :: Target/./TargetTests/PathMappingListTest.CrossPlatformTests (1771 of 2355) PASS: lldb-shell :: SymbolFile/DWARF/x86/debug-types-signature-loop.s (1772 of 2355) PASS: lldb-api :: python_api/function_symbol/TestSymbolAPI.py (1773 of 2355) PASS: lldb-api :: tools/lldb-server/TestGdbRemoteAttachOrWait.py (1774 of 2355) PASS: lldb-unit :: Utility/./UtilityTests/EnvironmentTest.EnvpConstruction (1775 of 2355) PASS: lldb-shell :: SymbolFile/NativePDB/s_constant.cpp (1776 of 2355) PASS: lldb-unit :: DataFormatter/./LLDBFormatterTests/TypeMatcherTests.GetMatchStringExactName (1777 of 2355) PASS: lldb-unit :: Utility/./UtilityTests/SerializationRountripTest.SerializeDeserializePodReferences (1778 of 2355) PASS: lldb-shell :: Minidump/Windows/find-module.test (1779 of 2355) PASS: lldb-unit :: Process/gdb-remote/./ProcessGdbRemoteTests/GDBRemoteClientBaseTest.SendContinueDelegateInterface (1780 of 2355) PASS: lldb-shell :: ScriptInterpreter/Python/eof.test (1781 of 2355) PASS: lldb-api :: functionalities/gdb_remote_client/TestGDBRemoteClient.py (1782 of 2355) PASS: lldb-unit :: Utility/./UtilityTests/XcodeSDKTest.GetSDKTypeForTriple (1783 of 2355) PASS: lldb-api :: functionalities/postmortem/minidump/TestMiniDump.py (1784 of 2355) PASS: lldb-unit :: Utility/./UtilityTests/AnsiTerminal.Empty (1785 of 2355) PASS: lldb-unit :: Utility/./UtilityTests/ProcessInfoTest.Constructor (1786 of 2355) PASS: lldb-shell :: Minidump/breakpad-symbols.test (1787 of 2355) PASS: lldb-api :: python_api/process/io/TestProcessIO.py (1788 of 2355) PASS: lldb-api :: python_api/value/TestValueAPI.py (1789 of 2355) PASS: lldb-unit :: UnwindAssembly/x86/./UnwindAssemblyx86Tests/Testx86AssemblyInspectionEngine.TestPushESI (1790 of 2355) PASS: lldb-api :: driver/batch_mode/TestBatchMode.py (1791 of 2355) FAIL: lldb-api :: macosx/dyld-trie-symbols/TestDyldTrieSymbols.py (1792 of 2355) ******************** TEST 'lldb-api :: macosx/dyld-trie-symbols/TestDyldTrieSymbols.py' FAILED ******************** Script: -- /Users/buildslave/jenkins/workspace/lldb-cmake-sanitized/lldb-build/lldb-test-build.noindex/copied-python /Users/buildslave/jenkins/workspace/lldb-cmake-sanitized/llvm-project/lldb/test/API/dotest.py -u CXXFLAGS -u CFLAGS --codesign-identity lldb_codesign --arch x86_64 --build-dir /Users/buildslave/jenkins/workspace/lldb-cmake-sanitized/lldb-build/lldb-test-build.noindex -t --env TERM=vt100 --env LLVM_LIBS_DIR=/Users/buildslave/jenkins/workspace/lldb-cmake-sanitized/lldb-build/./lib --inferior-env ASAN_OPTIONS=detect_stack_use_after_return=1 --inferior-env DYLD_INSERT_LIBRARIES=/Users/buildslave/jenkins/workspace/lldb-cmake-sanitized/host-compiler/lib/clang/13.0.99/lib/darwin/libclang_rt.asan_osx_dynamic.dylib --arch x86_64 --build-dir /Users/buildslave/jenkins/workspace/lldb-cmake-sanitized/lldb-build/lldb-test-build.noindex --lldb-module-cache-dir /Users/buildslave/jenkins/workspace/lldb-cmake-sanitized/lldb-build/lldb-test-build.noindex/module-cache-lldb/lldb-api --clang-module-cache-dir /Users/buildslave/jenkins/workspace/lldb-cmake-sanitized/lldb-build/lldb-test-build.noindex/module-cache-clang/lldb-api --executable /Users/buildslave/jenkins/workspace/lldb-cmake-sanitized/lldb-build/./bin/lldb --compiler /Users/buildslave/jenkins/workspace/lldb-cmake-sanitized/host-compiler/bin/clang --dsymutil /Users/buildslave/jenkins/workspace/lldb-cmake-sanitized/lldb-build/./bin/dsymutil --llvm-tools-dir /Users/buildslave/jenkins/workspace/lldb-cmake-sanitized/lldb-build/./bin --lldb-libs-dir /Users/buildslave/jenkins/workspace/lldb-cmake-sanitized/lldb-build/./lib /Users/buildslave/jenkins/workspace/lldb-cmake-sanitized/llvm-project/lldb/test/API/macosx/dyld-trie-symbols -p TestDyldTrieSymbols.py -- Exit Code: 1

Hide Details

Command Output (stdout): -- lldb version 13.0.99 (http://labmaster3.local/git/llvm-project.git revision 338a3f495ea4765b05612598e732c0d45dff3edc) clang revision 338a3f495ea4765b05612598e732c0d45dff3edc llvm revision 338a3f495ea4765b05612598e732c0d45dff3edc Skipping the following test categories: ['darwin-log', 'libstdcxx', 'dwo', 'llgs', 'fork']

Hide Details

-- Command Output (stderr): -- Change dir to: /Users/buildslave/jenkins/workspace/lldb-cmake-sanitized/llvm-project/lldb/test/API/macosx/dyld-trie-symbols runCmd: settings clear -all output:

Hide Details

runCmd: settings set symbols.enable-external-lookup false output:

Hide Details

runCmd: settings set target.inherit-tcc true output:

Hide Details

runCmd: settings set target.detach-on-error false output:

Hide Details

runCmd: settings set target.auto-apply-fixits false output:

Hide Details

runCmd: settings set plugin.process.gdb-remote.packet-timeout 60 output:

Hide Details

runCmd: settings set symbols.clang-modules-cache-path "/Users/buildslave/jenkins/workspace/lldb-cmake-sanitized/lldb-build/lldb-test-build.noindex/module-cache-lldb/lldb-api" output:

Hide Details

runCmd: settings set use-color false output:

Hide Details

runCmd: setting set target.prefer-dynamic-value no-dynamic-values output:

Hide Details

runCmd: settings set target.env-vars ASAN_OPTIONS=detect_stack_use_after_return=1 DYLD_INSERT_LIBRARIES=/Users/buildslave/jenkins/workspace/lldb-cmake-sanitized/host-compiler/lib/clang/13.0.99/lib/darwin/libclang_rt.asan_osx_dynamic.dylib output:

Hide Details

FAIL: LLDB (/Users/buildslave/jenkins/workspace/lldb-cmake-sanitized/host-compiler/bin/clang-x86_64) :: test_dyld_trie_symbols (TestDyldTrieSymbols.DyldTrieSymbolsTestCase) Restore dir to: /Users/buildslave/jenkins/workspace/lldb-cmake-sanitized/lldb-build/tools/lldb/test ====================================================================== FAIL: test_dyld_trie_symbols (TestDyldTrieSymbols.DyldTrieSymbolsTestCase) Test that we make create symbol table entries from the dyld trie data structure. ---------------------------------------------------------------------- Traceback (most recent call last): File "/Users/buildslave/jenkins/workspace/lldb-cmake-sanitized/llvm-project/lldb/test/API/macosx/dyld-trie-symbols/TestDyldTrieSymbols.py", line 66, in test_dyld_trie_symbols self.assertEqual(stripped_bazval_symbols.GetSize(), 1) AssertionError: 0 != 1 Config=x86_64-/Users/buildslave/jenkins/workspace/lldb-cmake-sanitized/host-compiler/bin/clang ---------------------------------------------------------------------- Ran 1 test in 3.126s

Hide Details

RESULT: FAILED (0 passes, 1 failures, 0 errors, 0 skipped, 0 expected failures, 0 unexpected successes)

Hide Details

--

Hide Details

******************** PASS: lldb-unit :: ScriptInterpreter/Python/./ScriptInterpreterPythonTests/PythonDataObjectsTest.TestPythonTupleSize (1793 of 2355) PASS: lldb-unit :: UnwindAssembly/x86/./UnwindAssemblyx86Tests/Testx86AssemblyInspectionEngine.TestSimplex86_64Augmented (1794 of 2355) PASS: lldb-unit :: DataFormatter/./LLDBFormatterTests/TypeMatcherTests.CreatedBySameMatchStringExactNamePrefixes (1795 of 2355) PASS: lldb-unit :: Language/Highlighting/./HighlighterTests/HighlighterTest.ClangStringLiterals (1796 of 2355) PASS: lldb-shell :: SymbolFile/DWARF/x86/debug_ranges-missing-section.s (1797 of 2355) PASS: lldb-shell :: Quit/TestQuitExitCodeHexA.test (1798 of 2355) PASS: lldb-unit :: Utility/./UtilityTests/UriParserTest.PortOverflow (1799 of 2355) PASS: lldb-api :: lang/c/stepping/TestThreadStepping.py (1800 of 2355) PASS: lldb-api :: functionalities/signal/raise/TestRaise.py (1801 of 2355) PASS: lldb-api :: commands/expression/import-std-module/forward_list-dbg-info-content/TestDbgInfoContentForwardListFromStdModule.py (1802 of 2355) UNSUPPORTED: lldb-api :: android/platform/TestDefaultCacheLineSize.py (1803 of 2355) PASS: lldb-shell :: Minidump/Windows/broken-unwind.test (1804 of 2355) PASS: lldb-unit :: Core/./LLDBCoreTests/MangledTest.ResultForBlockInvocation (1805 of 2355) PASS: lldb-unit :: Editline/./EditlineTests/EditlineTestFixture.EditlineReceivesSingleLineText (1806 of 2355) PASS: lldb-unit :: Utility/./UtilityTests/LogTest.LLDB_LOG_nullptr (1807 of 2355) PASS: lldb-unit :: Utility/./UtilityTests/DataExtractorTest.UncommonAddressSize (1808 of 2355) PASS: lldb-shell :: ObjectFile/ELF/PT_LOAD-overlap-PT_TLS.yaml (1809 of 2355) PASS: lldb-shell :: ObjectFile/ELF/section-types-edgecases.yaml (1810 of 2355) PASS: lldb-api :: commands/process/attach/TestProcessAttach.py (1811 of 2355) XFAIL: lldb-shell :: Register/x86-fp-write.test (1812 of 2355) PASS: lldb-api :: lang/cpp/exceptions/TestCPPExceptionBreakpoints.py (1813 of 2355) PASS: lldb-api :: lang/objcxx/objc-builtin-types/TestObjCBuiltinTypes.py (1814 of 2355) PASS: lldb-api :: lang/cpp/offsetof/TestOffsetofCpp.py (1815 of 2355) PASS: lldb-shell :: Breakpoint/jit-loader_rtdyld_elf.test (1816 of 2355) PASS: lldb-unit :: DataFormatter/./LLDBFormatterTests/TypeMatcherTests.RegexMatchPart (1817 of 2355) PASS: lldb-unit :: Utility/./UtilityTests/SerializationRountripTest.SerializeDeserializeObjectReference (1818 of 2355) PASS: lldb-unit :: Host/./HostTests/FileSystemTest.Exists (1819 of 2355) UNSUPPORTED: lldb-shell :: ExecControl/StopHook/stop-hook-threads.test (1820 of 2355) PASS: lldb-api :: functionalities/deleted-executable/TestDeletedExecutable.py (1821 of 2355) PASS: lldb-api :: lang/cpp/virtual-overload/TestVirtualOverload.py (1822 of 2355) PASS: lldb-api :: lang/cpp/elaborated-types/TestElaboratedTypes.py (1823 of 2355) PASS: lldb-unit :: Utility/./UtilityTests/UriParserTest.MinimalPortPath (1824 of 2355) UNSUPPORTED: lldb-api :: iohandler/autosuggestion/TestAutosuggestion.py (1825 of 2355) PASS: lldb-unit :: Utility/./UtilityTests/LogChannelEnabledTest.LogVerboseThread (1826 of 2355) PASS: lldb-unit :: Expression/./ExpressionTests/DiagnosticManagerTest.AppendMessageSubsequentDiags (1827 of 2355) PASS: lldb-unit :: Process/gdb-remote/./ProcessGdbRemoteTests/GDBRemoteClientBaseTest.InterruptNoResponse (1828 of 2355) PASS: lldb-api :: api/check_public_api_headers/TestPublicAPIHeaders.py (1829 of 2355) PASS: lldb-api :: types/TestFloatTypesExpr.py (1830 of 2355) PASS: lldb-unit :: Utility/./UtilityTests/StringExtractorTest.GetHexBytesAvail_OddPair2 (1831 of 2355) PASS: lldb-unit :: Process/Utility/./ProcessUtilityTests/ProcSMapTests/LinuxProcSMapsTestFixture.ParseSMapRegions/9 (1832 of 2355) PASS: lldb-shell :: ObjectFile/ELF/duplicate-section.yaml (1833 of 2355) XFAIL: lldb-shell :: Register/x86-64-write.test (1834 of 2355) PASS: lldb-unit :: Utility/./UtilityTests/ArchSpecTest.TestParseMachCPUDashSubtypeTripleSimple (1835 of 2355) PASS: lldb-api :: functionalities/optimized_code/TestNoASanExceptionAfterEvalOP_piece.py (1836 of 2355) PASS: lldb-api :: functionalities/data-formatter/data-formatter-stl/libcxx/unordered/TestDataFormatterUnordered.py (1837 of 2355) PASS: lldb-shell :: Register/Core/x86-64-netbsd-gp.test (1838 of 2355) PASS: lldb-api :: commands/expression/unwind_expression/TestUnwindExpression.py (1839 of 2355) PASS: lldb-api :: commands/expression/codegen-crash-typedefdecl-not-in_declcontext/TestCodegenCrashTypedefDeclNotInDeclContext.py (1840 of 2355) PASS: lldb-unit :: Utility/./UtilityTests/SerializationRountripTest.SerializeDeserializeCStringArrayNullptrElem (1841 of 2355) UNSUPPORTED: lldb-shell :: Unwind/unwind-plan-dwarf-dump.test (1842 of 2355) PASS: lldb-api :: functionalities/breakpoint/scripted_bkpt/TestScriptedResolver.py (1843 of 2355) UNSUPPORTED: lldb-api :: functionalities/tty/TestTerminal.py (1844 of 2355) PASS: lldb-unit :: Utility/./UtilityTests/ProcessInstanceInfo.Dump (1845 of 2355) UNSUPPORTED: lldb-api :: python_api/disassemble-raw-data/TestDisassemble_VST1_64.py (1846 of 2355) PASS: lldb-unit :: Core/./LLDBCoreTests/ModuleSpecTest.InvalidInMemoryBuffer (1847 of 2355) PASS: lldb-api :: tools/lldb-vscode/step/TestVSCode_step.py (1848 of 2355) PASS: lldb-shell :: ObjectFile/ELF/riscv-arch.yaml (1849 of 2355) PASS: lldb-unit :: Utility/./UtilityTests/TimerTest.CategoryTimesNested (1850 of 2355) PASS: lldb-shell :: SymbolFile/DWARF/x86/debug-names-compressed.cpp (1851 of 2355) UNSUPPORTED: lldb-shell :: SymbolFile/PDB/variables-locations.test (1852 of 2355) PASS: lldb-unit :: Signals/./SignalsTests/UnixSignalsTest.GetFilteredSignals (1853 of 2355) PASS: lldb-api :: lang/c/const_variables/TestConstVariables.py (1854 of 2355) PASS: lldb-unit :: Language/Highlighting/./HighlighterTests/HighlighterTest.ClangTrailingBackslashWithWhitespace (1855 of 2355) PASS: lldb-api :: functionalities/gdb_remote_client/TestNoWatchpointSupportInfo.py (1856 of 2355) PASS: lldb-shell :: Breakpoint/debug_rnglist_offset_pair.test (1857 of 2355) PASS: lldb-unit :: Language/Highlighting/./HighlighterTests/HighlighterTest.Keywords (1858 of 2355) PASS: lldb-api :: lang/objc/foundation/TestConstStrings.py (1859 of 2355) PASS: lldb-api :: commands/target/stop-hook/enable/TestTargetStopHookEnable.py (1860 of 2355) PASS: lldb-shell :: ObjectFile/ELF/section-types.yaml (1861 of 2355) PASS: lldb-api :: functionalities/data-formatter/summary-string-onfail/Test-rdar-9974002.py (1862 of 2355) PASS: lldb-shell :: SymbolFile/DWARF/x86/inline-function-address-shared.test (1863 of 2355) PASS: lldb-api :: functionalities/thread/concurrent_events/TestConcurrentBreakpointDelayBreakpointOneSignal.py (1864 of 2355) PASS: lldb-api :: lang/objc/objc-ivar-offsets/TestObjCIvarOffsets.py (1865 of 2355) PASS: lldb-api :: lang/objc/modules-objc-property/TestModulesObjCProperty.py (1866 of 2355) PASS: lldb-shell :: Driver/TestProcessAttach.test (1867 of 2355) PASS: lldb-api :: functionalities/tail_call_frames/thread_step_out_message/TestArtificialFrameStepOutMessage.py (1868 of 2355) PASS: lldb-unit :: tools/lldb-server/tests/./LLDBServerTests/TestBase.LaunchModePreservesEnvironment (1869 of 2355) PASS: lldb-shell :: ObjectFile/ELF/build-id-case.yaml (1870 of 2355) PASS: lldb-api :: functionalities/thread/crash_during_step/TestCrashDuringStep.py (1871 of 2355) PASS: lldb-api :: tools/lldb-server/register-reading/TestGdbRemoteGPacket.py (1872 of 2355) PASS: lldb-shell :: Driver/TestRepl.test (1873 of 2355) UNSUPPORTED: lldb-api :: functionalities/unwind/aarch64_unwind_pac/TestAArch64UnwindPAC.py (1874 of 2355) PASS: lldb-api :: lang/cpp/operator-overload/TestOperatorOverload.py (1875 of 2355) UNSUPPORTED: lldb-api :: commands/gui/basic/TestGuiBasic.py (1876 of 2355) PASS: lldb-unit :: Utility/./UtilityTests/RangeDataVector.FindEntryThatContains (1877 of 2355) PASS: lldb-api :: lang/cpp/breakpoint-commands/TestCPPBreakpointCommands.py (1878 of 2355) UNSUPPORTED: lldb-api :: functionalities/darwin_log/basic/TestDarwinLogBasic.py (1879 of 2355) PASS: lldb-unit :: ScriptInterpreter/Python/./ScriptInterpreterPythonTests/PythonDataObjectsTest.TestPythonDictionaryManipulation (1880 of 2355) PASS: lldb-unit :: Symbol/./SymbolTests/TestTypeSystemClang.OnlyPackName (1881 of 2355) PASS: lldb-unit :: Process/minidump/./LLDBMinidumpTests/MinidumpParserTest.GetPid (1882 of 2355) PASS: lldb-unit :: DataFormatter/./LLDBFormatterTests/TypeMatcherTests.CreatedBySameMatchString (1883 of 2355) PASS: lldb-unit :: Symbol/./SymbolTests/TestTypeSystemClang.TestFunctionTemplateInRecordConstruction (1884 of 2355) PASS: lldb-api :: functionalities/gdb_remote_client/TestIOSSimulator.py (1885 of 2355) PASS: lldb-unit :: Utility/./UtilityTests/UriParserTest.Empty (1886 of 2355) PASS: lldb-shell :: ObjectFile/ELF/null-jmprel.yaml (1887 of 2355) PASS: lldb-api :: functionalities/thread/concurrent_events/TestConcurrentSignalWatch.py (1888 of 2355) PASS: lldb-api :: commands/watchpoints/watchpoint_commands/command/TestWatchpointCommandPython.py (1889 of 2355) PASS: lldb-api :: macosx/lc-note/firmware-corefile/TestFirmwareCorefiles.py (1890 of 2355) PASS: lldb-shell :: SymbolFile/DWARF/x86/dwarf5_locations.s (1891 of 2355) PASS: lldb-unit :: Utility/./UtilityTests/ScalarTest.Comparison (1892 of 2355) PASS: lldb-unit :: ScriptInterpreter/Python/./ScriptInterpreterPythonTests/PythonDataObjectsTest.TestExceptions (1893 of 2355) PASS: lldb-unit :: Utility/./UtilityTests/LogChannelTest.EnableOptions (1894 of 2355) UNSUPPORTED: lldb-api :: tools/lldb-server/TestGdbRemoteCompletion.py (1895 of 2355) PASS: lldb-unit :: Utility/./UtilityTests/StreamTest.PutCharWhitespace (1896 of 2355) PASS: lldb-shell :: SymbolFile/DWARF/x86/debug_loc_and_loclists.s (1897 of 2355) PASS: lldb-api :: lang/c/anonymous/TestAnonymous.py (1898 of 2355) UNSUPPORTED: lldb-shell :: SymbolFile/DWARF/debug-types-expressions.test (1899 of 2355) PASS: lldb-shell :: SymbolFile/DWARF/x86/find-function-regex.cpp (1900 of 2355) PASS: lldb-shell :: ObjectFile/ELF/PT_LOAD-overlap-section.yaml (1901 of 2355) UNSUPPORTED: lldb-shell :: SymbolFile/PDB/expressions.test (1902 of 2355) PASS: lldb-api :: lang/cpp/typedef/TestCppTypedef.py (1903 of 2355) PASS: lldb-unit :: ObjectFile/PECOFF/./ObjectFilePECOFFTests/PECallFrameInfoTest.Chained_eh (1904 of 2355) PASS: lldb-api :: commands/register/register/register_command/TestRegisters.py (1905 of 2355) PASS: lldb-api :: functionalities/unwind/zeroth_frame/TestZerothFrame.py (1906 of 2355) PASS: lldb-shell :: ScriptInterpreter/Python/command_relative_import.test (1907 of 2355) PASS: lldb-unit :: Utility/./UtilityTests/StreamTest.PutBytesAsRawHex8ToMixedEndian (1908 of 2355) PASS: lldb-api :: functionalities/memory/read/TestMemoryRead.py (1909 of 2355) PASS: lldb-unit :: Utility/./UtilityTests/StringListTest.GetSize (1910 of 2355) PASS: lldb-unit :: Utility/./UtilityTests/FileSpecTest.FileAndDirectoryComponents (1911 of 2355) PASS: lldb-api :: functionalities/data-formatter/data-formatter-stl/libstdcpp/unique_ptr/invalid/TestDataFormatterInvalidStdUniquePtr.py (1912 of 2355) UNSUPPORTED: lldb-api :: functionalities/darwin_log/filter/regex/activity-chain/TestDarwinLogFilterRegexActivityChain.py (1913 of 2355) PASS: lldb-shell :: ObjectFile/PECOFF/basic-info-arm64.yaml (1914 of 2355) PASS: lldb-unit :: UnwindAssembly/x86/./UnwindAssemblyx86Tests/Testx86AssemblyInspectionEngine.TestPopR14 (1915 of 2355) PASS: lldb-shell :: Error/assert.test (1916 of 2355) PASS: lldb-unit :: Utility/./UtilityTests/OptionsWithRawTest.ArgsButNoDelimiter (1917 of 2355) PASS: lldb-unit :: Utility/./UtilityTests/BinaryStreamTest.PutULEB128FourBytes (1918 of 2355) PASS: lldb-api :: lang/objc/modules-cache/TestClangModulesCache.py (1919 of 2355) PASS: lldb-api :: python_api/section/TestSectionAPI.py (1920 of 2355) PASS: lldb-api :: python_api/watchpoint/TestSetWatchpoint.py (1921 of 2355) PASS: lldb-api :: macosx/builtin-debugtrap/TestBuiltinDebugTrap.py (1922 of 2355) PASS: lldb-unit :: Symbol/./SymbolTests/TestClangASTImporter.MetadataPropagationAfterCopying (1923 of 2355) UNSUPPORTED: lldb-api :: lang/cpp/printf/TestPrintf.py (1924 of 2355) PASS: lldb-api :: commands/process/attach/attach_denied/TestAttachDenied.py (1925 of 2355) PASS: lldb-api :: lang/c/record_decl_in_expr/TestRecordDeclInExpr.py (1926 of 2355) PASS: lldb-unit :: Host/./HostTests/ConnectionFileDescriptorTest.TCPGetURIv4 (1927 of 2355) PASS: lldb-api :: functionalities/tail_call_frames/disambiguate_call_site/TestDisambiguateCallSite.py (1928 of 2355) PASS: lldb-api :: commands/expression/call-function/TestCallStdStringFunction.py (1929 of 2355) UNSUPPORTED: lldb-api :: functionalities/tsan/cpp_global_location/TestTsanCPPGlobalLocation.py (1930 of 2355) PASS: lldb-unit :: Utility/./UtilityTests/StringExtractorTest.GetHexU8_InvalidHex (1931 of 2355) PASS: lldb-unit :: Utility/./UtilityTests/TimeoutTest.Construction (1932 of 2355) PASS: lldb-unit :: Utility/./UtilityTests/BinaryStreamTest.PutSLEB128TwoBytes (1933 of 2355) UNSUPPORTED: lldb-shell :: Register/x86-64-zmm-read.test (1934 of 2355) PASS: lldb-unit :: Utility/./UtilityTests/FileSpecTest.EqualDotsPosixRoot (1935 of 2355) PASS: lldb-unit :: Utility/./UtilityTests/VASprintfTest.BufferResize (1936 of 2355) PASS: lldb-api :: lang/cpp/dynamic-value/TestDynamicValue.py (1937 of 2355) PASS: lldb-api :: commands/platform/basic/TestPlatformPython.py (1938 of 2355) PASS: lldb-unit :: Utility/./UtilityTests/StringExtractorTest.DecodeHexU8_Extra (1939 of 2355) PASS: lldb-shell :: ObjectFile/PECOFF/uuid.yaml (1940 of 2355) PASS: lldb-unit :: Process/gdb-remote/./ProcessGdbRemoteTests/GDBRemoteClientBaseTest.SendContinueAndAsyncPacket (1941 of 2355) UNSUPPORTED: lldb-api :: functionalities/tsan/thread_numbers/TestTsanThreadNumbers.py (1942 of 2355) UNSUPPORTED: lldb-shell :: SymbolFile/NativePDB/ast-functions-msvc.cpp (1943 of 2355) PASS: lldb-shell :: Register/Core/x86-64-freebsd-addr.test (1944 of 2355) PASS: lldb-unit :: Core/./LLDBCoreTests/MangledTest.EmptyForInvalidRustV0Name (1945 of 2355) PASS: lldb-unit :: ScriptInterpreter/Python/./ScriptInterpreterPythonTests/PythonDataObjectsTest.TestScript (1946 of 2355) PASS: lldb-unit :: Symbol/./SymbolTests/SymbolsTest.TerminateLocateExecutableSymbolFileForUnknownExecutableAndUnknownSymbolFile (1947 of 2355) UNSUPPORTED: lldb-shell :: SymbolFile/dissassemble-entry-point.s (1948 of 2355) UNSUPPORTED: lldb-shell :: Register/x86-db-read.test (1949 of 2355) PASS: lldb-unit :: Utility/./UtilityTests/RecordReplayTest.ValidSequence (1950 of 2355) PASS: lldb-unit :: Utility/./UtilityTests/StreamTeeTest.Constructor1Stream (1951 of 2355) PASS: lldb-api :: lang/cpp/chained-calls/TestCppChainedCalls.py (1952 of 2355) PASS: lldb-api :: types/TestRecursiveTypes.py (1953 of 2355) PASS: lldb-shell :: ObjectFile/ELF/avr-basic-info.yaml (1954 of 2355) PASS: lldb-unit :: Utility/./UtilityTests/StringListTest.GetMaxStringLengthEmpty (1955 of 2355) PASS: lldb-unit :: UnwindAssembly/x86/./UnwindAssemblyx86Tests/Testx86AssemblyInspectionEngine.TestSpillRegToStackViaMOVi386 (1956 of 2355) PASS: lldb-unit :: Utility/./UtilityTests/PassiveReplayTest.InstrumentedBarPtr (1957 of 2355) PASS: lldb-api :: python_api/value_var_update/TestValueVarUpdate.py (1958 of 2355) PASS: lldb-unit :: Utility/./UtilityTests/ScalarTest.SetValueFromCString (1959 of 2355) PASS: lldb-unit :: Utility/./UtilityTests/StringListTest.InsertStringAtIndexOutOfBounds (1960 of 2355) PASS: lldb-unit :: Utility/./UtilityTests/StringLexerTest.HasAtLeast (1961 of 2355) PASS: lldb-unit :: Utility/./UtilityTests/RangeTest.SlideZero (1962 of 2355) PASS: lldb-unit :: Interpreter/./InterpreterTests/CompletionTest.DirCompletionAbsolute (1963 of 2355) PASS: lldb-unit :: Utility/./UtilityTests/StringExtractorTest.GetHexBytesAvail_FullString (1964 of 2355) PASS: lldb-api :: functionalities/thread/concurrent_events/TestConcurrentCrashWithSignal.py (1965 of 2355) PASS: lldb-api :: lang/c/modules/TestCModules.py (1966 of 2355) PASS: lldb-api :: functionalities/history/TestHistoryRecall.py (1967 of 2355) PASS: lldb-shell :: SymbolFile/NativePDB/function-types-builtins.cpp (1968 of 2355) PASS: lldb-api :: functionalities/thread/concurrent_events/TestConcurrentSignalBreak.py (1969 of 2355) PASS: lldb-api :: commands/expression/radar_9673664/TestExprHelpExamples.py (1970 of 2355) UNSUPPORTED: lldb-shell :: SymbolFile/NativePDB/local-variables.cpp (1971 of 2355) PASS: lldb-shell :: Quit/TestQuitExitCode30.test (1972 of 2355) PASS: lldb-api :: macosx/DBGSourcePathRemapping/TestDSYMSourcePathRemapping.py (1973 of 2355) PASS: lldb-api :: commands/expression/import-std-module/basic/TestImportStdModule.py (1974 of 2355) PASS: lldb-unit :: Process/minidump/./LLDBMinidumpTests/MinidumpParserTest.GetThreadContext_x86_32_wow64 (1975 of 2355) PASS: lldb-unit :: UnwindAssembly/x86/./UnwindAssemblyx86Tests/Testx86AssemblyInspectionEngine.TestSubRSP (1976 of 2355) PASS: lldb-api :: commands/expression/import-std-module/unique_ptr-dbg-info-content/TestUniquePtrDbgInfoContent.py (1977 of 2355) PASS: lldb-unit :: Utility/./UtilityTests/FileSpecTest.GetPath (1978 of 2355) PASS: lldb-unit :: Utility/./UtilityTests/TimerTest.CategoryTimes2 (1979 of 2355) UNSUPPORTED: lldb-shell :: Watchpoint/netbsd-nouserdbregs.test (1980 of 2355) PASS: lldb-api :: commands/apropos/with-process/TestAproposWithProcess.py (1981 of 2355) PASS: lldb-unit :: Symbol/./SymbolTests/TestTypeSystemClang.TestGetTypeClassTypeOf (1982 of 2355) PASS: lldb-shell :: Reproducer/TestDriverOptions.test (1983 of 2355) PASS: lldb-unit :: Signals/./SignalsTests/UnixSignalsTest.Iteration (1984 of 2355) PASS: lldb-unit :: Symbol/./SymbolTests/TestTypeSystemClang.TestRemoveFastQualifiers (1985 of 2355) PASS: lldb-unit :: Language/Highlighting/./HighlighterTests/HighlighterTest.HighlighterSelectionPath (1986 of 2355) PASS: lldb-unit :: Core/./LLDBCoreTests/DumpDataExtractorTest.StartOffset (1987 of 2355) PASS: lldb-api :: api/multithreaded/TestMultithreaded.py (1988 of 2355) PASS: lldb-unit :: Utility/./UtilityTests/GeneratorTest.Create (1989 of 2355) PASS: lldb-shell :: SymbolFile/NativePDB/globals-bss.cpp (1990 of 2355) PASS: lldb-api :: functionalities/recursion/TestValueObjectRecursion.py (1991 of 2355) PASS: lldb-unit :: Utility/./UtilityTests/OptionsWithRawTest.WhitespaceSuffix (1992 of 2355) PASS: lldb-unit :: Process/minidump/./LLDBMinidumpTests/MinidumpParserTest.MinidumpDuplicateModuleMappedFirst (1993 of 2355) PASS: lldb-unit :: Utility/./UtilityTests/RecordReplayTest.InstrumentedFooSameThis (1994 of 2355) PASS: lldb-api :: functionalities/data-formatter/hexcaps/TestDataFormatterHexCaps.py (1995 of 2355) PASS: lldb-unit :: ObjectFile/Breakpad/./ObjectFileBreakpadTests/InfoRecord.parse (1996 of 2355) PASS: lldb-shell :: ObjectFile/Breakpad/breakpad-identification.test (1997 of 2355) PASS: lldb-shell :: SymbolFile/Breakpad/unwind-via-stack-win.test (1998 of 2355) PASS: lldb-shell :: SymbolFile/DWARF/x86/find-basic-variable.cpp (1999 of 2355) PASS: lldb-api :: functionalities/data-formatter/setvaluefromcstring/TestSetValueFromCString.py (2000 of 2355) PASS: lldb-api :: commands/expression/function_template_specialization_temp_args/TestFunctionTemplateSpecializationTempArgs.py (2001 of 2355) UNSUPPORTED: lldb-api :: functionalities/thread/concurrent_events/TestConcurrentManySignals.py (2002 of 2355) PASS: lldb-unit :: UnwindAssembly/x86/./UnwindAssemblyx86Tests/Testx86AssemblyInspectionEngine.TestPopRBP (2003 of 2355) PASS: lldb-api :: functionalities/thread/concurrent_events/TestConcurrentTwoBreakpointsOneDelaySignal.py (2004 of 2355) PASS: lldb-api :: functionalities/breakpoint/serialize/TestBreakpointSerialization.py (2005 of 2355) PASS: lldb-unit :: Symbol/./SymbolTests/TestTypeSystemClang.TestGetTypeClassDeclType (2006 of 2355) PASS: lldb-unit :: Utility/./UtilityTests/ConstStringTest.MangledCounterpart (2007 of 2355) XFAIL: lldb-shell :: Register/x86-64-ymm-write.test (2008 of 2355) PASS: lldb-unit :: Utility/./UtilityTests/StreamTeeTest.Constructor2Streams (2009 of 2355) PASS: lldb-unit :: Utility/./UtilityTests/ArchSpecTest.Compatibility (2010 of 2355) PASS: lldb-api :: commands/expression/scoped_enums/TestScopedEnumType.py (2011 of 2355) PASS: lldb-unit :: Utility/./UtilityTests/ArgsTest.ReplaceArgumentAtIndexFarOutOfRange (2012 of 2355) PASS: lldb-unit :: Host/./HostTests/FileSystemTest.FileAndDirectoryComponents (2013 of 2355) PASS: lldb-unit :: Utility/./UtilityTests/StreamTest.AddressRangeSize (2014 of 2355) PASS: lldb-api :: lang/cpp/class-template-type-parameter-pack/TestClassTemplateTypeParameterPack.py (2015 of 2355) PASS: lldb-api :: functionalities/tail_call_frames/ambiguous_tail_call_seq2/TestAmbiguousTailCallSeq2.py (2016 of 2355) PASS: lldb-api :: commands/platform/file/close/TestPlatformFileClose.py (2017 of 2355) UNSUPPORTED: lldb-api :: functionalities/signal/handle-segv/TestHandleSegv.py (2018 of 2355) PASS: lldb-shell :: SymbolFile/DWARF/x86/find-method.cpp (2019 of 2355) UNSUPPORTED: lldb-api :: benchmarks/expression/TestRepeatedExprs.py (2020 of 2355) PASS: lldb-api :: commands/watchpoints/watchpoint_disable/TestWatchpointDisable.py (2021 of 2355) PASS: lldb-unit :: Utility/./UtilityTests/RangeTest.ContainsRange (2022 of 2355) PASS: lldb-api :: functionalities/gdb_remote_client/TestArmRegisterDefinition.py (2023 of 2355) PASS: lldb-api :: functionalities/breakpoint/breakpoint_command/TestRegexpBreakCommand.py (2024 of 2355) PASS: lldb-unit :: Utility/./UtilityTests/RangeTest.Copy (2025 of 2355) PASS: lldb-unit :: Process/minidump/./LLDBMinidumpTests/MinidumpParserTest.GetLinuxProcStatus (2026 of 2355) UNSUPPORTED: lldb-shell :: SymbolFile/PDB/udt-layout.test (2027 of 2355) PASS: lldb-unit :: UnwindAssembly/x86/./UnwindAssemblyx86Tests/Testx86AssemblyInspectionEngine.TestPopRBX (2028 of 2355) PASS: lldb-unit :: ScriptInterpreter/Python/./ScriptInterpreterPythonTests/PythonDataObjectsTest.TestPythonDictionaryToStructuredDictionary (2029 of 2355) PASS: lldb-api :: functionalities/postmortem/wow64_minidump/TestWow64MiniDump.py (2030 of 2355) PASS: lldb-shell :: Reproducer/TestVerify.test (2031 of 2355) PASS: lldb-unit :: Utility/./UtilityTests/DataExtractorTest.GetMaxS64 (2032 of 2355) PASS: lldb-unit :: Utility/./UtilityTests/StringExtractorTest.GetU64BigEndian (2033 of 2355) PASS: lldb-unit :: Utility/./UtilityTests/SerializationRountripTest.SerializeDeserializePodPointers (2034 of 2355) PASS: lldb-shell :: Driver/LocalLLDBInit.test (2035 of 2355) PASS: lldb-shell :: SymbolFile/DWARF/x86/debug_line-relative_path.s (2036 of 2355) PASS: lldb-api :: commands/expression/char/TestExprsChar.py (2037 of 2355) PASS: lldb-shell :: Driver/TestHelp.test (2038 of 2355) PASS: lldb-unit :: Utility/./UtilityTests/StringLexerTest.NextIf (2039 of 2355) PASS: lldb-api :: python_api/sblaunchinfo/TestSBLaunchInfo.py (2040 of 2355) PASS: lldb-shell :: Reproducer/Functionalities/TestStepping.test (2041 of 2355) PASS: lldb-shell :: Heap/heap-cstr.test (2042 of 2355) PASS: lldb-api :: functionalities/postmortem/elf-core/thread_crash/TestLinuxCoreThreads.py (2043 of 2355) PASS: lldb-api :: sanity/TestModuleCacheSanity.py (2044 of 2355) PASS: lldb-unit :: Symbol/./SymbolTests/PostfixExpression.ParseOneExpression (2045 of 2355) PASS: lldb-unit :: Utility/./UtilityTests/XcodeSDKTest.GetCanonicalNameAndConstruct (2046 of 2355) PASS: lldb-unit :: Symbol/./SymbolTests/TestTypeSystemClang.TestDisplayNameEmpty (2047 of 2355) PASS: lldb-unit :: Utility/./UtilityTests/ArgsTest.TestAppendArg (2048 of 2355) PASS: lldb-shell :: Breakpoint/debug_rnglist_rlestartend.test (2049 of 2355) PASS: lldb-shell :: SymbolFile/DWARF/x86/array-sizes.s (2050 of 2355) PASS: lldb-api :: functionalities/data-formatter/data-formatter-objc/TestDataFormatterObjCNSData.py (2051 of 2355) PASS: lldb-api :: functionalities/breakpoint/breakpoint_names/TestBreakpointNames.py (2052 of 2355) PASS: lldb-shell :: SymbolFile/DWARF/x86/split-dwarf-inlining.cpp (2053 of 2355) PASS: lldb-unit :: UnwindAssembly/x86/./UnwindAssemblyx86Tests/Testx86AssemblyInspectionEngine.TestPushR15 (2054 of 2355) UNSUPPORTED: lldb-api :: arm/breakpoint-it/TestBreakpointIt.py (2055 of 2355) PASS: lldb-api :: commands/expression/anonymous-struct/TestCallUserAnonTypedef.py (2056 of 2355) PASS: lldb-unit :: Core/./LLDBCoreTests/SourceFileCache.FindSourceFileNotFound (2057 of 2355) UNSUPPORTED: lldb-shell :: Subprocess/clone-follow-parent-wp.test (2058 of 2355) PASS: lldb-unit :: Utility/./UtilityTests/StringExtractorTest.GetNameColonValueNoColon (2059 of 2355) PASS: lldb-unit :: ScriptInterpreter/Python/./ScriptInterpreterPythonTests/PythonDataObjectsTest.TestTypeNameResolutionNoDot (2060 of 2355) PASS: lldb-api :: tools/lldb-vscode/console/TestVSCode_redirection_to_console.py (2061 of 2355) UNSUPPORTED: lldb-api :: functionalities/darwin_log/filter/exact_match/activity-chain/TestDarwinLogFilterMatchActivityChain.py (2062 of 2355) PASS: lldb-unit :: Utility/./UtilityTests/ScalarTest.CastOperations (2063 of 2355) PASS: lldb-unit :: ScriptInterpreter/Python/./ScriptInterpreterPythonTests/PythonDataObjectsTest.TestModuleNameResolutionNoDot (2064 of 2355) PASS: lldb-unit :: Utility/./UtilityTests/AnsiTerminal.Unknown (2065 of 2355) PASS: lldb-api :: commands/expression/persistent_ptr_update/TestPersistentPtrUpdate.py (2066 of 2355) PASS: lldb-unit :: Process/./ProcessEventDataTests/ProcessEventDataTest.ShouldStop (2067 of 2355) PASS: lldb-api :: functionalities/unwind/noreturn/TestNoreturnUnwind.py (2068 of 2355) PASS: lldb-unit :: Process/Utility/./ProcessUtilityTests/ProcSMapTests/LinuxProcSMapsTestFixture.ParseSMapRegions/3 (2069 of 2355) PASS: lldb-unit :: Utility/./UtilityTests/PassiveReplayTest.InstrumentedBarRef (2070 of 2355) PASS: lldb-shell :: SymbolFile/DWARF/x86/gnu-style-compression.cpp (2071 of 2355) PASS: lldb-unit :: UnwindAssembly/x86/./UnwindAssemblyx86Tests/Testx86AssemblyInspectionEngine.TestPushEBP (2072 of 2355) PASS: lldb-unit :: Utility/./UtilityTests/ScalarTest.GetValue (2073 of 2355) PASS: lldb-unit :: Utility/./UtilityTests/ArgsTest.EscapeLLDBCommandArgument (2074 of 2355) PASS: lldb-api :: functionalities/data-formatter/data-formatter-stl/libcxx/initializerlist/TestInitializerList.py (2075 of 2355) PASS: lldb-unit :: UnwindAssembly/x86/./UnwindAssemblyx86Tests/Testx86AssemblyInspectionEngine.TestPushExtended (2076 of 2355) PASS: lldb-shell :: SymbolFile/DWARF/x86/DW_AT_data_bit_offset-DW_OP_stack_value.s (2077 of 2355) PASS: lldb-unit :: Utility/./UtilityTests/ArgsTest.TestQuotedUnknownEscape (2078 of 2355) PASS: lldb-api :: functionalities/load_lazy/TestLoadUsingLazyBind.py (2079 of 2355) PASS: lldb-unit :: Symbol/./SymbolTests/TestTypeSystemClang.TestIsClangType (2080 of 2355) UNSUPPORTED: lldb-api :: functionalities/thread/multi_break/TestMultipleBreakpoints.py (2081 of 2355) PASS: lldb-unit :: Utility/./UtilityTests/FileSpecTest.EqualSeparator (2082 of 2355) PASS: lldb-unit :: ObjectFile/Breakpad/./ObjectFileBreakpadTests/PublicRecord.parse (2083 of 2355) UNSUPPORTED: lldb-shell :: SymbolFile/Breakpad/stack-cfi-arm.yaml (2084 of 2355) PASS: lldb-unit :: tools/lldb-server/tests/./LLDBServerTests/TestBase.DebugserverEnv (2085 of 2355) PASS: lldb-unit :: UnwindAssembly/x86/./UnwindAssemblyx86Tests/Testx86AssemblyInspectionEngine.TestSpArithx86_64Augmented (2086 of 2355) PASS: lldb-unit :: Host/./HostTests/NativeProcessProtocolTest.ReadCStringFromMemory (2087 of 2355) PASS: lldb-api :: lang/objc/bitfield_ivars/TestBitfieldIvars.py (2088 of 2355) PASS: lldb-api :: tools/lldb-vscode/stackTrace/TestVSCode_stackTrace.py (2089 of 2355) PASS: lldb-api :: commands/target/stop-hook/disable/TestTargetStopHookDisable.py (2090 of 2355) PASS: lldb-shell :: SymbolFile/NativePDB/ast-types.cpp (2091 of 2355) PASS: lldb-unit :: Host/./HostTests/HostInfoTest.GetXcodeSDK (2092 of 2355) PASS: lldb-unit :: ScriptInterpreter/Python/./ScriptInterpreterPythonTests/PythonDataObjectsTest.TestPythonStringToStr (2093 of 2355) PASS: lldb-shell :: SymbolFile/DWARF/x86/dwp.s (2094 of 2355) PASS: lldb-unit :: Utility/./UtilityTests/OptionsWithRawTest.SingleWhitespaceInput (2095 of 2355) PASS: lldb-api :: commands/expression/error-limit/TestExprErrorLimit.py (2096 of 2355) PASS: lldb-unit :: Target/./TargetTests/MemoryRegionInfoTest.Formatv (2097 of 2355) PASS: lldb-api :: functionalities/inferior-crashing/recursive-inferior/TestRecursiveInferior.py (2098 of 2355) PASS: lldb-shell :: SymbolFile/DWARF/x86/dir-separator-no-comp-dir-relative-name.s (2099 of 2355) PASS: lldb-unit :: Expression/./ExpressionTests/CppModuleConfigurationTest.AmbiguousCLib (2100 of 2355) PASS: lldb-unit :: Utility/./UtilityTests/SerializationRountripTest.SerializeDeserializeCStringArray (2101 of 2355) PASS: lldb-unit :: Process/minidump/./LLDBMinidumpTests/MinidumpParserTest.GetMiscInfoWindows (2102 of 2355) UNSUPPORTED: lldb-shell :: Minidump/Windows/arm-fp-unwind.test (2103 of 2355) PASS: lldb-api :: lang/objc/objc-foundation-dictionary-empty/TestNSDictionary0.py (2104 of 2355) PASS: lldb-shell :: Register/Core/x86-32-freebsd-fp.test (2105 of 2355) PASS: lldb-unit :: Utility/./UtilityTests/ProcessInstanceInfo.Yaml (2106 of 2355) PASS: lldb-shell :: SymbolFile/DWARF/x86/DW_OP_piece-smaller-than-struct.s (2107 of 2355) PASS: lldb-unit :: Expression/./ExpressionTests/CppModuleConfigurationTest.UnrelatedLibrary (2108 of 2355) PASS: lldb-unit :: Utility/./UtilityTests/CompletionRequest.TryCompleteCurrentArgMode (2109 of 2355) PASS: lldb-shell :: ObjectFile/MachO/lc_build_version.yaml (2110 of 2355) PASS: lldb-shell :: SymbolFile/DWARF/x86/childless-compile-unit.s (2111 of 2355) PASS: lldb-shell :: Driver/TestFile.test (2112 of 2355) PASS: lldb-api :: commands/watchpoints/watchpoint_size/TestWatchpointSizes.py (2113 of 2355) PASS: lldb-api :: functionalities/thread/concurrent_events/TestConcurrentDelaySignalBreak.py (2114 of 2355) PASS: lldb-api :: python_api/signals/TestSignalsAPI.py (2115 of 2355) PASS: lldb-unit :: Utility/./UtilityTests/XcodeSDKTest.MergeTest (2116 of 2355) PASS: lldb-unit :: Language/Highlighting/./HighlighterTests/HighlighterTest.ClangOperators (2117 of 2355) PASS: lldb-unit :: Utility/./UtilityTests/StringListTest.JoinEmpty (2118 of 2355) PASS: lldb-unit :: Utility/./UtilityTests/StringExtractorTest.DecodeHexU8_Underflow2 (2119 of 2355) PASS: lldb-unit :: Host/./HostTests/MainLoopTest.Signal (2120 of 2355) PASS: lldb-api :: lang/cpp/pointer_to_member_type_depending_on_parent_size/TestPointerToMemberTypeDependingOnParentSize.py (2121 of 2355) PASS: lldb-unit :: ScriptInterpreter/Python/./ScriptInterpreterPythonTests/PythonDataObjectsTest.TestPythonListValueEquality (2122 of 2355) PASS: lldb-api :: lang/cpp/class-template-parameter-pack/TestClassTemplateParameterPack.py (2123 of 2355) PASS: lldb-unit :: UnwindAssembly/x86/./UnwindAssemblyx86Tests/Testx86AssemblyInspectionEngine.Test64bitFramelessBigStackFrame (2124 of 2355) PASS: lldb-unit :: Interpreter/./InterpreterTests/OptionValueArgs.DeepCopy (2125 of 2355) PASS: lldb-api :: commands/target/stop-hooks/TestStopHooks.py (2126 of 2355) PASS: lldb-api :: lang/cpp/class_types/TestClassTypes.py (2127 of 2355) PASS: lldb-unit :: ScriptInterpreter/Python/./ScriptInterpreterPythonTests/PythonDataObjectsTest.TestPythonDictionaryValueEquality (2128 of 2355) PASS: lldb-unit :: Utility/./UtilityTests/ConstStringTest.format_provider (2129 of 2355) PASS: lldb-unit :: UnwindAssembly/x86/./UnwindAssemblyx86Tests/Testx86AssemblyInspectionEngine.TestAddESP (2130 of 2355) PASS: lldb-unit :: Utility/./UtilityTests/ArgsTest.TestSingleQuotedArgWithSpace (2131 of 2355) PASS: lldb-api :: commands/expression/import-std-module/weak_ptr/TestWeakPtrFromStdModule.py (2132 of 2355) PASS: lldb-shell :: ScriptInterpreter/Python/Crashlog/json.test (2133 of 2355) PASS: lldb-unit :: Utility/./UtilityTests/ScalarTest.Promotion (2134 of 2355) PASS: lldb-shell :: Reproducer/TestVersionCheck.test (2135 of 2355) PASS: lldb-api :: functionalities/data-formatter/data-formatter-stl/libcxx/optional/TestDataFormatterLibcxxOptional.py (2136 of 2355) PASS: lldb-shell :: ObjectFile/ELF/eh_frame-symbols.yaml (2137 of 2355) PASS: lldb-shell :: SymbolFile/symbol-binding.test (2138 of 2355) PASS: lldb-api :: functionalities/tail_call_frames/cross_dso/TestCrossDSOTailCalls.py (2139 of 2355) PASS: lldb-unit :: Utility/./UtilityTests/SerializationRountripTest.SerializeDeserializeCStringArrayNullptr (2140 of 2355) PASS: lldb-unit :: Utility/./UtilityTests/XcodeSDKTest.SDKSupportsModules (2141 of 2355) PASS: lldb-unit :: Utility/./UtilityTests/ScalarTest.Scalar_512 (2142 of 2355) PASS: lldb-unit :: Platform/./LLDBPlatformTests/PlatformDarwinTest.FindComponentInPath (2143 of 2355) UNSUPPORTED: lldb-api :: tools/lldb-server/memory-tagging/TestGdbRemoteMemoryTagging.py (2144 of 2355) PASS: lldb-unit :: Utility/./UtilityTests/UriParserTest.SchemeHostSeparator2 (2145 of 2355) PASS: lldb-api :: lang/cpp/namespace_definitions/TestNamespaceDefinitions.py (2146 of 2355) PASS: lldb-unit :: Utility/./UtilityTests/OptionsWithRawTest.EmptyInput (2147 of 2355) PASS: lldb-api :: lang/cpp/extern_c/TestExternCSymbols.py (2148 of 2355) PASS: lldb-api :: lang/cpp/incomplete-types/TestCppIncompleteTypes.py (2149 of 2355) PASS: lldb-unit :: Utility/./UtilityTests/StringListTest.ShiftStdString (2150 of 2355) PASS: lldb-api :: functionalities/multiword-commands/TestMultiWordCommands.py (2151 of 2355) PASS: lldb-unit :: Utility/./UtilityTests/StringExtractorTest.GetHexBytes_OddPair (2152 of 2355) PASS: lldb-api :: commands/frame/diagnose/complicated-expression/TestComplicatedExpression.py (2153 of 2355) PASS: lldb-api :: functionalities/set-data/TestSetData.py (2154 of 2355) PASS: lldb-api :: functionalities/breakpoint/breakpoint_ignore_count/TestBreakpointIgnoreCount.py (2155 of 2355) PASS: lldb-unit :: Utility/./UtilityTests/StringListTest.GetMaxStringLengthDecreasingSize (2156 of 2355) PASS: lldb-api :: tools/lldb-server/inferior-crash/TestGdbRemoteAbort.py (2157 of 2355) PASS: lldb-api :: python_api/sbenvironment/TestSBEnvironment.py (2158 of 2355) PASS: lldb-api :: lang/cpp/forward-declared-template-specialization/TestCppForwardDeclaredTemplateSpecialization.py (2159 of 2355) PASS: lldb-unit :: Utility/./UtilityTests/StreamTest.ShiftOperatorPtr (2160 of 2355) PASS: lldb-api :: lang/c/stepping/TestStepAndBreakpoints.py (2161 of 2355) PASS: lldb-api :: lang/objc/objc-dyn-sbtype/TestObjCDynamicSBType.py (2162 of 2355) PASS: lldb-unit :: Utility/./UtilityTests/StringLexerTest.GetUnlexed (2163 of 2355) PASS: lldb-shell :: SymbolFile/DWARF/x86/find-basic-type.cpp (2164 of 2355) PASS: lldb-api :: lang/cpp/template/TestTemplateArgs.py (2165 of 2355) PASS: lldb-shell :: Reproducer/TestDump.test (2166 of 2355) PASS: lldb-unit :: Utility/./UtilityTests/IndexToObjectTest.ObjectForIndex (2167 of 2355) PASS: lldb-unit :: Process/minidump/./LLDBMinidumpTests/MinidumpParserTest.GetMemoryRegionInfo (2168 of 2355) PASS: lldb-unit :: ScriptInterpreter/Python/./ScriptInterpreterPythonTests/PythonDataObjectsTest.TestPythonBytes (2169 of 2355) PASS: lldb-shell :: Reproducer/TestFinalize.test (2170 of 2355) PASS: lldb-api :: lang/cpp/limit-debug-info/TestWithLimitDebugInfo.py (2171 of 2355) PASS: lldb-unit :: Utility/./UtilityTests/LogChannelEnabledTest.LLDB_LOG_ERROR (2172 of 2355) PASS: lldb-api :: python_api/findvalue_duplist/TestSBFrameFindValue.py (2173 of 2355) UNSUPPORTED: lldb-shell :: SymbolFile/DWARF/x86/dwarf5-line-strp.s (2174 of 2355) PASS: lldb-unit :: Utility/./UtilityTests/PassiveReplayTest.InstrumentedFooInvalid (2175 of 2355) PASS: lldb-unit :: Process/minidump/./LLDBMinidumpTests/RegisterContextMinidump.ConvertMinidumpContext_x86_64 (2176 of 2355) PASS: lldb-unit :: Expression/./ExpressionTests/DiagnosticManagerTest.PutString (2177 of 2355) PASS: lldb-unit :: Utility/./UtilityTests/StringExtractorGDBRemoteTest.GetPidTidMultipleValues (2178 of 2355) PASS: lldb-unit :: Process/minidump/./LLDBMinidumpTests/MinidumpParserTest.GetThreadContext_x86_64 (2179 of 2355) PASS: lldb-unit :: Utility/./UtilityTests/ProcessInstanceInfoList.Yaml (2180 of 2355) PASS: lldb-api :: functionalities/thread/concurrent_events/TestConcurrentManyCrash.py (2181 of 2355) PASS: lldb-api :: functionalities/data-formatter/frameformat_smallstruct/TestFrameFormatSmallStruct.py (2182 of 2355) PASS: lldb-shell :: SymbolFile/DWARF/x86/dir-separator-windows.s (2183 of 2355) PASS: lldb-api :: tools/lldb-server/inferior-crash/TestGdbRemoteSegFault.py (2184 of 2355) PASS: lldb-unit :: Utility/./UtilityTests/ReproducerTest.SetCapture (2185 of 2355) UNSUPPORTED: lldb-api :: tools/lldb-server/vCont-threads/TestGdbRemote_vContThreads.py (2186 of 2355) PASS: lldb-unit :: Utility/./UtilityTests/StringListTest.CopyList (2187 of 2355) PASS: lldb-unit :: Utility/./UtilityTests/SubsystemRAIITest.SubsystemWithErrorSuccess (2188 of 2355) PASS: lldb-unit :: Utility/./UtilityTests/VMRange.IsValid (2189 of 2355) PASS: lldb-unit :: Symbol/./SymbolTests/TestClangASTImporter.DeportDeclTagDecl (2190 of 2355) PASS: lldb-unit :: ScriptInterpreter/Python/./ScriptInterpreterPythonTests/PythonDataObjectsTest.TestPythonTupleToStructuredList (2191 of 2355) PASS: lldb-unit :: Symbol/./SymbolTests/TestClangASTImporter.CopyDeclTagDecl (2192 of 2355) PASS: lldb-unit :: Process/Utility/./ProcessUtilityTests/MemoryTagManagerAArch64MTETest.GetLogicalTag (2193 of 2355) UNSUPPORTED: lldb-api :: linux/thread/create_during_instruction_step/TestCreateDuringInstructionStep.py (2194 of 2355) PASS: lldb-api :: tools/lldb-server/commandline/TestStubSetSID.py (2195 of 2355) PASS: lldb-api :: commands/expression/persistent_types/TestPersistentTypes.py (2196 of 2355) PASS: lldb-api :: tools/lldb-vscode/breakpoint/TestVSCode_setExceptionBreakpoints.py (2197 of 2355) PASS: lldb-unit :: Process/minidump/./LLDBMinidumpTests/RegisterContextMinidump.CheckRegisterContextMinidump_ARM (2198 of 2355) PASS: lldb-api :: commands/expression/radar_8638051/Test8638051.py (2199 of 2355) PASS: lldb-api :: functionalities/data-formatter/data-formatter-stl/libcxx/set/TestDataFormatterLibcxxSet.py (2200 of 2355) PASS: lldb-api :: macosx/nslog/TestDarwinNSLogOutput.py (2201 of 2355) PASS: lldb-unit :: Utility/./UtilityTests/StringListTest.SplitIntoLinesEmpty (2202 of 2355) PASS: lldb-unit :: Process/Utility/./ProcessUtilityTests/MemoryTagManagerAArch64MTETest.UnpackTagsData (2203 of 2355) PASS: lldb-unit :: Utility/./UtilityTests/SubsystemRAIITest.NormalSubsystem (2204 of 2355) UNSUPPORTED: lldb-api :: linux/aarch64/mte_memory_region/TestAArch64LinuxMTEMemoryRegion.py (2205 of 2355) UNSUPPORTED: lldb-shell :: SymbolFile/DWARF/x86/DW_TAG_variable-DW_AT_decl_file-DW_AT_abstract_origin-crosscu1.s (2206 of 2355) PASS: lldb-unit :: Core/./LLDBCoreTests/ModuleSpecTest.TestCOFFFile (2207 of 2355) PASS: lldb-unit :: Utility/./UtilityTests/ArgsTest.TestSingleArgWithQuotedSpace (2208 of 2355) PASS: lldb-api :: lang/cpp/namespace/TestNamespace.py (2209 of 2355) UNSUPPORTED: lldb-shell :: SymbolFile/PDB/class-layout.test (2210 of 2355) PASS: lldb-unit :: SymbolFile/DWARF/./SymbolFileDWARFTests/DWARFUnitTest.MissingSentinel (2211 of 2355) PASS: lldb-api :: functionalities/data-formatter/data-formatter-objc/TestDataFormatterObjCNSDate.py (2212 of 2355) PASS: lldb-unit :: Core/./LLDBCoreTests/UniqueCStringMap.NoDefaultConstructor (2213 of 2355) PASS: lldb-api :: types/TestFloatTypes.py (2214 of 2355) PASS: lldb-unit :: Expression/./ExpressionTests/ClangHostTest.ComputeClangResourceDirectory (2215 of 2355) PASS: lldb-api :: functionalities/data-formatter/compactvectors/TestCompactVectors.py (2216 of 2355) PASS: lldb-unit :: DataFormatter/./LLDBFormatterTests/StringPrinterTests.CxxUTF8 (2217 of 2355) PASS: lldb-api :: lang/objc/objc++/TestObjCXX.py (2218 of 2355) PASS: lldb-api :: functionalities/postmortem/mach-core/TestMachCore.py (2219 of 2355) PASS: lldb-api :: functionalities/gdb_remote_client/TestTargetXMLArch.py (2220 of 2355) PASS: lldb-api :: functionalities/reproducers/attach/TestReproducerAttach.py (2221 of 2355) PASS: lldb-api :: macosx/thread_suspend/TestInternalThreadSuspension.py (2222 of 2355) PASS: lldb-api :: commands/expression/fixits/TestFixIts.py (2223 of 2355) PASS: lldb-unit :: Utility/./UtilityTests/StreamTest.Indent (2224 of 2355) PASS: lldb-unit :: SymbolFile/DWARF/./SymbolFileDWARFTests/DWARFUnitTest.NullUnitDie (2225 of 2355) XFAIL: lldb-shell :: SymbolFile/DWARF/find-type-in-function.cpp (2226 of 2355) PASS: lldb-api :: functionalities/gdb_remote_client/TestStopPCs.py (2227 of 2355) UNSUPPORTED: lldb-shell :: Expr/TestIRMemoryMapWindows.test (2228 of 2355) PASS: lldb-api :: sanity/TestSettingSkipping.py (2229 of 2355) PASS: lldb-api :: commands/frame/diagnose/dereference-this/TestDiagnoseDereferenceThis.py (2230 of 2355) PASS: lldb-api :: functionalities/gdb_remote_client/TestJLink6Armv7RegisterDefinition.py (2231 of 2355) PASS: lldb-unit :: Utility/./UtilityTests/StringListTest.Assignment (2232 of 2355) PASS: lldb-api :: commands/source/info/TestSourceInfo.py (2233 of 2355) PASS: lldb-api :: commands/expression/dollar-in-variable/TestDollarInVariable.py (2234 of 2355) PASS: lldb-api :: functionalities/breakpoint/move_nearest/TestMoveNearest.py (2235 of 2355) PASS: lldb-api :: functionalities/data-formatter/type_summary_list_arg/TestTypeSummaryListArg.py (2236 of 2355) PASS: lldb-unit :: Core/./LLDBCoreTests/SourceLocationSpecTest.Equal (2237 of 2355) PASS: lldb-shell :: SymbolFile/NativePDB/function-types-classes.cpp (2238 of 2355) PASS: lldb-unit :: Utility/./UtilityTests/RangeVector.CombineConsecutiveRanges (2239 of 2355) UNSUPPORTED: lldb-api :: iohandler/unicode/TestUnicode.py (2240 of 2355) PASS: lldb-unit :: Utility/./UtilityTests/RangeDataVector.CustomSort (2241 of 2355) PASS: lldb-unit :: Utility/./UtilityTests/StringExtractorTest.InitMisc (2242 of 2355) PASS: lldb-unit :: Platform/./LLDBPlatformTests/PlatformAppleSimulatorTest.TestSimHasSimEnvionament (2243 of 2355) PASS: lldb-api :: commands/expression/call-function/TestCallUserDefinedFunction.py (2244 of 2355) PASS: lldb-api :: functionalities/fat_archives/TestFatArchives.py (2245 of 2355) PASS: lldb-shell :: Quit/TestQuitExitCode0.test (2246 of 2355) PASS: lldb-shell :: Reproducer/TestRelativePath.test (2247 of 2355) PASS: lldb-unit :: Utility/./UtilityTests/StreamTeeTest.Assignment (2248 of 2355) PASS: lldb-api :: lang/cpp/trivial_abi/TestTrivialABI.py (2249 of 2355) PASS: lldb-api :: functionalities/thread_plan/TestThreadPlanCommands.py (2250 of 2355) PASS: lldb-api :: functionalities/type_completion/TestTypeCompletion.py (2251 of 2355) UNSUPPORTED: lldb-api :: functionalities/thread/break_after_join/TestBreakAfterJoin.py (2252 of 2355) PASS: lldb-unit :: Utility/./UtilityTests/NameMatchesTest.Ignore (2253 of 2355) PASS: lldb-unit :: ObjectFile/Breakpad/./ObjectFileBreakpadTests/ModuleRecord.parse (2254 of 2355) PASS: lldb-api :: commands/expression/context-object-objc/TestContextObjectObjc.py (2255 of 2355) PASS: lldb-unit :: Utility/./UtilityTests/CompletionRequest.ShiftArguments (2256 of 2355) PASS: lldb-api :: lang/objc/objc-static-method-stripped/TestObjCStaticMethodStripped.py (2257 of 2355) PASS: lldb-unit :: Utility/./UtilityTests/BinaryStreamTest.PutSLEB128SevenBytes (2258 of 2355) PASS: lldb-unit :: Utility/./UtilityTests/RegularExpression.CopyAssignment (2259 of 2355) PASS: lldb-api :: commands/quit/TestQuit.py (2260 of 2355) PASS: lldb-api :: tools/lldb-server/thread-name/TestGdbRemoteThreadName.py (2261 of 2355) UNSUPPORTED: lldb-shell :: SymbolFile/PDB/func-symbols.test (2262 of 2355) PASS: lldb-api :: commands/expression/persistent_variables/TestPersistentVariables.py (2263 of 2355) PASS: lldb-api :: types/TestLongTypesExpr.py (2264 of 2355) PASS: lldb-shell :: Driver/TestCore.test (2265 of 2355) PASS: lldb-shell :: SymbolFile/NativePDB/tag-types.cpp (2266 of 2355) UNSUPPORTED: lldb-api :: functionalities/data-formatter/data-formatter-stl/libstdcpp/tuple/TestDataFormatterStdTuple.py (2267 of 2355) PASS: lldb-shell :: ObjectFile/PECOFF/section-types.yaml (2268 of 2355) PASS: lldb-unit :: Symbol/./SymbolTests/TestTypeSystemClang.TestConvertAccessTypeToAccessSpecifier (2269 of 2355) PASS: lldb-api :: functionalities/inline-stepping/TestInlineStepping.py (2270 of 2355) PASS: lldb-shell :: SymbolFile/DWARF/anon_class_w_and_wo_export_symbols.ll (2271 of 2355) PASS: lldb-api :: macosx/lc-note/kern-ver-str/TestKernVerStrLCNOTE.py (2272 of 2355) PASS: lldb-unit :: Utility/./UtilityTests/BinaryStreamTest.PutULEB128FiveBytes (2273 of 2355) PASS: lldb-unit :: Process/gdb-remote/./ProcessGdbRemoteTests/GDBRemoteCommunicationServerTest.SendErrorResponse_Status (2274 of 2355) PASS: lldb-api :: functionalities/data-formatter/data-formatter-objc/TestDataFormatterObjCPlain.py (2275 of 2355) PASS: lldb-unit :: Utility/./UtilityTests/AnsiTerminal.KnownPrefix (2276 of 2355) PASS: lldb-unit :: Interpreter/./InterpreterTests/OptionArgParserTest.toChar (2277 of 2355) PASS: lldb-shell :: Settings/TestEchoCommands.test (2278 of 2355) PASS: lldb-unit :: UnwindAssembly/x86/./UnwindAssemblyx86Tests/Testx86AssemblyInspectionEngine.TestPushECX (2279 of 2355) PASS: lldb-unit :: Host/./HostTests/NativeProcessProtocolTest.SetBreakpointFailRead (2280 of 2355) PASS: lldb-shell :: Commands/command-backtrace-parser-1.test (2281 of 2355) PASS: lldb-shell :: Driver/TestTarget.test (2282 of 2355) UNSUPPORTED: lldb-api :: commands/gui/breakpoints/TestGuiBreakpoints.py (2283 of 2355) PASS: lldb-shell :: SymbolFile/DWARF/x86/dwarf5-atomic.s (2284 of 2355) PASS: lldb-unit :: Utility/./UtilityTests/NameMatchesTest.StartsWith (2285 of 2355) PASS: lldb-unit :: Process/minidump/./LLDBMinidumpTests/MinidumpParserTest.MinidumpModuleOrder (2286 of 2355) PASS: lldb-api :: commands/session/history/TestSessionHistory.py (2287 of 2355) PASS: lldb-api :: commands/expression/invalid-args/TestInvalidArgsExpression.py (2288 of 2355) PASS: lldb-unit :: Process/minidump/./LLDBMinidumpTests/MinidumpParserTest.GetMiscInfo_no_stream (2289 of 2355) PASS: lldb-api :: commands/frame/select/TestFrameSelect.py (2290 of 2355) PASS: lldb-unit :: SymbolFile/DWARF/./SymbolFileDWARFTests/SymbolFileDWARFTests.TestAbbrevOrder1Start5 (2291 of 2355) PASS: lldb-api :: lang/objc/modules-inline-functions/TestModulesInlineFunctions.py (2292 of 2355) PASS: lldb-unit :: Utility/./UtilityTests/StreamTest.QuotedCString (2293 of 2355) PASS: lldb-api :: commands/add-dsym/uuid/TestAddDsymCommand.py (2294 of 2355) PASS: lldb-unit :: Utility/./UtilityTests/SerializationRountripTest.SerializeDeserializePod (2295 of 2355) PASS: lldb-unit :: Signals/./SignalsTests/UnixSignalsTest.VersionChange (2296 of 2355) PASS: lldb-shell :: Unwind/eh-frame-dwarf-unwind.test (2297 of 2355) PASS: lldb-unit :: debugserver/./debugserverTests/RNBSocket.LoopBackConnectIPv6 (2298 of 2355) PASS: lldb-shell :: SymbolFile/DWARF/x86/dwp-debug-types.s (2299 of 2355) UNSUPPORTED: lldb-api :: commands/trace/TestTraceSchema.py (2300 of 2355) PASS: lldb-unit :: ObjectFile/PECOFF/./ObjectFilePECOFFTests/PECallFrameInfoTest.Frame_reg_eh (2301 of 2355) PASS: lldb-unit :: Utility/./UtilityTests/BroadcasterTest.EventTypeHasListeners (2302 of 2355) UNSUPPORTED: lldb-shell :: ScriptInterpreter/Lua/partial_statements.test (2303 of 2355) PASS: lldb-unit :: Utility/./UtilityTests/RangeTest.ContainsEndInclusive (2304 of 2355) PASS: lldb-unit :: Utility/./UtilityTests/PassiveReplayTest.InstrumentedBar (2305 of 2355) PASS: lldb-unit :: Utility/./UtilityTests/Predicate.WaitForValueEqualTo (2306 of 2355) PASS: lldb-unit :: Process/Utility/./ProcessUtilityTests/ProcMapTests/LinuxProcMapsTestFixture.ParseMapRegions/4 (2307 of 2355) PASS: lldb-unit :: Utility/./UtilityTests/StringListTest.AppendStringCString (2308 of 2355) PASS: lldb-api :: lang/objc/modules-auto-import/TestModulesAutoImport.py (2309 of 2355) PASS: lldb-api :: functionalities/data-formatter/data-formatter-ptr-to-array/TestPtrToArrayFormatting.py (2310 of 2355) PASS: lldb-api :: lang/objc/blocks/TestObjCIvarsInBlocks.py (2311 of 2355) PASS: lldb-unit :: Utility/./UtilityTests/StreamTeeTest.SetStreamAtIndexOverwrite (2312 of 2355) PASS: lldb-unit :: Utility/./UtilityTests/ConstStringTest.CompareConstString (2313 of 2355) UNSUPPORTED: lldb-api :: benchmarks/expression/TestExpressionCmd.py (2314 of 2355) PASS: lldb-unit :: Core/./LLDBCoreTests/DumpDataExtractorTest.MultiLine (2315 of 2355) PASS: lldb-shell :: SymbolFile/DWARF/x86/inline-function-address.ll (2316 of 2355) PASS: lldb-api :: functionalities/data-formatter/typedef_array/TestTypedefArray.py (2317 of 2355) PASS: lldb-api :: commands/expression/expr-in-syscall/TestExpressionInSyscall.py (2318 of 2355) PASS: lldb-unit :: Host/./HostTests/SocketTests/SocketTest.TCPListen0ConnectAccept/ipv6 (2319 of 2355) UNSUPPORTED: lldb-shell :: Register/x86-gp-write.test (2320 of 2355) PASS: lldb-unit :: Utility/./UtilityTests/StatusTest.Formatv (2321 of 2355) PASS: lldb-unit :: Utility/./UtilityTests/StreamTest.PutPtr (2322 of 2355) PASS: lldb-api :: lang/cpp/typeof/TestTypeOfDeclTypeExpr.py (2323 of 2355) PASS: lldb-api :: functionalities/tail_call_frames/disambiguate_paths_to_common_sink/TestDisambiguatePathsToCommonSink.py (2324 of 2355) PASS: lldb-api :: functionalities/gdb_remote_client/TestqOffsets.py (2325 of 2355) UNSUPPORTED: lldb-api :: benchmarks/frame_variable/TestFrameVariableResponse.py (2326 of 2355) PASS: lldb-unit :: Utility/./UtilityTests/UriParserTest.TypicalPortPathIPv6 (2327 of 2355) PASS: lldb-unit :: Utility/./UtilityTests/NameMatchesTest.Contains (2328 of 2355) UNSUPPORTED: lldb-api :: commands/register/register/intel_xtended_registers/TestMPXRegisters.py (2329 of 2355) PASS: lldb-api :: python_api/symbol-context/two-files/TestSymbolContextTwoFiles.py (2330 of 2355) UNSUPPORTED: lldb-api :: functionalities/gdb_remote_client/TestQemuAArch64TargetXml.py (2331 of 2355) PASS: lldb-unit :: DataFormatter/./LLDBFormatterTests/TypeMatcherTests.RegexName (2332 of 2355) PASS: lldb-unit :: Utility/./UtilityTests/ConstStringTest.CompareStringRef (2333 of 2355) PASS: lldb-api :: tools/lldb-server/TestGdbRemoteAttach.py (2334 of 2355) PASS: lldb-api :: lang/cpp/incompatible-class-templates/TestCppIncompatibleClassTemplates.py (2335 of 2355) PASS: lldb-unit :: Utility/./UtilityTests/SerializationRountripTest.SerializeDeserializeObjectPointer (2336 of 2355) PASS: lldb-api :: functionalities/data-formatter/dump_dynamic/TestDumpDynamic.py (2337 of 2355) PASS: lldb-api :: functionalities/thread/exit_during_expression/TestExitDuringExpression.py (2338 of 2355) PASS: lldb-unit :: Utility/./UtilityTests/BinaryStreamTest.PutSLEB128EightBytes (2339 of 2355) PASS: lldb-api :: macosx/order/TestOrderFile.py (2340 of 2355) PASS: lldb-unit :: Utility/./UtilityTests/ArgsTest.TestUnknownEscape (2341 of 2355) PASS: lldb-api :: python_api/breakpoint/TestBreakpointAPI.py (2342 of 2355) PASS: lldb-shell :: SymbolFile/DWARF/x86/DW_AT_declaration-with-children.s (2343 of 2355) PASS: lldb-api :: python_api/sbstructureddata/TestStructuredDataAPI.py (2344 of 2355) UNSUPPORTED: lldb-api :: commands/expression/call-restarts/TestCallThatRestarts.py (2345 of 2355) PASS: lldb-unit :: Utility/./UtilityTests/StringLexerTest.Peek (2346 of 2355) PASS: lldb-unit :: Utility/./UtilityTests/VMRange.Comparison (2347 of 2355) PASS: lldb-shell :: Settings/TestModuleCacheSanity.test (2348 of 2355) PASS: lldb-unit :: Utility/./UtilityTests/StringExtractorTest.GetHexU8_Underflow2_NoEof (2349 of 2355) PASS: lldb-api :: lang/cpp/subst_template_type_param/TestSubstTemplateTypeParam.py (2350 of 2355) PASS: lldb-api :: lang/c/global_variables/TestGlobalVariables.py (2351 of 2355) PASS: lldb-unit :: Utility/./UtilityTests/DataExtractorTest.GetCStrEmpty (2352 of 2355) PASS: lldb-api :: functionalities/thread/concurrent_events/TestConcurrentManyBreakpoints.py (2353 of 2355) PASS: lldb-api :: functionalities/memory-region/TestMemoryRegion.py (2354 of 2355) PASS: lldb-api :: lang/objc/objc-new-syntax/TestObjCNewSyntaxLiteral.py (2355 of 2355) Slowest Tests: -------------------------------------------------------------------------- 262.52s: lldb-api :: tools/lldb-server/TestLldbGdbServer.py 139.31s: lldb-api :: functionalities/memory-region/TestMemoryRegion.py 131.23s: lldb-api :: api/multithreaded/TestMultithreaded.py 112.91s: lldb-api :: macosx/skinny-corefile/TestSkinnyCorefile.py 91.28s: lldb-api :: functionalities/gdb_remote_client/TestWasm.py 84.77s: lldb-api :: types/TestLongTypesExpr.py 75.66s: lldb-api :: lang/objc/exceptions/TestObjCExceptions.py 70.28s: lldb-api :: commands/expression/import-std-module/queue/TestQueueFromStdModule.py 68.61s: lldb-api :: commands/expression/import-std-module/stack/TestStackFromStdModule.py 63.24s: lldb-api :: lang/objc/hidden-ivars/TestHiddenIvars.py 63.17s: lldb-api :: lang/cpp/namespace/TestNamespaceLookup.py 58.88s: lldb-api :: lang/objc/objc-new-syntax/TestObjCNewSyntaxLiteral.py 58.03s: lldb-api :: lang/objc/foundation/TestObjCMethods.py 57.79s: lldb-api :: commands/expression/import-std-module/vector/TestVectorFromStdModule.py 53.37s: lldb-api :: types/TestIntegerTypeExpr.py 50.85s: lldb-api :: python_api/target/TestTargetAPI.py 50.83s: lldb-api :: commands/expression/import-std-module/deque-basic/TestDequeFromStdModule.py 50.63s: lldb-api :: lang/objc/modules/TestObjCModules.py 50.18s: lldb-api :: tools/lldb-server/TestGdbRemoteThreadsInStopReply.py 49.03s: lldb-api :: commands/expression/import-std-module/vector-dbg-info-content/TestDbgInfoContentVectorFromStdModule.py

Hide Details

Tests Times: -------------------------------------------------------------------------- [ Range ] :: [ Percentage ] :: [ Count ] -------------------------------------------------------------------------- [260s,280s) :: [ ] :: [ 1/2355] [240s,260s) :: [ ] :: [ 0/2355] [220s,240s) :: [ ] :: [ 0/2355] [200s,220s) :: [ ] :: [ 0/2355] [180s,200s) :: [ ] :: [ 0/2355] [160s,180s) :: [ ] :: [ 0/2355] [140s,160s) :: [ ] :: [ 1/2355] [120s,140s) :: [ ] :: [ 2/2355] [100s,120s) :: [ ] :: [ 0/2355] [ 80s,100s) :: [ ] :: [ 3/2355] [ 60s, 80s) :: [ ] :: [ 7/2355] [ 40s, 60s) :: [ ] :: [ 17/2355] [ 20s, 40s) :: [* ] :: [ 70/2355] [ 0s, 20s) :: [************************************** ] :: [2254/2355] -------------------------------------------------------------------------- ******************** Failed Tests (6): lldb-api :: lang/cpp/member-and-local-vars-with-same-name/TestMembersAndLocalsWithSameName.py lldb-api :: macosx/dyld-trie-symbols/TestDyldTrieSymbols.py lldb-api :: macosx/function-starts/TestFunctionStarts.py lldb-api :: tools/lldb-vscode/breakpoint/TestVSCode_setBreakpoints.py lldb-api :: tools/lldb-vscode/breakpoint/TestVSCode_setFunctionBreakpoints.py lldb-api :: tools/lldb-vscode/evaluate/TestVSCode_evaluate.py

Hide Details

Hide Details

Testing Time: 2434.70s Unsupported : 212 Passed : 2127 Expectedly Failed: 10 Failed : 6 FAILED: tools/lldb/test/CMakeFiles/check-lldb cd /Users/buildslave/jenkins/workspace/lldb-cmake-sanitized/lldb-build/tools/lldb/test && /usr/local/Frameworks/Python.framework/Versions/3.7/bin/python3.7 /Users/buildslave/jenkins/workspace/lldb-cmake-sanitized/lldb-build/./bin/llvm-lit -v --time-tests --shuffle --xunit-xml-output=/Users/buildslave/jenkins/workspace/lldb-cmake-sanitized/test/results.xml -v -j 4 --timeout 1200 /Users/buildslave/jenkins/workspace/lldb-cmake-sanitized/lldb-build/tools/lldb/test ninja: build stopped: subcommand failed. Command failed: Command '['/usr/bin/env', 'TERM=vt100', '/usr/local/bin/ninja', '-v', 'check-lldb']' returned non-zero exit status 1. Command: ['/usr/bin/env', 'TERM=vt100', '/usr/local/bin/ninja', '-v', 'check-lldb'] [Pipeline] } [Pipeline] // timeout [Pipeline] } [Pipeline] // stage [Pipeline] stage [Pipeline] { (Declarative: Post Actions) [Pipeline] scanForIssues [Clang (LLVM based)] Sleeping for 5 seconds due to JENKINS-32191... [Clang (LLVM based)] Parsing console log (workspace: '/Users/buildslave/jenkins/workspace/lldb-cmake-sanitized') [Clang (LLVM based)] Successfully parsed console log [Clang (LLVM based)] -> found 4 issues (skipped 4 duplicates) [Clang (LLVM based)] [-ERROR-] Can't create fingerprints for some files: [Clang (LLVM based)] [-ERROR-] - '/Users/buildslave/jenkins/workspace/lldb-cmake-sanitized/lldb-build/{"body":{"category":"console","output":"/Users/buildslave/jenkins/workspace/lldb-cmake-sanitized/llvm-project/lldb/tools/lldb-vscode/ProgressEvent.cpp', IO exception has been thrown: java.nio.file.NoSuchFileException: /Users/buildslave/jenkins/workspace/lldb-cmake-sanitized/lldb-build/{"body":{"category":"console","output":"/Users/buildslave/jenkins/workspace/lldb-cmake-sanitized/llvm-project/lldb/tools/lldb-vscode/ProgressEvent.cpp [Clang (LLVM based)] Post processing issues on 'green-dragon-23' with source code encoding 'UTF-8' [Clang (LLVM based)] Creating SCM blamer to obtain author and commit information for affected files [Clang (LLVM based)] -> No blamer installed yet. You need to install the 'git-forensics' plugin to enable blaming for Git. [Clang (LLVM based)] Resolving file names for all issues in source directory '/Users/buildslave/jenkins/workspace/lldb-cmake-sanitized' [Clang (LLVM based)] -> resolved paths in source directory (3 found, 1 not found) [Clang (LLVM based)] Resolving module names from module definitions (build.xml, pom.xml, or Manifest.mf files) [Clang (LLVM based)] -> resolved module names for 4 issues [Clang (LLVM based)] Resolving package names (or namespaces) by parsing the affected files [Clang (LLVM based)] -> resolved package names of 4 affected files [Clang (LLVM based)] No filter has been set, publishing all 4 issues [Clang (LLVM based)] Creating fingerprints for all affected code blocks to track issues over different builds [Clang (LLVM based)] -> created fingerprints for 3 issues (skipped 1 issues) [Clang (LLVM based)] Copying affected files to Jenkins' build folder '/Users/Shared/Jenkins/Home/jobs/lldb-cmake-sanitized/builds/1898/files-with-issues' [Clang (LLVM based)] -> 3 copied, 0 not in workspace, 1 not-found, 0 with I/O error [Clang (LLVM based)] Repository miner is not configured, skipping repository mining [Pipeline] junit Recording test results [Checks API] No suitable checks publisher found. [Pipeline] } [Pipeline] // stage [Pipeline] } [Pipeline] // withEnv [Pipeline] } [Pipeline] // node [Pipeline] End of Pipeline ERROR: script returned exit code 1 Finished: FAILURE