FailedConsole Output

Skipping 956 KB.. Full Log
 lldb-unit :: Utility/./UtilityTests/SerializationRountripTest.SerializeDeserializePodPointers (1053 of 2355)
PASS: lldb-unit :: Utility/./UtilityTests/GeneratorTest.YamlMultiProvider (1054 of 2355)
PASS: lldb-unit :: Process/Utility/./ProcessUtilityTests/MemoryTagManagerAArch64MTETest.ExpandToGranule (1055 of 2355)
UNSUPPORTED: lldb-api :: commands/gui/basicdebug/TestGuiBasicDebug.py (1056 of 2355)
PASS: lldb-unit :: Utility/./UtilityTests/StreamTest.Indent (1057 of 2355)
PASS: lldb-unit :: SymbolFile/NativePDB/./SymbolFileNativePDBTests/PDBFPOProgramToDWARFExpressionTests.InvalidOpBinary (1058 of 2355)
PASS: lldb-unit :: Utility/./UtilityTests/CompletionRequest.Constructor (1059 of 2355)
PASS: lldb-api :: lang/objcxx/cxx-bridged-po/TestObjCXXBridgedPO.py (1060 of 2355)
PASS: lldb-shell :: ObjectFile/PECOFF/basic-info.yaml (1061 of 2355)
PASS: lldb-unit :: Utility/./UtilityTests/TimerTest.CategoryTimes (1062 of 2355)
PASS: lldb-shell :: Minidump/disassemble-no-module.yaml (1063 of 2355)
PASS: lldb-api :: functionalities/gdb_remote_client/TestGDBRemoteLoad.py (1064 of 2355)
PASS: lldb-shell :: SymbolFile/NativePDB/break-by-line.cpp (1065 of 2355)
PASS: lldb-unit :: Interpreter/./InterpreterTests/TestProperties.DeepCopy (1066 of 2355)
PASS: lldb-unit :: Process/gdb-remote/./ProcessGdbRemoteTests/GDBRemoteCommunicationClientTest.SyncThreadState (1067 of 2355)
PASS: lldb-shell :: Quit/TestQuitExitCodeHex0.test (1068 of 2355)
PASS: lldb-api :: functionalities/signal/handle-abrt/TestHandleAbort.py (1069 of 2355)
PASS: lldb-unit :: Host/./HostTests/FileSystemTest.MakeAbsolute (1070 of 2355)
PASS: lldb-shell :: SymbolFile/DWARF/x86/find-function-regex.cpp (1071 of 2355)
PASS: lldb-api :: functionalities/plugins/python_os_plugin/stepping_plugin_threads/TestOSPluginStepping.py (1072 of 2355)
PASS: lldb-shell :: SymbolFile/DWARF/x86/debug-line-basic.s (1073 of 2355)
PASS: lldb-unit :: Utility/./UtilityTests/PassiveReplayTest.InstrumentedBar (1074 of 2355)
PASS: lldb-api :: python_api/section/TestSectionAPI.py (1075 of 2355)
PASS: lldb-api :: commands/expression/char/TestExprsChar.py (1076 of 2355)
PASS: lldb-unit :: Utility/./UtilityTests/UriParserTest.MinimalPort (1077 of 2355)
PASS: lldb-api :: python_api/watchpoint/TestWatchpointIter.py (1078 of 2355)
PASS: lldb-shell :: Reproducer/Modules/TestModuleCXX.test (1079 of 2355)
PASS: lldb-api :: functionalities/breakpoint/breakpoint_language/TestBreakpointLanguage.py (1080 of 2355)
PASS: lldb-unit :: Utility/./UtilityTests/RangeTest.NotEqual (1081 of 2355)
XFAIL: lldb-shell :: Register/x86-64-fp-write.test (1082 of 2355)
PASS: lldb-api :: tools/lldb-vscode/breakpoint-events/TestVSCode_breakpointEvents.py (1083 of 2355)
PASS: lldb-unit :: Process/gdb-remote/./ProcessGdbRemoteTests/GDBRemoteCommunicationClientTest.WriteRegisterNoSuffix (1084 of 2355)
PASS: lldb-unit :: Utility/./UtilityTests/StringListTest.SplitIntoLinesEmpty (1085 of 2355)
PASS: lldb-api :: commands/source/info/TestSourceInfo.py (1086 of 2355)
PASS: lldb-api :: macosx/save_crashlog/TestSaveCrashlog.py (1087 of 2355)
PASS: lldb-unit :: Utility/./UtilityTests/SubsystemRAIITest.SubsystemWithErrorSuccess (1088 of 2355)
PASS: lldb-api :: commands/watchpoints/step_over_watchpoint/TestStepOverWatchpoint.py (1089 of 2355)
PASS: lldb-api :: lang/objc/hidden-ivars/TestHiddenIvars.py (1090 of 2355)
PASS: lldb-shell :: Register/x86-64-read.test (1091 of 2355)
PASS: lldb-shell :: SymbolFile/DWARF/x86/find-method.cpp (1092 of 2355)
PASS: lldb-unit :: Process/Utility/./ProcessUtilityTests/ProcMapTests/LinuxProcMapsTestFixture.ParseMapRegions/4 (1093 of 2355)
PASS: lldb-api :: api/multithreaded/TestMultithreaded.py (1094 of 2355)
PASS: lldb-unit :: Process/Utility/./ProcessUtilityTests/MemoryTagManagerAArch64MTETest.AddressDiff (1095 of 2355)
PASS: lldb-shell :: Commands/CommandScriptImmediateOutput/CommandScriptImmediateOutputFile.test (1096 of 2355)
PASS: lldb-shell :: SymbolFile/DWARF/x86/debug-types-signature-loop.s (1097 of 2355)
PASS: lldb-api :: functionalities/data-formatter/data-formatter-objc/TestDataFormatterObjCNSURL.py (1098 of 2355)
UNSUPPORTED: lldb-api :: functionalities/thread/break_after_join/TestBreakAfterJoin.py (1099 of 2355)
UNSUPPORTED: lldb-api :: functionalities/thread/multi_break/TestMultipleBreakpoints.py (1100 of 2355)
PASS: lldb-api :: functionalities/data-formatter/data-formatter-cpp/TestDataFormatterCpp.py (1101 of 2355)
PASS: lldb-unit :: Process/gdb-remote/./ProcessGdbRemoteTests/GDBRemoteClientBaseTest.SendContinueAndLateInterrupt (1102 of 2355)
PASS: lldb-api :: functionalities/breakpoint/breakpoint_command/TestBreakpointCommandsFromPython.py (1103 of 2355)
PASS: lldb-unit :: UnwindAssembly/x86/./UnwindAssemblyx86Tests/Testx86AssemblyInspectionEngine.TestPushR14 (1104 of 2355)
PASS: lldb-api :: lang/c/offsetof/TestOffsetof.py (1105 of 2355)
PASS: lldb-unit :: Utility/./UtilityTests/ArgsTest.AppendArguments (1106 of 2355)
PASS: lldb-unit :: Expression/./ExpressionTests/CppModuleConfigurationTest.Xcode (1107 of 2355)
PASS: lldb-api :: functionalities/data-formatter/vector-types/TestVectorTypesFormatting.py (1108 of 2355)
PASS: lldb-api :: commands/gui/invalid-args/TestInvalidArgsGui.py (1109 of 2355)
PASS: lldb-unit :: Utility/./UtilityTests/Flags.GetBitSize (1110 of 2355)
PASS: lldb-unit :: Utility/./UtilityTests/BinaryStreamTest.PutSLEB128NineBytes (1111 of 2355)
PASS: lldb-unit :: Utility/./UtilityTests/StringListTest.InsertStringAtIndexMove (1112 of 2355)
PASS: lldb-unit :: Utility/./UtilityTests/StringListTest.ForRange (1113 of 2355)
PASS: lldb-shell :: ObjectFile/ELF/section-types-edgecases.yaml (1114 of 2355)
PASS: lldb-unit :: Utility/./UtilityTests/UUIDTest.Validity (1115 of 2355)
PASS: lldb-shell :: SymbolFile/DWARF/x86/dir-separator-windows.s (1116 of 2355)
PASS: lldb-shell :: Register/Core/x86-32-linux-gp.test (1117 of 2355)
PASS: lldb-unit :: Utility/./UtilityTests/UUIDTest.SetFromStringRef (1118 of 2355)
PASS: lldb-api :: functionalities/data-formatter/data-formatter-objc/TestDataFormatterObjCNSData.py (1119 of 2355)
PASS: lldb-unit :: Expression/./ExpressionTests/DiagnosticManagerTest.PutStringSeverities (1120 of 2355)
PASS: lldb-api :: python_api/interpreter/TestRunCommandInterpreterAPI.py (1121 of 2355)
PASS: lldb-unit :: Symbol/./SymbolTests/TestClangASTImporter.ImportInvalidType (1122 of 2355)
PASS: lldb-unit :: Utility/./UtilityTests/ScalarTest.GetValue (1123 of 2355)
PASS: lldb-shell :: SymbolFile/NativePDB/locate-pdb.cpp (1124 of 2355)
PASS: lldb-unit :: Utility/./UtilityTests/ArgsTest.ReplaceArgumentAtIndexOutOfRange (1125 of 2355)
PASS: lldb-api :: functionalities/data-formatter/data-formatter-synthtype/TestDataFormatterSynthType.py (1126 of 2355)
UNSUPPORTED: lldb-api :: functionalities/breakpoint/hardware_breakpoints/hardware_breakpoint_on_multiple_threads/TestHWBreakMultiThread.py (1127 of 2355)
PASS: lldb-api :: functionalities/param_entry_vals/basic_entry_values/TestBasicEntryValues.py (1128 of 2355)
PASS: lldb-api :: functionalities/find-line-entry/TestFindLineEntry.py (1129 of 2355)
PASS: lldb-api :: commands/quit/TestQuit.py (1130 of 2355)
PASS: lldb-api :: functionalities/thread/concurrent_events/TestConcurrentBreakpointsDelayedBreakpointOneWatchpoint.py (1131 of 2355)
PASS: lldb-shell :: Settings/TestFrameFormatColor.test (1132 of 2355)
PASS: lldb-unit :: Utility/./UtilityTests/RangeTest.Constructor (1133 of 2355)
PASS: lldb-api :: python_api/sbdata/TestSBData.py (1134 of 2355)
PASS: lldb-unit :: Host/./HostTests/ConnectionFileDescriptorTest.TCPGetURIv4 (1135 of 2355)
PASS: lldb-unit :: Symbol/./SymbolTests/PostfixExpression.ParseOneExpression (1136 of 2355)
PASS: lldb-shell :: Heap/heap-cstr.test (1137 of 2355)
PASS: lldb-shell :: SymbolFile/DWARF/x86/limit-debug-info.s (1138 of 2355)
PASS: lldb-shell :: Commands/command-disassemble-process.yaml (1139 of 2355)
PASS: lldb-unit :: UnwindAssembly/x86/./UnwindAssemblyx86Tests/Testx86AssemblyInspectionEngine.TestPopESI (1140 of 2355)
PASS: lldb-unit :: ObjectFile/Breakpad/./ObjectFileBreakpadTests/FileRecord.parse (1141 of 2355)
PASS: lldb-unit :: Host/./HostTests/SocketAddressTest.GetAddressInfo (1142 of 2355)
PASS: lldb-api :: sanity/TestModuleCacheSanity.py (1143 of 2355)
PASS: lldb-shell :: Register/Core/x86-32-linux-fp.test (1144 of 2355)
PASS: lldb-api :: functionalities/thread/exit_during_step/TestExitDuringStep.py (1145 of 2355)
PASS: lldb-unit :: Process/minidump/./LLDBMinidumpTests/MinidumpParserTest.FindMemoryRange (1146 of 2355)
PASS: lldb-api :: lang/objc/foundation/TestObjCMethodsString.py (1147 of 2355)
PASS: lldb-unit :: Utility/./UtilityTests/BinaryStreamTest.PutULEB128NineBytes (1148 of 2355)
PASS: lldb-api :: lang/cpp/gmodules-templates/TestGModules.py (1149 of 2355)
PASS: lldb-api :: macosx/universal/TestUniversal.py (1150 of 2355)
PASS: lldb-api :: functionalities/gdb_remote_client/TestRegDefinitionInParts.py (1151 of 2355)
PASS: lldb-shell :: SymbolFile/DWARF/x86/DW_OP_piece-smaller-than-struct.s (1152 of 2355)
PASS: lldb-api :: functionalities/unwind/noreturn/module-end/TestNoReturnModuleEnd.py (1153 of 2355)
PASS: lldb-api :: commands/platform/file/read/TestPlatformFileRead.py (1154 of 2355)
PASS: lldb-api :: functionalities/data-formatter/data-formatter-objc/nsstring/TestDataFormatterNSString.py (1155 of 2355)
PASS: lldb-unit :: Utility/./UtilityTests/UriParserTest.BracketedHostnameWithPortIPv6 (1156 of 2355)
PASS: lldb-api :: functionalities/thread/exit_during_expression/TestExitDuringExpression.py (1157 of 2355)
PASS: lldb-api :: lang/c/cpp_keyword_identifiers/TestCppKeywordsAsCIdentifiers.py (1158 of 2355)
PASS: lldb-unit :: Host/./HostTests/SocketTests/SocketTest.UDPGetConnectURI/ipv6 (1159 of 2355)
UNSUPPORTED: lldb-api :: tools/lldb-server/TestGdbRemoteAuxvSupport.py (1160 of 2355)
PASS: lldb-api :: types/TestDoubleTypes.py (1161 of 2355)
PASS: lldb-unit :: Utility/./UtilityTests/EnvironmentTest.EnvpConversion (1162 of 2355)
UNSUPPORTED: lldb-shell :: SymbolFile/PDB/ast-restore.test (1163 of 2355)
PASS: lldb-shell :: SymbolFile/DWARF/x86/debug_line-relative_path.s (1164 of 2355)
PASS: lldb-shell :: Reproducer/TestRelativePath.test (1165 of 2355)
PASS: lldb-unit :: Utility/./UtilityTests/DataExtractorTest.GetDoubleUnaligned (1166 of 2355)
PASS: lldb-api :: functionalities/breakpoint/address_breakpoints/TestAddressBreakpoints.py (1167 of 2355)
FAIL: lldb-api :: macosx/dyld-trie-symbols/TestDyldTrieSymbols.py (1168 of 2355)
******************** TEST 'lldb-api :: macosx/dyld-trie-symbols/TestDyldTrieSymbols.py' FAILED ********************
Script:
--
/Users/buildslave/jenkins/workspace/lldb-cmake-sanitized/lldb-build/lldb-test-build.noindex/copied-python /Users/buildslave/jenkins/workspace/lldb-cmake-sanitized/llvm-project/lldb/test/API/dotest.py -u CXXFLAGS -u CFLAGS --codesign-identity lldb_codesign --arch x86_64 --build-dir /Users/buildslave/jenkins/workspace/lldb-cmake-sanitized/lldb-build/lldb-test-build.noindex -t --env TERM=vt100 --env LLVM_LIBS_DIR=/Users/buildslave/jenkins/workspace/lldb-cmake-sanitized/lldb-build/./lib --inferior-env ASAN_OPTIONS=detect_stack_use_after_return=1 --inferior-env DYLD_INSERT_LIBRARIES=/Users/buildslave/jenkins/workspace/lldb-cmake-sanitized/host-compiler/lib/clang/13.0.99/lib/darwin/libclang_rt.asan_osx_dynamic.dylib --arch x86_64 --build-dir /Users/buildslave/jenkins/workspace/lldb-cmake-sanitized/lldb-build/lldb-test-build.noindex --lldb-module-cache-dir /Users/buildslave/jenkins/workspace/lldb-cmake-sanitized/lldb-build/lldb-test-build.noindex/module-cache-lldb/lldb-api --clang-module-cache-dir /Users/buildslave/jenkins/workspace/lldb-cmake-sanitized/lldb-build/lldb-test-build.noindex/module-cache-clang/lldb-api --executable /Users/buildslave/jenkins/workspace/lldb-cmake-sanitized/lldb-build/./bin/lldb --compiler /Users/buildslave/jenkins/workspace/lldb-cmake-sanitized/host-compiler/bin/clang --dsymutil /Users/buildslave/jenkins/workspace/lldb-cmake-sanitized/lldb-build/./bin/dsymutil --llvm-tools-dir /Users/buildslave/jenkins/workspace/lldb-cmake-sanitized/lldb-build/./bin --lldb-libs-dir /Users/buildslave/jenkins/workspace/lldb-cmake-sanitized/lldb-build/./lib /Users/buildslave/jenkins/workspace/lldb-cmake-sanitized/llvm-project/lldb/test/API/macosx/dyld-trie-symbols -p TestDyldTrieSymbols.py
--
Exit Code: 1

Command Output (stdout):
--
lldb version 13.0.99 (http://labmaster3.local/git/llvm-project.git revision b9c24257c7b4da398798934ffefdd30015152180)
  clang revision b9c24257c7b4da398798934ffefdd30015152180
  llvm revision b9c24257c7b4da398798934ffefdd30015152180
Skipping the following test categories: ['darwin-log', 'libstdcxx', 'dwo', 'llgs', 'fork']

--
Command Output (stderr):
--
Change dir to: /Users/buildslave/jenkins/workspace/lldb-cmake-sanitized/llvm-project/lldb/test/API/macosx/dyld-trie-symbols
runCmd: settings clear -all
output: 

runCmd: settings set symbols.enable-external-lookup false
output: 

runCmd: settings set target.inherit-tcc true
output: 

runCmd: settings set target.detach-on-error false
output: 

runCmd: settings set target.auto-apply-fixits false
output: 

runCmd: settings set plugin.process.gdb-remote.packet-timeout 60
output: 

runCmd: settings set symbols.clang-modules-cache-path "/Users/buildslave/jenkins/workspace/lldb-cmake-sanitized/lldb-build/lldb-test-build.noindex/module-cache-lldb/lldb-api"
output: 

runCmd: settings set use-color false
output: 

runCmd: setting set target.prefer-dynamic-value no-dynamic-values
output: 

runCmd: settings set target.env-vars ASAN_OPTIONS=detect_stack_use_after_return=1 DYLD_INSERT_LIBRARIES=/Users/buildslave/jenkins/workspace/lldb-cmake-sanitized/host-compiler/lib/clang/13.0.99/lib/darwin/libclang_rt.asan_osx_dynamic.dylib
output: 

FAIL: LLDB (/Users/buildslave/jenkins/workspace/lldb-cmake-sanitized/host-compiler/bin/clang-x86_64) :: test_dyld_trie_symbols (TestDyldTrieSymbols.DyldTrieSymbolsTestCase)
Restore dir to: /Users/buildslave/jenkins/workspace/lldb-cmake-sanitized/lldb-build/tools/lldb/test
======================================================================
FAIL: test_dyld_trie_symbols (TestDyldTrieSymbols.DyldTrieSymbolsTestCase)
   Test that we make create symbol table entries from the dyld trie data structure.
----------------------------------------------------------------------
Traceback (most recent call last):
  File "/Users/buildslave/jenkins/workspace/lldb-cmake-sanitized/llvm-project/lldb/test/API/macosx/dyld-trie-symbols/TestDyldTrieSymbols.py", line 66, in test_dyld_trie_symbols
    self.assertEqual(stripped_bazval_symbols.GetSize(), 1)
AssertionError: 0 != 1
Config=x86_64-/Users/buildslave/jenkins/workspace/lldb-cmake-sanitized/host-compiler/bin/clang
----------------------------------------------------------------------
Ran 1 test in 3.088s

RESULT: FAILED (0 passes, 1 failures, 0 errors, 0 skipped, 0 expected failures, 0 unexpected successes)

--

********************
PASS: lldb-api :: functionalities/data-formatter/type_summary_list_script/TestTypeSummaryListScript.py (1169 of 2355)
PASS: lldb-unit :: Utility/./UtilityTests/VMRange.Ordering (1170 of 2355)
PASS: lldb-unit :: Utility/./UtilityTests/VMRange.Reset (1171 of 2355)
PASS: lldb-api :: macosx/find-dsym/bundle-with-dot-in-filename/TestBundleWithDotInFilename.py (1172 of 2355)
PASS: lldb-unit :: Utility/./UtilityTests/SerializationRountripTest.SerializeDeserializeObjectReference (1173 of 2355)
PASS: lldb-api :: functionalities/gdb_remote_client/TestProcessConnect.py (1174 of 2355)
PASS: lldb-shell :: ScriptInterpreter/Python/sb_address_exception.test (1175 of 2355)
PASS: lldb-api :: functionalities/breakpoint/global_constructor/TestBreakpointInGlobalConstructor.py (1176 of 2355)
PASS: lldb-unit :: Utility/./UtilityTests/ScalarTest.ComparisonFloat (1177 of 2355)
PASS: lldb-shell :: SymbolFile/DWARF/x86/find-variable-dwo.cpp (1178 of 2355)
PASS: lldb-unit :: Utility/./UtilityTests/StreamTeeTest.GetStreamAtIndexOutOfBounds (1179 of 2355)
PASS: lldb-unit :: Utility/./UtilityTests/StreamTest.PutCString (1180 of 2355)
PASS: lldb-unit :: Utility/./UtilityTests/ListenerTest.GetEventWait (1181 of 2355)
PASS: lldb-unit :: UnwindAssembly/x86/./UnwindAssemblyx86Tests/Testx86AssemblyInspectionEngine.TestPushExtended (1182 of 2355)
PASS: lldb-api :: functionalities/type_completion/TestTypeCompletion.py (1183 of 2355)
PASS: lldb-unit :: Process/gdb-remote/./ProcessGdbRemoteTests/PortMapTest.AllowPort (1184 of 2355)
PASS: lldb-unit :: Process/minidump/./LLDBMinidumpTests/MinidumpParserTest.GetThreadContext_x86_64 (1185 of 2355)
PASS: lldb-unit :: ObjectFile/PECOFF/./ObjectFilePECOFFTests/PECallFrameInfoTest.Frame_reg_eh (1186 of 2355)
PASS: lldb-api :: functionalities/gdb_remote_client/TestRestartBug.py (1187 of 2355)
UNSUPPORTED: lldb-shell :: SymbolFile/PDB/enums-layout.test (1188 of 2355)
PASS: lldb-unit :: Process/gdb-remote/./ProcessGdbRemoteTests/GDBRemoteCommunicationServerTest.SendErrorResponse_ErrorList (1189 of 2355)
UNSUPPORTED: lldb-shell :: Unwind/split-machine-functions.test (1190 of 2355)
PASS: lldb-api :: functionalities/thread/concurrent_events/TestConcurrentTwoBreakpointsOneSignal.py (1191 of 2355)
PASS: lldb-api :: functionalities/recursion/TestValueObjectRecursion.py (1192 of 2355)
PASS: lldb-unit :: Language/Highlighting/./HighlighterTests/HighlighterTest.ClangTrailingBackslashWithWhitespace (1193 of 2355)
PASS: lldb-unit :: Utility/./UtilityTests/StringExtractorTest.DecodeHexU8_Underflow2 (1194 of 2355)
PASS: lldb-api :: functionalities/data-formatter/data-formatter-stl/libcxx/atomic/TestLibCxxAtomic.py (1195 of 2355)
PASS: lldb-api :: commands/expression/fixits/TestFixIts.py (1196 of 2355)
PASS: lldb-unit :: Utility/./UtilityTests/ArgsTest.TestMultipleArgs (1197 of 2355)
UNSUPPORTED: lldb-shell :: ScriptInterpreter/Lua/independent_state.test (1198 of 2355)
PASS: lldb-shell :: ObjectFile/PDB/object.test (1199 of 2355)
PASS: lldb-api :: lang/cpp/class_static/TestStaticVariables.py (1200 of 2355)
PASS: lldb-api :: python_api/function_symbol/TestSymbolAPI.py (1201 of 2355)
PASS: lldb-unit :: Utility/./UtilityTests/ConstStringTest.YAML (1202 of 2355)
PASS: lldb-api :: functionalities/thread/concurrent_events/TestConcurrentSignalDelayWatch.py (1203 of 2355)
PASS: lldb-api :: python_api/process/TestProcessAPI.py (1204 of 2355)
PASS: lldb-api :: lang/cpp/dereferencing_references/TestCPPDereferencingReferences.py (1205 of 2355)
PASS: lldb-unit :: Symbol/./SymbolTests/TestTypeSystemClang.TestGetEnumIntegerTypeBasicTypes (1206 of 2355)
PASS: lldb-unit :: ObjectFile/ELF/./ObjectFileELFTests/ObjectFileELFTest.GetSymtab_NoSymEntryPointArmAddressClass (1207 of 2355)
PASS: lldb-unit :: DataFormatter/./LLDBFormatterTests/TypeMatcherTests.GetMatchStringExactName (1208 of 2355)
PASS: lldb-unit :: Utility/./UtilityTests/ArchSpecTest.MergeFrom (1209 of 2355)
PASS: lldb-unit :: Target/./TargetTests/MemoryRegionInfoTest.Formatv (1210 of 2355)
PASS: lldb-unit :: Host/./HostTests/SocketTests/SocketTest.UDPGetConnectURI/ipv4 (1211 of 2355)
PASS: lldb-shell :: Quit/TestQuitExitCodeImplicit0.test (1212 of 2355)
PASS: lldb-api :: lang/c/complex_int/TestComplexInt.py (1213 of 2355)
PASS: lldb-unit :: Utility/./UtilityTests/RangeTest.ContainsEndInclusive (1214 of 2355)
PASS: lldb-unit :: Language/Highlighting/./HighlighterTests/HighlighterTest.FallbackHighlighter (1215 of 2355)
UNSUPPORTED: lldb-api :: functionalities/data-formatter/data-formatter-stl/libstdcpp/string/TestDataFormatterStdString.py (1216 of 2355)
PASS: lldb-api :: functionalities/thread/concurrent_events/TestConcurrentBreakpointDelayBreakpointOneSignal.py (1217 of 2355)
PASS: lldb-unit :: Utility/./UtilityTests/FileSpecTest.EqualDotsPosixRoot (1218 of 2355)
UNSUPPORTED: lldb-api :: commands/expression/call-restarts/TestCallThatRestarts.py (1219 of 2355)
PASS: lldb-api :: lang/cpp/wchar_t/TestCxxWCharT.py (1220 of 2355)
PASS: lldb-api :: functionalities/data-formatter/data-formatter-categories/TestDataFormatterCategories.py (1221 of 2355)
PASS: lldb-api :: python_api/hello_world/TestHelloWorld.py (1222 of 2355)
PASS: lldb-api :: lang/c/step-target/TestStepTarget.py (1223 of 2355)
PASS: lldb-shell :: SymbolFile/DWARF/x86/debug_loclists-dwo.s (1224 of 2355)
PASS: lldb-unit :: Utility/./UtilityTests/CompletionRequest.FakeLastArg (1225 of 2355)
PASS: lldb-shell :: VSCode/TestOptions.test (1226 of 2355)
PASS: lldb-api :: python_api/frame/TestFrames.py (1227 of 2355)
PASS: lldb-unit :: Utility/./UtilityTests/LogTest.Unregister (1228 of 2355)
PASS: lldb-unit :: Utility/./UtilityTests/XcodeSDKTest.GetCanonicalNameAndConstruct (1229 of 2355)
PASS: lldb-shell :: SymbolFile/DWARF/x86/dwarf5-atomic.s (1230 of 2355)
PASS: lldb-api :: commands/expression/import-std-module/unique_ptr/TestUniquePtrFromStdModule.py (1231 of 2355)
PASS: lldb-api :: commands/expression/result_numbering/TestResultNumbering.py (1232 of 2355)
PASS: lldb-api :: python_api/class_members/TestSBTypeClassMembers.py (1233 of 2355)
PASS: lldb-unit :: Host/./HostTests/SocketTests/SocketTest.TCPGetConnectURI/ipv4 (1234 of 2355)
PASS: lldb-api :: lang/c/const_variables/TestConstVariables.py (1235 of 2355)
PASS: lldb-api :: functionalities/data-formatter/var-in-aggregate-misuse/TestVarInAggregateMisuse.py (1236 of 2355)
UNSUPPORTED: lldb-api :: functionalities/longjmp/TestLongjmp.py (1237 of 2355)
UNSUPPORTED: lldb-shell :: SymbolFile/NativePDB/typedefs.cpp (1238 of 2355)
PASS: lldb-api :: commands/expression/formatters/TestFormatters.py (1239 of 2355)
PASS: lldb-unit :: UnwindAssembly/x86/./UnwindAssemblyx86Tests/Testx86AssemblyInspectionEngine.TestSubESP (1240 of 2355)
PASS: lldb-api :: functionalities/memory/tag/TestMemoryTag.py (1241 of 2355)
PASS: lldb-unit :: Utility/./UtilityTests/OptionsWithRawTest.EmptySuffix (1242 of 2355)
PASS: lldb-api :: commands/watchpoints/hello_watchpoint/TestMyFirstWatchpoint.py (1243 of 2355)
PASS: lldb-unit :: ScriptInterpreter/Python/./ScriptInterpreterPythonTests/PythonDataObjectsTest.TestObjectAttributes (1244 of 2355)
PASS: lldb-api :: functionalities/thread/concurrent_events/TestConcurrentTwoWatchpointThreads.py (1245 of 2355)
PASS: lldb-unit :: Utility/./UtilityTests/RangeDataVector.FindEntryThatContains_Overlap (1246 of 2355)
PASS: lldb-unit :: Process/minidump/./LLDBMinidumpTests/MinidumpParserTest.GetMemoryRegionInfoFromMemoryList (1247 of 2355)
PASS: lldb-unit :: SymbolFile/DWARF/./SymbolFileDWARFTests/SymbolFileDWARFTests.TestAbbrevOrder1Start5 (1248 of 2355)
PASS: lldb-api :: tools/lldb-server/thread-name/TestGdbRemoteThreadName.py (1249 of 2355)
PASS: lldb-unit :: UnwindAssembly/x86/./UnwindAssemblyx86Tests/Testx86AssemblyInspectionEngine.TestPushR12 (1250 of 2355)
PASS: lldb-unit :: Expression/./ExpressionTests/ClangHostTest.MacOSX (1251 of 2355)
UNSUPPORTED: lldb-api :: commands/expression/multiline-navigation/TestMultilineNavigation.py (1252 of 2355)
PASS: lldb-api :: lang/cpp/class-template-type-parameter-pack/TestClassTemplateTypeParameterPack.py (1253 of 2355)
PASS: lldb-shell :: ObjectFile/ELF/duplicate-section.yaml (1254 of 2355)
PASS: lldb-shell :: SymbolFile/Breakpad/symtab.test (1255 of 2355)
UNSUPPORTED: lldb-api :: functionalities/tty/TestTerminal.py (1256 of 2355)
UNSUPPORTED: lldb-api :: functionalities/thread/create_during_step/TestCreateDuringStep.py (1257 of 2355)
PASS: lldb-unit :: Host/./HostTests/Host.GetEnvironment (1258 of 2355)
PASS: lldb-unit :: Host/./HostTests/MainLoopTest.ReadObject (1259 of 2355)
PASS: lldb-api :: commands/watchpoints/watchpoint_disable/TestWatchpointDisable.py (1260 of 2355)
PASS: lldb-unit :: Utility/./UtilityTests/StreamTest.ChangingByteOrder (1261 of 2355)
PASS: lldb-api :: python_api/watchpoint/watchlocation/TestSetWatchlocation.py (1262 of 2355)
UNSUPPORTED: lldb-api :: commands/trace/TestTraceDumpInstructions.py (1263 of 2355)
UNSUPPORTED: lldb-api :: terminal/TestEditline.py (1264 of 2355)
PASS: lldb-api :: api/check_public_api_headers/TestPublicAPIHeaders.py (1265 of 2355)
PASS: lldb-api :: tools/lldb-server/memory-allocation/TestGdbRemoteMemoryAllocation.py (1266 of 2355)
PASS: lldb-unit :: Expression/./ExpressionTests/ClangHostTest.ComputeClangResourceDirectory (1267 of 2355)
PASS: lldb-api :: lang/objc/objc-runtime-ivars/TestRuntimeIvars.py (1268 of 2355)
PASS: lldb-unit :: Utility/./UtilityTests/UriParserTest.MinimalPortPath (1269 of 2355)
PASS: lldb-api :: lang/cpp/namespace/TestNamespace.py (1270 of 2355)
PASS: lldb-unit :: Expression/./ExpressionTests/CppModuleConfigurationTest.UnknownLibCppFile (1271 of 2355)
PASS: lldb-unit :: Utility/./UtilityTests/StringExtractorTest.GetHexBytesAvail_FullString (1272 of 2355)
PASS: lldb-unit :: Target/./TargetTests/MCBasedABI.MapRegisterName (1273 of 2355)
PASS: lldb-unit :: SymbolFile/DWARF/./SymbolFileDWARFTests/SymbolFileDWARFTests.TestAbbrevValidAttrNullForm (1274 of 2355)
PASS: lldb-api :: lang/c/unicode/TestUnicodeSymbols.py (1275 of 2355)
PASS: lldb-unit :: Utility/./UtilityTests/StreamTest.PutBytesAsRawHex8ToBigEndian (1276 of 2355)
PASS: lldb-unit :: Host/./HostTests/MainLoopTest.TwoSignalCallbacks (1277 of 2355)
PASS: lldb-api :: functionalities/stats_api/TestStatisticsAPI.py (1278 of 2355)
UNSUPPORTED: lldb-shell :: SymbolFile/NativePDB/stack_unwinding01.cpp (1279 of 2355)
PASS: lldb-unit :: Utility/./UtilityTests/VMRange.IsValid (1280 of 2355)
PASS: lldb-unit :: Utility/./UtilityTests/BinaryStreamTest.PutULEB128OneByte (1281 of 2355)
PASS: lldb-unit :: ScriptInterpreter/Python/./ScriptInterpreterPythonTests/PythonDataObjectsTest.TestExtractingUInt64ThroughStructuredData (1282 of 2355)
PASS: lldb-api :: lang/cpp/this_class_type_mixing/TestThisClassTypeMixing.py (1283 of 2355)
PASS: lldb-unit :: Utility/./UtilityTests/StringExtractorTest.GetU64BigEndian (1284 of 2355)
UNSUPPORTED: lldb-shell :: Unwind/basic-block-sections.test (1285 of 2355)
PASS: lldb-api :: commands/expression/codegen-crash-import-def-arraytype-element/TestImportDefinitionArrayType.py (1286 of 2355)
PASS: lldb-unit :: Utility/./UtilityTests/RegularExpression.CopyAssignment (1287 of 2355)
PASS: lldb-api :: commands/expression/deleting-implicit-copy-constructor/TestDeletingImplicitCopyConstructor.py (1288 of 2355)
PASS: lldb-api :: lang/c/shared_lib_stripped_symbols/TestSharedLibStrippedSymbols.py (1289 of 2355)
PASS: lldb-unit :: Core/./LLDBCoreTests/DumpDataExtractorTest.ItemByteSizeErrors (1290 of 2355)
PASS: lldb-api :: commands/session/history/TestSessionHistory.py (1291 of 2355)
PASS: lldb-unit :: Utility/./UtilityTests/StreamTeeTest.SetStreamAtIndexOutOfBounds (1292 of 2355)
PASS: lldb-shell :: SymbolFile/DWARF/x86/find-basic-function.cpp (1293 of 2355)
PASS: lldb-api :: commands/target/modules/search-paths/insert/TestTargetModulesSearchpathsInsert.py (1294 of 2355)
PASS: lldb-unit :: Utility/./UtilityTests/BinaryStreamTest.PutSLEB128SixBytes (1295 of 2355)
PASS: lldb-api :: functionalities/thread/concurrent_events/TestConcurrentManyBreakpoints.py (1296 of 2355)
PASS: lldb-api :: lang/objc/objc-optimized/TestObjcOptimized.py (1297 of 2355)
PASS: lldb-unit :: Process/Utility/./ProcessUtilityTests/MemoryTagManagerAArch64MTETest.RemoveNonAddressBits (1298 of 2355)
UNSUPPORTED: lldb-api :: lang/cpp/printf/TestPrintf.py (1299 of 2355)
PASS: lldb-unit :: Utility/./UtilityTests/FileSpecTest.Equal (1300 of 2355)
PASS: lldb-shell :: BuildScript/compiler-full-path.test (1301 of 2355)
PASS: lldb-api :: tools/lldb-server/commandline/TestGdbRemoteConnection.py (1302 of 2355)
PASS: lldb-unit :: Utility/./UtilityTests/StreamTest.PutCharNull (1303 of 2355)
PASS: lldb-unit :: Utility/./UtilityTests/FileSpecTest.EqualDotsWindows (1304 of 2355)
PASS: lldb-shell :: Reproducer/Functionalities/TestStepping.test (1305 of 2355)
PASS: lldb-unit :: Process/minidump/./LLDBMinidumpTests/MinidumpParserTest.GetMiscInfoWindows (1306 of 2355)
PASS: lldb-unit :: Utility/./UtilityTests/RecordReplayTest.InstrumentedBarPtr (1307 of 2355)
PASS: lldb-shell :: SymbolFile/DWARF/x86/debug_loc.s (1308 of 2355)
PASS: lldb-shell :: SymbolFile/DWARF/x86/dwarf5-split.s (1309 of 2355)
UNSUPPORTED: lldb-api :: commands/gui/viewlarge/TestGuiViewLarge.py (1310 of 2355)
PASS: lldb-shell :: Driver/TestConvenienceVariables.test (1311 of 2355)
PASS: lldb-api :: commands/target/basic/TestTargetCommand.py (1312 of 2355)
PASS: lldb-unit :: Utility/./UtilityTests/StringLexerTest.NextIfList (1313 of 2355)
PASS: lldb-api :: lang/cpp/const_this/TestConstThis.py (1314 of 2355)
PASS: lldb-api :: macosx/version_zero/TestGetVersionZeroVersion.py (1315 of 2355)
PASS: lldb-shell :: SymbolFile/NativePDB/source-list.cpp (1316 of 2355)
PASS: lldb-unit :: Symbol/./SymbolTests/LineEntryTest.GetSameLineContiguousAddressRangeNoInlines (1317 of 2355)
PASS: lldb-unit :: Utility/./UtilityTests/DataExtractorTest.GetMaxU64 (1318 of 2355)
PASS: lldb-unit :: Interpreter/./InterpreterTests/OptionValueArgs.DeepCopy (1319 of 2355)
PASS: lldb-unit :: Utility/./UtilityTests/DataExtractorTest.GetFloat (1320 of 2355)
PASS: lldb-api :: lang/objcxx/cpp_keywords_enabled/TestObjCppKeywordsEnabled.py (1321 of 2355)
PASS: lldb-unit :: Utility/./UtilityTests/SerializationRountripTest.SerializeDeserializeCStringArrayNullptr (1322 of 2355)
PASS: lldb-api :: functionalities/breakpoint/cpp_exception/TestCPPExceptionBreakpoint.py (1323 of 2355)
PASS: lldb-shell :: SymbolFile/DWARF/x86/dir-separator-posix.s (1324 of 2355)
PASS: lldb-api :: functionalities/data-formatter/data-formatter-stl/libcxx/vbool/TestDataFormatterLibcxxVBool.py (1325 of 2355)
PASS: lldb-unit :: SymbolFile/DWARF/./SymbolFileDWARFTests/SymbolFileDWARFTests.TestAbbrevOrder1Start1 (1326 of 2355)
PASS: lldb-api :: lang/cpp/static_members/TestCPPStaticMembers.py (1327 of 2355)
UNSUPPORTED: lldb-shell :: ScriptInterpreter/Lua/print.test (1328 of 2355)
PASS: lldb-unit :: Utility/./UtilityTests/ProcessInstanceInfo.DumpTable (1329 of 2355)
PASS: lldb-shell :: Breakpoint/debug_rnglist_offset_pair.test (1330 of 2355)
PASS: lldb-api :: functionalities/data-formatter/builtin-formats/TestBuiltinFormats.py (1331 of 2355)
UNSUPPORTED: lldb-shell :: Register/arm-fp-read.test (1332 of 2355)
PASS: lldb-api :: functionalities/breakpoint/breakpoint_command/TestBreakpointCommand.py (1333 of 2355)
PASS: lldb-api :: lang/c/array_types/TestArrayTypes.py (1334 of 2355)
PASS: lldb-api :: python_api/value/linked_list/TestValueAPILinkedList.py (1335 of 2355)
PASS: lldb-shell :: lldb-server/TestErrorMessages.test (1336 of 2355)
PASS: lldb-api :: lang/objc/objc-super/TestObjCSuper.py (1337 of 2355)
PASS: lldb-unit :: Utility/./UtilityTests/StringExtractorTest.InitEmpty (1338 of 2355)
PASS: lldb-api :: commands/help/TestHelp.py (1339 of 2355)
PASS: lldb-api :: commands/frame/var-scope/TestFrameVariableScope.py (1340 of 2355)
PASS: lldb-api :: lang/objc/rdar-10967107/TestRdar10967107.py (1341 of 2355)
PASS: lldb-shell :: ObjectFile/PECOFF/symbol.yaml (1342 of 2355)
PASS: lldb-unit :: Interpreter/./InterpreterTests/OptionArgParserTest.toScriptLanguage (1343 of 2355)
PASS: lldb-unit :: Utility/./UtilityTests/StreamTest.AddressSize (1344 of 2355)
PASS: lldb-unit :: Utility/./UtilityTests/StateTest.Formatv (1345 of 2355)
PASS: lldb-unit :: Process/minidump/./LLDBMinidumpTests/MinidumpParserTest.GetMiscInfo_no_stream (1346 of 2355)
UNSUPPORTED: lldb-shell :: ScriptInterpreter/Lua/convenience_variables.test (1347 of 2355)
PASS: lldb-unit :: ObjectFile/Breakpad/./ObjectFileBreakpadTests/LineRecord.parse (1348 of 2355)
PASS: lldb-shell :: BuildScript/script-args.test (1349 of 2355)
PASS: lldb-unit :: Process/minidump/./LLDBMinidumpTests/MinidumpParserTest.GetThreadsAndGetThreadContext (1350 of 2355)
PASS: lldb-api :: functionalities/type_get_module/TestTypeGetModule.py (1351 of 2355)
PASS: lldb-unit :: Utility/./UtilityTests/LogTest.Register (1352 of 2355)
PASS: lldb-api :: commands/frame/diagnose/dereference-function-return/TestDiagnoseDereferenceFunctionReturn.py (1353 of 2355)
PASS: lldb-unit :: Host/./HostTests/SocketTests/SocketTest.DomainListenConnectAccept/ipv4 (1354 of 2355)
PASS: lldb-api :: lang/objc/foundation/TestSymbolTable.py (1355 of 2355)
PASS: lldb-api :: lang/cpp/nsimport/TestCppNsImport.py (1356 of 2355)
PASS: lldb-unit :: UnwindAssembly/x86/./UnwindAssemblyx86Tests/Testx86AssemblyInspectionEngine.TestPopRBX (1357 of 2355)
PASS: lldb-unit :: Host/./HostTests/NativeProcessProtocolTest.ReadCStringFromMemory (1358 of 2355)
PASS: lldb-shell :: Reproducer/TestGDBRemoteRepro.test (1359 of 2355)
PASS: lldb-shell :: SymbolFile/DWARF/x86/DW_TAG_basic_type_DW_ATE_UTF_nonC.ll (1360 of 2355)
PASS: lldb-unit :: Expression/./ExpressionTests/CppModuleConfigurationTest.MissingLibCpp (1361 of 2355)
PASS: lldb-unit :: ObjectFile/PECOFF/./ObjectFilePECOFFTests/PECallFrameInfoTest.Basic_eh (1362 of 2355)
PASS: lldb-api :: tools/lldb-vscode/runInTerminal/TestVSCode_runInTerminal.py (1363 of 2355)
PASS: lldb-api :: functionalities/data-formatter/data-formatter-named-summaries/TestDataFormatterNamedSummaries.py (1364 of 2355)
PASS: lldb-api :: types/TestIntegerTypeExpr.py (1365 of 2355)
PASS: lldb-shell :: SymbolFile/DWARF/x86/split-dwarf-multiple-cu.ll (1366 of 2355)
UNSUPPORTED: lldb-api :: functionalities/thread/concurrent_events/TestConcurrentManySignals.py (1367 of 2355)
PASS: lldb-unit :: Process/Utility/./ProcessUtilityTests/ProcMapTests/LinuxProcMapsTestFixture.ParseMapRegions/7 (1368 of 2355)
PASS: lldb-unit :: Utility/./UtilityTests/ProcessInstanceInfo.Yaml (1369 of 2355)
UNSUPPORTED: lldb-api :: tools/lldb-server/registers-target-xml-reading/TestGdbRemoteTargetXmlPacket.py (1370 of 2355)
PASS: lldb-unit :: SymbolFile/DWARF/./SymbolFileDWARFTests/DWARFASTParserClangTests.EnsureAllDIEsInDeclContextHaveBeenParsedParsesOnlyMatchingEntries (1371 of 2355)
PASS: lldb-shell :: Settings/TestModuleCacheSanity.test (1372 of 2355)
UNSUPPORTED: lldb-shell :: ScriptInterpreter/Lua/io.test (1373 of 2355)
PASS: lldb-api :: functionalities/data-formatter/stringprinter/TestStringPrinter.py (1374 of 2355)
PASS: lldb-api :: lang/cpp/signed_types/TestSignedTypes.py (1375 of 2355)
PASS: lldb-api :: commands/version/TestVersion.py (1376 of 2355)
PASS: lldb-unit :: SymbolFile/DWARF/./SymbolFileDWARFTests/SymbolFileDWARFTests.ParseArangesNonzeroSegmentSize (1377 of 2355)
PASS: lldb-unit :: Utility/./UtilityTests/DataExtractorTest.GetULEB128_bit63 (1378 of 2355)
PASS: lldb-api :: functionalities/signal/TestSendSignal.py (1379 of 2355)
PASS: lldb-unit :: UnwindAssembly/x86/./UnwindAssemblyx86Tests/Testx86AssemblyInspectionEngine.TestLEAVE (1380 of 2355)
PASS: lldb-api :: commands/expression/xvalue/TestXValuePrinting.py (1381 of 2355)
PASS: lldb-api :: functionalities/data-formatter/data-formatter-synth/TestDataFormatterSynth.py (1382 of 2355)
PASS: lldb-api :: lang/objc/bitfield_ivars/TestBitfieldIvars.py (1383 of 2355)
UNSUPPORTED: lldb-shell :: Unwind/unwind-plan-dwarf-dump.test (1384 of 2355)
PASS: lldb-api :: lang/objc/modules-cache/TestClangModulesCache.py (1385 of 2355)
PASS: lldb-unit :: ScriptInterpreter/Python/./ScriptInterpreterPythonTests/PythonDataObjectsTest.TestPythonTupleSize (1386 of 2355)
PASS: lldb-api :: sanity/TestSettingSkipping.py (1387 of 2355)
PASS: lldb-api :: functionalities/data-formatter/ptr_ref_typedef/TestPtrRef2Typedef.py (1388 of 2355)
PASS: lldb-unit :: Utility/./UtilityTests/StringExtractorTest.GetNameColonValueSuccess (1389 of 2355)
PASS: lldb-unit :: Expression/./ExpressionTests/DWARFExpression.DW_OP_piece (1390 of 2355)
PASS: lldb-api :: lang/c/inlines/TestRedefinitionsInInlines.py (1391 of 2355)
PASS: lldb-api :: python_api/findvalue_duplist/TestSBFrameFindValue.py (1392 of 2355)
PASS: lldb-unit :: Utility/./UtilityTests/RangeTest.ContainsEndInclusiveInvalid (1393 of 2355)
UNSUPPORTED: lldb-api :: functionalities/darwin_log/filter/regex/category/TestDarwinLogFilterRegexCategory.py (1394 of 2355)
UNSUPPORTED: lldb-shell :: Subprocess/clone-follow-parent-wp.test (1395 of 2355)
PASS: lldb-api :: functionalities/fat_archives/TestFatArchives.py (1396 of 2355)
PASS: lldb-api :: functionalities/thread/concurrent_events/TestConcurrentWatchpointWithDelayWatchpointThreads.py (1397 of 2355)
PASS: lldb-shell :: Reproducer/TestPythonImport.test (1398 of 2355)
PASS: lldb-shell :: SymbolFile/Breakpad/unwind-via-raSearch.test (1399 of 2355)
PASS: lldb-api :: functionalities/data-formatter/data-formatter-objc/TestDataFormatterObjCNSError.py (1400 of 2355)
PASS: lldb-unit :: Utility/./UtilityTests/TimerTest.CategoryTimes2 (1401 of 2355)
PASS: lldb-unit :: Process/gdb-remote/./ProcessGdbRemoteTests/GDBRemoteCommunicationClientTest.SendSignalsToIgnore (1402 of 2355)
PASS: lldb-unit :: Core/./LLDBCoreTests/RichManglingContextTest.SwitchProvider (1403 of 2355)
PASS: lldb-unit :: ScriptInterpreter/Python/./ScriptInterpreterPythonTests/PythonDataObjectsTest.TestDictionaryResolutionWithDot (1404 of 2355)
PASS: lldb-api :: commands/process/attach-resume/TestAttachResume.py (1405 of 2355)
PASS: lldb-api :: functionalities/data-formatter/data-formatter-stl/libcxx/multiset/TestDataFormatterLibcxxMultiSet.py (1406 of 2355)
PASS: lldb-api :: functionalities/reproducers/attach/TestReproducerAttach.py (1407 of 2355)
PASS: lldb-unit :: Host/./HostTests/MainLoopTest.DetectsEOF (1408 of 2355)
PASS: lldb-shell :: ObjectFile/ELF/riscv-arch.yaml (1409 of 2355)
PASS: lldb-api :: python_api/value/empty_class/TestValueAPIEmptyClass.py (1410 of 2355)
PASS: lldb-shell :: ObjectFile/wasm/basic.yaml (1411 of 2355)
UNSUPPORTED: lldb-api :: iohandler/autosuggestion/TestAutosuggestion.py (1412 of 2355)
PASS: lldb-unit :: Utility/./UtilityTests/StringLexerTest.NextIf (1413 of 2355)
PASS: lldb-api :: lang/objc/rdar-11355592/TestRdar11355592.py (1414 of 2355)
PASS: lldb-unit :: Utility/./UtilityTests/StreamTest.AddressRangeEmptyRange (1415 of 2355)
PASS: lldb-unit :: Utility/./UtilityTests/StringListTest.Join (1416 of 2355)
PASS: lldb-api :: functionalities/thread/concurrent_events/TestConcurrentBreakpointOneDelayBreakpointThreads.py (1417 of 2355)
PASS: lldb-unit :: Expression/./ExpressionTests/DWARFExpression.DW_OP_const (1418 of 2355)
UNSUPPORTED: lldb-api :: commands/watchpoints/variable_out_of_scope/TestWatchedVarHitWhenInScope.py (1419 of 2355)
PASS: lldb-shell :: Driver/TestCore.test (1420 of 2355)
PASS: lldb-unit :: Utility/./UtilityTests/AnsiTerminal.WhiteSpace (1421 of 2355)
PASS: lldb-unit :: Core/./LLDBCoreTests/FormatEntityTest.DefinitionConstructionNameAndString (1422 of 2355)
PASS: lldb-shell :: SymbolFile/DWARF/x86/debug-types-basic.test (1423 of 2355)
PASS: lldb-unit :: Utility/./UtilityTests/UUIDTest.StringConverion (1424 of 2355)
UNSUPPORTED: lldb-api :: benchmarks/libcxxlist/TestBenchmarkLibcxxList.py (1425 of 2355)
PASS: lldb-api :: functionalities/data-formatter/data-formatter-objc/TestDataFormatterObjNSException.py (1426 of 2355)
PASS: lldb-unit :: Utility/./UtilityTests/RegularExpression.Match (1427 of 2355)
UNSUPPORTED: lldb-api :: linux/aarch64/mte_memory_region/TestAArch64LinuxMTEMemoryRegion.py (1428 of 2355)
PASS: lldb-api :: commands/expression/static-initializers/TestStaticInitializers.py (1429 of 2355)
PASS: lldb-unit :: Core/./LLDBCoreTests/SourceLocationSpecTest.Equal (1430 of 2355)
PASS: lldb-unit :: Process/minidump/./LLDBMinidumpTests/MinidumpParserTest.GetThreadContext_x86_32 (1431 of 2355)
PASS: lldb-shell :: SymbolFile/DWARF/x86/debug_loc_and_loclists.s (1432 of 2355)
PASS: lldb-shell :: Commands/command-breakpoint-col.test (1433 of 2355)
PASS: lldb-shell :: SymbolFile/DWARF/x86/DW_AT_data_bit_offset-DW_OP_stack_value.s (1434 of 2355)
PASS: lldb-unit :: Process/Utility/./ProcessUtilityTests/RegisterContext_x86Test.FullToAbridgedTagWord (1435 of 2355)
PASS: lldb-api :: lang/cpp/class-template-non-type-parameter-pack/TestClassTemplateNonTypeParameterPack.py (1436 of 2355)
PASS: lldb-api :: functionalities/data-formatter/data-formatter-stl/libcxx/initializerlist/TestInitializerList.py (1437 of 2355)
PASS: lldb-shell :: SymbolFile/DWARF/x86/DW_AT_const_value.s (1438 of 2355)
PASS: lldb-api :: python_api/watchpoint/TestWatchpointIgnoreCount.py (1439 of 2355)
PASS: lldb-unit :: Host/./HostTests/HostInfoTestInitialization.InitTwice (1440 of 2355)
UNSUPPORTED: lldb-api :: arm/breakpoint-thumb-codesection/TestBreakpointThumbCodesection.py (1441 of 2355)
PASS: lldb-unit :: Utility/./UtilityTests/StringExtractorTest.GetHexU8_InvalidHex_NoEof (1442 of 2355)
PASS: lldb-unit :: Utility/./UtilityTests/OptionsWithRawTest.WhitespaceInput (1443 of 2355)
PASS: lldb-unit :: Process/minidump/./LLDBMinidumpTests/MinidumpParserTest.MinidumpDuplicateModuleMinAddress (1444 of 2355)
PASS: lldb-shell :: Driver/TestCommands.test (1445 of 2355)
PASS: lldb-unit :: ScriptInterpreter/Python/./ScriptInterpreterPythonTests/PythonDataObjectsTest.TestOwnedReferences (1446 of 2355)
PASS: lldb-unit :: Language/Highlighting/./HighlighterTests/HighlighterTest.Keywords (1447 of 2355)
UNSUPPORTED: lldb-api :: benchmarks/continue/TestBenchmarkContinue.py (1448 of 2355)
PASS: lldb-api :: functionalities/thread/thread_specific_break/TestThreadSpecificBreakpoint.py (1449 of 2355)
UNSUPPORTED: lldb-api :: commands/trace/TestTraceSchema.py (1450 of 2355)
PASS: lldb-api :: commands/expression/context-object-objc/TestContextObjectObjc.py (1451 of 2355)
PASS: lldb-shell :: ObjectFile/ELF/aarch64-relocations.yaml (1452 of 2355)
PASS: lldb-shell :: SymbolFile/DWARF/x86/inline-function-address.ll (1453 of 2355)
PASS: lldb-api :: lang/objcxx/class-name-clash/TestNameClash.py (1454 of 2355)
PASS: lldb-api :: commands/command/delete/TestCommandDelete.py (1455 of 2355)
PASS: lldb-shell :: ObjectFile/PECOFF/sections-names.yaml (1456 of 2355)
PASS: lldb-api :: tools/lldb-server/TestGdbRemoteKill.py (1457 of 2355)
PASS: lldb-api :: python_api/lldbutil/TestSwigVersion.py (1458 of 2355)
PASS: lldb-unit :: Process/Utility/./ProcessUtilityTests/MemoryTagManagerAArch64MTETest.UnpackTagsData (1459 of 2355)
PASS: lldb-unit :: Process/gdb-remote/./ProcessGdbRemoteTests/GDBRemoteClientBaseTest.SendContinueDelegateStructuredDataReceipt (1460 of 2355)
UNSUPPORTED: lldb-api :: commands/register/register/intel_xtended_registers/TestMPXRegisters.py (1461 of 2355)
PASS: lldb-api :: types/TestIntegerType.py (1462 of 2355)
PASS: lldb-shell :: Register/x86-multithread-read.test (1463 of 2355)
PASS: lldb-api :: functionalities/data-formatter/data-formatter-stl/libcxx/multimap/TestDataFormatterLibccMultiMap.py (1464 of 2355)
PASS: lldb-unit :: Process/gdb-remote/./ProcessGdbRemoteTests/GDBRemoteCommunicationClientTest.GetQOffsets (1465 of 2355)
PASS: lldb-unit :: Core/./LLDBCoreTests/MangledTest.NameIndexes_FindFunctionSymbols (1466 of 2355)
PASS: lldb-api :: commands/expression/import-std-module/forward_decl_from_module/TestForwardDeclFromStdModule.py (1467 of 2355)
PASS: lldb-api :: commands/process/launch-with-shellexpand/TestLaunchWithShellExpand.py (1468 of 2355)
PASS: lldb-shell :: SymbolFile/Breakpad/stack-cfi-parsing.test (1469 of 2355)
UNSUPPORTED: lldb-api :: functionalities/darwin_log/filter/exact_match/activity/TestDarwinLogFilterMatchActivity.py (1470 of 2355)
PASS: lldb-api :: functionalities/conditional_break/TestConditionalBreak.py (1471 of 2355)
PASS: lldb-api :: lang/c/unions/TestUnionMembers.py (1472 of 2355)
PASS: lldb-api :: lang/cpp/class_types/TestClassTypes.py (1473 of 2355)
PASS: lldb-unit :: Process/gdb-remote/./ProcessGdbRemoteTests/GDBRemoteClientBaseTest.SendContinueAndAsyncPacket (1474 of 2355)
PASS: lldb-unit :: Utility/./UtilityTests/FileSpecTest.RemoveLastPathComponent (1475 of 2355)
PASS: lldb-unit :: Target/./TargetTests/RemoteAwarePlatformTest.TestResolveExecutabelOnClientByPlatform (1476 of 2355)
PASS: lldb-api :: functionalities/value_md5_crash/TestValueMD5Crash.py (1477 of 2355)
UNSUPPORTED: lldb-api :: functionalities/gdb_remote_client/TestWasm.py (1478 of 2355)
PASS: lldb-unit :: Symbol/./SymbolTests/PostfixExpression.ToDWARF (1479 of 2355)
PASS: lldb-unit :: Process/Utility/./ProcessUtilityTests/ProcSMapTests/LinuxProcSMapsTestFixture.ParseSMapRegions/4 (1480 of 2355)
PASS: lldb-api :: commands/breakpoint/command/list/TestBreakpointCommandList.py (1481 of 2355)
UNSUPPORTED: lldb-api :: linux/aarch64/mte_tag_read/TestAArch64LinuxMTEMemoryTagRead.py (1482 of 2355)
PASS: lldb-unit :: Core/./LLDBCoreTests/DumpDataExtractorTest.MultiLine (1483 of 2355)
PASS: lldb-unit :: Utility/./UtilityTests/AnsiTerminal.Unknown (1484 of 2355)
PASS: lldb-unit :: Utility/./UtilityTests/XcodeSDKTest.SDKSupportsSwift (1485 of 2355)
PASS: lldb-unit :: Utility/./UtilityTests/DataExtractorTest.UncommonAddressSize (1486 of 2355)
PASS: lldb-api :: functionalities/multiword-commands/TestMultiWordCommands.py (1487 of 2355)
PASS: lldb-unit :: Process/minidump/./LLDBMinidumpTests/MinidumpParserTest.GetLinuxProcStatus_no_stream (1488 of 2355)
PASS: lldb-api :: lang/objc/real-definition/TestRealDefinition.py (1489 of 2355)
PASS: lldb-api :: commands/expression/error-limit/TestExprErrorLimit.py (1490 of 2355)
PASS: lldb-api :: tools/lldb-vscode/coreFile/TestVSCode_coreFile.py (1491 of 2355)
PASS: lldb-unit :: Utility/./UtilityTests/FileSpecTest.IsRelative (1492 of 2355)
PASS: lldb-api :: functionalities/step-avoids-no-debug/TestStepNoDebug.py (1493 of 2355)
UNSUPPORTED: lldb-shell :: ObjectFile/ELF/minidebuginfo-no-lzma.yaml (1494 of 2355)
PASS: lldb-unit :: Host/./HostTests/ConnectionFileDescriptorTest.TCPGetURIv6 (1495 of 2355)
PASS: lldb-api :: functionalities/postmortem/elf-core/TestLinuxCore.py (1496 of 2355)
PASS: lldb-shell :: Recognizer/assert.test (1497 of 2355)
PASS: lldb-unit :: Symbol/./SymbolTests/TestTypeSystemClang.TestFunctionTemplateInRecordConstruction (1498 of 2355)
PASS: lldb-api :: functionalities/inferior-crashing/recursive-inferior/TestRecursiveInferiorStep.py (1499 of 2355)
PASS: lldb-api :: lang/cpp/frame-var-anon-unions/TestFrameVariableAnonymousUnions.py (1500 of 2355)
PASS: lldb-shell :: ExecControl/StopHook/stop-hook.test (1501 of 2355)
PASS: lldb-api :: lang/objc/objc-property/TestObjCProperty.py (1502 of 2355)
PASS: lldb-shell :: Commands/command-stop-hook-output.test (1503 of 2355)
UNSUPPORTED: lldb-shell :: ObjectFile/PECOFF/disassemble-thumb.yaml (1504 of 2355)
PASS: lldb-unit :: ScriptInterpreter/Python/./ScriptInterpreterPythonTests/PythonDataObjectsTest.TestPythonCallableCheck (1505 of 2355)
PASS: lldb-api :: tools/lldb-server/signal-filtering/TestGdbRemote_QPassSignals.py (1506 of 2355)
PASS: lldb-unit :: Utility/./UtilityTests/StreamTest.ShiftOperatorPtr (1507 of 2355)
PASS: lldb-shell :: ObjectFile/ELF/minidebuginfo-corrupt-xz.yaml (1508 of 2355)
PASS: lldb-api :: commands/target/stop-hook/enable/TestTargetStopHookEnable.py (1509 of 2355)
PASS: lldb-api :: functionalities/step_scripted/TestStepScripted.py (1510 of 2355)
PASS: lldb-unit :: UnwindAssembly/x86/./UnwindAssemblyx86Tests/Testx86AssemblyInspectionEngine.TestPushRBPWithREX (1511 of 2355)
PASS: lldb-api :: lang/cpp/accelerator-table/TestCPPAccelerator.py (1512 of 2355)
PASS: lldb-api :: lang/c/stepping/TestStepAndBreakpoints.py (1513 of 2355)
UNSUPPORTED: lldb-api :: iohandler/unicode/TestUnicode.py (1514 of 2355)
PASS: lldb-api :: functionalities/data-formatter/data-formatter-smart-array/TestDataFormatterSmartArray.py (1515 of 2355)
PASS: lldb-unit :: Host/./HostTests/FileSystemTest.Readable (1516 of 2355)
PASS: lldb-unit :: Utility/./UtilityTests/ArchSpecTest.Compatibility (1517 of 2355)
PASS: lldb-api :: functionalities/memory/read/TestMemoryRead.py (1518 of 2355)
PASS: lldb-unit :: Core/./LLDBCoreTests/ModuleSpecTest.TestMachOFile (1519 of 2355)
PASS: lldb-unit :: Symbol/./SymbolTests/DWARFCallFrameInfoTest.Basic_dwarf4 (1520 of 2355)
PASS: lldb-shell :: Driver/TestNoUseColor.test (1521 of 2355)
PASS: lldb-api :: functionalities/thread/concurrent_events/TestConcurrentDelayWatchBreak.py (1522 of 2355)
PASS: lldb-unit :: Host/./HostTests/HostInfoTest.GetHostname (1523 of 2355)
PASS: lldb-api :: lang/c/anonymous/TestAnonymous.py (1524 of 2355)
UNSUPPORTED: lldb-api :: functionalities/unwind/standard/TestStandardUnwind.py (1525 of 2355)
PASS: lldb-api :: macosx/find-app-in-bundle/TestFindAppInBundle.py (1526 of 2355)
PASS: lldb-api :: functionalities/completion/TestCompletion.py (1527 of 2355)
PASS: lldb-unit :: Utility/./UtilityTests/StringListTest.RemoveBlankLines (1528 of 2355)
PASS: lldb-unit :: Process/gdb-remote/./ProcessGdbRemoteTests/GDBRemoteCommunicationClientTest.ReadMemoryTags (1529 of 2355)
PASS: lldb-api :: functionalities/thread/concurrent_events/TestConcurrentWatchpointDelayWatchpointOneBreakpoint.py (1530 of 2355)
PASS: lldb-unit :: Utility/./UtilityTests/RangeTest.SetRangeBase (1531 of 2355)
PASS: lldb-shell :: SymbolFile/NativePDB/globals-fundamental.cpp (1532 of 2355)
PASS: lldb-unit :: Target/./TargetTests/PathMappingListTest.AbsoluteTests (1533 of 2355)
PASS: lldb-shell :: Quit/TestQuitExitCode0.test (1534 of 2355)
PASS: lldb-unit :: Utility/./UtilityTests/ScalarTest.Getters (1535 of 2355)
PASS: lldb-unit :: Language/CPlusPlus/./LanguageCPlusPlusTests/CPlusPlusLanguage.FindAlternateFunctionManglings (1536 of 2355)
PASS: lldb-unit :: Utility/./UtilityTests/StreamTeeTest.GetStreamAtIndexOutOfBoundsEmpty (1537 of 2355)
PASS: lldb-unit :: Symbol/./SymbolTests/TestTypeSystemClang.TemplateArguments (1538 of 2355)
PASS: lldb-api :: python_api/lldbutil/iter/TestLLDBIterator.py (1539 of 2355)
PASS: lldb-unit :: Utility/./UtilityTests/ProcessInstanceInfo.DumpTable_invalidUID (1540 of 2355)
PASS: lldb-unit :: Utility/./UtilityTests/ArgsTest.TestSingleArgWithQuotedSpace (1541 of 2355)
PASS: lldb-unit :: Process/gdb-remote/./ProcessGdbRemoteTests/PortMapTest.Constructors (1542 of 2355)
PASS: lldb-shell :: ObjectFile/ELF/minidebuginfo-find-symbols.yaml (1543 of 2355)
UNSUPPORTED: lldb-api :: commands/platform/connect/TestPlatformConnect.py (1544 of 2355)
PASS: lldb-unit :: Core/./LLDBCoreTests/SourceLocationSpecTest.Compare (1545 of 2355)
PASS: lldb-unit :: Utility/./UtilityTests/ArchSpecTest.TestParseMachCPUDashSubtypeTripleSimple (1546 of 2355)
PASS: lldb-unit :: Utility/./UtilityTests/LogChannelEnabledTest.log_options (1547 of 2355)
PASS: lldb-api :: lang/cpp/typeof/TestTypeOfDeclTypeExpr.py (1548 of 2355)
PASS: lldb-unit :: Utility/./UtilityTests/StringExtractorTest.DecodeHexU8_InvalidHex (1549 of 2355)
PASS: lldb-api :: source-manager/TestSourceManager.py (1550 of 2355)
PASS: lldb-unit :: Utility/./UtilityTests/StringExtractorTest.GetHexBytesAvail_Underflow (1551 of 2355)
UNSUPPORTED: lldb-shell :: Subprocess/vfork-follow-parent-wp.test (1552 of 2355)
PASS: lldb-unit :: Utility/./UtilityTests/ArgsTest.TestOverwriteArgs (1553 of 2355)
PASS: lldb-api :: macosx/thread_suspend/TestInternalThreadSuspension.py (1554 of 2355)
PASS: lldb-api :: functionalities/tail_call_frames/cross_dso/TestCrossDSOTailCalls.py (1555 of 2355)
PASS: lldb-unit :: Process/gdb-remote/./ProcessGdbRemoteTests/GDBRemoteClientBaseTest.SendPacketAndReceiveResponseWithOutputSupport (1556 of 2355)
PASS: lldb-unit :: Language/Highlighting/./HighlighterTests/HighlighterTest.ClangEmptyInput (1557 of 2355)
PASS: lldb-unit :: Utility/./UtilityTests/OptionsWithRawTest.EmptyArgsOnlySuffix (1558 of 2355)
PASS: lldb-unit :: UnwindAssembly/x86/./UnwindAssemblyx86Tests/Testx86AssemblyInspectionEngine.TestPopR13 (1559 of 2355)
PASS: lldb-unit :: ObjectFile/Breakpad/./ObjectFileBreakpadTests/PublicRecord.parse (1560 of 2355)
PASS: lldb-unit :: Utility/./UtilityTests/LogTest.LLDB_LOG_nullptr (1561 of 2355)
PASS: lldb-unit :: Utility/./UtilityTests/StringLexerTest.Next (1562 of 2355)
PASS: lldb-unit :: Utility/./UtilityTests/UriParserTest.SchemeHostSeparator2 (1563 of 2355)
PASS: lldb-api :: functionalities/set-data/TestSetData.py (1564 of 2355)
UNSUPPORTED: lldb-shell :: Register/x86-fp-read.test (1565 of 2355)
PASS: lldb-shell :: SymbolFile/NativePDB/disassembly.cpp (1566 of 2355)
UNSUPPORTED: lldb-api :: functionalities/breakpoint/breakpoint_callback_command_source/TestBreakpointCallbackCommandSource.py (1567 of 2355)
PASS: lldb-api :: tools/lldb-server/TestLldbGdbServer.py (1568 of 2355)
PASS: lldb-shell :: Reproducer/TestCrash.test (1569 of 2355)
PASS: lldb-unit :: Utility/./UtilityTests/StringListTest.AppendListCStringArrayEmpty (1570 of 2355)
PASS: lldb-unit :: Utility/./UtilityTests/StringExtractorTest.DecodeHexU8_Extra (1571 of 2355)
PASS: lldb-unit :: Host/./HostTests/NativeProcessProtocolTest.ReadCStringFromMemory_CrossPageBoundary (1572 of 2355)
PASS: lldb-unit :: Utility/./UtilityTests/StringLexerTest.GetUnlexed (1573 of 2355)
PASS: lldb-api :: lang/cpp/breakpoint-commands/TestCPPBreakpointCommands.py (1574 of 2355)
PASS: lldb-shell :: Commands/command-disassemble.s (1575 of 2355)
PASS: lldb-unit :: Utility/./UtilityTests/RecordReplayTest.InstrumentedFooSameThis (1576 of 2355)
PASS: lldb-unit :: Utility/./UtilityTests/XcodeSDKTest.GetSDKTypeForTriple (1577 of 2355)
UNSUPPORTED: lldb-shell :: SymbolFile/PDB/pointers.test (1578 of 2355)
PASS: lldb-shell :: ObjectFile/MachO/lc_version_min.yaml (1579 of 2355)
PASS: lldb-shell :: Settings/TestDisassemblyFormat.test (1580 of 2355)
PASS: lldb-api :: commands/target/dump-symtab-demangle/TestDumpSymtabDemangle.py (1581 of 2355)
PASS: lldb-unit :: Utility/./UtilityTests/UriParserTest.PortOverflow (1582 of 2355)
PASS: lldb-unit :: Process/Utility/./ProcessUtilityTests/ProcMapTests/LinuxProcMapsTestFixture.ParseMapRegions/1 (1583 of 2355)
PASS: lldb-api :: commands/platform/basic/TestPlatformCommand.py (1584 of 2355)
PASS: lldb-api :: functionalities/tail_call_frames/ambiguous_tail_call_seq1/TestAmbiguousTailCallSeq1.py (1585 of 2355)
PASS: lldb-unit :: Host/./HostTests/FileSystemTest.OpenErrno (1586 of 2355)
PASS: lldb-api :: python_api/get-value-32bit-int/TestGetValue32BitInt.py (1587 of 2355)
PASS: lldb-unit :: Utility/./UtilityTests/StringExtractorTest.GetHexBytes_Partial (1588 of 2355)
PASS: lldb-unit :: Process/gdb-remote/./ProcessGdbRemoteTests/PortMapTest.FreePort (1589 of 2355)
PASS: lldb-api :: tools/lldb-vscode/launch/TestVSCode_launch.py (1590 of 2355)
PASS: lldb-api :: functionalities/data-formatter/data-formatter-objc/TestDataFormatterObjCCF.py (1591 of 2355)
PASS: lldb-api :: lang/cpp/forward-declared-template-specialization/TestCppForwardDeclaredTemplateSpecialization.py (1592 of 2355)
PASS: lldb-unit :: Utility/./UtilityTests/StreamTest.PutHex64ByteOrderLittle (1593 of 2355)
PASS: lldb-unit :: Utility/./UtilityTests/ArgsTest.TestUnknownEscape (1594 of 2355)
PASS: lldb-api :: lang/objc/modules-incomplete/TestIncompleteModules.py (1595 of 2355)
PASS: lldb-unit :: Utility/./UtilityTests/RangeVector.CombineConsecutiveRanges (1596 of 2355)
PASS: lldb-shell :: Commands/command-source.test (1597 of 2355)
PASS: lldb-shell :: SymbolFile/DWARF/x86/DW_TAG_variable-invalid_location.s (1598 of 2355)
PASS: lldb-unit :: UnwindAssembly/x86/./UnwindAssemblyx86Tests/Testx86AssemblyInspectionEngine.TestStackRealignMSVC_i386 (1599 of 2355)
PASS: lldb-unit :: ObjectFile/Breakpad/./ObjectFileBreakpadTests/StackCFIRecord.parse (1600 of 2355)
PASS: lldb-api :: commands/expression/cast_int_to_anonymous_enum/TestCastIntToAnonymousEnum.py (1601 of 2355)
PASS: lldb-unit :: Process/./ProcessEventDataTests/ProcessEventDataTest.DoOnRemoval (1602 of 2355)
PASS: lldb-api :: macosx/find-dsym/deep-bundle/TestDeepBundle.py (1603 of 2355)
PASS: lldb-unit :: Utility/./UtilityTests/ArgsTest.TestInsertArg (1604 of 2355)
PASS: lldb-api :: lang/objc/variadic_methods/TestVariadicMethods.py (1605 of 2355)
PASS: lldb-unit :: Utility/./UtilityTests/UriParserTest.Minimal (1606 of 2355)
PASS: lldb-unit :: Utility/./UtilityTests/StringListTest.AppendList (1607 of 2355)
UNSUPPORTED: lldb-shell :: ScriptInterpreter/Lua/quit.test (1608 of 2355)
PASS: lldb-api :: functionalities/breakpoint/breakpoint_ids/TestBreakpointIDs.py (1609 of 2355)
PASS: lldb-unit :: Utility/./UtilityTests/OptionsWithRawTest.SingleWordSuffix (1610 of 2355)
PASS: lldb-unit :: debugserver/./debugserverTests/RNBSocket.LoopBackListenIPv4 (1611 of 2355)
PASS: lldb-api :: lang/cpp/struct_with_keyword_name/TestStructWithKeywordName.py (1612 of 2355)
UNSUPPORTED: lldb-api :: functionalities/tsan/thread_leak/TestTsanThreadLeak.py (1613 of 2355)
PASS: lldb-api :: python_api/watchpoint/condition/TestWatchpointConditionAPI.py (1614 of 2355)
PASS: lldb-unit :: Host/./HostTests/File.GetWaitableHandleFileno (1615 of 2355)
PASS: lldb-unit :: debugserver/./debugserverTests/RNBSocket.LoopBackListenIPv6 (1616 of 2355)
PASS: lldb-shell :: ObjectFile/PECOFF/invalid-export-table.yaml (1617 of 2355)
PASS: lldb-api :: functionalities/gdb_remote_client/TestJLink6Armv7RegisterDefinition.py (1618 of 2355)
PASS: lldb-api :: functionalities/thread/concurrent_events/TestConcurrentNWatchNBreak.py (1619 of 2355)
PASS: lldb-unit :: Process/gdb-remote/./ProcessGdbRemoteTests/GDBRemoteCommunicationServerTest.SendErrorResponse_ErrorNumber (1620 of 2355)
PASS: lldb-api :: functionalities/multidebugger_commands/TestMultipleDebuggersCommands.py (1621 of 2355)
PASS: lldb-unit :: Utility/./UtilityTests/ArchSpecTest.YAML (1622 of 2355)
PASS: lldb-api :: sample_test/TestSampleTest.py (1623 of 2355)
PASS: lldb-api :: python_api/value/change_values/TestChangeValueAPI.py (1624 of 2355)
PASS: lldb-unit :: Process/minidump/./LLDBMinidumpTests/MinidumpParserTest.GetThreadContext_x86_32_wow64 (1625 of 2355)
PASS: lldb-api :: lang/c/step_over_no_deadlock/TestStepOverDoesntBlock.py (1626 of 2355)
PASS: lldb-api :: lang/cpp/this/TestCPPThis.py (1627 of 2355)
PASS: lldb-unit :: ScriptInterpreter/Python/./ScriptInterpreterPythonTests/PythonDataObjectsTest.TestResetting (1628 of 2355)
UNSUPPORTED: lldb-shell :: Register/x86-64-xmm16-read.test (1629 of 2355)
PASS: lldb-unit :: Utility/./UtilityTests/XcodeSDKTest.SDKSupportsModules (1630 of 2355)
PASS: lldb-unit :: UnwindAssembly/x86/./UnwindAssemblyx86Tests/Testx86AssemblyInspectionEngine.TestPushRBP (1631 of 2355)
PASS: lldb-shell :: Reproducer/TestDriverOptions.test (1632 of 2355)
PASS: lldb-unit :: Process/minidump/./LLDBMinidumpTests/MinidumpParserTest.MinidumpModuleOrder (1633 of 2355)
PASS: lldb-shell :: Register/Core/x86-64-linux-fp.test (1634 of 2355)
PASS: lldb-unit :: Utility/./UtilityTests/StringExtractorTest.GetHexBytes_OddPair2 (1635 of 2355)
PASS: lldb-unit :: Platform/./LLDBPlatformTests/PlatformDarwinTest.FindComponentInPath (1636 of 2355)
PASS: lldb-shell :: Driver/TestProcessAttach.test (1637 of 2355)
PASS: lldb-unit :: SymbolFile/NativePDB/./SymbolFileNativePDBTests/PDBFPOProgramToDWARFExpressionTests.InvalidAssignmentMultiple (1638 of 2355)
PASS: lldb-api :: functionalities/type_lookup/TestTypeLookup.py (1639 of 2355)
PASS: lldb-unit :: Symbol/./SymbolTests/TestClangASTImporter.CompleteFwdDeclWithOtherOrigin (1640 of 2355)
PASS: lldb-unit :: Utility/./UtilityTests/StreamTest.ShiftOperatorStrings (1641 of 2355)
PASS: lldb-api :: lang/cpp/bitfields/TestCppBitfields.py (1642 of 2355)
PASS: lldb-api :: commands/expression/ir-interpreter/TestIRInterpreter.py (1643 of 2355)
PASS: lldb-unit :: Utility/./UtilityTests/RangeDataVector.CustomSort (1644 of 2355)
PASS: lldb-shell :: Reproducer/TestDump.test (1645 of 2355)
PASS: lldb-shell :: ObjectFile/ELF/PT_LOAD-overlap.yaml (1646 of 2355)
PASS: lldb-unit :: Core/./LLDBCoreTests/MangledTest.ResultForValidName (1647 of 2355)
PASS: lldb-unit :: Utility/./UtilityTests/AnsiTerminal.Incomplete (1648 of 2355)
PASS: lldb-unit :: Utility/./UtilityTests/SerializationRountripTest.SerializeDeserializeCString (1649 of 2355)
PASS: lldb-api :: functionalities/data-formatter/hexcaps/TestDataFormatterHexCaps.py (1650 of 2355)
PASS: lldb-shell :: ObjectFile/ELF/PT_LOAD-overlap-PT_TLS.yaml (1651 of 2355)
PASS: lldb-unit :: Utility/./UtilityTests/ScalarTest.CastOperations (1652 of 2355)
PASS: lldb-unit :: Utility/./UtilityTests/ReproducerTest.SetCapture (1653 of 2355)
PASS: lldb-unit :: Utility/./UtilityTests/GeneratorTest.Create (1654 of 2355)
PASS: lldb-unit :: Process/minidump/./LLDBMinidumpTests/MinidumpParserTest.MinidumpDuplicateModuleSeparateCode (1655 of 2355)
PASS: lldb-api :: lang/c/stepping/TestThreadStepping.py (1656 of 2355)
PASS: lldb-unit :: Language/Highlighting/./HighlighterTests/HighlighterTest.ClangStringLiterals (1657 of 2355)
PASS: lldb-api :: functionalities/breakpoint/serialize/TestBreakpointSerialization.py (1658 of 2355)
PASS: lldb-unit :: ScriptInterpreter/Python/./ScriptInterpreterPythonTests/PythonDataObjectsTest.TestPythonDictionaryValueEquality (1659 of 2355)
PASS: lldb-shell :: Commands/command-target-modules-dump-sections.yaml (1660 of 2355)
PASS: lldb-unit :: Core/./LLDBCoreTests/ModuleSpecTest.InvalidInMemoryBufferValidFile (1661 of 2355)
PASS: lldb-api :: functionalities/breakpoint/objc/TestObjCBreakpoints.py (1662 of 2355)
PASS: lldb-api :: functionalities/data-formatter/typedef_array/TestTypedefArray.py (1663 of 2355)
PASS: lldb-unit :: Process/minidump/./LLDBMinidumpTests/MinidumpParserTest.GetArchitectureWindows (1664 of 2355)
PASS: lldb-unit :: Utility/./UtilityTests/Flags.Clear (1665 of 2355)
PASS: lldb-shell :: Process/UnsupportedLanguage.test (1666 of 2355)
PASS: lldb-unit :: Utility/./UtilityTests/StreamTest.AddressPrefixAndSuffix (1667 of 2355)
UNSUPPORTED: lldb-api :: functionalities/breakpoint/breakpoint_in_delayslot/TestAvoidBreakpointInDelaySlot.py (1668 of 2355)
PASS: lldb-unit :: SymbolFile/NativePDB/./SymbolFileNativePDBTests/PDBFPOProgramToDWARFExpressionTests.DependencyChain (1669 of 2355)
PASS: lldb-unit :: Process/gdb-remote/./ProcessGdbRemoteTests/GDBRemoteClientBaseTest.SendContinueAndInterrupt (1670 of 2355)
PASS: lldb-api :: lang/objc/objc-static-method/TestObjCStaticMethod.py (1671 of 2355)
PASS: lldb-unit :: Utility/./UtilityTests/UriParserTest.BracketedHostnameWithPortIPv4 (1672 of 2355)
PASS: lldb-shell :: Commands/command-backtrace-parser-2.test (1673 of 2355)
PASS: lldb-unit :: Utility/./UtilityTests/ScalarTest.LongLongAssigmentOperator (1674 of 2355)
PASS: lldb-api :: functionalities/thread/thread_exit/TestThreadExit.py (1675 of 2355)
PASS: lldb-api :: functionalities/thread/concurrent_events/TestConcurrentDelayedCrashWithBreakpointSignal.py (1676 of 2355)
PASS: lldb-api :: lang/cpp/class_types/TestClassTypesDisassembly.py (1677 of 2355)
PASS: lldb-shell :: Quit/TestQuitExitCode-30.test (1678 of 2355)
PASS: lldb-shell :: Register/Core/x86-64-netbsd-gp.test (1679 of 2355)
PASS: lldb-unit :: Utility/./UtilityTests/RangeTest.ContainsRange (1680 of 2355)
PASS: lldb-shell :: SymbolFile/DWARF/x86/dwarf5-partial-index.cpp (1681 of 2355)
PASS: lldb-shell :: SymbolFile/NativePDB/tag-types.cpp (1682 of 2355)
PASS: lldb-api :: lang/cpp/function_refs/TestFunctionRefs.py (1683 of 2355)
PASS: lldb-unit :: Target/./TargetTests/PathMappingListTest.CrossPlatformTests (1684 of 2355)
PASS: lldb-api :: api/log/TestAPILog.py (1685 of 2355)
PASS: lldb-unit :: Utility/./UtilityTests/StringExtractorTest.GetHexBytesAvail_Partial (1686 of 2355)
PASS: lldb-unit :: Symbol/./SymbolTests/TestTypeSystemClang.TestDisplayNameEmpty (1687 of 2355)
PASS: lldb-unit :: Target/./TargetTests/ExecutionContextTest.GetByteOrder (1688 of 2355)
PASS: lldb-api :: commands/frame/diagnose/local-variable/TestLocalVariable.py (1689 of 2355)
PASS: lldb-api :: functionalities/load_lazy/TestLoadUsingLazyBind.py (1690 of 2355)
PASS: lldb-api :: functionalities/gdb_remote_client/TestNoGPacketSupported.py (1691 of 2355)
PASS: lldb-api :: functionalities/data-formatter/data-formatter-advanced/TestDataFormatterAdv.py (1692 of 2355)
PASS: lldb-unit :: Utility/./UtilityTests/SharedCluster.ClusterManager (1693 of 2355)
PASS: lldb-api :: functionalities/thread/concurrent_events/TestConcurrentManyCrash.py (1694 of 2355)
PASS: lldb-unit :: Utility/./UtilityTests/AnsiTerminal.Twice (1695 of 2355)
PASS: lldb-api :: functionalities/backticks/TestBackticksWithoutATarget.py (1696 of 2355)
PASS: lldb-unit :: Expression/./ExpressionTests/CppModuleConfigurationTest.Sysroot (1697 of 2355)
PASS: lldb-unit :: ScriptInterpreter/Python/./ScriptInterpreterPythonTests/PythonDataObjectsTest.TestPythonListToStructuredList (1698 of 2355)
PASS: lldb-shell :: SymbolFile/DWARF/x86/debug_aranges-empty-section.s (1699 of 2355)
PASS: lldb-unit :: Utility/./UtilityTests/StreamTest.PutULEB128 (1700 of 2355)
PASS: lldb-api :: lang/cpp/modules-import/TestCXXModulesImport.py (1701 of 2355)
PASS: lldb-unit :: Utility/./UtilityTests/FileSpecTest.EqualDotsPosix (1702 of 2355)
PASS: lldb-unit :: Symbol/./SymbolTests/TestTypeSystemClang.AddMethodToObjCObjectType (1703 of 2355)
UNSUPPORTED: lldb-shell :: Expr/TestIRMemoryMapWindows.test (1704 of 2355)
PASS: lldb-unit :: Utility/./UtilityTests/BinaryStreamTest.PutSLEB128One (1705 of 2355)
PASS: lldb-unit :: Host/./HostTests/NativeProcessProtocolTest.ReadMemoryWithoutTrap (1706 of 2355)
PASS: lldb-unit :: Utility/./UtilityTests/ArgsTest.ReplaceArgumentAtIndexShort (1707 of 2355)
PASS: lldb-api :: functionalities/show_location/TestShowLocationDwarf5.py (1708 of 2355)
PASS: lldb-unit :: Utility/./UtilityTests/LogChannelTest.Enable (1709 of 2355)
PASS: lldb-api :: functionalities/data-formatter/data-formatter-objc/TestDataFormatterObjCExpr.py (1710 of 2355)
PASS: lldb-unit :: Utility/./UtilityTests/ConstStringTest.UpdateMangledCounterpart (1711 of 2355)
UNSUPPORTED: lldb-shell :: Unwind/eh-frame-augment-noop.test (1712 of 2355)
PASS: lldb-unit :: Utility/./UtilityTests/StringListTest.JoinNonSpace (1713 of 2355)
PASS: lldb-api :: iohandler/resize/TestIOHandlerResizeNoEditline.py (1714 of 2355)
PASS: lldb-unit :: Utility/./UtilityTests/DataExtractorTest.GetBitfield (1715 of 2355)
PASS: lldb-unit :: Utility/./UtilityTests/StringExtractorTest.GetNameColonValueNoColon (1716 of 2355)
PASS: lldb-unit :: Utility/./UtilityTests/RangeDataVector.FindEntryThatContains (1717 of 2355)
PASS: lldb-api :: macosx/duplicate-archive-members/TestDuplicateMembers.py (1718 of 2355)
PASS: lldb-api :: functionalities/process_crash_info/TestProcessCrashInfo.py (1719 of 2355)
PASS: lldb-unit :: Process/gdb-remote/./ProcessGdbRemoteTests/GDBRemoteCommunicationClientTest.TestPacketSpeedJSON (1720 of 2355)
PASS: lldb-api :: commands/expression/import-std-module/vector/TestVectorFromStdModule.py (1721 of 2355)
PASS: lldb-api :: functionalities/gdb_remote_client/TestRecognizeBreakpoint.py (1722 of 2355)
PASS: lldb-unit :: Utility/./UtilityTests/ArgsTest.StringListConstructor (1723 of 2355)
PASS: lldb-unit :: Host/./HostTests/PipeTest.OpenAsReader (1724 of 2355)
PASS: lldb-unit :: Expression/./ExpressionTests/DiagnosticManagerTest.FixedExpression (1725 of 2355)
PASS: lldb-unit :: Language/Highlighting/./HighlighterTests/HighlighterTest.ClangSquareBrackets (1726 of 2355)
PASS: lldb-api :: commands/frame/language/TestGuessLanguage.py (1727 of 2355)
PASS: lldb-api :: commands/session/save/TestSessionSave.py (1728 of 2355)
PASS: lldb-unit :: UnwindAssembly/x86/./UnwindAssemblyx86Tests/Testx86AssemblyInspectionEngine.Test64bitFramelessSmallStackFrame (1729 of 2355)
PASS: lldb-unit :: Utility/./UtilityTests/StringListTest.JoinMultiCharSeparator (1730 of 2355)
PASS: lldb-api :: commands/frame/diagnose/dereference-argument/TestDiagnoseDereferenceArgument.py (1731 of 2355)
PASS: lldb-api :: functionalities/breakpoint/breakpoint_options/TestBreakpointOptions.py (1732 of 2355)
PASS: lldb-api :: tools/lldb-server/TestGdbRemoteSingleStep.py (1733 of 2355)
PASS: lldb-api :: functionalities/inferior-changed/TestInferiorChanged.py (1734 of 2355)
PASS: lldb-unit :: Core/./LLDBCoreTests/SourceFileCache.FindSourceFileFound (1735 of 2355)
PASS: lldb-api :: commands/expression/po_verbosity/TestPoVerbosity.py (1736 of 2355)
PASS: lldb-api :: tools/lldb-server/TestGdbRemoteAttachWait.py (1737 of 2355)
PASS: lldb-unit :: Process/minidump/./LLDBMinidumpTests/MinidumpParserTest.FindMemoryRangeWithFullMemoryMinidump (1738 of 2355)
PASS: lldb-shell :: Register/Core/x86-32-freebsd-fp.test (1739 of 2355)
PASS: lldb-unit :: Utility/./UtilityTests/ProcessInfoTest.Constructor (1740 of 2355)
PASS: lldb-api :: lang/c/vla/TestVLA.py (1741 of 2355)
PASS: lldb-api :: macosx/DBGSourcePathRemapping/TestDSYMSourcePathRemapping.py (1742 of 2355)
PASS: lldb-api :: functionalities/thread/concurrent_events/TestConcurrentTwoBreakpointsOneDelaySignal.py (1743 of 2355)
PASS: lldb-shell :: SymbolFile/DWARF/x86/DW_OP_piece-struct.s (1744 of 2355)
UNSUPPORTED: lldb-shell :: SymbolFile/target-symbols-add-unwind.test (1745 of 2355)
PASS: lldb-api :: python_api/sbtype_typeclass/TestSBTypeTypeClass.py (1746 of 2355)
PASS: lldb-unit :: debugserver/./debugserverTests/RNBSocket.LoopBackConnectIPv4 (1747 of 2355)
PASS: lldb-api :: lang/objc/exceptions/TestObjCExceptions.py (1748 of 2355)
PASS: lldb-api :: types/TestShortTypeExpr.py (1749 of 2355)
PASS: lldb-unit :: SymbolFile/DWARF/./SymbolFileDWARFTests/SymbolFileDWARFTests.TestAbbrevNullAttrValidForm (1750 of 2355)
UNSUPPORTED: lldb-shell :: ScriptInterpreter/Lua/watchpoint_callback.test (1751 of 2355)
PASS: lldb-api :: functionalities/target_var/TestTargetVar.py (1752 of 2355)
PASS: lldb-unit :: Process/minidump/./LLDBMinidumpTests/RegisterContextMinidump.ConvertMinidumpContext_x86_64 (1753 of 2355)
PASS: lldb-api :: python_api/value/TestValueAPI.py (1754 of 2355)
UNSUPPORTED: lldb-shell :: SymbolFile/PDB/typedefs.test (1755 of 2355)
PASS: lldb-unit :: Expression/./ExpressionTests/DWARFExpression.DW_OP_unknown (1756 of 2355)
PASS: lldb-api :: tools/lldb-server/TestGdbRemoteExitCode.py (1757 of 2355)
PASS: lldb-unit :: Host/./HostTests/SocketTests/SocketTest.DecodeHostAndPort/ipv4 (1758 of 2355)
PASS: lldb-unit :: Core/./LLDBCoreTests/DumpDataExtractorTest.FormatCharArray (1759 of 2355)
PASS: lldb-shell :: Minidump/memory-region.yaml (1760 of 2355)
PASS: lldb-unit :: SymbolFile/DWARF/./SymbolFileDWARFTests/DWARFUnitTest.MissingSentinel (1761 of 2355)
PASS: lldb-api :: functionalities/gdb_remote_client/TestPartialGPacket.py (1762 of 2355)
PASS: lldb-unit :: tools/lldb-server/tests/./LLDBServerTests/TestBase.LaunchModePreservesEnvironment (1763 of 2355)
PASS: lldb-unit :: UnwindAssembly/x86/./UnwindAssemblyx86Tests/Testx86AssemblyInspectionEngine.TestSpillRegToStackViaMOVi386 (1764 of 2355)
PASS: lldb-unit :: UnwindAssembly/x86/./UnwindAssemblyx86Tests/Testx86AssemblyInspectionEngine.Test32BitOnlyInstruction (1765 of 2355)
PASS: lldb-shell :: Settings/TestEchoCommands.test (1766 of 2355)
PASS: lldb-api :: functionalities/breakpoint/scripted_bkpt/TestScriptedResolver.py (1767 of 2355)
PASS: lldb-unit :: Utility/./UtilityTests/StreamTest.PutHex32ByteOrderBig (1768 of 2355)
PASS: lldb-unit :: SymbolFile/NativePDB/./SymbolFileNativePDBTests/PDBFPOProgramToDWARFExpressionTests.UnresolvedRegisterReference (1769 of 2355)
PASS: lldb-shell :: ObjectFile/ELF/section-addresses.yaml (1770 of 2355)
PASS: lldb-api :: functionalities/lazy-loading/TestLazyLoading.py (1771 of 2355)
PASS: lldb-api :: lang/c/blocks/TestBlocks.py (1772 of 2355)
PASS: lldb-unit :: Core/./LLDBCoreTests/RichManglingContextTest.FromCxxMethodName (1773 of 2355)
PASS: lldb-unit :: Host/./HostTests/FileSystemTest.GetByteSize (1774 of 2355)
PASS: lldb-unit :: Utility/./UtilityTests/UriParserTest.MinimalPath (1775 of 2355)
PASS: lldb-unit :: Symbol/./SymbolTests/DWARFCallFrameInfoTest.Basic_eh (1776 of 2355)
PASS: lldb-api :: commands/expression/import_base_class_when_class_has_derived_member/TestImportBaseClassWhenClassHasDerivedMember.py (1777 of 2355)
UNSUPPORTED: lldb-api :: benchmarks/frame_variable/TestFrameVariableResponse.py (1778 of 2355)
PASS: lldb-unit :: Utility/./UtilityTests/DataExtractorTest.GetFloatUnaligned (1779 of 2355)
UNSUPPORTED: lldb-api :: tools/lldb-server/TestGdbRemoteModuleInfo.py (1780 of 2355)
PASS: lldb-unit :: Process/minidump/./LLDBMinidumpTests/MinidumpParserTest.MinidumpDuplicateModuleMappedSecond (1781 of 2355)
PASS: lldb-shell :: Driver/TestSingleQuote.test (1782 of 2355)
PASS: lldb-unit :: Utility/./UtilityTests/BinaryStreamTest.PutULEB128SevenBytes (1783 of 2355)
PASS: lldb-api :: commands/expression/call-function/TestCallStdStringFunction.py (1784 of 2355)
PASS: lldb-unit :: DataFormatter/./LLDBFormatterTests/TypeMatcherTests.CreatedBySameMatchString (1785 of 2355)
PASS: lldb-api :: functionalities/gdb_remote_client/TestHaltFails.py (1786 of 2355)
XFAIL: lldb-shell :: Expr/nodefaultlib.cpp (1787 of 2355)
PASS: lldb-unit :: Utility/./UtilityTests/StringExtractorTest.GetNameColonValueNoSemicolon (1788 of 2355)
PASS: lldb-unit :: Utility/./UtilityTests/NameMatchesTest.Equals (1789 of 2355)
PASS: lldb-shell :: SymbolFile/DWARF/deterministic-build.cpp (1790 of 2355)
PASS: lldb-unit :: Utility/./UtilityTests/VASprintfTest.NoBufferResize (1791 of 2355)
PASS: lldb-api :: api/multiple-targets/TestMultipleTargets.py (1792 of 2355)
PASS: lldb-shell :: Minidump/breakpad-symbols.test (1793 of 2355)
PASS: lldb-unit :: Utility/./UtilityTests/StringListTest.LongestCommonPrefixDuplicateElement (1794 of 2355)
PASS: lldb-api :: functionalities/thread/step_out/TestThreadStepOut.py (1795 of 2355)
PASS: lldb-unit :: ScriptInterpreter/Python/./ScriptInterpreterPythonTests/PythonDataObjectsTest.TestInstanceNameResolutionNoDot (1796 of 2355)
PASS: lldb-api :: commands/breakpoint/set/func-regex/TestBreakpointRegexError.py (1797 of 2355)
PASS: lldb-api :: python_api/disassemble-raw-data/TestDisassembleRawData.py (1798 of 2355)
PASS: lldb-shell :: Driver/TestTarget.test (1799 of 2355)
PASS: lldb-shell :: Minidump/memory-region-from-module.yaml (1800 of 2355)
PASS: lldb-unit :: Process/Utility/./ProcessUtilityTests/ProcMapTests/LinuxProcMapsTestFixture.ParseMapRegions/2 (1801 of 2355)
PASS: lldb-api :: python_api/function_symbol/TestDisasmAPI.py (1802 of 2355)
PASS: lldb-api :: functionalities/data-formatter/data-formatter-caching/TestDataFormatterCaching.py (1803 of 2355)
PASS: lldb-shell :: Register/Core/x86-64-netbsd-addr.test (1804 of 2355)
PASS: lldb-api :: functionalities/data-formatter/data-formatter-stl/libcxx/queue/TestDataFormatterLibcxxQueue.py (1805 of 2355)
PASS: lldb-api :: python_api/sblaunchinfo/TestSBLaunchInfo.py (1806 of 2355)
PASS: lldb-unit :: ScriptInterpreter/Python/./ScriptInterpreterPythonTests/PythonDataObjectsTest.TestPythonIntegerToStr (1807 of 2355)
PASS: lldb-api :: lang/cpp/breakpoint_in_member_func_w_non_primitive_params/TestBreakpointInMemberFuncWNonPrimitiveParams.py (1808 of 2355)
XFAIL: lldb-shell :: Register/x86-mm-xmm-read.test (1809 of 2355)
PASS: lldb-unit :: Utility/./UtilityTests/LogChannelTest.List (1810 of 2355)
PASS: lldb-unit :: Process/gdb-remote/./ProcessGdbRemoteTests/GDBRemoteClientBaseTest.InterruptNoResponse (1811 of 2355)
PASS: lldb-unit :: Process/./ProcessEventDataTests/ProcessEventDataTest.ShouldStop (1812 of 2355)
PASS: lldb-unit :: Utility/./UtilityTests/ArgsTest.BareSingleQuote (1813 of 2355)
PASS: lldb-api :: lang/cpp/keywords_enabled/TestCppKeywordsEnabled.py (1814 of 2355)
PASS: lldb-api :: lang/objcxx/objc-builtin-types/TestObjCBuiltinTypes.py (1815 of 2355)
PASS: lldb-api :: lang/objc/objc-baseclass-sbtype/TestObjCBaseClassSBType.py (1816 of 2355)
PASS: lldb-shell :: Breakpoint/dummy-target.test (1817 of 2355)
PASS: lldb-unit :: Utility/./UtilityTests/StreamTest.PutBytesAsRawHex8ToLittleEndian (1818 of 2355)
UNSUPPORTED: lldb-api :: commands/gui/breakpoints/TestGuiBreakpoints.py (1819 of 2355)
PASS: lldb-api :: python_api/value_var_update/TestValueVarUpdate.py (1820 of 2355)
PASS: lldb-shell :: Minidump/fb-dump.test (1821 of 2355)
PASS: lldb-shell :: Reproducer/TestReuseDirectory.test (1822 of 2355)
UNSUPPORTED: lldb-shell :: Register/x86-zmm-write.test (1823 of 2355)
PASS: lldb-unit :: Utility/./UtilityTests/StringListTest.JoinThree (1824 of 2355)
PASS: lldb-shell :: Register/x86-multithread-write.test (1825 of 2355)
UNSUPPORTED: lldb-api :: tools/lldb-server/vCont-threads/TestGdbRemote_vContThreads.py (1826 of 2355)
PASS: lldb-api :: tools/lldb-server/commandline/TestStubSetSID.py (1827 of 2355)
PASS: lldb-api :: commands/settings/use_source_cache/TestUseSourceCache.py (1828 of 2355)
PASS: lldb-unit :: ObjectFile/Breakpad/./ObjectFileBreakpadTests/InfoRecord.parse (1829 of 2355)
PASS: lldb-unit :: Utility/./UtilityTests/ScalarTest.Scalar_512 (1830 of 2355)
PASS: lldb-unit :: Utility/./UtilityTests/AnsiTerminal.AtStart (1831 of 2355)
PASS: lldb-unit :: Process/Utility/./ProcessUtilityTests/ProcMapTests/LinuxProcMapsTestFixture.ParseMapRegions/0 (1832 of 2355)
PASS: lldb-api :: lang/cpp/symbols/TestSymbols.py (1833 of 2355)
PASS: lldb-api :: functionalities/data-formatter/data-formatter-synthval/TestDataFormatterSynthVal.py (1834 of 2355)
PASS: lldb-unit :: Host/./HostTests/FileSystemTest.FileAndDirectoryComponents (1835 of 2355)
PASS: lldb-shell :: Reproducer/Functionalities/TestDataFormatter.test (1836 of 2355)
PASS: lldb-unit :: Utility/./UtilityTests/ConstStringTest.format_provider (1837 of 2355)
PASS: lldb-api :: commands/expression/import-std-module/unique_ptr-dbg-info-content/TestUniquePtrDbgInfoContent.py (1838 of 2355)
PASS: lldb-unit :: Process/Utility/./ProcessUtilityTests/ProcSMapTests/LinuxProcSMapsTestFixture.ParseSMapRegions/6 (1839 of 2355)
PASS: lldb-api :: lang/cpp/reference-to-outer-type/TestCppReferenceToOuterClass.py (1840 of 2355)
PASS: lldb-unit :: Utility/./UtilityTests/StringExtractorTest.GetHexU8_Underflow2 (1841 of 2355)
PASS: lldb-api :: functionalities/data-formatter/data-formatter-objc/TestDataFormatterObjCNSContainer.py (1842 of 2355)
PASS: lldb-shell :: Register/x86-64-gp-read.test (1843 of 2355)
PASS: lldb-unit :: Utility/./UtilityTests/RangeTest.LessThanInvalid (1844 of 2355)
PASS: lldb-unit :: SymbolFile/NativePDB/./SymbolFileNativePDBTests/PDBFPOProgramToDWARFExpressionTests.UnknownOp (1845 of 2355)
UNSUPPORTED: lldb-shell :: SymbolFile/NativePDB/ast-functions-msvc.cpp (1846 of 2355)
PASS: lldb-api :: functionalities/thread/state_after_expression/TestStateAfterExpression.py (1847 of 2355)
PASS: lldb-api :: commands/expression/radar_9673664/TestExprHelpExamples.py (1848 of 2355)
PASS: lldb-unit :: Language/Highlighting/./HighlighterTests/HighlighterTest.ClangCursorPosBeforeOtherToken (1849 of 2355)
PASS: lldb-api :: commands/frame/diagnose/dereference-this/TestDiagnoseDereferenceThis.py (1850 of 2355)
PASS: lldb-unit :: SymbolFile/DWARF/./SymbolFileDWARFTests/SymbolFileDWARFTests.ParseAranges (1851 of 2355)
PASS: lldb-api :: lang/objcxx/objcxx-ivar-vector/TestIvarVector.py (1852 of 2355)
PASS: lldb-shell :: Settings/TestFrameFormatMangling.test (1853 of 2355)
PASS: lldb-shell :: ObjectFile/ELF/PT_LOAD-overlap-section.yaml (1854 of 2355)
PASS: lldb-api :: lang/c/stepping/TestThreadStepInAvoidRegexp.py (1855 of 2355)
PASS: lldb-unit :: Host/./HostTests/MainLoopTest.TerminatesImmediately (1856 of 2355)
PASS: lldb-api :: python_api/sbplatform/TestSBPlatform.py (1857 of 2355)
PASS: lldb-unit :: Process/Utility/./ProcessUtilityTests/ProcSMapTests/LinuxProcSMapsTestFixture.ParseSMapRegions/1 (1858 of 2355)
PASS: lldb-api :: commands/expression/import-std-module/deque-dbg-info-content/TestDbgInfoContentDequeFromStdModule.py (1859 of 2355)
PASS: lldb-shell :: Unwind/thread-step-out-ret-addr-check.test (1860 of 2355)
PASS: lldb-api :: functionalities/data-formatter/array_typedef/TestArrayTypedef.py (1861 of 2355)
PASS: lldb-unit :: Utility/./UtilityTests/BinaryStreamTest.PutSLEB128OneByte (1862 of 2355)
PASS: lldb-api :: lang/c/record_decl_in_expr/TestRecordDeclInExpr.py (1863 of 2355)
PASS: lldb-unit :: Utility/./UtilityTests/ScalarTest.Division (1864 of 2355)
PASS: lldb-unit :: Utility/./UtilityTests/UUIDTest.RelationalOperators (1865 of 2355)
PASS: lldb-shell :: ObjectFile/Breakpad/breakpad-identification.test (1866 of 2355)
UNSUPPORTED: lldb-shell :: ExecControl/StopHook/stop-hook-threads.test (1867 of 2355)
PASS: lldb-api :: python_api/process/read-mem-cstring/TestReadMemCString.py (1868 of 2355)
PASS: lldb-unit :: Utility/./UtilityTests/FileSpecTest.GuessPathStyle (1869 of 2355)
PASS: lldb-shell :: ObjectFile/wasm/stripped-debug-sections.yaml (1870 of 2355)
PASS: lldb-api :: lang/objc/foundation/TestObjCMethodsNSError.py (1871 of 2355)
PASS: lldb-api :: types/TestFloatTypes.py (1872 of 2355)
PASS: lldb-api :: python_api/lldbutil/frame/TestFrameUtils.py (1873 of 2355)
PASS: lldb-unit :: UnwindAssembly/x86/./UnwindAssemblyx86Tests/Testx86AssemblyInspectionEngine.TestPopEBP (1874 of 2355)
PASS: lldb-api :: functionalities/gdb_remote_client/TestGDBRemoteDiskFileCompletion.py (1875 of 2355)
PASS: lldb-shell :: Reproducer/Functionalities/TestExpressionEvaluation.test (1876 of 2355)
PASS: lldb-unit :: Utility/./UtilityTests/StringExtractorTest.GetHexU8_Extra (1877 of 2355)
PASS: lldb-shell :: ScriptInterpreter/Python/scripted_breakpoint_lua.test (1878 of 2355)
PASS: lldb-api :: functionalities/thread/concurrent_events/TestConcurrentCrashWithBreak.py (1879 of 2355)
PASS: lldb-api :: functionalities/breakpoint/step_over_breakpoint/TestStepOverBreakpoint.py (1880 of 2355)
XFAIL: lldb-shell :: Register/x86-mm-xmm-write.test (1881 of 2355)
UNSUPPORTED: lldb-shell :: Watchpoint/netbsd-nouserdbregs.test (1882 of 2355)
PASS: lldb-unit :: Utility/./UtilityTests/CompletionRequest.TestCompletionOwnership (1883 of 2355)
PASS: lldb-unit :: Utility/./UtilityTests/ArchSpecTest.TestParseMachCPUDashSubtypeTripleExtra (1884 of 2355)
PASS: lldb-unit :: Utility/./UtilityTests/ArchSpecTest.TripleComponentsWereSpecified (1885 of 2355)
UNSUPPORTED: lldb-api :: arm/breakpoint-it/TestBreakpointIt.py (1886 of 2355)
PASS: lldb-unit :: Symbol/./SymbolTests/TestTypeSystemClang.TestConvertAccessTypeToAccessSpecifier (1887 of 2355)
PASS: lldb-api :: commands/expression/import-std-module/forward_list/TestForwardListFromStdModule.py (1888 of 2355)
PASS: lldb-unit :: Utility/./UtilityTests/RangeTest.ClearWithStarAddress (1889 of 2355)
PASS: lldb-api :: lang/cpp/static_member_type_depending_on_parent_size/TestStaticMemberTypeDependingOnParentSize.py (1890 of 2355)
PASS: lldb-api :: functionalities/testid/TestTestId.py (1891 of 2355)
PASS: lldb-unit :: Utility/./UtilityTests/ArgsTest.GetQuotedCommandString (1892 of 2355)
UNSUPPORTED: lldb-shell :: ScriptInterpreter/Lua/breakpoint_callback.test (1893 of 2355)
UNSUPPORTED: lldb-api :: functionalities/unwind/ehframe/TestEhFrameUnwind.py (1894 of 2355)
PASS: lldb-unit :: Target/./TargetTests/ModuleCacheTest.GetAndPutUuidExists (1895 of 2355)
PASS: lldb-unit :: Target/./TargetTests/ExecutionContextTest.GetByteOrderProcess (1896 of 2355)
PASS: lldb-unit :: Utility/./UtilityTests/SerializationRountripTest.SerializeDeserializePod (1897 of 2355)
PASS: lldb-api :: functionalities/gdb_remote_client/TestMultiprocess.py (1898 of 2355)
PASS: lldb-unit :: SymbolFile/NativePDB/./SymbolFileNativePDBTests/PDBFPOProgramToDWARFExpressionTests.InvalidAssignmentSingle (1899 of 2355)
PASS: lldb-api :: macosx/macCatalyst/TestMacCatalyst.py (1900 of 2355)
PASS: lldb-api :: functionalities/data-formatter/data-formatter-stl/libcxx/shared_ptr/TestDataFormatterLibcxxSharedPtr.py (1901 of 2355)
UNSUPPORTED: lldb-api :: commands/expression/multiline-completion/TestMultilineCompletion.py (1902 of 2355)
PASS: lldb-unit :: Process/Utility/./ProcessUtilityTests/ProcMapTests/LinuxProcMapsTestFixture.ParseMapRegions/6 (1903 of 2355)
PASS: lldb-unit :: Process/gdb-remote/./ProcessGdbRemoteTests/GDBRemoteCommunicationClientTest.GetModulesInfoInvalidResponse (1904 of 2355)
PASS: lldb-shell :: SymbolFile/DWARF/x86/dwp.s (1905 of 2355)
PASS: lldb-unit :: Host/./HostTests/SocketTests/SocketTest.UDPConnect/ipv6 (1906 of 2355)
PASS: lldb-api :: python_api/default-constructor/TestDefaultConstructorForAPIObjects.py (1907 of 2355)
PASS: lldb-unit :: ScriptInterpreter/Python/./ScriptInterpreterPythonTests/PythonDataObjectsTest.TestModuleNameResolutionNoDot (1908 of 2355)
PASS: lldb-api :: commands/expression/import-std-module/no-std-module/TestMissingStdModule.py (1909 of 2355)
PASS: lldb-unit :: ObjectFile/Breakpad/./ObjectFileBreakpadTests/ModuleRecord.parse (1910 of 2355)
PASS: lldb-api :: lang/cpp/call-function/TestCallCPPFunction.py (1911 of 2355)
PASS: lldb-shell :: Driver/TestHelp.test (1912 of 2355)
PASS: lldb-api :: tools/lldb-server/TestGdbRemote_vCont.py (1913 of 2355)
PASS: lldb-unit :: Language/CLanguages/./LanguageCLanguagesTests/CLanguages.LookupCLanguagesByLanguageType (1914 of 2355)
PASS: lldb-api :: functionalities/mtc/simple/TestMTCSimple.py (1915 of 2355)
PASS: lldb-api :: functionalities/data-formatter/data-formatter-skip-summary/TestDataFormatterSkipSummary.py (1916 of 2355)
PASS: lldb-unit :: Core/./LLDBCoreTests/RichManglingContextTest.Basic (1917 of 2355)
PASS: lldb-unit :: Utility/./UtilityTests/StreamTest.PutHex64ByteOrderBig (1918 of 2355)
PASS: lldb-unit :: Utility/./UtilityTests/StringExtractorTest.GetHexU8_InvalidHex (1919 of 2355)
PASS: lldb-api :: commands/expression/import-std-module/empty-module/TestEmptyStdModule.py (1920 of 2355)
PASS: lldb-api :: functionalities/data-formatter/nsarraysynth/TestNSArraySynthetic.py (1921 of 2355)
PASS: lldb-api :: types/TestFloatTypesExpr.py (1922 of 2355)
PASS: lldb-unit :: Symbol/./SymbolTests/TestClangASTImporter.MetadataPropagationIndirectImport (1923 of 2355)
PASS: lldb-api :: functionalities/inferior-crashing/TestInferiorCrashing.py (1924 of 2355)
PASS: lldb-shell :: Commands/command-backtrace-parser-1.test (1925 of 2355)
PASS: lldb-shell :: Breakpoint/debug_addrx.test (1926 of 2355)
PASS: lldb-unit :: Utility/./UtilityTests/UriParserTest.SchemeHostSeparator3 (1927 of 2355)
UNSUPPORTED: lldb-api :: android/platform/TestDefaultCacheLineSize.py (1928 of 2355)
PASS: lldb-api :: functionalities/breakpoint/breakpoint_locations/TestBreakpointLocations.py (1929 of 2355)
PASS: lldb-api :: lang/objc/blocks/TestObjCIvarsInBlocks.py (1930 of 2355)
UNSUPPORTED: lldb-shell :: Register/x86-ymm-read.test (1931 of 2355)
PASS: lldb-unit :: Symbol/./SymbolTests/TestTypeSystemClang.TestGetEnumIntegerTypeUnexpectedType (1932 of 2355)
PASS: lldb-unit :: Expression/./ExpressionTests/CppModuleConfigurationTest.AmbiguousCLib (1933 of 2355)
PASS: lldb-api :: functionalities/data-formatter/data-formatter-proper-plurals/TestFormattersOneIsSingular.py (1934 of 2355)
PASS: lldb-unit :: Utility/./UtilityTests/ScalarTest.Equality (1935 of 2355)
PASS: lldb-api :: functionalities/tail_call_frames/cross_object/TestCrossObjectTailCalls.py (1936 of 2355)
PASS: lldb-api :: functionalities/thread/concurrent_events/TestConcurrentTwoBreakpointThreads.py (1937 of 2355)
PASS: lldb-api :: lang/cpp/offsetof/TestOffsetofCpp.py (1938 of 2355)
PASS: lldb-api :: commands/command/script/TestCommandScript.py (1939 of 2355)
PASS: lldb-shell :: Commands/command-regex-unalias.test (1940 of 2355)
PASS: lldb-shell :: SymbolFile/DWARF/x86/dir-separator-no-comp-dir-relative-name.s (1941 of 2355)
PASS: lldb-unit :: Host/./HostTests/SocketTests/SocketTest.DomainGetConnectURI/ipv6 (1942 of 2355)
PASS: lldb-unit :: UnwindAssembly/x86/./UnwindAssemblyx86Tests/Testx86AssemblyInspectionEngine.Test64bitFramelessBigStackFrame (1943 of 2355)
UNSUPPORTED: lldb-shell :: SymbolFile/PDB/compilands.test (1944 of 2355)
PASS: lldb-api :: functionalities/tail_call_frames/unambiguous_sequence/TestUnambiguousTailCalls.py (1945 of 2355)
PASS: lldb-unit :: Utility/./UtilityTests/BinaryStreamTest.PutSLEB128SevenBytes (1946 of 2355)
PASS: lldb-api :: tools/lldb-server/TestGdbRemoteProcessInfo.py (1947 of 2355)
PASS: lldb-unit :: Target/./TargetTests/PathMappingListTest.RemapRoot (1948 of 2355)
PASS: lldb-unit :: Symbol/./SymbolTests/TestTypeSystemClang.TestOwningModule (1949 of 2355)
PASS: lldb-api :: commands/expression/namespace_local_var_same_name_obj_c/TestNamespaceLocalVarSameNameObjC.py (1950 of 2355)
PASS: lldb-unit :: Signals/./SignalsTests/UnixSignalsTest.VersionChange (1951 of 2355)
PASS: lldb-unit :: Host/./HostTests/FileSystemTest.Exists (1952 of 2355)
PASS: lldb-shell :: ScriptInterpreter/Python/fail_breakpoint_oneline.test (1953 of 2355)
PASS: lldb-api :: functionalities/data-formatter/data-formatter-stl/libcxx/unique_ptr/TestDataFormatterLibcxxUniquePtr.py (1954 of 2355)
PASS: lldb-unit :: Utility/./UtilityTests/CompletionRequest.TryCompleteCurrentArgGood (1955 of 2355)
UNSUPPORTED: lldb-api :: functionalities/gdb_remote_client/TestQemuAArch64TargetXml.py (1956 of 2355)
PASS: lldb-unit :: ScriptInterpreter/Python/./ScriptInterpreterPythonTests/PythonDataObjectsTest.TestPythonListValueEquality (1957 of 2355)
PASS: lldb-unit :: DataFormatter/./LLDBFormatterTests/TypeMatcherTests.RegexName (1958 of 2355)
PASS: lldb-shell :: SymbolFile/DWARF/x86/childless-compile-unit.s (1959 of 2355)
UNSUPPORTED: lldb-api :: functionalities/darwin_log/filter/regex/message/TestDarwinLogFilterRegexMessage.py (1960 of 2355)
PASS: lldb-unit :: Utility/./UtilityTests/UserIDResolver.GetGroupName (1961 of 2355)
PASS: lldb-api :: lang/cpp/stl/TestSTL.py (1962 of 2355)
PASS: lldb-unit :: DataFormatter/./LLDBFormatterTests/TypeMatcherTests.RegexMatchPart (1963 of 2355)
PASS: lldb-api :: functionalities/tail_call_frames/inlining_and_tail_calls/TestInliningAndTailCalls.py (1964 of 2355)
UNSUPPORTED: lldb-api :: tools/intel-features/intel-pt/test/TestIntelPTSimpleBinary.py (1965 of 2355)
PASS: lldb-api :: functionalities/tail_call_frames/sbapi_support/TestTailCallFrameSBAPI.py (1966 of 2355)
PASS: lldb-api :: lang/c/forward/TestForwardDeclaration.py (1967 of 2355)
PASS: lldb-api :: lang/objc/warnings-in-expr-parser/TestObjCWarningsInExprParser.py (1968 of 2355)
PASS: lldb-unit :: Expression/./ExpressionTests/DiagnosticManagerTest.GetStringNoDiags (1969 of 2355)
PASS: lldb-shell :: SymbolFile/DWARF/x86/subprogram_ranges.test (1970 of 2355)
PASS: lldb-unit :: Utility/./UtilityTests/StringListTest.ForRangeEmpty (1971 of 2355)
PASS: lldb-unit :: Utility/./UtilityTests/FileSpecTest.CopyByAppendingPathComponent (1972 of 2355)
PASS: lldb-api :: functionalities/breakpoint/inlined_breakpoints/TestInlinedBreakpoints.py (1973 of 2355)
PASS: lldb-api :: tools/lldb-vscode/attach/TestVSCode_attach.py (1974 of 2355)
PASS: lldb-unit :: Utility/./UtilityTests/DataExtractorTest.GetMaxU64_unchecked (1975 of 2355)
PASS: lldb-unit :: Utility/./UtilityTests/ScalarTest.GetBytes (1976 of 2355)
PASS: lldb-api :: functionalities/breakpoint/breakpoint_command/TestRegexpBreakCommand.py (1977 of 2355)
PASS: lldb-unit :: Utility/./UtilityTests/OptionsWithRawTest.TerminatedQuote (1978 of 2355)
PASS: lldb-unit :: ScriptInterpreter/Python/./ScriptInterpreterPythonTests/PythonDataObjectsTest.TestPythonInteger (1979 of 2355)
PASS: lldb-shell :: SymbolFile/Breakpad/line-table-discontinuous-file-ids.test (1980 of 2355)
PASS: lldb-unit :: Process/gdb-remote/./ProcessGdbRemoteTests/GDBRemoteCommunicationServerTest.SendErrorResponse_StringError (1981 of 2355)
PASS: lldb-shell :: Settings/TestSettingsSet.test (1982 of 2355)
UNSUPPORTED: lldb-shell :: ScriptInterpreter/Lua/lua-python.test (1983 of 2355)
PASS: lldb-unit :: UnwindAssembly/x86/./UnwindAssemblyx86Tests/Testx86AssemblyInspectionEngine.TestPushRBX (1984 of 2355)
PASS: lldb-unit :: Expression/./ExpressionTests/DWARFExpression.DW_OP_stack_value (1985 of 2355)
PASS: lldb-api :: macosx/add-dsym/TestAddDsymMidExecutionCommand.py (1986 of 2355)
PASS: lldb-unit :: Utility/./UtilityTests/TimerTest.CategoryTimesStats (1987 of 2355)
PASS: lldb-unit :: Process/minidump/./LLDBMinidumpTests/MinidumpParserTest.GetArchitecture (1988 of 2355)
PASS: lldb-shell :: Commands/command-regex-delete.test (1989 of 2355)
PASS: lldb-api :: python_api/interpreter/TestCommandInterpreterAPI.py (1990 of 2355)
UNSUPPORTED: lldb-api :: functionalities/ubsan/basic/TestUbsanBasic.py (1991 of 2355)
PASS: lldb-api :: tools/lldb-server/TestGdbRemoteExpeditedRegisters.py (1992 of 2355)
PASS: lldb-api :: tools/lldb-server/register-reading/TestGdbRemoteGPacket.py (1993 of 2355)
PASS: lldb-shell :: SymbolFile/NativePDB/s_constant.cpp (1994 of 2355)
PASS: lldb-unit :: Utility/./UtilityTests/StringListTest.SetSize (1995 of 2355)
PASS: lldb-unit :: Utility/./UtilityTests/ConstStringTest.CompareStringRef (1996 of 2355)
PASS: lldb-unit :: Utility/./UtilityTests/StringLexerTest.PutBack (1997 of 2355)
PASS: lldb-unit :: Utility/./UtilityTests/PassiveReplayTest.InstrumentedFooInvalid (1998 of 2355)
PASS: lldb-api :: functionalities/postmortem/wow64_minidump/TestWow64MiniDump.py (1999 of 2355)
PASS: lldb-unit :: Process/minidump/./LLDBMinidumpTests/MinidumpParserTest.InvalidMinidump (2000 of 2355)
PASS: lldb-shell :: SymbolFile/DWARF/x86/debug_rnglists-dwo.s (2001 of 2355)
PASS: lldb-api :: functionalities/tail_call_frames/thread_step_out_or_return/TestSteppingOutWithArtificialFrames.py (2002 of 2355)
PASS: lldb-shell :: Settings/TestDefaultModuleCachePath.test (2003 of 2355)
PASS: lldb-api :: lang/cpp/scope/TestCppScope.py (2004 of 2355)
UNSUPPORTED: lldb-api :: tools/lldb-vscode/disconnect/TestVSCode_disconnect.py (2005 of 2355)
PASS: lldb-shell :: SymbolFile/DWARF/x86/debug-names-compressed.cpp (2006 of 2355)
PASS: lldb-unit :: Expression/./ExpressionTests/DWARFExpression.DW_OP_pick (2007 of 2355)
PASS: lldb-unit :: Symbol/./SymbolTests/TestTypeSystemClang.TestNotDeletingUserCopyCstrDueToMoveCStr (2008 of 2355)
PASS: lldb-unit :: Language/CPlusPlus/./LanguageCPlusPlusTests/CPlusPlusLanguage.MethodNameParsing (2009 of 2355)
PASS: lldb-shell :: SymbolFile/NativePDB/load-pdb.cpp (2010 of 2355)
UNSUPPORTED: lldb-shell :: ScriptInterpreter/Lua/bindings.test (2011 of 2355)
PASS: lldb-api :: tools/lldb-server/TestGdbRemoteRegisterState.py (2012 of 2355)
UNSUPPORTED: lldb-api :: linux/mix-dwo-and-regular-objects/TestMixedDwarfBinary.py (2013 of 2355)
PASS: lldb-shell :: Watchpoint/SetErrorCases.test (2014 of 2355)
PASS: lldb-unit :: Core/./LLDBCoreTests/SourceFileCache.FindSourceFileNotFound (2015 of 2355)
PASS: lldb-api :: lang/cpp/namespace_definitions/TestNamespaceDefinitions.py (2016 of 2355)
PASS: lldb-unit :: Utility/./UtilityTests/ArgsTest.ReplaceArgumentAtIndexFarOutOfRange (2017 of 2355)
PASS: lldb-shell :: Host/TestCustomShell.test (2018 of 2355)
PASS: lldb-api :: commands/expression/import-std-module/non-module-type-separation/TestNonModuleTypeSeparation.py (2019 of 2355)
PASS: lldb-unit :: Process/Utility/./ProcessUtilityTests/ProcMapTests/LinuxProcMapsTestFixture.ParseMapRegions/8 (2020 of 2355)
PASS: lldb-shell :: ObjectFile/PECOFF/export-dllfunc.yaml (2021 of 2355)
PASS: lldb-api :: lang/cpp/nested-class-other-compilation-unit/TestNestedClassWithParentInAnotherCU.py (2022 of 2355)
PASS: lldb-api :: lang/objcxx/hide-runtime-values/TestObjCXXHideRuntimeValues.py (2023 of 2355)
PASS: lldb-shell :: SymbolFile/DWARF/x86/debug_ranges_and_rnglists.test (2024 of 2355)
PASS: lldb-api :: commands/expression/import-std-module/deque-basic/TestDequeFromStdModule.py (2025 of 2355)
UNSUPPORTED: lldb-shell :: SymbolFile/PDB/type-quals.test (2026 of 2355)
PASS: lldb-api :: commands/process/attach/attach_denied/TestAttachDenied.py (2027 of 2355)
PASS: lldb-shell :: ObjectFile/ELF/netbsd-core-amd64.test (2028 of 2355)
UNSUPPORTED: lldb-shell :: ScriptInterpreter/Lua/breakpoint_oneline_callback.test (2029 of 2355)
PASS: lldb-unit :: Interpreter/./InterpreterTests/CompletionTest.DirCompletionUsername (2030 of 2355)
PASS: lldb-unit :: Utility/./UtilityTests/BinaryStreamTest.PutULEB128One (2031 of 2355)
PASS: lldb-unit :: Symbol/./SymbolTests/TestTypeSystemClang.GetExeModuleWhenMissingSymbolFile (2032 of 2355)
PASS: lldb-unit :: Symbol/./SymbolTests/TestCreateClassTemplateDecl.FindExistingTemplatesWithParameterPack (2033 of 2355)
PASS: lldb-api :: lang/objc/modules-compile-error/TestModulesCompileError.py (2034 of 2355)
PASS: lldb-shell :: Unwind/eh-frame-dwarf-unwind.test (2035 of 2355)
PASS: lldb-unit :: Utility/./UtilityTests/StringExtractorTest.GetHexBytes_Underflow (2036 of 2355)
XFAIL: lldb-shell :: Unwind/prefer-debug-over-eh-frame.test (2037 of 2355)
PASS: lldb-shell :: SymbolFile/DWARF/DW_AT_range-DW_FORM_sec_offset.s (2038 of 2355)
UNSUPPORTED: lldb-api :: functionalities/ubsan/user-expression/TestUbsanUserExpression.py (2039 of 2355)
PASS: lldb-unit :: Utility/./UtilityTests/StringExtractorTest.GetHexBytesAvail (2040 of 2355)
PASS: lldb-unit :: Utility/./UtilityTests/RangeDataVector.FindEntryIndexesThatContain (2041 of 2355)
PASS: lldb-unit :: Utility/./UtilityTests/XcodeSDKTest.MergeTest (2042 of 2355)
PASS: lldb-unit :: ObjectFile/Breakpad/./ObjectFileBreakpadTests/FuncRecord.parse (2043 of 2355)
PASS: lldb-shell :: Reproducer/TestProcessList.test (2044 of 2355)
PASS: lldb-unit :: ScriptInterpreter/Python/./ScriptInterpreterPythonTests/PythonDataObjectsTest.TestPythonListManipulation (2045 of 2355)
PASS: lldb-unit :: Utility/./UtilityTests/CompletionRequest.DuplicateFilteringWithComments (2046 of 2355)
PASS: lldb-api :: functionalities/breakpoint/cpp/TestCPPBreakpointLocations.py (2047 of 2355)
PASS: lldb-api :: lang/objc/ivar-IMP/TestObjCiVarIMP.py (2048 of 2355)
PASS: lldb-unit :: Utility/./UtilityTests/StreamTest.PutMaxHex64ByteOrderLittle (2049 of 2355)
UNSUPPORTED: lldb-shell :: BuildScript/toolchain-msvc.test (2050 of 2355)
PASS: lldb-shell :: Register/Core/x86-32-linux-addr.test (2051 of 2355)
PASS: lldb-unit :: Language/Highlighting/./HighlighterTests/HighlighterTest.ClangCursorOutOfBounds (2052 of 2355)
PASS: lldb-unit :: Core/./LLDBCoreTests/DumpDataExtractorTest.BaseAddress (2053 of 2355)
PASS: lldb-api :: commands/expression/import-std-module/weak_ptr/TestWeakPtrFromStdModule.py (2054 of 2355)
PASS: lldb-shell :: SymbolFile/DWARF/x86/DW_AT_const_value-bitfields.s (2055 of 2355)
PASS: lldb-unit :: Signals/./SignalsTests/UnixSignalsTest.Iteration (2056 of 2355)
UNSUPPORTED: lldb-api :: functionalities/ptr_refs/TestPtrRefs.py (2057 of 2355)
PASS: lldb-unit :: Core/./LLDBCoreTests/MangledTest.EmptyForInvalidName (2058 of 2355)
PASS: lldb-api :: python_api/debugger/TestDebuggerAPI.py (2059 of 2355)
PASS: lldb-shell :: Driver/LocalLLDBInit.test (2060 of 2355)
PASS: lldb-unit :: Utility/./UtilityTests/StreamTeeTest.DefaultConstructor (2061 of 2355)
UNSUPPORTED: lldb-api :: lang/objc/ptr_refs/TestPtrRefsObjC.py (2062 of 2355)
PASS: lldb-api :: commands/command/script/import/TestImport.py (2063 of 2355)
PASS: lldb-api :: functionalities/signal/raise/TestRaise.py (2064 of 2355)
PASS: lldb-unit :: Core/./LLDBCoreTests/RichManglingContextTest.IPDRealloc (2065 of 2355)
PASS: lldb-unit :: Host/./HostTests/FileActionTest.Open (2066 of 2355)
UNSUPPORTED: lldb-api :: tools/lldb-server/TestGdbRemoteCompletion.py (2067 of 2355)
PASS: lldb-unit :: ScriptInterpreter/Python/./ScriptInterpreterPythonTests/PythonDataObjectsTest.TestPythonString (2068 of 2355)
UNSUPPORTED: lldb-shell :: SymbolFile/NativePDB/local-variables.cpp (2069 of 2355)
PASS: lldb-shell :: SymbolFile/DWARF/x86/DW_AT_low_pc-addrx.s (2070 of 2355)
PASS: lldb-unit :: Platform/./LLDBPlatformTests/PlatformAppleSimulatorTest.TestHostPlatformToSim (2071 of 2355)
PASS: lldb-unit :: Utility/./UtilityTests/FileSpecTest.AppendPathComponent (2072 of 2355)
PASS: lldb-unit :: SymbolFile/DWARF/./SymbolFileDWARFTests/SymbolFileDWARFTests.TestAbilitiesForDWARF (2073 of 2355)
PASS: lldb-api :: lang/cpp/chained-calls/TestCppChainedCalls.py (2074 of 2355)
PASS: lldb-unit :: Language/Highlighting/./HighlighterTests/HighlighterTest.ClangComments (2075 of 2355)
PASS: lldb-unit :: Utility/./UtilityTests/DataExtractorTest.PeekData (2076 of 2355)
PASS: lldb-api :: functionalities/data-formatter/refpointer-recursion/TestDataFormatterRefPtrRecursion.py (2077 of 2355)
UNSUPPORTED: lldb-shell :: ScriptInterpreter/Lua/command_script_import.test (2078 of 2355)
PASS: lldb-shell :: SymbolFile/DWARF/x86/dwarf5-implicit-const.s (2079 of 2355)
PASS: lldb-unit :: Process/gdb-remote/./ProcessGdbRemoteTests/GDBRemoteClientBaseTest.SendContinueAndAsyncSignal (2080 of 2355)
PASS: lldb-unit :: Utility/./UtilityTests/ArchSpecTest.OperatorBool (2081 of 2355)
PASS: lldb-unit :: Language/Highlighting/./HighlighterTests/HighlighterTest.ClangTrailingBackslashMissingNewLine (2082 of 2355)
PASS: lldb-api :: arm/emulation/TestEmulations.py (2083 of 2355)
PASS: lldb-shell :: Minidump/Windows/broken-unwind.test (2084 of 2355)
PASS: lldb-api :: lang/cpp/thread_local/TestThreadLocal.py (2085 of 2355)
PASS: lldb-shell :: ScriptInterpreter/Python/Crashlog/text.test (2086 of 2355)
UNSUPPORTED: lldb-api :: lang/objc/rdar-12408181/TestRdar12408181.py (2087 of 2355)
PASS: lldb-api :: python_api/name_lookup/TestNameLookup.py (2088 of 2355)
PASS: lldb-unit :: Utility/./UtilityTests/ScalarTest.Promotion (2089 of 2355)
UNSUPPORTED: lldb-shell :: Breakpoint/case-insensitive.test (2090 of 2355)
PASS: lldb-api :: tools/lldb-vscode/stackTrace/TestVSCode_stackTrace.py (2091 of 2355)
UNSUPPORTED: lldb-api :: linux/thread/create_during_instruction_step/TestCreateDuringInstructionStep.py (2092 of 2355)
PASS: lldb-unit :: Utility/./UtilityTests/RangeDataVector.FindEntryIndexesThatContain_Overlap (2093 of 2355)
PASS: lldb-unit :: Process/minidump/./LLDBMinidumpTests/MinidumpParserTest.GetLinuxProcStatus (2094 of 2355)
PASS: lldb-unit :: Utility/./UtilityTests/IndexToObjectTest.ObjectForIndex (2095 of 2355)
PASS: lldb-unit :: Utility/./UtilityTests/SerializationRountripTest.SerializeDeserializeCStringArrayNullptrElem (2096 of 2355)
PASS: lldb-unit :: API/./APITests/SBCommandInterpreterTest.MultiWordCommand (2097 of 2355)
PASS: lldb-unit :: Utility/./UtilityTests/AnsiTerminal.KnownPrefix (2098 of 2355)
PASS: lldb-shell :: SymbolFile/NativePDB/globals-bss.cpp (2099 of 2355)
PASS: lldb-api :: commands/settings/TestSettings.py (2100 of 2355)
PASS: lldb-unit :: Process/Utility/./ProcessUtilityTests/ProcSMapTests/LinuxProcSMapsTestFixture.ParseSMapRegions/2 (2101 of 2355)
UNSUPPORTED: lldb-api :: functionalities/thread/state/TestThreadStates.py (2102 of 2355)
PASS: lldb-api :: macosx/safe-to-func-call/TestSafeFuncCalls.py (2103 of 2355)
PASS: lldb-api :: functionalities/inferior-crashing/recursive-inferior/TestRecursiveInferior.py (2104 of 2355)
PASS: lldb-api :: functionalities/gdb_remote_client/TestNestedRegDefinitions.py (2105 of 2355)
PASS: lldb-api :: lang/c/global_variables/TestGlobalVariables.py (2106 of 2355)
UNSUPPORTED: lldb-api :: functionalities/data-formatter/data-formatter-stl/libstdcpp/map/TestDataFormatterStdMap.py (2107 of 2355)
UNSUPPORTED: lldb-shell :: ScriptInterpreter/Lua/fail_breakpoint_oneline.test (2108 of 2355)
PASS: lldb-unit :: Utility/./UtilityTests/BinaryStreamTest.PutULEB128SixBytes (2109 of 2355)
PASS: lldb-api :: commands/expression/expr-in-syscall/TestExpressionInSyscall.py (2110 of 2355)
PASS: lldb-unit :: Process/minidump/./LLDBMinidumpTests/RegisterContextMinidump.ConvertMinidumpContext_x86_32 (2111 of 2355)
PASS: lldb-api :: functionalities/jitloader_gdb/TestJITLoaderGDB.py (2112 of 2355)
PASS: lldb-shell :: ObjectFile/PECOFF/basic-info-arm.yaml (2113 of 2355)
PASS: lldb-api :: lang/cpp/template-arguments/TestCppTemplateArguments.py (2114 of 2355)
PASS: lldb-api :: commands/expression/import-std-module/conflicts/TestStdModuleWithConflicts.py (2115 of 2355)
PASS: lldb-unit :: Utility/./UtilityTests/TimeoutTest.Construction (2116 of 2355)
PASS: lldb-api :: tools/lldb-server/inferior-crash/TestGdbRemoteSegFault.py (2117 of 2355)
PASS: lldb-unit :: Core/./LLDBCoreTests/UniqueCStringMap.NoDefaultConstructor (2118 of 2355)
PASS: lldb-unit :: Utility/./UtilityTests/Flags.Reset (2119 of 2355)
PASS: lldb-unit :: Utility/./UtilityTests/StringExtractorTest.GetHexU8_Underflow2_NoEof (2120 of 2355)
PASS: lldb-unit :: Utility/./UtilityTests/StreamTeeTest.Constructor1Stream (2121 of 2355)
PASS: lldb-api :: tools/lldb-vscode/console/TestVSCode_redirection_to_console.py (2122 of 2355)
PASS: lldb-unit :: Utility/./UtilityTests/FileSpecTest.GetPath (2123 of 2355)
PASS: lldb-unit :: UnwindAssembly/x86/./UnwindAssemblyx86Tests/Testx86AssemblyInspectionEngine.Test32bitFramelessSmallStackFrame (2124 of 2355)
PASS: lldb-api :: python_api/process/io/TestProcessIO.py (2125 of 2355)
PASS: lldb-unit :: Utility/./UtilityTests/StringListTest.ShiftStdString (2126 of 2355)
PASS: lldb-api :: functionalities/memory-region/TestMemoryRegion.py (2127 of 2355)
UNSUPPORTED: lldb-api :: functionalities/asan/TestMemoryHistory.py (2128 of 2355)
PASS: lldb-api :: functionalities/breakpoint/breakpoint_names/TestBreakpointNames.py (2129 of 2355)
UNSUPPORTED: lldb-api :: iohandler/completion/TestIOHandlerCompletion.py (2130 of 2355)
PASS: lldb-shell :: Register/Core/x86-32-freebsd-gp.test (2131 of 2355)
PASS: lldb-unit :: UnwindAssembly/x86/./UnwindAssemblyx86Tests/Testx86AssemblyInspectionEngine.TestPopEDI (2132 of 2355)
PASS: lldb-api :: commands/expression/call-throws/TestCallThatThrows.py (2133 of 2355)
PASS: lldb-api :: lang/objc/objc-class-method/TestObjCClassMethod.py (2134 of 2355)
PASS: lldb-api :: commands/target/stop-hook/disable/TestTargetStopHookDisable.py (2135 of 2355)
PASS: lldb-api :: types/TestDoubleTypesExpr.py (2136 of 2355)
PASS: lldb-api :: lang/c/register_variables/TestRegisterVariables.py (2137 of 2355)
PASS: lldb-api :: python_api/sberror/TestSBError.py (2138 of 2355)
PASS: lldb-unit :: Utility/./UtilityTests/FileSpecTest.FormatFileSpec (2139 of 2355)
PASS: lldb-unit :: Utility/./UtilityTests/StreamTeeTest.Assignment (2140 of 2355)
PASS: lldb-unit :: Utility/./UtilityTests/ConstStringTest.CompareConstString (2141 of 2355)
PASS: lldb-api :: commands/process/signal/TestProcessSignal.py (2142 of 2355)
PASS: lldb-unit :: ObjectFile/Breakpad/./ObjectFileBreakpadTests/Record.classify (2143 of 2355)
PASS: lldb-unit :: Symbol/./SymbolTests/DWARFCallFrameInfoTest.Basic_dwarf3 (2144 of 2355)
PASS: lldb-api :: lang/c/find_struct_type/TestFindStructTypes.py (2145 of 2355)
PASS: lldb-unit :: Thread/./ThreadTests/ThreadTest.GetPrivateStopInfo (2146 of 2355)
PASS: lldb-unit :: Utility/./UtilityTests/StreamTest.ShiftOperatorChars (2147 of 2355)
PASS: lldb-api :: macosx/nslog/TestDarwinNSLogOutput.py (2148 of 2355)
PASS: lldb-api :: lang/cpp/class-template-parameter-pack/TestClassTemplateParameterPack.py (2149 of 2355)
PASS: lldb-unit :: Process/gdb-remote/./ProcessGdbRemoteTests/GDBRemoteCommunicationClientTest.GetModulesInfo_UUID20 (2150 of 2355)
PASS: lldb-api :: commands/expression/ignore-artificial-constructors/TestIgnoreArtificialConstructors.py (2151 of 2355)
PASS: lldb-api :: functionalities/load_using_paths/TestLoadUsingPaths.py (2152 of 2355)
PASS: lldb-api :: commands/expression/import-std-module/list/TestListFromStdModule.py (2153 of 2355)
PASS: lldb-shell :: SymbolFile/DWARF/x86/find-inline-method.s (2154 of 2355)
PASS: lldb-api :: types/TestShortType.py (2155 of 2355)
PASS: lldb-unit :: UnwindAssembly/x86/./UnwindAssemblyx86Tests/Testx86AssemblyInspectionEngine.TestPushEBX (2156 of 2355)
PASS: lldb-api :: lang/objc/objc-new-syntax/TestObjCNewSyntaxArray.py (2157 of 2355)
PASS: lldb-unit :: Process/gdb-remote/./ProcessGdbRemoteTests/GDBRemoteCommunicationClientTest.SendTraceSupportedPacket (2158 of 2355)
PASS: lldb-unit :: Core/./LLDBCoreTests/SourceLocationSpecTest.OperatorBool (2159 of 2355)
PASS: lldb-api :: functionalities/data-formatter/compactvectors/TestCompactVectors.py (2160 of 2355)
UNSUPPORTED: lldb-api :: functionalities/data-formatter/data-formatter-stl/libstdcpp/vbool/TestDataFormatterStdVBool.py (2161 of 2355)
PASS: lldb-api :: functionalities/gdb_remote_client/TestStopPCs.py (2162 of 2355)
PASS: lldb-unit :: Host/./HostTests/SocketTests/SocketTest.TCPListen0ConnectAccept/ipv4 (2163 of 2355)
PASS: lldb-unit :: Language/Highlighting/./HighlighterTests/HighlighterTest.DefaultHighlighterWithCursor (2164 of 2355)
UNSUPPORTED: lldb-api :: functionalities/tsan/basic/TestTsanBasic.py (2165 of 2355)
PASS: lldb-unit :: Utility/./UtilityTests/RecordReplayTest.InstrumentedBarRef (2166 of 2355)
PASS: lldb-unit :: Symbol/./SymbolTests/TestTypeSystemClang.TestDeletingImplicitCopyCstrDueToMoveCStr (2167 of 2355)
PASS: lldb-api :: lang/objc/objc_direct-methods/TestObjCDirectMethods.py (2168 of 2355)
UNSUPPORTED: lldb-shell :: SymbolFile/DWARF/split-dwarf-expression-eval-bug.cpp (2169 of 2355)
PASS: lldb-api :: lang/cpp/bool/TestCPPBool.py (2170 of 2355)
PASS: lldb-unit :: Language/Highlighting/./HighlighterTests/HighlighterTest.DefaultHighlighter (2171 of 2355)
PASS: lldb-unit :: Process/gdb-remote/./ProcessGdbRemoteTests/PortMapTest.FreePortForProcess (2172 of 2355)
PASS: lldb-api :: commands/process/launch/TestProcessLaunch.py (2173 of 2355)
PASS: lldb-api :: commands/expression/regression-access-function-template-in-record/TestRegressionAccessFunctionTemplateInRecord.py (2174 of 2355)
PASS: lldb-shell :: SymbolFile/DWARF/x86/dwarf5_locations.s (2175 of 2355)
PASS: lldb-unit :: Symbol/./SymbolTests/SymbolsTest.LocateExecutableSymbolFileForUnknownExecutableAndMissingSymbolFile (2176 of 2355)
PASS: lldb-unit :: Utility/./UtilityTests/StreamTest.PutNHex8 (2177 of 2355)
PASS: lldb-api :: commands/command/invalid-args/TestInvalidArgsCommand.py (2178 of 2355)
PASS: lldb-unit :: UnwindAssembly/x86/./UnwindAssemblyx86Tests/Testx86AssemblyInspectionEngine.TestSpillRegToStackViaMOVx86_64 (2179 of 2355)
PASS: lldb-api :: functionalities/gdb_remote_client/TestPlatformClient.py (2180 of 2355)
PASS: lldb-unit :: Utility/./UtilityTests/DataExtractorTest.GetDouble (2181 of 2355)
PASS: lldb-api :: functionalities/archives/TestBSDArchives.py (2182 of 2355)
PASS: lldb-api :: functionalities/data-formatter/data-formatter-stl/libcxx/forward_list/TestDataFormatterLibcxxForwardList.py (2183 of 2355)
PASS: lldb-unit :: Utility/./UtilityTests/StringLexerTest.Peek (2184 of 2355)
PASS: lldb-shell :: Process/Optimization.test (2185 of 2355)
PASS: lldb-unit :: Utility/./UtilityTests/Flags.Test (2186 of 2355)
UNSUPPORTED: lldb-api :: benchmarks/libcxxmap/TestBenchmarkLibcxxMap.py (2187 of 2355)
PASS: lldb-api :: commands/expression/import-std-module/array/TestArrayFromStdModule.py (2188 of 2355)
PASS: lldb-unit :: Utility/./UtilityTests/NameMatchesTest.RegularExpression (2189 of 2355)
UNSUPPORTED: lldb-api :: functionalities/process_save_core/TestProcessSaveCore.py (2190 of 2355)
PASS: lldb-api :: functionalities/plugins/command_plugin/TestPluginCommands.py (2191 of 2355)
PASS: lldb-unit :: Target/./TargetTests/ModuleCacheTest.GetAndPut (2192 of 2355)
PASS: lldb-unit :: tools/lldb-server/tests/./LLDBServerTests/TestBase.DebugserverEnv (2193 of 2355)
UNSUPPORTED: lldb-api :: functionalities/signal/handle-segv/TestHandleSegv.py (2194 of 2355)
PASS: lldb-api :: lang/objc/modules-app-update/TestClangModulesAppUpdate.py (2195 of 2355)
PASS: lldb-api :: commands/expression/radar_9531204/TestPrintfAfterUp.py (2196 of 2355)
PASS: lldb-api :: functionalities/data-formatter/data-formatter-stl/libcxx/tuple/TestDataFormatterLibcxxTuple.py (2197 of 2355)
PASS: lldb-unit :: Symbol/./SymbolTests/TestClangASTImporter.MetadataPropagationAfterCopying (2198 of 2355)
PASS: lldb-unit :: Expression/./ExpressionTests/DiagnosticManagerTest.AddDiagnostic (2199 of 2355)
PASS: lldb-unit :: UnwindAssembly/x86/./UnwindAssemblyx86Tests/Testx86AssemblyInspectionEngine.TestSpArithx86_64Augmented (2200 of 2355)
PASS: lldb-api :: functionalities/data-formatter/summary-string-onfail/Test-rdar-9974002.py (2201 of 2355)
PASS: lldb-shell :: SymbolFile/DWARF/x86/find-method-local-struct.cpp (2202 of 2355)
PASS: lldb-api :: lang/cpp/extern_c/TestExternCSymbols.py (2203 of 2355)
PASS: lldb-shell :: SymbolFile/DWARF/x86/parallel-indexing-stress.s (2204 of 2355)
PASS: lldb-unit :: Process/gdb-remote/./ProcessGdbRemoteTests/GDBRemoteClientBaseTest.SendContinueAndInterrupt2PacketBug (2205 of 2355)
PASS: lldb-api :: commands/expression/completion-in-lambda-and-unnamed-class/TestCompletionInLambdaAndUnnamedClass.py (2206 of 2355)
PASS: lldb-unit :: Utility/./UtilityTests/RecordReplayTest.InstrumentedBar (2207 of 2355)
PASS: lldb-api :: lang/objc/print-obj/TestPrintObj.py (2208 of 2355)
PASS: lldb-unit :: Host/./HostTests/SocketTests/SocketTest.DecodeHostAndPort/ipv6 (2209 of 2355)
UNSUPPORTED: lldb-api :: linux/add-symbols/TestTargetSymbolsAddCommand.py (2210 of 2355)
UNSUPPORTED: lldb-api :: functionalities/data-formatter/data-formatter-stl/libstdcpp/vector/TestDataFormatterStdVector.py (2211 of 2355)
PASS: lldb-unit :: Utility/./UtilityTests/RegularExpression.Invalid (2212 of 2355)
PASS: lldb-unit :: Utility/./UtilityTests/ArchSpecTest.TestSetTriple (2213 of 2355)
PASS: lldb-unit :: Utility/./UtilityTests/UriParserTest.BadPort2 (2214 of 2355)
PASS: lldb-shell :: Settings/TestStopCommandSourceOnError.test (2215 of 2355)
PASS: lldb-api :: lang/cpp/overloaded-functions/TestOverloadedFunctions.py (2216 of 2355)
PASS: lldb-unit :: SymbolFile/NativePDB/./SymbolFileNativePDBTests/PDBFPOProgramToDWARFExpressionTests.MultipleIndependentAssignments (2217 of 2355)
PASS: lldb-unit :: DataFormatter/./LLDBFormatterTests/StringPrinterTests.CxxUTF8 (2218 of 2355)
PASS: lldb-api :: python_api/target/TestTargetAPI.py (2219 of 2355)
PASS: lldb-unit :: Core/./LLDBCoreTests/MangledTest.ResultForBlockInvocation (2220 of 2355)
PASS: lldb-shell :: ObjectFile/ELF/avr-basic-info.yaml (2221 of 2355)
PASS: lldb-shell :: Driver/TestError.test (2222 of 2355)
PASS: lldb-shell :: SymbolFile/DWARF/x86/module-ownership.mm (2223 of 2355)
PASS: lldb-unit :: Utility/./UtilityTests/StringExtractorTest.GetHexBytesAvail_OddPair2 (2224 of 2355)
PASS: lldb-unit :: Utility/./UtilityTests/RecordReplayTest.ValidSequence (2225 of 2355)
PASS: lldb-unit :: Utility/./UtilityTests/ScalarTest.Comparison (2226 of 2355)
PASS: lldb-api :: functionalities/thread/concurrent_events/TestConcurrentTwoWatchpointsOneBreakpoint.py (2227 of 2355)
PASS: lldb-api :: lang/cpp/global_variables/TestCPPGlobalVariables.py (2228 of 2355)
UNSUPPORTED: lldb-shell :: Register/x86-db-read.test (2229 of 2355)
PASS: lldb-api :: commands/platform/basic/TestPlatformPython.py (2230 of 2355)
PASS: lldb-unit :: Utility/./UtilityTests/StringListTest.JoinEmpty (2231 of 2355)
PASS: lldb-unit :: Utility/./UtilityTests/ArgsTest.TestQuotedUnknownEscape (2232 of 2355)
PASS: lldb-unit :: Utility/./UtilityTests/ConstStringTest.FromMidOfBufferStringRef (2233 of 2355)
PASS: lldb-unit :: Utility/./UtilityTests/SerializationRountripTest.SerializeDeserializePodReferences (2234 of 2355)
PASS: lldb-unit :: Host/./HostTests/ProcessLaunchInfoTest.Constructor (2235 of 2355)
PASS: lldb-api :: lang/cpp/default-template-args/TestDefaultTemplateArgs.py (2236 of 2355)
PASS: lldb-unit :: Utility/./UtilityTests/RegularExpression.Empty (2237 of 2355)
PASS: lldb-unit :: ScriptInterpreter/Python/./ScriptInterpreterPythonTests/PythonDataObjectsTest.TestPythonFile (2238 of 2355)
UNSUPPORTED: lldb-api :: commands/register/register/intel_xtended_registers/mpx_offset_intersection/TestMPXOffsetIntersection.py (2239 of 2355)
PASS: lldb-api :: functionalities/data-formatter/data-formatter-stl/libcxx/optional/TestDataFormatterLibcxxOptional.py (2240 of 2355)
PASS: lldb-unit :: Expression/./ExpressionTests/ClangExpressionDeclMapTest.TestPersistentDeclLookup (2241 of 2355)
PASS: lldb-shell :: SymbolFile/DWARF/x86/find-basic-namespace.cpp (2242 of 2355)
UNSUPPORTED: lldb-api :: iohandler/resize/TestIOHandlerResize.py (2243 of 2355)
PASS: lldb-api :: functionalities/source-map/TestTargetSourceMap.py (2244 of 2355)
PASS: lldb-unit :: Host/./HostTests/MainLoopTest.Signal (2245 of 2355)
PASS: lldb-api :: functionalities/data-formatter/frameformat_smallstruct/TestFrameFormatSmallStruct.py (2246 of 2355)
PASS: lldb-api :: functionalities/inline-stepping/TestInlineStepping.py (2247 of 2355)
PASS: lldb-unit :: UnwindAssembly/x86/./UnwindAssemblyx86Tests/Testx86AssemblyInspectionEngine.TestStackRealign32BitDisp_x86_64 (2248 of 2355)
PASS: lldb-api :: functionalities/data-formatter/data-formatter-stl/libcxx/list/TestDataFormatterLibcxxList.py (2249 of 2355)
UNSUPPORTED: lldb-shell :: SymbolFile/DWARF/x86/DW_TAG_GNU_call_site-DW_AT_low_pc.s (2250 of 2355)
PASS: lldb-api :: commands/expression/scoped_enums/TestScopedEnumType.py (2251 of 2355)
PASS: lldb-shell :: SymbolFile/NativePDB/global-classes.cpp (2252 of 2355)
PASS: lldb-shell :: SymbolFile/DWARF/x86/gnu-style-compression.cpp (2253 of 2355)
PASS: lldb-api :: commands/expression/import-std-module/iterator/TestIteratorFromStdModule.py (2254 of 2355)
UNSUPPORTED: lldb-api :: tools/lldb-server/libraries-svr4/TestGdbRemoteLibrariesSvr4Support.py (2255 of 2355)
PASS: lldb-unit :: Utility/./UtilityTests/StringExtractorTest.GetHexU8_Underflow_NoEof (2256 of 2355)
PASS: lldb-api :: lang/cpp/trivial_abi/TestTrivialABI.py (2257 of 2355)
PASS: lldb-unit :: UnwindAssembly/x86/./UnwindAssemblyx86Tests/Testx86AssemblyInspectionEngine.Testi386IgnoredRegisters (2258 of 2355)
PASS: lldb-api :: commands/expression/import-std-module/missing-module-sources/TestStdModuleSourcesMissing.py (2259 of 2355)
PASS: lldb-unit :: DataFormatter/./LLDBFormatterTests/TypeMatcherTests.CreatedBySameMatchStringExactNamePrefixes (2260 of 2355)
PASS: lldb-unit :: Utility/./UtilityTests/NameMatchesTest.Ignore (2261 of 2355)
PASS: lldb-unit :: Symbol/./SymbolTests/TestCreateClassTemplateDecl.FindExistingTemplates (2262 of 2355)
PASS: lldb-unit :: Utility/./UtilityTests/StringListTest.GetMaxStringLengthDecreasingSize (2263 of 2355)
PASS: lldb-api :: lang/cpp/non-type-template-param/TestCppNonTypeTemplateParam.py (2264 of 2355)
PASS: lldb-unit :: Utility/./UtilityTests/ArgsTest.DoubleQuotedItem (2265 of 2355)
PASS: lldb-api :: lang/cpp/constructors/TestCppConstructors.py (2266 of 2355)
PASS: lldb-unit :: Utility/./UtilityTests/StreamTest.PutBytesAsRawHex8ToMixedEndian (2267 of 2355)
PASS: lldb-unit :: Utility/./UtilityTests/BinaryStreamTest.PutULEB128ThreeBytes (2268 of 2355)
PASS: lldb-unit :: Utility/./UtilityTests/StreamTest.PutPtr (2269 of 2355)
PASS: lldb-unit :: Utility/./UtilityTests/StringExtractorTest.DecodeHexU8_Exact (2270 of 2355)
PASS: lldb-api :: commands/expression/import-std-module/shared_ptr-dbg-info-content/TestSharedPtrDbgInfoContentFromStdModule.py (2271 of 2355)
PASS: lldb-api :: functionalities/data-formatter/data-formatter-stl/libcxx/map/TestDataFormatterLibccMap.py (2272 of 2355)
UNSUPPORTED: lldb-api :: tools/lldb-vscode/completions/TestVSCode_completions.py (2273 of 2355)
PASS: lldb-api :: commands/expression/call-function/TestCallStopAndContinue.py (2274 of 2355)
PASS: lldb-api :: lang/cpp/diamond/TestDiamond.py (2275 of 2355)
PASS: lldb-shell :: ObjectFile/ELF/PT_TLS-overlap-PT_LOAD.yaml (2276 of 2355)
PASS: lldb-unit :: Utility/./UtilityTests/ArgsTest.TestSingleArg (2277 of 2355)
UNSUPPORTED: lldb-shell :: Register/x86-64-ymm16-write.test (2278 of 2355)
PASS: lldb-unit :: Process/Utility/./ProcessUtilityTests/ProcSMapTests/LinuxProcSMapsTestFixture.ParseSMapRegions/3 (2279 of 2355)
PASS: lldb-unit :: Language/Highlighting/./HighlighterTests/HighlighterTest.DefaultHighlighterWithCursorOutOfBounds (2280 of 2355)
PASS: lldb-unit :: ScriptInterpreter/Python/./ScriptInterpreterPythonTests/PythonDataObjectsTest.TestPythonDictionaryManipulation (2281 of 2355)
PASS: lldb-api :: macosx/lc-note/kern-ver-str/TestKernVerStrLCNOTE.py (2282 of 2355)
PASS: lldb-unit :: Signals/./SignalsTests/UnixSignalsTest.GetFilteredSignals (2283 of 2355)
PASS: lldb-api :: lang/cpp/operators/TestCppOperators.py (2284 of 2355)
PASS: lldb-shell :: ObjectFile/PECOFF/sections.yaml (2285 of 2355)
PASS: lldb-unit :: Utility/./UtilityTests/StreamTest.PutHex16ByteOrderBig (2286 of 2355)
PASS: lldb-unit :: Utility/./UtilityTests/BinaryStreamTest.PutSLEB128TwoBytes (2287 of 2355)
PASS: lldb-api :: functionalities/gdb_remote_client/TestqOffsets.py (2288 of 2355)
PASS: lldb-api :: lang/cpp/static_methods/TestCPPStaticMethods.py (2289 of 2355)
PASS: lldb-unit :: Utility/./UtilityTests/ArgsTest.EscapeLLDBCommandArgument (2290 of 2355)
PASS: lldb-shell :: ScriptInterpreter/Python/Crashlog/parser_text.test (2291 of 2355)
PASS: lldb-api :: python_api/sbvalue_const_addrof/TestSBValueConstAddrOf.py (2292 of 2355)
PASS: lldb-api :: lang/objc/single-entry-dictionary/TestObjCSingleEntryDictionary.py (2293 of 2355)
PASS: lldb-unit :: Expression/./ExpressionTests/CppModuleConfigurationTest.LibCppV2 (2294 of 2355)
PASS: lldb-api :: functionalities/data-formatter/data-formatter-stl/libstdcpp/unique_ptr/invalid/TestDataFormatterInvalidStdUniquePtr.py (2295 of 2355)
PASS: lldb-api :: api/command-return-object/TestSBCommandReturnObject.py (2296 of 2355)
PASS: lldb-unit :: Utility/./UtilityTests/SubsystemRAIITest.SubsystemWithErrorFailure (2297 of 2355)
PASS: lldb-api :: functionalities/thread/concurrent_events/TestConcurrentDelaySignalWatch.py (2298 of 2355)
PASS: lldb-unit :: Utility/./UtilityTests/UriParserTest.TypicalPortPathIPv6 (2299 of 2355)
PASS: lldb-unit :: Utility/./UtilityTests/StringListTest.ShiftCString (2300 of 2355)
PASS: lldb-unit :: Utility/./UtilityTests/StringListTest.GetMaxStringLengthIncreasingSize (2301 of 2355)
PASS: lldb-unit :: Signals/./SignalsTests/UnixSignalsTest.GetInfo (2302 of 2355)
PASS: lldb-api :: functionalities/thread/concurrent_events/TestConcurrentSignalNWatchNBreak.py (2303 of 2355)
PASS: lldb-api :: functionalities/data-formatter/data-formatter-stl/libcxx/variant/TestDataFormatterLibcxxVariant.py (2304 of 2355)
XFAIL: lldb-shell :: Register/x86-64-fp-read.test (2305 of 2355)
PASS: lldb-unit :: Process/minidump/./LLDBMinidumpTests/MinidumpParserTest.GetFilteredModuleList (2306 of 2355)
PASS: lldb-api :: functionalities/thread/concurrent_events/TestConcurrentWatchBreak.py (2307 of 2355)
PASS: lldb-unit :: Utility/./UtilityTests/XcodeSDKTest.ParseTest (2308 of 2355)
PASS: lldb-api :: lang/objc/modules/TestObjCModules.py (2309 of 2355)
PASS: lldb-api :: commands/expression/import-std-module/queue/TestQueueFromStdModule.py (2310 of 2355)
UNSUPPORTED: lldb-api :: functionalities/darwin_log/filter/exact_match/subsystem/TestDarwinLogFilterMatchSubsystem.py (2311 of 2355)
PASS: lldb-unit :: Utility/./UtilityTests/RangeTest.EqualInvalid (2312 of 2355)
PASS: lldb-shell :: SymbolFile/DWARF/x86/dwarf5_tu_index_abbrev_offset.s (2313 of 2355)
UNSUPPORTED: lldb-shell :: Register/x86-ymm-write.test (2314 of 2355)
PASS: lldb-unit :: Utility/./UtilityTests/OptionsWithRawTest.MultiWordSuffix (2315 of 2355)
PASS: lldb-api :: commands/disassemble/basic/TestFrameDisassemble.py (2316 of 2355)
PASS: lldb-unit :: Process/gdb-remote/./ProcessGdbRemoteTests/GDBRemoteCommunicationClientTest.GetModulesInfo (2317 of 2355)
PASS: lldb-unit :: ScriptInterpreter/Python/./ScriptInterpreterPythonTests/PythonDataObjectsTest.TestScript (2318 of 2355)
PASS: lldb-shell :: SymbolFile/DWARF/x86/debug_loc-aslr.s (2319 of 2355)
PASS: lldb-api :: tools/lldb-server/TestGdbRemoteAttach.py (2320 of 2355)
PASS: lldb-shell :: SymbolFile/NativePDB/function-types-classes.cpp (2321 of 2355)
PASS: lldb-api :: lang/objc/objc-ivar-offsets/TestObjCIvarOffsets.py (2322 of 2355)
PASS: lldb-unit :: Utility/./UtilityTests/TimerTest.CategoryTimesNested (2323 of 2355)
PASS: lldb-api :: lang/objc/modules-hash-mismatch/TestClangModulesHashMismatch.py (2324 of 2355)
PASS: lldb-shell :: ScriptInterpreter/Python/command_import.test (2325 of 2355)
PASS: lldb-api :: commands/expression/dollar-in-variable/TestDollarInVariable.py (2326 of 2355)
PASS: lldb-shell :: Quit/TestQuitExitCodeTooManyArgs.test (2327 of 2355)
PASS: lldb-unit :: Core/./LLDBCoreTests/DumpDataExtractorTest.StartOffset (2328 of 2355)
PASS: lldb-api :: python_api/type/TestTypeList.py (2329 of 2355)
PASS: lldb-unit :: UnwindAssembly/x86/./UnwindAssemblyx86Tests/Testx86AssemblyInspectionEngine.TestSimple32bitFrameFunction (2330 of 2355)
PASS: lldb-shell :: ObjectFile/ELF/section-types.yaml (2331 of 2355)
PASS: lldb-unit :: DataFormatter/./LLDBFormatterTests/TypeMatcherTests.ExactName (2332 of 2355)
PASS: lldb-unit :: Symbol/./SymbolTests/TestClangASTImporter.CanImportInvalidType (2333 of 2355)
PASS: lldb-api :: commands/expression/unwind_expression/TestUnwindExpression.py (2334 of 2355)
PASS: lldb-api :: commands/expression/function_template_specialization_temp_args/TestFunctionTemplateSpecializationTempArgs.py (2335 of 2355)
PASS: lldb-api :: commands/expression/entry-bp/TestExprEntryBP.py (2336 of 2355)
PASS: lldb-api :: commands/target/stop-hooks/TestStopHooks.py (2337 of 2355)
PASS: lldb-unit :: Host/./HostTests/PipeTest.CreateWithUniqueName (2338 of 2355)
PASS: lldb-unit :: Utility/./UtilityTests/StatusTest.ErrorConstructor (2339 of 2355)
PASS: lldb-api :: lang/cpp/type_lookup/TestCppTypeLookup.py (2340 of 2355)
PASS: lldb-unit :: UnwindAssembly/x86/./UnwindAssemblyx86Tests/Testx86AssemblyInspectionEngine.TestPopRBPWithREX (2341 of 2355)
PASS: lldb-api :: commands/expression/no-deadlock/TestExprDoesntBlock.py (2342 of 2355)
PASS: lldb-unit :: Interpreter/./InterpreterTests/OptionArgParserTest.toChar (2343 of 2355)
UNSUPPORTED: lldb-api :: macosx/simulator/TestSimulatorPlatform.py (2344 of 2355)
FAIL: lldb-api :: macosx/function-starts/TestFunctionStarts.py (2345 of 2355)
******************** TEST 'lldb-api :: macosx/function-starts/TestFunctionStarts.py' FAILED ********************
Script:
--
/Users/buildslave/jenkins/workspace/lldb-cmake-sanitized/lldb-build/lldb-test-build.noindex/copied-python /Users/buildslave/jenkins/workspace/lldb-cmake-sanitized/llvm-project/lldb/test/API/dotest.py -u CXXFLAGS -u CFLAGS --codesign-identity lldb_codesign --arch x86_64 --build-dir /Users/buildslave/jenkins/workspace/lldb-cmake-sanitized/lldb-build/lldb-test-build.noindex -t --env TERM=vt100 --env LLVM_LIBS_DIR=/Users/buildslave/jenkins/workspace/lldb-cmake-sanitized/lldb-build/./lib --inferior-env ASAN_OPTIONS=detect_stack_use_after_return=1 --inferior-env DYLD_INSERT_LIBRARIES=/Users/buildslave/jenkins/workspace/lldb-cmake-sanitized/host-compiler/lib/clang/13.0.99/lib/darwin/libclang_rt.asan_osx_dynamic.dylib --arch x86_64 --build-dir /Users/buildslave/jenkins/workspace/lldb-cmake-sanitized/lldb-build/lldb-test-build.noindex --lldb-module-cache-dir /Users/buildslave/jenkins/workspace/lldb-cmake-sanitized/lldb-build/lldb-test-build.noindex/module-cache-lldb/lldb-api --clang-module-cache-dir /Users/buildslave/jenkins/workspace/lldb-cmake-sanitized/lldb-build/lldb-test-build.noindex/module-cache-clang/lldb-api --executable /Users/buildslave/jenkins/workspace/lldb-cmake-sanitized/lldb-build/./bin/lldb --compiler /Users/buildslave/jenkins/workspace/lldb-cmake-sanitized/host-compiler/bin/clang --dsymutil /Users/buildslave/jenkins/workspace/lldb-cmake-sanitized/lldb-build/./bin/dsymutil --llvm-tools-dir /Users/buildslave/jenkins/workspace/lldb-cmake-sanitized/lldb-build/./bin --lldb-libs-dir /Users/buildslave/jenkins/workspace/lldb-cmake-sanitized/lldb-build/./lib /Users/buildslave/jenkins/workspace/lldb-cmake-sanitized/llvm-project/lldb/test/API/macosx/function-starts -p TestFunctionStarts.py
--
Exit Code: 1

Command Output (stdout):
--
lldb version 13.0.99 (http://labmaster3.local/git/llvm-project.git revision b9c24257c7b4da398798934ffefdd30015152180)
  clang revision b9c24257c7b4da398798934ffefdd30015152180
  llvm revision b9c24257c7b4da398798934ffefdd30015152180
I wasn't stripped
I wasn't stripped
I wasn't stripped
I wasn't stripped
I wasn't stripped
I wasn't stripped
I wasn't stripped
I wasn't stripped
I wasn't stripped
I wasn't stripped
I wasn't stripped
I wasn't stripped
I wasn't stripped
I wasn't stripped
I wasn't stripped
I wasn't stripped
I wasn't stripped
I wasn't stripped
I wasn't stripped
I wasn't stripped
I wasn't stripped
I wasn't stripped
I wasn't stripped
I wasn't stripped
I wasn't stripped
I wasn't stripped
I wasn't stripped
I wasn't stripped
I wasn't stripped
I wasn't stripped
I wasn't stripped
I wasn't stripped
I wasn't stripped
I wasn't stripped
I wasn't stripped
I wasn't stripped
I wasn't stripped
I wasn't stripped
I wasn't stripped
I wasn't stripped
I wasn't stripped
I wasn't stripped
I wasn't stripped
I wasn't stripped
I wasn't stripped
I wasn't stripped
I wasn't stripped
I wasn't stripped
I wasn't stripped
I wasn't stripped
I wasn't stripped
I wasn't stripped
I wasn't stripped
I wasn't stripped
I wasn't stripped
I wasn't stripped
I wasn't stripped
I wasn't stripped
I wasn't stripped
I wasn't stripped
I wasn't stripped
I wasn't stripped
I wasn't stripped
I wasn't stripped
I wasn't stripped
I wasn't stripped
I wasn't stripped
I wasn't stripped
I wasn't stripped
I wasn't stripped
I wasn't stripped
I wasn't stripped
I wasn't stripped
I wasn't stripped
I wasn't stripped
I wasn't stripped
I wasn't stripped
I wasn't stripped
I wasn't stripped
I wasn't stripped
I wasn't stripped
I wasn't stripped
I wasn't stripped
I wasn't stripped
I wasn't stripped
I wasn't stripped
I wasn't stripped
I wasn't stripped
I wasn't stripped
I wasn't stripped
I wasn't stripped
I wasn't stripped
I wasn't stripped
I wasn't stripped
I wasn't stripped
I wasn't stripped
I wasn't stripped
I wasn't stripped
I wasn't stripped
I wasn't stripped
I wasn't stripped
I wasn't stripped
I wasn't stripped
I wasn't stripped
I wasn't stripped
I wasn't stripped
I wasn't stripped
I wasn't stripped
I wasn't stripped
I wasn't stripped
I wasn't stripped
I wasn't stripped
I wasn't stripped
I wasn't stripped
I wasn't stripped
I wasn't stripped
I wasn't stripped
I wasn't stripped
I wasn't stripped
I wasn't stripped
I wasn't stripped
I wasn't stripped
I wasn't stripped
I wasn't stripped
I wasn't stripped
I wasn't stripped
I wasn't stripped
I wasn't stripped
I wasn't stripped
I wasn't stripped
I wasn't stripped
I wasn't stripped
I wasn't stripped
I wasn't stripped
I wasn't stripped
I wasn't stripped
I wasn't stripped
I wasn't stripped
I wasn't stripped
I wasn't stripped
I wasn't stripped
I wasn't stripped
I wasn't stripped
I wasn't stripped
I wasn't stripped
I wasn't stripped
I wasn't stripped
I wasn't stripped
I wasn't stripped
I wasn't stripped
I wasn't stripped
I wasn't stripped
I wasn't stripped
I wasn't stripped
I wasn't stripped
I wasn't stripped
I wasn't stripped
I wasn't stripped
I wasn't stripped
I wasn't stripped
I wasn't stripped
I wasn't stripped
I wasn't stripped
I wasn't stripped
I wasn't stripped
I wasn't stripped
I wasn't stripped
I wasn't stripped
I wasn't stripped
I wasn't stripped
I wasn't stripped
I wasn't stripped
I wasn't stripped
I wasn't stripped
I wasn't stripped
I wasn't stripped
I wasn't stripped
I wasn't stripped
I wasn't stripped
I wasn't stripped
I wasn't stripped
I wasn't stripped
I wasn't stripped
I wasn't stripped
I wasn't stripped
I wasn't stripped
I wasn't stripped
I wasn't stripped
I wasn't stripped
I wasn't stripped
I wasn't stripped
I wasn't stripped
I wasn't stripped
I wasn't stripped
I wasn't stripped
I wasn't stripped
I wasn't stripped
I wasn't stripped
I wasn't stripped
I wasn't stripped
I wasn't stripped
I wasn't stripped
I wasn't stripped
I wasn't stripped
I wasn't stripped
I wasn't stripped
I wasn't stripped
I wasn't stripped
I wasn't stripped
I wasn't stripped
I wasn't stripped
I wasn't stripped
I wasn't stripped
I wasn't stripped
I wasn't stripped
I wasn't stripped
I wasn't stripped
I wasn't stripped
I wasn't stripped
I wasn't stripped
I wasn't stripped
I wasn't stripped
I wasn't stripped
I wasn't stripped
I wasn't stripped
I wasn't stripped
I wasn't stripped
I wasn't stripped
I wasn't stripped
I wasn't stripped
I wasn't stripped
I wasn't stripped
I wasn't stripped
I wasn't stripped
I wasn't stripped
I wasn't stripped
I wasn't stripped
I wasn't stripped
I wasn't stripped
I wasn't stripped
I wasn't stripped
I wasn't stripped
I wasn't stripped
I wasn't stripped
I wasn't stripped
I wasn't stripped
I wasn't stripped
I wasn't stripped
I wasn't stripped
I wasn't stripped
I wasn't stripped
I wasn't stripped
I wasn't stripped
I wasn't stripped
I wasn't stripped
I wasn't stripped
I wasn't stripped
I wasn't stripped
I wasn't stripped
I wasn't stripped
I wasn't stripped
I wasn't stripped
I wasn't stripped
I wasn't stripped
I wasn't stripped
I wasn't stripped
I wasn't stripped
I wasn't stripped
I wasn't stripped
I wasn't stripped
I wasn't stripped
I wasn't stripped
I wasn't stripped
I wasn't stripped
I wasn't stripped
I wasn't stripped
I wasn't stripped
I wasn't stripped
I wasn't stripped
I wasn't stripped
I wasn't stripped
I wasn't stripped
I wasn't stripped
I wasn't stripped
I wasn't stripped
I wasn't stripped
I wasn't stripped
I wasn't stripped
I wasn't stripped
I wasn't stripped
I wasn't stripped
I wasn't stripped
I wasn't stripped
I wasn't stripped
I wasn't stripped
I wasn't stripped
I wasn't stripped
I wasn't stripped
I wasn't stripped
I wasn't stripped
I wasn't stripped
I wasn't stripped
I wasn't stripped
I wasn't stripped
I wasn't stripped
I wasn't stripped
I wasn't stripped
I wasn't stripped
I wasn't stripped
I wasn't stripped
I wasn't stripped
I wasn't stripped
I wasn't stripped
I wasn't stripped
I wasn't stripped
I wasn't stripped
I wasn't stripped
I wasn't stripped
I wasn't stripped
I wasn't stripped
I wasn't stripped
I wasn't stripped
I wasn't stripped
I wasn't stripped
I wasn't stripped
I wasn't stripped
I wasn't stripped
I wasn't stripped
I wasn't stripped
I wasn't stripped
I wasn't stripped
I wasn't stripped
I wasn't stripped
I wasn't stripped
I wasn't stripped
I wasn't stripped
I wasn't stripped
I wasn't stripped
I wasn't stripped
I wasn't stripped
I wasn't stripped
I wasn't stripped
I wasn't stripped
I wasn't stripped
I wasn't stripped
I wasn't stripped
I wasn't stripped
I wasn't stripped
I wasn't stripped
I wasn't stripped
I wasn't stripped
I wasn't stripped
I wasn't stripped
I wasn't stripped
I wasn't stripped
I wasn't stripped
I wasn't stripped
I wasn't stripped
I wasn't stripped
I wasn't stripped
I wasn't stripped
I wasn't stripped
I wasn't stripped
I wasn't stripped
I wasn't stripped
I wasn't stripped
I wasn't stripped
I wasn't stripped
I wasn't stripped
I wasn't stripped
I wasn't stripped
I wasn't stripped
I wasn't stripped
I wasn't stripped
I wasn't stripped
I wasn't stripped
I wasn't stripped
I wasn't stripped
I wasn't stripped
I wasn't stripped
I wasn't stripped
I wasn't stripped
I wasn't stripped
I wasn't stripped
I wasn't stripped
I wasn't stripped
I wasn't stripped
I wasn't stripped
I wasn't stripped
I wasn't stripped
I wasn't stripped
I wasn't stripped
I wasn't stripped
I wasn't stripped
I wasn't stripped
I wasn't stripped
I wasn't stripped
I wasn't stripped
I wasn't stripped
I wasn't stripped
I wasn't stripped
I wasn't stripped
I wasn't stripped
I wasn't stripped
I wasn't stripped
I wasn't stripped
I wasn't stripped
I wasn't stripped
I wasn't stripped
I wasn't stripped
I wasn't stripped
I wasn't stripped
I wasn't stripped
I wasn't stripped
I wasn't stripped
I wasn't stripped
I wasn't stripped
I wasn't stripped
I wasn't stripped
I wasn't stripped
I wasn't stripped
I wasn't stripped
I wasn't stripped
I wasn't stripped
I wasn't stripped
I wasn't stripped
I wasn't stripped
I wasn't stripped
I wasn't stripped
I wasn't stripped
I wasn't stripped
I wasn't stripped
I wasn't stripped
I wasn't stripped
I wasn't stripped
I wasn't stripped
I wasn't stripped
I wasn't stripped
I wasn't stripped
I wasn't stripped
I wasn't stripped
I wasn't stripped
I wasn't stripped
I wasn't stripped
I wasn't stripped
I wasn't stripped
I wasn't stripped
I wasn't stripped
I wasn't stripped
I wasn't stripped
I wasn't stripped
I wasn't stripped
I wasn't stripped
I wasn't stripped
I wasn't stripped
I wasn't stripped
I wasn't stripped
I wasn't stripped
I wasn't stripped
I wasn't stripped
I wasn't stripped
I wasn't stripped
I wasn't stripped
I wasn't stripped
I wasn't stripped
I wasn't stripped
I wasn't stripped
I wasn't stripped
I wasn't stripped
I wasn't stripped
I wasn't stripped
I wasn't stripped
I wasn't stripped
I wasn't stripped
I wasn't stripped
I wasn't stripped
I wasn't stripped
I wasn't stripped
I wasn't stripped
I wasn't stripped
I wasn't stripped
I wasn't stripped
I wasn't stripped
I wasn't stripped
I wasn't stripped
I wasn't stripped
I wasn't stripped
I wasn't stripped
I wasn't stripped
I wasn't stripped
I wasn't stripped
I wasn't stripped
I wasn't stripped
I wasn't stripped
I wasn't stripped
I wasn't stripped
I wasn't stripped
I wasn't stripped
I wasn't stripped
I wasn't stripped
I wasn't stripped
I wasn't stripped
I wasn't stripped
I wasn't stripped
I wasn't stripped
I wasn't stripped
I wasn't stripped
I wasn't stripped
I wasn't stripped
I wasn't stripped
I wasn't stripped
I wasn't stripped
I wasn't stripped
I wasn't stripped
I wasn't stripped
I wasn't stripped
I wasn't stripped
I wasn't stripped
I wasn't stripped
I wasn't stripped
I wasn't stripped
I wasn't stripped
I wasn't stripped
I wasn't stripped
I wasn't stripped
I wasn't stripped
I wasn't stripped
I wasn't stripped
I wasn't stripped
I wasn't stripped
I wasn't stripped
I wasn't stripped
I wasn't stripped
I wasn't stripped
I wasn't stripped
I wasn't stripped
I wasn't stripped
I wasn't stripped
I wasn't stripped
I wasn't stripped
I wasn't stripped
I wasn't stripped
I wasn't stripped
I wasn't stripped
I wasn't stripped
I wasn't stripped
I wasn't stripped
I wasn't stripped
I wasn't stripped
I wasn't stripped
I wasn't stripped
I wasn't stripped
I wasn't stripped
I wasn't stripped
I wasn't stripped
I wasn't stripped
I wasn't stripped
I wasn't stripped
I wasn't stripped
I wasn't stripped
I wasn't stripped
I wasn't stripped
I wasn't stripped
I wasn't stripped
I wasn't stripped
I wasn't stripped
I wasn't stripped
I wasn't stripped
I wasn't stripped
I wasn't stripped
I wasn't stripped
I wasn't stripped
I wasn't stripped
I wasn't stripped
I wasn't stripped
I wasn't stripped
I wasn't stripped
I wasn't stripped
I wasn't stripped
I wasn't stripped
I wasn't stripped
I wasn't stripped
I wasn't stripped
I wasn't stripped
I wasn't stripped
I wasn't stripped
I wasn't stripped
I wasn't stripped
I wasn't stripped
I wasn't stripped
I wasn't stripped
I wasn't stripped
I wasn't stripped
I wasn't stripped
I wasn't stripped
I wasn't stripped
I wasn't stripped
I wasn't stripped
I wasn't stripped
I wasn't stripped
I wasn't stripped
I wasn't stripped
I wasn't stripped
I wasn't stripped
I wasn't stripped
I wasn't stripped
I wasn't stripped
I wasn't stripped
I wasn't stripped
I wasn't stripped
I wasn't stripped
I wasn't stripped
I wasn't stripped
I wasn't stripped
I wasn't stripped
I wasn't stripped
I wasn't stripped
I wasn't stripped
I wasn't stripped
I wasn't stripped
I wasn't stripped
I wasn't stripped
I wasn't stripped
I wasn't stripped
I wasn't stripped
I wasn't stripped
I wasn't stripped
I wasn't stripped
I wasn't stripped
I wasn't stripped
I wasn't stripped
I wasn't stripped
I wasn't stripped
I wasn't stripped
I wasn't stripped
I wasn't stripped
I wasn't stripped
I wasn't stripped
I wasn't stripped
I wasn't stripped
I wasn't stripped
I wasn't stripped
I wasn't stripped
I wasn't stripped
I wasn't stripped
I wasn't stripped
I wasn't stripped
I wasn't stripped
I wasn't stripped
I wasn't stripped
I wasn't stripped
I wasn't stripped
I wasn't stripped
I wasn't stripped
I wasn't stripped
I wasn't stripped
I wasn't stripped
I wasn't stripped
I wasn't stripped
I wasn't stripped
I wasn't stripped
I wasn't stripped
I wasn't stripped
I wasn't stripped
I wasn't stripped
I wasn't stripped
I wasn't stripped
I wasn't stripped
I wasn't stripped
I wasn't stripped
I wasn't stripped
I wasn't stripped
I wasn't stripped
I wasn't stripped
I wasn't stripped
I wasn't stripped
I wasn't stripped
I wasn't stripped
I wasn't stripped
I wasn't stripped
I wasn't stripped
I wasn't stripped
I wasn't stripped
I wasn't stripped
I wasn't stripped
I wasn't stripped
I wasn't stripped
I wasn't stripped
I wasn't stripped
I wasn't stripped
I wasn't stripped
I wasn't stripped
I wasn't stripped
I wasn't stripped
I wasn't stripped
I wasn't stripped
I wasn't stripped
I wasn't stripped
I wasn't stripped
I wasn't stripped
I wasn't stripped
I wasn't stripped
I wasn't stripped
I wasn't stripped
I wasn't stripped
I wasn't stripped
I wasn't stripped
I wasn't stripped
I wasn't stripped
I wasn't stripped
I wasn't stripped
I wasn't stripped
I wasn't stripped
I wasn't stripped
I wasn't stripped
I wasn't stripped
I wasn't stripped
I wasn't stripped
I wasn't stripped
I wasn't stripped
I wasn't stripped
I wasn't stripped
I wasn't stripped
I wasn't stripped
I wasn't stripped
I wasn't stripped
I wasn't stripped
I wasn't stripped
I wasn't stripped
I wasn't stripped
I wasn't stripped
I wasn't stripped
I wasn't stripped
I wasn't stripped
I wasn't stripped
I wasn't stripped
I wasn't stripped
I wasn't stripped
I wasn't stripped
I wasn't stripped
I wasn't stripped
I wasn't stripped
I wasn't stripped
I wasn't stripped
I wasn't stripped
I wasn't stripped
I wasn't stripped
I wasn't stripped
I wasn't stripped
I wasn't stripped
I wasn't stripped
I wasn't stripped
I wasn't stripped
I wasn't stripped
I wasn't stripped
I wasn't stripped
I wasn't stripped
I wasn't stripped
I wasn't stripped
I wasn't stripped
I wasn't stripped
I wasn't stripped
I wasn't stripped
I wasn't stripped
I wasn't stripped
I wasn't stripped
I wasn't stripped
I wasn't stripped
I wasn't stripped
I wasn't stripped
I wasn't stripped
I wasn't stripped
I wasn't stripped
I wasn't stripped
I wasn't stripped
I wasn't stripped
I wasn't stripped
I wasn't stripped
I wasn't stripped
I wasn't stripped
I wasn't stripped
I wasn't stripped
I wasn't stripped
I wasn't stripped
I wasn't stripped
I wasn't stripped
I wasn't stripped
I wasn't stripped
I wasn't stripped
I wasn't stripped
I wasn't stripped
I wasn't stripped
I wasn't stripped
I wasn't stripped
I wasn't stripped
I wasn't stripped
I wasn't stripped
I wasn't stripped
I wasn't stripped
I wasn't stripped
I wasn't stripped
I wasn't stripped
I wasn't stripped
I wasn't stripped
I wasn't stripped
I wasn't stripped
I wasn't stripped
I wasn't stripped
I wasn't stripped
I wasn't stripped
I wasn't stripped
I wasn't stripped
I wasn't stripped
I wasn't stripped
I wasn't stripped
I wasn't stripped
I wasn't stripped
I wasn't stripped
I wasn't stripped
I wasn't stripped
I wasn't stripped
I wasn't stripped
I wasn't stripped
I wasn't stripped
I wasn't stripped
I wasn't stripped
I wasn't stripped
I wasn't stripped
I wasn't stripped
I wasn't stripped
I wasn't stripped
I wasn't stripped
I wasn't stripped
I wasn't stripped
I wasn't stripped
I wasn't stripped
I wasn't stripped
I wasn't stripped
I wasn't stripped
I wasn't stripped
I wasn't stripped
I wasn't stripped
I wasn't stripped
I wasn't stripped
I wasn't stripped
I wasn't stripped
I wasn't stripped
I wasn't stripped
I wasn't stripped
I wasn't stripped
I wasn't stripped
I wasn't stripped
I wasn't stripped
I wasn't stripped
I wasn't stripped
I wasn't stripped
I wasn't stripped
I wasn't stripped
I wasn't stripped
I wasn't stripped
I wasn't stripped
I wasn't stripped
I wasn't stripped
I wasn't stripped
I wasn't stripped
I wasn't stripped
I wasn't stripped
I wasn't stripped
I wasn't stripped
I wasn't stripped
I wasn't stripped
I wasn't stripped
I wasn't stripped
I wasn't stripped
I wasn't stripped
I wasn't stripped
I wasn't stripped
I wasn't stripped
I wasn't stripped
I wasn't stripped
I wasn't stripped
I wasn't stripped
I wasn't stripped
I wasn't stripped
I wasn't stripped
I wasn't stripped
I wasn't stripped
I wasn't stripped
I wasn't stripped
I wasn't stripped
I wasn't stripped
I wasn't stripped
I wasn't stripped
I wasn't stripped
I wasn't stripped
I wasn't stripped
I wasn't stripped
I wasn't stripped
I wasn't stripped
I wasn't stripped
I wasn't stripped
I wasn't stripped
I wasn't stripped
I wasn't stripped
I wasn't stripped
I wasn't stripped
I wasn't stripped
I wasn't stripped
I wasn't stripped
I wasn't stripped
I waSkipping the following test categories: ['darwin-log', 'libstdcxx', 'dwo', 'llgs', 'fork']

--
Command Output (stderr):
--
Change dir to: /Users/buildslave/jenkins/workspace/lldb-cmake-sanitized/llvm-project/lldb/test/API/macosx/function-starts
runCmd: settings clear -all
output: 

runCmd: settings set symbols.enable-external-lookup false
output: 

runCmd: settings set target.inherit-tcc true
output: 

runCmd: settings set target.detach-on-error false
output: 

runCmd: settings set target.auto-apply-fixits false
output: 

runCmd: settings set plugin.process.gdb-remote.packet-timeout 60
output: 

runCmd: settings set symbols.clang-modules-cache-path "/Users/buildslave/jenkins/workspace/lldb-cmake-sanitized/lldb-build/lldb-test-build.noindex/module-cache-lldb/lldb-api"
output: 

runCmd: settings set use-color false
output: 

runCmd: setting set target.prefer-dynamic-value no-dynamic-values
output: 

runCmd: settings set target.env-vars ASAN_OPTIONS=detect_stack_use_after_return=1 DYLD_INSERT_LIBRARIES=/Users/buildslave/jenkins/workspace/lldb-cmake-sanitized/host-compiler/lib/clang/13.0.99/lib/darwin/libclang_rt.asan_osx_dynamic.dylib
output: 

Adding tearDown hook:             lambda: self.run_platform_command(
                "rm %s" %
                (pid_file_path)))


FAIL: LLDB (/Users/buildslave/jenkins/workspace/lldb-cmake-sanitized/host-compiler/bin/clang-x86_64) :: test_function_starts_binary (TestFunctionStarts.FunctionStartsTestCase)
<bound method SBProcess.Kill of <lldb.SBProcess; proxy of <Swig Object of type 'lldb::SBProcess *' at 0x123c7b690> >>: success

Executing tearDown hook:             lambda: self.run_platform_command(
                "rm %s" %
                (pid_file_path)))


runCmd: settings clear -all
output: 

runCmd: settings set symbols.enable-external-lookup false
output: 

runCmd: settings set target.inherit-tcc true
output: 

runCmd: settings set target.detach-on-error false
output: 

runCmd: settings set target.auto-apply-fixits false
output: 

runCmd: settings set plugin.process.gdb-remote.packet-timeout 60
output: 

runCmd: settings set symbols.clang-modules-cache-path "/Users/buildslave/jenkins/workspace/lldb-cmake-sanitized/lldb-build/lldb-test-build.noindex/module-cache-lldb/lldb-api"
output: 

runCmd: settings set use-color false
output: 

runCmd: setting set target.prefer-dynamic-value no-dynamic-values
output: 

runCmd: settings set target.env-vars ASAN_OPTIONS=detect_stack_use_after_return=1 DYLD_INSERT_LIBRARIES=/Users/buildslave/jenkins/workspace/lldb-cmake-sanitized/host-compiler/lib/clang/13.0.99/lib/darwin/libclang_rt.asan_osx_dynamic.dylib
output: 

Adding tearDown hook:             lambda: self.run_platform_command(
                "rm %s" %
                (pid_file_path)))


FAIL: LLDB (/Users/buildslave/jenkins/workspace/lldb-cmake-sanitized/host-compiler/bin/clang-x86_64) :: test_function_starts_no_binary (TestFunctionStarts.FunctionStartsTestCase)
<bound method SBProcess.Kill of <lldb.SBProcess; proxy of <Swig Object of type 'lldb::SBProcess *' at 0x10cd88ae0> >>: success

Executing tearDown hook:             lambda: self.run_platform_command(
                "rm %s" %
                (pid_file_path)))


Restore dir to: /Users/buildslave/jenkins/workspace/lldb-cmake-sanitized/lldb-build/tools/lldb/test
======================================================================
FAIL: test_function_starts_binary (TestFunctionStarts.FunctionStartsTestCase)
   Test that we make synthetic symbols when we have the binary.
----------------------------------------------------------------------
Traceback (most recent call last):
  File "/Users/buildslave/jenkins/workspace/lldb-cmake-sanitized/llvm-project/lldb/test/API/macosx/function-starts/TestFunctionStarts.py", line 26, in test_function_starts_binary
    self.do_function_starts(False)
  File "/Users/buildslave/jenkins/workspace/lldb-cmake-sanitized/llvm-project/lldb/test/API/macosx/function-starts/TestFunctionStarts.py", line 84, in do_function_starts
    self.assertTrue(name.endswith("$$StripMe"))
AssertionError: False is not True
Config=x86_64-/Users/buildslave/jenkins/workspace/lldb-cmake-sanitized/host-compiler/bin/clang
======================================================================
FAIL: test_function_starts_no_binary (TestFunctionStarts.FunctionStartsTestCase)
   Test that we make synthetic symbols when we don't have the binary
----------------------------------------------------------------------
Traceback (most recent call last):
  File "/Users/buildslave/jenkins/workspace/lldb-cmake-sanitized/llvm-project/lldb/test/API/macosx/function-starts/TestFunctionStarts.py", line 34, in test_function_starts_no_binary
    self.do_function_starts(True)
  File "/Users/buildslave/jenkins/workspace/lldb-cmake-sanitized/llvm-project/lldb/test/API/macosx/function-starts/TestFunctionStarts.py", line 84, in do_function_starts
    self.assertTrue(name.endswith("$$StripMe"))
AssertionError: False is not True
Config=x86_64-/Users/buildslave/jenkins/workspace/lldb-cmake-sanitized/host-compiler/bin/clang
----------------------------------------------------------------------
Ran 2 tests in 5.232s

RESULT: FAILED (0 passes, 2 failures, 0 errors, 0 skipped, 0 expected failures, 0 unexpected successes)

--

********************
PASS: lldb-unit :: Utility/./UtilityTests/BinaryStreamTest.PutSLEB128EightBytes (2346 of 2355)
PASS: lldb-shell :: Driver/TestFile.test (2347 of 2355)
PASS: lldb-api :: functionalities/pre_run_dylibs/TestPreRunDylibs.py (2348 of 2355)
PASS: lldb-api :: functionalities/data-formatter/data-formatter-objc/cmtime/TestDataFormatterCMTime.py (2349 of 2355)
PASS: lldb-unit :: Process/gdb-remote/./ProcessGdbRemoteTests/GDBRemoteClientBaseTest.SendContinueDelegateInterface (2350 of 2355)
PASS: lldb-api :: functionalities/data-formatter/setvaluefromcstring/TestSetValueFromCString.py (2351 of 2355)
UNSUPPORTED: lldb-shell :: Register/x86-gp-read.test (2352 of 2355)
PASS: lldb-api :: functionalities/data-formatter/nssetsynth/TestNSSetSynthetic.py (2353 of 2355)
PASS: lldb-api :: lang/c/bitfields/TestBitfields.py (2354 of 2355)
PASS: lldb-api :: macosx/skinny-corefile/TestSkinnyCorefile.py (2355 of 2355)
Slowest Tests:
--------------------------------------------------------------------------
263.49s: lldb-api :: tools/lldb-server/TestLldbGdbServer.py
143.78s: lldb-api :: functionalities/memory-region/TestMemoryRegion.py
127.36s: lldb-api :: api/multithreaded/TestMultithreaded.py
114.99s: lldb-api :: macosx/skinny-corefile/TestSkinnyCorefile.py
91.21s: lldb-api :: functionalities/gdb_remote_client/TestWasm.py
84.07s: lldb-api :: types/TestLongTypesExpr.py
72.10s: lldb-api :: lang/objc/exceptions/TestObjCExceptions.py
71.30s: lldb-api :: commands/expression/import-std-module/queue/TestQueueFromStdModule.py
68.54s: lldb-api :: commands/expression/import-std-module/stack/TestStackFromStdModule.py
65.51s: lldb-api :: lang/cpp/namespace/TestNamespaceLookup.py
63.05s: lldb-api :: lang/objc/objc-new-syntax/TestObjCNewSyntaxLiteral.py
61.88s: lldb-api :: lang/objc/hidden-ivars/TestHiddenIvars.py
58.57s: lldb-api :: commands/expression/import-std-module/vector/TestVectorFromStdModule.py
57.80s: lldb-api :: lang/objc/foundation/TestObjCMethods.py
53.06s: lldb-api :: commands/expression/import-std-module/deque-basic/TestDequeFromStdModule.py
52.52s: lldb-api :: types/TestIntegerTypeExpr.py
49.81s: lldb-api :: tools/lldb-server/TestGdbRemoteThreadsInStopReply.py
49.33s: lldb-api :: python_api/target/TestTargetAPI.py
48.63s: lldb-api :: commands/expression/import-std-module/vector-dbg-info-content/TestDbgInfoContentVectorFromStdModule.py
47.35s: lldb-api :: lang/objc/objc-new-syntax/TestObjCNewSyntaxArray.py

Tests Times:
--------------------------------------------------------------------------
[   Range   ] :: [               Percentage               ] :: [  Count  ]
--------------------------------------------------------------------------
[260s,280s) :: [                                        ] :: [   1/2355]
[240s,260s) :: [                                        ] :: [   0/2355]
[220s,240s) :: [                                        ] :: [   0/2355]
[200s,220s) :: [                                        ] :: [   0/2355]
[180s,200s) :: [                                        ] :: [   0/2355]
[160s,180s) :: [                                        ] :: [   0/2355]
[140s,160s) :: [                                        ] :: [   1/2355]
[120s,140s) :: [                                        ] :: [   2/2355]
[100s,120s) :: [                                        ] :: [   0/2355]
[ 80s,100s) :: [                                        ] :: [   2/2355]
[ 60s, 80s) :: [                                        ] :: [   8/2355]
[ 40s, 60s) :: [                                        ] :: [  17/2355]
[ 20s, 40s) :: [*                                       ] :: [  67/2355]
[  0s, 20s) :: [**************************************  ] :: [2257/2355]
--------------------------------------------------------------------------
********************
Failed Tests (6):
  lldb-api :: lang/cpp/member-and-local-vars-with-same-name/TestMembersAndLocalsWithSameName.py
  lldb-api :: macosx/dyld-trie-symbols/TestDyldTrieSymbols.py
  lldb-api :: macosx/function-starts/TestFunctionStarts.py
  lldb-api :: tools/lldb-vscode/breakpoint/TestVSCode_setBreakpoints.py
  lldb-api :: tools/lldb-vscode/breakpoint/TestVSCode_setFunctionBreakpoints.py
  lldb-api :: tools/lldb-vscode/evaluate/TestVSCode_evaluate.py


Testing Time: 2431.10s
  Unsupported      :  212
  Passed           : 2127
  Expectedly Failed:   10
  Failed           :    6
FAILED: tools/lldb/test/CMakeFiles/check-lldb 
cd /Users/buildslave/jenkins/workspace/lldb-cmake-sanitized/lldb-build/tools/lldb/test && /usr/local/Frameworks/Python.framework/Versions/3.7/bin/python3.7 /Users/buildslave/jenkins/workspace/lldb-cmake-sanitized/lldb-build/./bin/llvm-lit -v --time-tests --shuffle --xunit-xml-output=/Users/buildslave/jenkins/workspace/lldb-cmake-sanitized/test/results.xml -v -j 4 --timeout 1200 /Users/buildslave/jenkins/workspace/lldb-cmake-sanitized/lldb-build/tools/lldb/test
ninja: build stopped: subcommand failed.
Command failed: Command '['/usr/bin/env', 'TERM=vt100', '/usr/local/bin/ninja', '-v', 'check-lldb']' returned non-zero exit status 1.
Command: ['/usr/bin/env', 'TERM=vt100', '/usr/local/bin/ninja', '-v', 'check-lldb']