Console Output

Skipping 9,589 KB.. Full Log
PASS: lldb-unit :: Host/./HostTests/SocketTests/SocketTest.DecodeHostAndPort/ipv4 (1642 of 2355)
PASS: lldb-unit :: Utility/./UtilityTests/StreamTest.AddressRangeInvalidRange (1643 of 2355)
PASS: lldb-shell :: ObjectFile/ELF/aarch64-relocations.yaml (1644 of 2355)
PASS: lldb-unit :: Utility/./UtilityTests/SerializationRountripTest.SerializeDeserializeObjectReference (1645 of 2355)
PASS: lldb-shell :: Commands/command-image-lookup.yaml (1646 of 2355)
PASS: lldb-api :: types/TestFloatTypesExpr.py (1647 of 2355)
PASS: lldb-unit :: Utility/./UtilityTests/StringListTest.ShiftMove (1648 of 2355)
PASS: lldb-unit :: UnwindAssembly/x86/./UnwindAssemblyx86Tests/Testx86AssemblyInspectionEngine.TestSimple32bitFrameFunction (1649 of 2355)
PASS: lldb-unit :: Process/minidump/./LLDBMinidumpTests/MinidumpParserTest.GetFilteredModuleList (1650 of 2355)
UNSUPPORTED: lldb-api :: python_api/event/TestEvents.py (1651 of 2355)
UNSUPPORTED: lldb-api :: benchmarks/libcxxlist/TestBenchmarkLibcxxList.py (1652 of 2355)
PASS: lldb-api :: macosx/find-app-in-bundle/TestFindAppInBundle.py (1653 of 2355)
PASS: lldb-api :: macosx/lc-note/firmware-corefile/TestFirmwareCorefiles.py (1654 of 2355)
PASS: lldb-shell :: Quit/TestQuitExitCodeHex0.test (1655 of 2355)
PASS: lldb-unit :: Expression/./ExpressionTests/DiagnosticManagerTest.PutStringSeverities (1656 of 2355)
PASS: lldb-unit :: Utility/./UtilityTests/StringListTest.AppendListCStringArrayEmpty (1657 of 2355)
UNSUPPORTED: lldb-api :: iohandler/completion/TestIOHandlerCompletion.py (1658 of 2355)
PASS: lldb-shell :: Reproducer/TestDriverOptions.test (1659 of 2355)
PASS: lldb-unit :: Utility/./UtilityTests/StringListTest.SplitIntoLinesEmpty (1660 of 2355)
PASS: lldb-unit :: Utility/./UtilityTests/StringExtractorTest.DecodeHexU8_Exact (1661 of 2355)
PASS: lldb-api :: functionalities/wrong_commands/TestWrongCommands.py (1662 of 2355)
PASS: lldb-api :: functionalities/data-formatter/data-formatter-objc/TestDataFormatterObjCNSData.py (1663 of 2355)
PASS: lldb-shell :: SymbolFile/Breakpad/line-table-mixed-path-styles.test (1664 of 2355)
PASS: lldb-unit :: Utility/./UtilityTests/DataExtractorTest.GetDouble (1665 of 2355)
PASS: lldb-api :: functionalities/breakpoint/consecutive_breakpoints/TestConsecutiveBreakpoints.py (1666 of 2355)
PASS: lldb-unit :: Host/./HostTests/SocketTests/SocketTest.TCPListen0GetPort/ipv6 (1667 of 2355)
PASS: lldb-api :: lang/cpp/this_class_type_mixing/TestThisClassTypeMixing.py (1668 of 2355)
PASS: lldb-api :: functionalities/thread/concurrent_events/TestConcurrentTwoBreakpointsOneSignal.py (1669 of 2355)
PASS: lldb-shell :: ObjectFile/Breakpad/sections.test (1670 of 2355)
PASS: lldb-api :: tools/lldb-server/TestGdbRemoteExitCode.py (1671 of 2355)
PASS: lldb-unit :: Utility/./UtilityTests/ArgsTest.TestInsertArg (1672 of 2355)
PASS: lldb-shell :: SymbolFile/Breakpad/unwind-via-stack-cfi.test (1673 of 2355)
PASS: lldb-unit :: Utility/./UtilityTests/StreamTest.AddressSuffix (1674 of 2355)
PASS: lldb-unit :: DataFormatter/./LLDBFormatterTests/StringPrinterTests.CxxUTF8 (1675 of 2355)
PASS: lldb-unit :: Utility/./UtilityTests/OptionsWithRawTest.EmptyArgsOnlySuffix (1676 of 2355)
PASS: lldb-unit :: Utility/./UtilityTests/StringListTest.InsertStringAtIndexEnd (1677 of 2355)
PASS: lldb-shell :: SymbolFile/DWARF/x86/dir-separator-no-comp-dir-relative-name.s (1678 of 2355)
UNSUPPORTED: lldb-api :: functionalities/darwin_log/filter/exact_match/activity-chain/TestDarwinLogFilterMatchActivityChain.py (1679 of 2355)
PASS: lldb-unit :: UnwindAssembly/x86/./UnwindAssemblyx86Tests/Testx86AssemblyInspectionEngine.TestPushEDI (1680 of 2355)
PASS: lldb-unit :: Process/gdb-remote/./ProcessGdbRemoteTests/GDBRemoteCommunicationClientTest.GetModulesInfoInvalidResponse (1681 of 2355)
PASS: lldb-api :: python_api/process/TestProcessAPI.py (1682 of 2355)
PASS: lldb-api :: api/multiple-debuggers/TestMultipleDebuggers.py (1683 of 2355)
PASS: lldb-unit :: UnwindAssembly/x86/./UnwindAssemblyx86Tests/Testx86AssemblyInspectionEngine.TestPushR12 (1684 of 2355)
PASS: lldb-api :: types/TestFloatTypes.py (1685 of 2355)
PASS: lldb-unit :: Utility/./UtilityTests/UriParserTest.SchemeHostSeparator4 (1686 of 2355)
UNSUPPORTED: lldb-api :: commands/expression/call-restarts/TestCallThatRestarts.py (1687 of 2355)
PASS: lldb-api :: iohandler/resize/TestIOHandlerResizeNoEditline.py (1688 of 2355)
PASS: lldb-api :: functionalities/signal/handle-abrt/TestHandleAbort.py (1689 of 2355)
PASS: lldb-unit :: Utility/./UtilityTests/StringExtractorTest.GetNameColonValueNoColon (1690 of 2355)
PASS: lldb-api :: lang/cpp/static_methods/TestCPPStaticMethods.py (1691 of 2355)
PASS: lldb-unit :: Utility/./UtilityTests/StringExtractorTest.GetHexBytes_OddPair2 (1692 of 2355)
PASS: lldb-api :: commands/watchpoints/watchpoint_commands/command/TestWatchpointCommandLLDB.py (1693 of 2355)
PASS: lldb-api :: functionalities/step-avoids-no-debug/TestStepNoDebug.py (1694 of 2355)
PASS: lldb-api :: functionalities/dynamic_value_child_count/TestDynamicValueChildCount.py (1695 of 2355)
PASS: lldb-unit :: Utility/./UtilityTests/LogChannelTest.Enable (1696 of 2355)
PASS: lldb-api :: lang/objc/modules-non-objc-target/TestObjCModulesNonObjCTarget.py (1697 of 2355)
PASS: lldb-unit :: UnwindAssembly/x86/./UnwindAssemblyx86Tests/Testx86AssemblyInspectionEngine.TestPopR13 (1698 of 2355)
PASS: lldb-api :: functionalities/thread/concurrent_events/TestConcurrentCrashWithWatchpoint.py (1699 of 2355)
PASS: lldb-api :: functionalities/memory/cache/TestMemoryCache.py (1700 of 2355)
PASS: lldb-api :: functionalities/inferior-crashing/TestInferiorCrashingStep.py (1701 of 2355)
PASS: lldb-shell :: SymbolFile/DWARF/x86/split-dwarf-multiple-cu.ll (1702 of 2355)
PASS: lldb-api :: functionalities/thread/concurrent_events/TestConcurrentManyWatchpoints.py (1703 of 2355)
PASS: lldb-api :: lang/cpp/thread_local/TestThreadLocal.py (1704 of 2355)
PASS: lldb-unit :: Utility/./UtilityTests/OptionsWithRawTest.SingleWordSuffix (1705 of 2355)
PASS: lldb-unit :: Utility/./UtilityTests/StringExtractorTest.GetHexU8_Exact_NoEof (1706 of 2355)
PASS: lldb-unit :: Utility/./UtilityTests/StreamTest.PutCString (1707 of 2355)
PASS: lldb-shell :: ObjectFile/PDB/object.test (1708 of 2355)
PASS: lldb-api :: tools/lldb-server/register-reading/TestGdbRemoteGPacket.py (1709 of 2355)
PASS: lldb-shell :: SymbolFile/DWARF/x86/dwarf5-partial-index.cpp (1710 of 2355)
PASS: lldb-unit :: Expression/./ExpressionTests/CppModuleConfigurationTest.IgnoreLibStdCpp (1711 of 2355)
PASS: lldb-api :: commands/expression/unwind_expression/TestUnwindExpression.py (1712 of 2355)
PASS: lldb-unit :: Host/./HostTests/Host.GetEnvironment (1713 of 2355)
PASS: lldb-unit :: DataFormatter/./LLDBFormatterTests/TypeMatcherTests.RegexName (1714 of 2355)
PASS: lldb-api :: functionalities/thread/step_out/TestThreadStepOut.py (1715 of 2355)
PASS: lldb-api :: functionalities/scripted_process/TestScriptedProcess.py (1716 of 2355)
PASS: lldb-shell :: Minidump/Windows/broken-unwind.test (1717 of 2355)
PASS: lldb-api :: lang/cpp/rvalue-references/TestRvalueReferences.py (1718 of 2355)
PASS: lldb-api :: commands/add-dsym/uuid/TestAddDsymCommand.py (1719 of 2355)
PASS: lldb-api :: python_api/signals/TestSignalsAPI.py (1720 of 2355)
PASS: lldb-api :: lang/objc/objc-dyn-sbtype/TestObjCDynamicSBType.py (1721 of 2355)
PASS: lldb-api :: commands/platform/file/close/TestPlatformFileClose.py (1722 of 2355)
PASS: lldb-unit :: Process/gdb-remote/./ProcessGdbRemoteTests/GDBRemoteCommunicationClientTest.ReadMemoryTags (1723 of 2355)
PASS: lldb-shell :: ObjectFile/PECOFF/export-dllfunc.yaml (1724 of 2355)
PASS: lldb-api :: lang/objc/blocks/TestObjCIvarsInBlocks.py (1725 of 2355)
PASS: lldb-api :: macosx/universal/TestUniversal.py (1726 of 2355)
PASS: lldb-unit :: Interpreter/./InterpreterTests/OptionArgParserTest.toScriptLanguage (1727 of 2355)
PASS: lldb-unit :: Platform/./LLDBPlatformTests/PlatformDarwinTest.TestParseVersionBuildDir (1728 of 2355)
PASS: lldb-unit :: Utility/./UtilityTests/FileSpecTest.RemoveLastPathComponent (1729 of 2355)
PASS: lldb-unit :: Expression/./ExpressionTests/DiagnosticManagerTest.AppendMessageAttachToLastDiag (1730 of 2355)
PASS: lldb-unit :: Symbol/./SymbolTests/TestTypeSystemClang.TestGetTypeClassTypeOf (1731 of 2355)
PASS: lldb-unit :: Utility/./UtilityTests/StringListTest.CopyListEmpty (1732 of 2355)
PASS: lldb-unit :: Utility/./UtilityTests/UriParserTest.TypicalPortPathIPv6 (1733 of 2355)
PASS: lldb-unit :: SymbolFile/NativePDB/./SymbolFileNativePDBTests/PDBFPOProgramToDWARFExpressionTests.UnresolvedCyclicRegisterAssignmentReference (1734 of 2355)
PASS: lldb-unit :: Process/minidump/./LLDBMinidumpTests/RegisterContextMinidump.CheckRegisterContextMinidump_ARM (1735 of 2355)
PASS: lldb-api :: commands/watchpoints/watchpoint_count/TestWatchpointCount.py (1736 of 2355)
PASS: lldb-unit :: Utility/./UtilityTests/CompletionRequest.TryCompleteCurrentArgGood (1737 of 2355)
PASS: lldb-shell :: Register/Core/x86-64-netbsd-gp.test (1738 of 2355)
PASS: lldb-unit :: Utility/./UtilityTests/ScalarTest.LongLongAssigmentOperator (1739 of 2355)
PASS: lldb-api :: tools/lldb-vscode/breakpoint/TestVSCode_setExceptionBreakpoints.py (1740 of 2355)
PASS: lldb-unit :: Utility/./UtilityTests/ArchSpecTest.MergeFromMachOUnknown (1741 of 2355)
PASS: lldb-api :: commands/expression/function_template_specialization_temp_args/TestFunctionTemplateSpecializationTempArgs.py (1742 of 2355)
PASS: lldb-unit :: UnwindAssembly/x86/./UnwindAssemblyx86Tests/Testx86AssemblyInspectionEngine.TestPushRBPWithREX (1743 of 2355)
PASS: lldb-unit :: Symbol/./SymbolTests/TestTypeSystemClang.AddMethodToObjCObjectType (1744 of 2355)
PASS: lldb-unit :: Process/gdb-remote/./ProcessGdbRemoteTests/GDBRemoteCommunicationServerTest.SendErrorResponse_UnimplementedError (1745 of 2355)
PASS: lldb-unit :: Utility/./UtilityTests/RangeTest.DoesAdjoinOrIntersect (1746 of 2355)
PASS: lldb-api :: commands/help/TestHelp.py (1747 of 2355)
PASS: lldb-api :: functionalities/tail_call_frames/cross_dso/TestCrossDSOTailCalls.py (1748 of 2355)
PASS: lldb-unit :: Process/Utility/./ProcessUtilityTests/ProcMapTests/LinuxProcMapsTestFixture.ParseMapRegions/4 (1749 of 2355)
PASS: lldb-unit :: Expression/./ExpressionTests/CppModuleConfigurationTest.LibCppV2 (1750 of 2355)
PASS: lldb-api :: commands/expression/ignore-artificial-constructors/TestIgnoreArtificialConstructors.py (1751 of 2355)
PASS: lldb-unit :: Process/gdb-remote/./ProcessGdbRemoteTests/GDBRemoteCommunicationClientTest.GetQOffsets (1752 of 2355)
UNSUPPORTED: lldb-api :: benchmarks/frame_variable/TestFrameVariableResponse.py (1753 of 2355)
PASS: lldb-api :: commands/settings/TestSettings.py (1754 of 2355)
PASS: lldb-unit :: Process/minidump/./LLDBMinidumpTests/RegisterContextMinidump.ConvertMinidumpContext_x86_64 (1755 of 2355)
PASS: lldb-api :: functionalities/signal/TestSendSignal.py (1756 of 2355)
PASS: lldb-unit :: Symbol/./SymbolTests/SymbolsTest.TerminateLocateExecutableSymbolFileForUnknownExecutableAndUnknownSymbolFile (1757 of 2355)
PASS: lldb-unit :: Host/./HostTests/FileSystemTest.Readable (1758 of 2355)
PASS: lldb-unit :: Expression/./ExpressionTests/DiagnosticManagerTest.GetStringSeverityLabels (1759 of 2355)
PASS: lldb-unit :: Platform/./LLDBPlatformTests/PlatformDarwinTest.FindComponentInPath (1760 of 2355)
PASS: lldb-unit :: Process/minidump/./LLDBMinidumpTests/MinidumpParserTest.MinidumpDuplicateModuleMappedSecondHigh (1761 of 2355)
PASS: lldb-unit :: Process/minidump/./LLDBMinidumpTests/MinidumpParserTest.MinidumpDuplicateModuleMappedFirst (1762 of 2355)
PASS: lldb-api :: python_api/sbdata/TestSBData.py (1763 of 2355)
UNSUPPORTED: lldb-api :: functionalities/data-formatter/data-formatter-stl/libstdcpp/tuple/TestDataFormatterStdTuple.py (1764 of 2355)
PASS: lldb-api :: functionalities/data-formatter/dump_dynamic/TestDumpDynamic.py (1765 of 2355)
PASS: lldb-unit :: Utility/./UtilityTests/StringExtractorTest.GetHexU8_Extra (1766 of 2355)
PASS: lldb-unit :: Process/gdb-remote/./ProcessGdbRemoteTests/GDBRemoteClientBaseTest.SendContinueAndInterrupt2PacketBug (1767 of 2355)
PASS: lldb-shell :: SymbolFile/DWARF/x86/debug_line-relative_path.s (1768 of 2355)
PASS: lldb-unit :: Utility/./UtilityTests/StringListTest.JoinMultiCharSeparator (1769 of 2355)
PASS: lldb-unit :: Utility/./UtilityTests/DataExtractorTest.GetMaxU64 (1770 of 2355)
PASS: lldb-shell :: Reproducer/Functionalities/TestExpressionEvaluation.test (1771 of 2355)
PASS: lldb-unit :: Utility/./UtilityTests/UserIDResolver.GetUserName (1772 of 2355)
UNSUPPORTED: lldb-shell :: Register/x86-ymm-write.test (1773 of 2355)
PASS: lldb-shell :: SymbolFile/NativePDB/function-types-classes.cpp (1774 of 2355)
PASS: lldb-api :: tools/lldb-vscode/variables/TestVSCode_variables.py (1775 of 2355)
PASS: lldb-unit :: Utility/./UtilityTests/OptionsWithRawTest.UnterminatedQuote (1776 of 2355)
PASS: lldb-unit :: Utility/./UtilityTests/UriParserTest.BadPort (1777 of 2355)
PASS: lldb-api :: lang/c/tls_globals/TestTlsGlobals.py (1778 of 2355)
PASS: lldb-unit :: Core/./LLDBCoreTests/MangledTest.EmptyForInvalidName (1779 of 2355)
PASS: lldb-unit :: Language/Highlighting/./HighlighterTests/HighlighterTest.DefaultHighlighterWithCursor (1780 of 2355)
PASS: lldb-unit :: DataFormatter/./LLDBFormatterTests/TypeMatcherTests.GetMatchStringRegex (1781 of 2355)
PASS: lldb-unit :: ScriptInterpreter/Python/./ScriptInterpreterPythonTests/PythonDataObjectsTest.TestTypeNameResolutionNoDot (1782 of 2355)
FAIL: lldb-api :: macosx/dyld-trie-symbols/TestDyldTrieSymbols.py (1783 of 2355)
******************** TEST 'lldb-api :: macosx/dyld-trie-symbols/TestDyldTrieSymbols.py' FAILED ********************
Script:
--
/Users/buildslave/jenkins/workspace/lldb-cmake-sanitized/lldb-build/lldb-test-build.noindex/copied-python /Users/buildslave/jenkins/workspace/lldb-cmake-sanitized/llvm-project/lldb/test/API/dotest.py -u CXXFLAGS -u CFLAGS --codesign-identity lldb_codesign --arch x86_64 --build-dir /Users/buildslave/jenkins/workspace/lldb-cmake-sanitized/lldb-build/lldb-test-build.noindex -t --env TERM=vt100 --env LLVM_LIBS_DIR=/Users/buildslave/jenkins/workspace/lldb-cmake-sanitized/lldb-build/./lib --inferior-env ASAN_OPTIONS=detect_stack_use_after_return=1 --inferior-env DYLD_INSERT_LIBRARIES=/Users/buildslave/jenkins/workspace/lldb-cmake-sanitized/host-compiler/lib/clang/13.0.99/lib/darwin/libclang_rt.asan_osx_dynamic.dylib --arch x86_64 --build-dir /Users/buildslave/jenkins/workspace/lldb-cmake-sanitized/lldb-build/lldb-test-build.noindex --lldb-module-cache-dir /Users/buildslave/jenkins/workspace/lldb-cmake-sanitized/lldb-build/lldb-test-build.noindex/module-cache-lldb/lldb-api --clang-module-cache-dir /Users/buildslave/jenkins/workspace/lldb-cmake-sanitized/lldb-build/lldb-test-build.noindex/module-cache-clang/lldb-api --executable /Users/buildslave/jenkins/workspace/lldb-cmake-sanitized/lldb-build/./bin/lldb --compiler /Users/buildslave/jenkins/workspace/lldb-cmake-sanitized/host-compiler/bin/clang --dsymutil /Users/buildslave/jenkins/workspace/lldb-cmake-sanitized/lldb-build/./bin/dsymutil --llvm-tools-dir /Users/buildslave/jenkins/workspace/lldb-cmake-sanitized/lldb-build/./bin --lldb-libs-dir /Users/buildslave/jenkins/workspace/lldb-cmake-sanitized/lldb-build/./lib /Users/buildslave/jenkins/workspace/lldb-cmake-sanitized/llvm-project/lldb/test/API/macosx/dyld-trie-symbols -p TestDyldTrieSymbols.py
--
Exit Code: 1

Hide Details

Command Output (stdout): -- lldb version 13.0.99 (http://labmaster3.local/git/llvm-project.git revision 07a1f3513e2e3802671a0a4ca1edf2fe577fad03) clang revision 07a1f3513e2e3802671a0a4ca1edf2fe577fad03 llvm revision 07a1f3513e2e3802671a0a4ca1edf2fe577fad03 Skipping the following test categories: ['darwin-log', 'libstdcxx', 'dwo', 'llgs', 'fork']

Hide Details

-- Command Output (stderr): -- Change dir to: /Users/buildslave/jenkins/workspace/lldb-cmake-sanitized/llvm-project/lldb/test/API/macosx/dyld-trie-symbols runCmd: settings clear -all output:

Hide Details

runCmd: settings set symbols.enable-external-lookup false output:

Hide Details

runCmd: settings set target.inherit-tcc true output:

Hide Details

runCmd: settings set target.detach-on-error false output:

Hide Details

runCmd: settings set target.auto-apply-fixits false output:

Hide Details

runCmd: settings set plugin.process.gdb-remote.packet-timeout 60 output:

Hide Details

runCmd: settings set symbols.clang-modules-cache-path "/Users/buildslave/jenkins/workspace/lldb-cmake-sanitized/lldb-build/lldb-test-build.noindex/module-cache-lldb/lldb-api" output:

Hide Details

runCmd: settings set use-color false output:

Hide Details

runCmd: setting set target.prefer-dynamic-value no-dynamic-values output:

Hide Details

runCmd: settings set target.env-vars ASAN_OPTIONS=detect_stack_use_after_return=1 DYLD_INSERT_LIBRARIES=/Users/buildslave/jenkins/workspace/lldb-cmake-sanitized/host-compiler/lib/clang/13.0.99/lib/darwin/libclang_rt.asan_osx_dynamic.dylib output:

Hide Details

FAIL: LLDB (/Users/buildslave/jenkins/workspace/lldb-cmake-sanitized/host-compiler/bin/clang-x86_64) :: test_dyld_trie_symbols (TestDyldTrieSymbols.DyldTrieSymbolsTestCase) Restore dir to: /Users/buildslave/jenkins/workspace/lldb-cmake-sanitized/lldb-build/tools/lldb/test ====================================================================== FAIL: test_dyld_trie_symbols (TestDyldTrieSymbols.DyldTrieSymbolsTestCase) Test that we make create symbol table entries from the dyld trie data structure. ---------------------------------------------------------------------- Traceback (most recent call last): File "/Users/buildslave/jenkins/workspace/lldb-cmake-sanitized/llvm-project/lldb/test/API/macosx/dyld-trie-symbols/TestDyldTrieSymbols.py", line 66, in test_dyld_trie_symbols self.assertEqual(stripped_bazval_symbols.GetSize(), 1) AssertionError: 0 != 1 Config=x86_64-/Users/buildslave/jenkins/workspace/lldb-cmake-sanitized/host-compiler/bin/clang ---------------------------------------------------------------------- Ran 1 test in 3.197s

Hide Details

RESULT: FAILED (0 passes, 1 failures, 0 errors, 0 skipped, 0 expected failures, 0 unexpected successes)

Hide Details

--

Hide Details

******************** PASS: lldb-unit :: Host/./HostTests/NativeProcessProtocolTest.ReadCStringFromMemory_MaxSize (1784 of 2355) PASS: lldb-unit :: Utility/./UtilityTests/StreamTest.PutHex64ByteOrderBig (1785 of 2355) PASS: lldb-shell :: Subprocess/vfork-follow-parent.test (1786 of 2355) PASS: lldb-unit :: ObjectFile/ELF/./ObjectFileELFTests/ObjectFileELFTest.GetSymtab_NoSymEntryPointArmThumbAddressClass (1787 of 2355) PASS: lldb-unit :: Core/./LLDBCoreTests/FormatEntityTest.DefinitionConstructionNameTypeChildren (1788 of 2355) PASS: lldb-unit :: Utility/./UtilityTests/DataExtractorTest.GetCStrAtNullOffset (1789 of 2355) UNSUPPORTED: lldb-shell :: Register/x86-64-zmm-read.test (1790 of 2355) PASS: lldb-api :: lang/objc/foundation/TestRuntimeTypes.py (1791 of 2355) UNSUPPORTED: lldb-api :: tools/lldb-server/TestGdbRemoteAuxvSupport.py (1792 of 2355) PASS: lldb-unit :: Process/./ProcessEventDataTests/ProcessEventDataTest.ShouldStop (1793 of 2355) PASS: lldb-unit :: SymbolFile/NativePDB/./SymbolFileNativePDBTests/PDBFPOProgramToDWARFExpressionTests.InvalidOpUnary (1794 of 2355) PASS: lldb-api :: lang/cpp/namespace_definitions/TestNamespaceDefinitions.py (1795 of 2355) PASS: lldb-shell :: Quit/TestQuitExitCode-30.test (1796 of 2355) PASS: lldb-unit :: Utility/./UtilityTests/StringListTest.SplitIntoLines (1797 of 2355) PASS: lldb-unit :: Utility/./UtilityTests/StreamTest.PutHex16ByteOrderLittle (1798 of 2355) PASS: lldb-api :: functionalities/thread/concurrent_events/TestConcurrentCrashWithWatchpointBreakpointSignal.py (1799 of 2355) PASS: lldb-shell :: SymbolFile/NativePDB/source-list.cpp (1800 of 2355) PASS: lldb-unit :: Utility/./UtilityTests/StringExtractorTest.GetHexBytesAvail_FullString (1801 of 2355) PASS: lldb-api :: lang/cpp/extern_c/TestExternCSymbols.py (1802 of 2355) PASS: lldb-api :: commands/expression/xvalue/TestXValuePrinting.py (1803 of 2355) PASS: lldb-unit :: Utility/./UtilityTests/FileSpecTest.GuessPathStyle (1804 of 2355) PASS: lldb-unit :: Utility/./UtilityTests/NameMatchesTest.RegularExpression (1805 of 2355) PASS: lldb-unit :: Expression/./ExpressionTests/DiagnosticManagerTest.FixedExpression (1806 of 2355) PASS: lldb-unit :: Utility/./UtilityTests/CompletionRequest.DuplicateFiltering (1807 of 2355) PASS: lldb-shell :: SymbolFile/NativePDB/break-by-function.cpp (1808 of 2355) PASS: lldb-api :: lang/objc/objc-static-method/TestObjCStaticMethod.py (1809 of 2355) XFAIL: lldb-shell :: Unwind/prefer-debug-over-eh-frame.test (1810 of 2355) PASS: lldb-api :: driver/batch_mode/TestBatchMode.py (1811 of 2355) XFAIL: lldb-shell :: Register/x86-fp-write.test (1812 of 2355) PASS: lldb-unit :: Symbol/./SymbolTests/TestClangASTImporter.RecordLayout (1813 of 2355) PASS: lldb-api :: lang/objc/objc-class-method/TestObjCClassMethod.py (1814 of 2355) PASS: lldb-unit :: UnwindAssembly/x86/./UnwindAssemblyx86Tests/Testx86AssemblyInspectionEngine.Test32bitFramelessSmallStackFrame (1815 of 2355) PASS: lldb-unit :: Utility/./UtilityTests/DataExtractorTest.GetMaxS64 (1816 of 2355) PASS: lldb-api :: functionalities/plugins/python_os_plugin/stepping_plugin_threads/TestOSPluginStepping.py (1817 of 2355) PASS: lldb-unit :: Utility/./UtilityTests/SerializationRountripTest.SerializeDeserializeCStringArrayNullptrElem (1818 of 2355) PASS: lldb-api :: commands/expression/context-object-objc/TestContextObjectObjc.py (1819 of 2355) PASS: lldb-shell :: Error/assert.test (1820 of 2355) PASS: lldb-unit :: Process/gdb-remote/./ProcessGdbRemoteTests/PortMapTest.FreePort (1821 of 2355) PASS: lldb-unit :: Core/./LLDBCoreTests/DumpDataExtractorTest.Formats (1822 of 2355) PASS: lldb-api :: python_api/value/change_values/TestChangeValueAPI.py (1823 of 2355) PASS: lldb-unit :: Process/minidump/./LLDBMinidumpTests/MinidumpParserTest.GetThreadContext_x86_32 (1824 of 2355) PASS: lldb-api :: functionalities/gdb_remote_client/TestJLink6Armv7RegisterDefinition.py (1825 of 2355) PASS: lldb-unit :: Utility/./UtilityTests/StringExtractorTest.InitEmpty (1826 of 2355) PASS: lldb-api :: lang/cpp/breakpoint-commands/TestCPPBreakpointCommands.py (1827 of 2355) PASS: lldb-shell :: SymbolFile/NativePDB/globals-bss.cpp (1828 of 2355) PASS: lldb-unit :: Utility/./UtilityTests/StringExtractorTest.DecodeHexU8_InvalidHex (1829 of 2355) PASS: lldb-api :: lang/cpp/stl/TestStdCXXDisassembly.py (1830 of 2355) PASS: lldb-unit :: Symbol/./SymbolTests/TestTypeSystemClang.TestGetTypeClassNested (1831 of 2355) PASS: lldb-unit :: Core/./LLDBCoreTests/DumpDataExtractorTest.NullStream (1832 of 2355) PASS: lldb-api :: lang/cpp/constructors/TestCppConstructors.py (1833 of 2355) PASS: lldb-unit :: UnwindAssembly/x86/./UnwindAssemblyx86Tests/Testx86AssemblyInspectionEngine.TestSimplex86_64Augmented (1834 of 2355) PASS: lldb-unit :: Utility/./UtilityTests/FileSpecTest.EqualDotsPosix (1835 of 2355) PASS: lldb-unit :: Core/./LLDBCoreTests/ModuleSpecTest.InvalidInMemoryBufferValidFile (1836 of 2355) PASS: lldb-api :: functionalities/thread/concurrent_events/TestConcurrentWatchBreakDelay.py (1837 of 2355) PASS: lldb-shell :: SymbolFile/DWARF/x86/debug_loc_and_loclists.s (1838 of 2355) PASS: lldb-unit :: Host/./HostTests/SocketTests/SocketTest.TCPListen0ConnectAccept/ipv4 (1839 of 2355) PASS: lldb-api :: functionalities/breakpoint/step_over_breakpoint/TestStepOverBreakpoint.py (1840 of 2355) UNSUPPORTED: lldb-api :: functionalities/exec/TestExec.py (1841 of 2355) PASS: lldb-unit :: Thread/./ThreadTests/ThreadTest.SetStopInfo (1842 of 2355) PASS: lldb-unit :: Utility/./UtilityTests/StreamTest.AddressRangeSize (1843 of 2355) PASS: lldb-shell :: Commands/command-stop-hook-output.test (1844 of 2355) PASS: lldb-api :: functionalities/breakpoint/breakpoint_set_restart/TestBreakpointSetRestart.py (1845 of 2355) PASS: lldb-api :: arm/emulation/TestEmulations.py (1846 of 2355) PASS: lldb-shell :: ObjectFile/ELF/riscv-arch.yaml (1847 of 2355) PASS: lldb-shell :: SymbolFile/DWARF/x86/DW_AT_location-DW_AT_const_value.s (1848 of 2355) PASS: lldb-unit :: ObjectFile/MachO/./ObjectFileMachOTests/ObjectFileMachOTest.ModuleFromSharedCacheInfo (1849 of 2355) PASS: lldb-shell :: SymbolFile/DWARF/x86/childless-compile-unit.s (1850 of 2355) PASS: lldb-unit :: Utility/./UtilityTests/StreamTeeTest.Constructor2Streams (1851 of 2355) PASS: lldb-unit :: Utility/./UtilityTests/ArgsTest.TestTrailingBackslash (1852 of 2355) PASS: lldb-api :: functionalities/postmortem/minidump-new/TestMiniDumpUUID.py (1853 of 2355) PASS: lldb-shell :: ObjectFile/ELF/section-types-edgecases.yaml (1854 of 2355) PASS: lldb-unit :: SymbolFile/DWARF/./SymbolFileDWARFTests/SymbolFileDWARFTests.ParseArangesNonzeroSegmentSize (1855 of 2355) PASS: lldb-api :: functionalities/lazy-loading/TestLazyLoading.py (1856 of 2355) PASS: lldb-unit :: Utility/./UtilityTests/StreamTest.PutHex16ByteOrderBig (1857 of 2355) PASS: lldb-shell :: Breakpoint/jit-loader_jitlink_elf.test (1858 of 2355) PASS: lldb-shell :: Register/Core/x86-64-freebsd-fp.test (1859 of 2355) PASS: lldb-api :: functionalities/testid/TestTestId.py (1860 of 2355) UNSUPPORTED: lldb-shell :: SymbolFile/NativePDB/ast-functions-msvc.cpp (1861 of 2355) PASS: lldb-unit :: Utility/./UtilityTests/StateTest.Formatv (1862 of 2355) PASS: lldb-api :: lang/objc/modules-auto-import/TestModulesAutoImport.py (1863 of 2355) PASS: lldb-unit :: Target/./TargetTests/PathMappingListTest.AbsoluteTests (1864 of 2355) PASS: lldb-shell :: Settings/TestFrameFormatNoColor.test (1865 of 2355) PASS: lldb-shell :: Breakpoint/debug_addrx.test (1866 of 2355) PASS: lldb-shell :: SymbolFile/NativePDB/locate-pdb.cpp (1867 of 2355) PASS: lldb-unit :: Utility/./UtilityTests/ScalarTest.GetBytes (1868 of 2355) PASS: lldb-unit :: ScriptInterpreter/Python/./ScriptInterpreterPythonTests/PythonDataObjectsTest.TestGlobalNameResolutionWithDot (1869 of 2355) PASS: lldb-unit :: Process/gdb-remote/./ProcessGdbRemoteTests/PortMapTest.FreePortForProcess (1870 of 2355) PASS: lldb-unit :: Process/gdb-remote/./ProcessGdbRemoteTests/GDBRemoteClientBaseTest.SendContinueAndAsyncSignal (1871 of 2355) PASS: lldb-shell :: Commands/command-regex-unalias.test (1872 of 2355) PASS: lldb-api :: commands/frame/diagnose/virtual-method-call/TestDiagnoseDereferenceVirtualMethodCall.py (1873 of 2355) PASS: lldb-unit :: Editline/./EditlineTests/EditlineTestFixture.EditlineReceivesSingleLineText (1874 of 2355) UNSUPPORTED: lldb-shell :: SymbolFile/PDB/function-nested-block.test (1875 of 2355) PASS: lldb-api :: functionalities/recursion/TestValueObjectRecursion.py (1876 of 2355) PASS: lldb-shell :: Driver/TestPositionalArgs.test (1877 of 2355) PASS: lldb-unit :: Expression/./ExpressionTests/ClangHostTest.MacOSX (1878 of 2355) PASS: lldb-api :: functionalities/data-formatter/data-formatter-stl/libcxx/multimap/TestDataFormatterLibccMultiMap.py (1879 of 2355) PASS: lldb-unit :: Utility/./UtilityTests/DataExtractorTest.GetCStrUnterminated (1880 of 2355) PASS: lldb-unit :: Target/./TargetTests/PathMappingListTest.RemapRoot (1881 of 2355) UNSUPPORTED: lldb-api :: functionalities/data-formatter/data-formatter-stl/libstdcpp/unique_ptr/TestDataFormatterStdUniquePtr.py (1882 of 2355) PASS: lldb-shell :: Process/Optimization.test (1883 of 2355) PASS: lldb-shell :: BuildScript/compiler-full-path.test (1884 of 2355) PASS: lldb-unit :: Utility/./UtilityTests/StringExtractorTest.DecodeHexU8_Underflow2 (1885 of 2355) PASS: lldb-unit :: Utility/./UtilityTests/ArgsTest.Yaml (1886 of 2355) PASS: lldb-shell :: ObjectFile/MachO/subsections.yaml (1887 of 2355) PASS: lldb-unit :: UnwindAssembly/x86/./UnwindAssemblyx86Tests/Testx86AssemblyInspectionEngine.TestDisassemblyMidFunctionEpilogues (1888 of 2355) PASS: lldb-api :: commands/expression/import-std-module/stack/TestStackFromStdModule.py (1889 of 2355) PASS: lldb-shell :: SymbolFile/DWARF/x86/debug_loc.s (1890 of 2355) UNSUPPORTED: lldb-shell :: SymbolFile/NativePDB/stack_unwinding01.cpp (1891 of 2355) PASS: lldb-api :: functionalities/data-formatter/type_summary_list_arg/TestTypeSummaryListArg.py (1892 of 2355) PASS: lldb-unit :: Utility/./UtilityTests/OptionsWithRawTest.EmptySuffix (1893 of 2355) PASS: lldb-unit :: Utility/./UtilityTests/UUIDTest.StringConverion (1894 of 2355) PASS: lldb-unit :: Symbol/./SymbolTests/TestTypeSystemClang.GetExeModuleWhenMissingSymbolFile (1895 of 2355) PASS: lldb-api :: tools/lldb-vscode/coreFile/TestVSCode_coreFile.py (1896 of 2355) PASS: lldb-shell :: Quit/TestQuitExitCodeHexA.test (1897 of 2355) UNSUPPORTED: lldb-shell :: SymbolFile/DWARF/split-dwarf-expression-eval-bug.cpp (1898 of 2355) UNSUPPORTED: lldb-shell :: SymbolFile/DWARF/x86/DW_TAG_GNU_call_site-DW_AT_low_pc.s (1899 of 2355) PASS: lldb-unit :: Utility/./UtilityTests/BinaryStreamTest.PutSLEB128NineBytes (1900 of 2355) PASS: lldb-api :: functionalities/data-formatter/nsdictionarysynth/TestNSDictionarySynthetic.py (1901 of 2355) PASS: lldb-unit :: UnwindAssembly/x86/./UnwindAssemblyx86Tests/Testx86AssemblyInspectionEngine.TestStackRealign8BitDisp_i386 (1902 of 2355) PASS: lldb-api :: functionalities/thread/step_until/TestStepUntil.py (1903 of 2355) PASS: lldb-api :: functionalities/data-formatter/data-formatter-objc/TestDataFormatterObjCKVO.py (1904 of 2355) PASS: lldb-api :: functionalities/data-formatter/data-formatter-stl/libcxx/queue/TestDataFormatterLibcxxQueue.py (1905 of 2355) PASS: lldb-api :: commands/breakpoint/set/func-regex/TestBreakpointRegexError.py (1906 of 2355) PASS: lldb-shell :: lldb-server/TestGdbserverPort.test (1907 of 2355) PASS: lldb-unit :: Utility/./UtilityTests/StringExtractorTest.GetU64LittleEndian (1908 of 2355) UNSUPPORTED: lldb-shell :: Register/x86-db-read.test (1909 of 2355) PASS: lldb-unit :: Symbol/./SymbolTests/TestTypeSystemClang.TestConvertAccessTypeToAccessSpecifier (1910 of 2355) PASS: lldb-unit :: Process/gdb-remote/./ProcessGdbRemoteTests/GDBRemoteClientBaseTest.SendPacketAndReceiveResponseWithOutputSupport (1911 of 2355) PASS: lldb-api :: functionalities/target_var/no_vars/TestTargetVarNoVars.py (1912 of 2355) PASS: lldb-unit :: Expression/./ExpressionTests/ClangExpressionDeclMapTest.TestPersistentDeclLookup (1913 of 2355) PASS: lldb-unit :: ObjectFile/ELF/./ObjectFileELFTests/ObjectFileELFTest.GetModuleSpecifications_EarlySectionHeaders (1914 of 2355) PASS: lldb-api :: python_api/sbplatform/TestSBPlatform.py (1915 of 2355) PASS: lldb-unit :: Symbol/./SymbolTests/LineEntryTest.GetSameLineContiguousAddressRangeNoInlines (1916 of 2355) PASS: lldb-unit :: Utility/./UtilityTests/StringListTest.GetSize (1917 of 2355) PASS: lldb-unit :: debugserver/./debugserverTests/RNBSocket.LoopBackConnectIPv6 (1918 of 2355) PASS: lldb-unit :: Symbol/./SymbolTests/TestTypeSystemClang.TestRemoveFastQualifiers (1919 of 2355) PASS: lldb-shell :: Reproducer/TestDiscard.test (1920 of 2355) PASS: lldb-shell :: SymbolFile/DWARF/x86/DW_AT_low_pc-addrx.s (1921 of 2355) PASS: lldb-unit :: SymbolFile/DWARF/./SymbolFileDWARFTests/SymbolFileDWARFTests.TestAbbrevOrder1Start5 (1922 of 2355) UNSUPPORTED: lldb-api :: functionalities/darwin_log/filter/regex/category/TestDarwinLogFilterRegexCategory.py (1923 of 2355) PASS: lldb-api :: functionalities/unwind/noreturn/module-end/TestNoReturnModuleEnd.py (1924 of 2355) PASS: lldb-unit :: Host/./HostTests/MainLoopTest.TerminatesImmediately (1925 of 2355) UNSUPPORTED: lldb-shell :: ObjectFile/ELF/minidebuginfo-set-and-hit-breakpoint.test (1926 of 2355) PASS: lldb-api :: functionalities/value_md5_crash/TestValueMD5Crash.py (1927 of 2355) PASS: lldb-unit :: SymbolFile/DWARF/./SymbolFileDWARFTests/SymbolFileDWARFTests.TestAbbrevValidAttrNullForm (1928 of 2355) PASS: lldb-api :: macosx/macCatalyst/TestMacCatalyst.py (1929 of 2355) PASS: lldb-api :: commands/expression/test/TestExprs2.py (1930 of 2355) PASS: lldb-api :: lang/cpp/offsetof/TestOffsetofCpp.py (1931 of 2355) PASS: lldb-shell :: Driver/TestTarget.test (1932 of 2355) PASS: lldb-unit :: Platform/./LLDBPlatformTests/PlatformAppleSimulatorTest.TestHostPlatformToSim (1933 of 2355) PASS: lldb-unit :: Utility/./UtilityTests/SerializationRountripTest.SerializeDeserializeCStringNull (1934 of 2355) PASS: lldb-api :: functionalities/data-formatter/stringprinter/TestStringPrinter.py (1935 of 2355) PASS: lldb-api :: lang/c/bitfields/TestBitfields.py (1936 of 2355) PASS: lldb-unit :: Utility/./UtilityTests/StringExtractorTest.GetHexBytesAvail_OddPair2 (1937 of 2355) PASS: lldb-unit :: Core/./LLDBCoreTests/CommunicationTest.SynchronizeWhileClosing (1938 of 2355) PASS: lldb-api :: commands/watchpoints/multiple_threads/TestWatchpointMultipleThreads.py (1939 of 2355) PASS: lldb-unit :: Utility/./UtilityTests/StreamTeeTest.Assignment (1940 of 2355) PASS: lldb-api :: commands/expression/call-function/TestCallBuiltinFunction.py (1941 of 2355) PASS: lldb-unit :: Expression/./ExpressionTests/CppModuleConfigurationTest.AmbiguousLibCpp (1942 of 2355) PASS: lldb-shell :: SymbolFile/NativePDB/function-types-calling-conv.cpp (1943 of 2355) PASS: lldb-api :: commands/frame/diagnose/dereference-this/TestDiagnoseDereferenceThis.py (1944 of 2355) PASS: lldb-unit :: Platform/Android/./AdbClientTests/AdbClientTest.CreateByDeviceId_ByEnvVar (1945 of 2355) PASS: lldb-shell :: Reproducer/TestDebugSymbols.test (1946 of 2355) PASS: lldb-api :: functionalities/data-formatter/data-formatter-stl/libcxx/list/TestDataFormatterLibcxxList.py (1947 of 2355) UNSUPPORTED: lldb-shell :: SymbolFile/PDB/compilands.test (1948 of 2355) PASS: lldb-api :: python_api/default-constructor/TestDefaultConstructorForAPIObjects.py (1949 of 2355) PASS: lldb-unit :: Utility/./UtilityTests/UriParserTest.BadPort2 (1950 of 2355) PASS: lldb-shell :: SymbolFile/DWARF/clang-ast-from-dwarf-unamed-and-anon-structs.cpp (1951 of 2355) PASS: lldb-unit :: Utility/./UtilityTests/ArgsTest.BareSingleQuote (1952 of 2355) PASS: lldb-unit :: UnwindAssembly/x86/./UnwindAssemblyx86Tests/Testx86AssemblyInspectionEngine.TestSpillRegToStackViaMOVx86_64 (1953 of 2355) PASS: lldb-api :: lang/c/struct_types/TestStructTypes.py (1954 of 2355) PASS: lldb-api :: lang/cpp/function_refs/TestFunctionRefs.py (1955 of 2355) PASS: lldb-unit :: Utility/./UtilityTests/DataExtractorTest.UncommonAddressSize (1956 of 2355) PASS: lldb-unit :: Language/Highlighting/./HighlighterTests/HighlighterTest.ClangOperators (1957 of 2355) PASS: lldb-unit :: Process/gdb-remote/./ProcessGdbRemoteTests/GDBRemoteCommunicationClientTest.SaveRestoreRegistersNoSuffix (1958 of 2355) UNSUPPORTED: lldb-api :: commands/watchpoints/hello_watchlocation/TestWatchLocation.py (1959 of 2355) PASS: lldb-api :: lang/c/cpp_keyword_identifiers/TestCppKeywordsAsCIdentifiers.py (1960 of 2355) PASS: lldb-unit :: Utility/./UtilityTests/ArgsTest.ReplaceArgumentAtIndexShort (1961 of 2355) UNSUPPORTED: lldb-api :: lang/c/typedef/Testtypedef.py (1962 of 2355) PASS: lldb-unit :: Utility/./UtilityTests/StringListTest.JoinSingle (1963 of 2355) PASS: lldb-api :: tools/lldb-server/TestGdbRemote_vCont.py (1964 of 2355) PASS: lldb-api :: functionalities/plugins/command_plugin/TestPluginCommands.py (1965 of 2355) PASS: lldb-api :: types/TestIntegerTypeExpr.py (1966 of 2355) PASS: lldb-unit :: Utility/./UtilityTests/CompletionRequest.Constructor (1967 of 2355) UNSUPPORTED: lldb-api :: functionalities/thread/multi_break/TestMultipleBreakpoints.py (1968 of 2355) PASS: lldb-api :: lang/cpp/struct_with_keyword_name/TestStructWithKeywordName.py (1969 of 2355) PASS: lldb-unit :: Core/./LLDBCoreTests/ModuleSpecTest.TestELFFile (1970 of 2355) PASS: lldb-unit :: Utility/./UtilityTests/StringListTest.GetMaxStringLengthDecreasingSize (1971 of 2355) PASS: lldb-api :: functionalities/thread/concurrent_events/TestConcurrentTwoBreakpointsOneWatchpoint.py (1972 of 2355) PASS: lldb-api :: tools/lldb-vscode/step/TestVSCode_step.py (1973 of 2355) PASS: lldb-api :: lang/cpp/std-function-step-into-callable/TestStdFunctionStepIntoCallable.py (1974 of 2355) PASS: lldb-shell :: Minidump/dump-all.test (1975 of 2355) PASS: lldb-unit :: Core/./LLDBCoreTests/RichManglingContextTest.SwitchProvider (1976 of 2355) PASS: lldb-shell :: Commands/CommandScriptImmediateOutput/CommandScriptImmediateOutputFile.test (1977 of 2355) PASS: lldb-api :: functionalities/postmortem/mach-core/TestMachCore.py (1978 of 2355) PASS: lldb-api :: lang/c/offsetof/TestOffsetof.py (1979 of 2355) PASS: lldb-shell :: Expr/TestIRMemoryMap.test (1980 of 2355) PASS: lldb-api :: functionalities/thread/create_after_attach/TestCreateAfterAttach.py (1981 of 2355) PASS: lldb-unit :: Utility/./UtilityTests/UriParserTest.BracketedHostnameWithPortIPv6 (1982 of 2355) PASS: lldb-api :: lang/cpp/gmodules/TestWithModuleDebugging.py (1983 of 2355) PASS: lldb-unit :: Utility/./UtilityTests/GeneratorTest.Get (1984 of 2355) PASS: lldb-api :: lang/objc/foundation/TestObjCMethodsString.py (1985 of 2355) PASS: lldb-unit :: ObjectFile/Breakpad/./ObjectFileBreakpadTests/FuncRecord.parse (1986 of 2355) PASS: lldb-unit :: Utility/./UtilityTests/BinaryStreamTest.PutULEB128ThreeBytes (1987 of 2355) PASS: lldb-unit :: Process/gdb-remote/./ProcessGdbRemoteTests/GDBRemoteCommunicationClientTest.WriteRegister (1988 of 2355) PASS: lldb-api :: commands/reproducer/invalid-args/TestInvalidArgsReproducer.py (1989 of 2355) PASS: lldb-api :: python_api/name_lookup/TestNameLookup.py (1990 of 2355) PASS: lldb-unit :: ScriptInterpreter/Python/./ScriptInterpreterPythonTests/PythonDataObjectsTest.TestPythonIntegerToStructuredInteger (1991 of 2355) PASS: lldb-shell :: Driver/TestConvenienceVariables.test (1992 of 2355) PASS: lldb-unit :: Utility/./UtilityTests/UriParserTest.SchemeHostSeparator2 (1993 of 2355) PASS: lldb-unit :: Process/Utility/./ProcessUtilityTests/ProcMapTests/LinuxProcMapsTestFixture.ParseMapRegions/0 (1994 of 2355) PASS: lldb-unit :: Utility/./UtilityTests/StreamTest.AddressEmptyPrefix (1995 of 2355) PASS: lldb-api :: lang/objcxx/cpp_keywords_enabled/TestObjCppKeywordsEnabled.py (1996 of 2355) PASS: lldb-api :: functionalities/breakpoint/breakpoint_hit_count/TestBreakpointHitCount.py (1997 of 2355) PASS: lldb-unit :: ScriptInterpreter/Python/./ScriptInterpreterPythonTests/PythonDataObjectsTest.TestRun (1998 of 2355) PASS: lldb-unit :: Utility/./UtilityTests/CompletionRequest.TryCompleteCurrentArgMode (1999 of 2355) PASS: lldb-api :: functionalities/thread/crash_during_step/TestCrashDuringStep.py (2000 of 2355) PASS: lldb-unit :: Utility/./UtilityTests/AnsiTerminal.Basic (2001 of 2355) UNSUPPORTED: lldb-shell :: SymbolFile/DWARF/debug-types-expressions.test (2002 of 2355) PASS: lldb-shell :: Quit/TestQuitExitCodeTooManyArgs.test (2003 of 2355) PASS: lldb-unit :: Utility/./UtilityTests/StreamTest.Indent (2004 of 2355) PASS: lldb-shell :: Process/UnsupportedLanguage.test (2005 of 2355) PASS: lldb-unit :: Utility/./UtilityTests/GeneratorTest.Create (2006 of 2355) PASS: lldb-api :: commands/target/stop-hook/disable/TestTargetStopHookDisable.py (2007 of 2355) PASS: lldb-unit :: Utility/./UtilityTests/RegisterValueTest.GetSet8 (2008 of 2355) PASS: lldb-api :: functionalities/gdb_remote_client/TestArmRegisterDefinition.py (2009 of 2355) PASS: lldb-unit :: UnwindAssembly/x86/./UnwindAssemblyx86Tests/Testx86AssemblyInspectionEngine.TestSpArithx86_64Augmented (2010 of 2355) PASS: lldb-unit :: Host/./HostTests/SocketTests/SocketTest.TCPListen0ConnectAccept/ipv6 (2011 of 2355) PASS: lldb-unit :: Symbol/./SymbolTests/TestTypeSystemClang.TestGetBasicTypeFromEnum (2012 of 2355) PASS: lldb-unit :: Utility/./UtilityTests/StringListTest.AppendListCStringArray (2013 of 2355) PASS: lldb-shell :: ObjectFile/ELF/PT_LOAD-empty.yaml (2014 of 2355) PASS: lldb-api :: commands/watchpoints/watchpoint_size/TestWatchpointSizes.py (2015 of 2355) UNSUPPORTED: lldb-api :: commands/trace/TestTraceLoad.py (2016 of 2355) UNSUPPORTED: lldb-api :: functionalities/thread/thread_specific_break_plus_condition/TestThreadSpecificBpPlusCondition.py (2017 of 2355) PASS: lldb-unit :: Utility/./UtilityTests/FileSpecTest.GetPath (2018 of 2355) PASS: lldb-api :: commands/watchpoints/watchpoint_disable/TestWatchpointDisable.py (2019 of 2355) PASS: lldb-api :: functionalities/gdb_remote_client/TestIOSSimulator.py (2020 of 2355) PASS: lldb-shell :: SymbolFile/DWARF/x86/DW_AT_data_bit_offset-DW_OP_stack_value.s (2021 of 2355) PASS: lldb-unit :: UnwindAssembly/x86/./UnwindAssemblyx86Tests/Testx86AssemblyInspectionEngine.TestSpillRegToStackViaMOVi386 (2022 of 2355) PASS: lldb-shell :: ObjectFile/wasm/unified-debug-sections.yaml (2023 of 2355) PASS: lldb-unit :: Utility/./UtilityTests/StringLexerTest.AdvanceIf (2024 of 2355) PASS: lldb-api :: functionalities/abbreviation/TestAbbreviations.py (2025 of 2355) PASS: lldb-unit :: API/./APITests/SBCommandInterpreterTest.SingleWordCommand (2026 of 2355) PASS: lldb-api :: python_api/breakpoint/TestBreakpointAPI.py (2027 of 2355) PASS: lldb-shell :: Minidump/memory-region-from-module.yaml (2028 of 2355) PASS: lldb-api :: functionalities/gdb_remote_client/TestPartialGPacket.py (2029 of 2355) PASS: lldb-unit :: UnwindAssembly/x86/./UnwindAssemblyx86Tests/Testx86AssemblyInspectionEngine.TestPopEBX (2030 of 2355) PASS: lldb-api :: commands/frame/diagnose/array/TestArray.py (2031 of 2355) PASS: lldb-api :: functionalities/data-formatter/data-formatter-stl/libstdcpp/unique_ptr/invalid/TestDataFormatterInvalidStdUniquePtr.py (2032 of 2355) FAIL: lldb-api :: tools/lldb-vscode/breakpoint/TestVSCode_setBreakpoints.py (2033 of 2355) ******************** TEST 'lldb-api :: tools/lldb-vscode/breakpoint/TestVSCode_setBreakpoints.py' FAILED ******************** Script: -- /Users/buildslave/jenkins/workspace/lldb-cmake-sanitized/lldb-build/lldb-test-build.noindex/copied-python /Users/buildslave/jenkins/workspace/lldb-cmake-sanitized/llvm-project/lldb/test/API/dotest.py -u CXXFLAGS -u CFLAGS --codesign-identity lldb_codesign --arch x86_64 --build-dir /Users/buildslave/jenkins/workspace/lldb-cmake-sanitized/lldb-build/lldb-test-build.noindex -t --env TERM=vt100 --env LLVM_LIBS_DIR=/Users/buildslave/jenkins/workspace/lldb-cmake-sanitized/lldb-build/./lib --inferior-env ASAN_OPTIONS=detect_stack_use_after_return=1 --inferior-env DYLD_INSERT_LIBRARIES=/Users/buildslave/jenkins/workspace/lldb-cmake-sanitized/host-compiler/lib/clang/13.0.99/lib/darwin/libclang_rt.asan_osx_dynamic.dylib --arch x86_64 --build-dir /Users/buildslave/jenkins/workspace/lldb-cmake-sanitized/lldb-build/lldb-test-build.noindex --lldb-module-cache-dir /Users/buildslave/jenkins/workspace/lldb-cmake-sanitized/lldb-build/lldb-test-build.noindex/module-cache-lldb/lldb-api --clang-module-cache-dir /Users/buildslave/jenkins/workspace/lldb-cmake-sanitized/lldb-build/lldb-test-build.noindex/module-cache-clang/lldb-api --executable /Users/buildslave/jenkins/workspace/lldb-cmake-sanitized/lldb-build/./bin/lldb --compiler /Users/buildslave/jenkins/workspace/lldb-cmake-sanitized/host-compiler/bin/clang --dsymutil /Users/buildslave/jenkins/workspace/lldb-cmake-sanitized/lldb-build/./bin/dsymutil --llvm-tools-dir /Users/buildslave/jenkins/workspace/lldb-cmake-sanitized/lldb-build/./bin --lldb-libs-dir /Users/buildslave/jenkins/workspace/lldb-cmake-sanitized/lldb-build/./lib /Users/buildslave/jenkins/workspace/lldb-cmake-sanitized/llvm-project/lldb/test/API/tools/lldb-vscode/breakpoint -p TestVSCode_setBreakpoints.py -- Exit Code: 1

Hide Details

Command Output (stdout): -- lldb version 13.0.99 (http://labmaster3.local/git/llvm-project.git revision 07a1f3513e2e3802671a0a4ca1edf2fe577fad03) clang revision 07a1f3513e2e3802671a0a4ca1edf2fe577fad03 llvm revision 07a1f3513e2e3802671a0a4ca1edf2fe577fad03 Skipping the following test categories: ['darwin-log', 'libstdcxx', 'dwo', 'llgs', 'fork'] ========= DEBUG ADAPTER PROTOCOL LOGS ========= --> Content-Length: 284

Hide Details

{"command":"initialize","type":"request","arguments":{"adapterID":"lldb-native","clientID":"vscode","columnsStartAt1":true,"linesStartAt1":true,"locale":"en-us","pathFormat":"path","supportsRunInTerminalRequest":true,"supportsVariablePaging":true,"supportsVariableType":true},"seq":1} <-- Content-Length: 1222

Hide Details

{"body":{"exceptionBreakpointFilters":[{"default":false,"filter":"cpp_catch","label":"C++ Catch"},{"default":false,"filter":"cpp_throw","label":"C++ Throw"},{"default":false,"filter":"objc_catch","label":"Objective C Catch"},{"default":false,"filter":"objc_throw","label":"Objective C Throw"},{"default":false,"filter":"swift_catch","label":"Swift Catch"},{"default":false,"filter":"swift_throw","label":"Swift Throw"}],"supportTerminateDebuggee":true,"supportsCompletionsRequest":false,"supportsConditionalBreakpoints":true,"supportsConfigurationDoneRequest":true,"supportsDelayedStackTraceLoading":true,"supportsEvaluateForHovers":true,"supportsExceptionInfoRequest":true,"supportsExceptionOptions":true,"supportsFunctionBreakpoints":true,"supportsGotoTargetsRequest":false,"supportsHitConditionalBreakpoints":true,"supportsLoadedSourcesRequest":false,"supportsModulesRequest":false,"supportsProgressReporting":true,"supportsRestartFrame":false,"supportsRestartRequest":false,"supportsRunInTerminalRequest":true,"supportsSetVariable":true,"supportsStepBack":false,"supportsStepInTargetsRequest":false,"supportsValueFormattingOptions":true},"command":"initialize","request_seq":1,"seq":0,"success":true,"type":"response"} --> Content-Length: 1058

Hide Details

{"command":"launch","type":"request","arguments":{"program":"/Users/buildslave/jenkins/workspace/lldb-cmake-sanitized/lldb-build/lldb-test-build.noindex/tools/lldb-vscode/breakpoint/TestVSCode_setBreakpoints.test_clear_breakpoints_unset_breakpoints/a.out","disableASLR":true,"initCommands":["settings clear -all","settings set symbols.enable-external-lookup false","settings set target.inherit-tcc true","settings set target.detach-on-error false","settings set target.auto-apply-fixits false","settings set plugin.process.gdb-remote.packet-timeout 60","settings set symbols.clang-modules-cache-path \"/Users/buildslave/jenkins/workspace/lldb-cmake-sanitized/lldb-build/lldb-test-build.noindex/module-cache-lldb/lldb-api\"","settings set use-color false","setting set target.prefer-dynamic-value no-dynamic-values","settings set target.env-vars ASAN_OPTIONS=detect_stack_use_after_return=1 DYLD_INSERT_LIBRARIES=/Users/buildslave/jenkins/workspace/lldb-cmake-sanitized/host-compiler/lib/clang/13.0.99/lib/darwin/libclang_rt.asan_osx_dynamic.dylib"]},"seq":2} <-- Content-Length: 923

Hide Details

{"body":{"category":"console","output":"Running initCommands:\n(lldb) settings clear -all\n(lldb) settings set symbols.enable-external-lookup false\n(lldb) settings set target.inherit-tcc true\n(lldb) settings set target.detach-on-error false\n(lldb) settings set target.auto-apply-fixits false\n(lldb) settings set plugin.process.gdb-remote.packet-timeout 60\n(lldb) settings set symbols.clang-modules-cache-path \"/Users/buildslave/jenkins/workspace/lldb-cmake-sanitized/lldb-build/lldb-test-build.noindex/module-cache-lldb/lldb-api\"\n(lldb) settings set use-color false\n(lldb) setting set target.prefer-dynamic-value no-dynamic-values\n(lldb) settings set target.env-vars ASAN_OPTIONS=detect_stack_use_after_return=1 DYLD_INSERT_LIBRARIES=/Users/buildslave/jenkins/workspace/lldb-cmake-sanitized/host-compiler/lib/clang/13.0.99/lib/darwin/libclang_rt.asan_osx_dynamic.dylib\n"},"event":"output","seq":0,"type":"event"} <-- Content-Length: 77

Hide Details

{"command":"launch","request_seq":2,"seq":0,"success":true,"type":"response"} <-- Content-Length: 323

Hide Details

{"body":{"isLocalProcess":true,"name":"/Users/buildslave/jenkins/workspace/lldb-cmake-sanitized/lldb-build/lldb-test-build.noindex/tools/lldb-vscode/breakpoint/TestVSCode_setBreakpoints.test_clear_breakpoints_unset_breakpoints/a.out","startMethod":"launch","systemProcessId":60786},"event":"process","seq":0,"type":"event"} <-- Content-Length: 46

Hide Details

{"event":"initialized","seq":0,"type":"event"} --> Content-Length: 392

Hide Details

{"command":"setBreakpoints","type":"request","arguments":{"source":{"name":"main-copy.cpp","path":"/Users/buildslave/jenkins/workspace/lldb-cmake-sanitized/lldb-build/lldb-test-build.noindex/tools/lldb-vscode/breakpoint/TestVSCode_setBreakpoints.test_clear_breakpoints_unset_breakpoints/main-copy.cpp"},"sourceModified":false,"lines":"[6, 10]","breakpoints":[{"line":6},{"line":10}]},"seq":3} <-- Content-Length: 669

Hide Details

{"body":{"breakpoints":[{"id":1,"line":6,"source":{"name":"main-copy.cpp","path":"/Users/buildslave/jenkins/workspace/lldb-cmake-sanitized/lldb-build/lldb-test-build.noindex/tools/lldb-vscode/breakpoint/TestVSCode_setBreakpoints.test_clear_breakpoints_unset_breakpoints/main-copy.cpp"},"verified":true},{"id":2,"line":10,"source":{"name":"main-copy.cpp","path":"/Users/buildslave/jenkins/workspace/lldb-cmake-sanitized/lldb-build/lldb-test-build.noindex/tools/lldb-vscode/breakpoint/TestVSCode_setBreakpoints.test_clear_breakpoints_unset_breakpoints/main-copy.cpp"},"verified":true}]},"command":"setBreakpoints","request_seq":3,"seq":0,"success":true,"type":"response"} --> Content-Length: 335

Hide Details

{"command":"setBreakpoints","type":"request","arguments":{"source":{"name":"main-copy.cpp","path":"/Users/buildslave/jenkins/workspace/lldb-cmake-sanitized/lldb-build/lldb-test-build.noindex/tools/lldb-vscode/breakpoint/TestVSCode_setBreakpoints.test_clear_breakpoints_unset_breakpoints/main-copy.cpp"},"sourceModified":false},"seq":4} <-- Content-Length: 111

Hide Details

{"body":{"breakpoints":[]},"command":"setBreakpoints","request_seq":4,"seq":0,"success":true,"type":"response"} --> Content-Length: 79

Hide Details

{"command":"_testGetTargetBreakpoints","type":"request","arguments":{},"seq":5} <-- Content-Length: 122

Hide Details

{"body":{"breakpoints":[]},"command":"_testGetTargetBreakpoints","request_seq":5,"seq":0,"success":true,"type":"response"} --> Content-Length: 88

Hide Details

{"command":"disconnect","type":"request","arguments":{"terminateDebuggee":true},"seq":6} <-- Content-Length: 63

Hide Details

{"body":{"exitCode":9},"event":"exited","seq":0,"type":"event"} <-- Content-Length: 45

Hide Details

{"event":"terminated","seq":0,"type":"event"} <-- Content-Length: 81

Hide Details

{"command":"disconnect","request_seq":6,"seq":0,"success":true,"type":"response"}

Hide Details

========= END ========= ========= DEBUG ADAPTER PROTOCOL LOGS ========= --> Content-Length: 284

Hide Details

{"command":"initialize","type":"request","arguments":{"adapterID":"lldb-native","clientID":"vscode","columnsStartAt1":true,"linesStartAt1":true,"locale":"en-us","pathFormat":"path","supportsRunInTerminalRequest":true,"supportsVariablePaging":true,"supportsVariableType":true},"seq":1} <-- Content-Length: 1222

Hide Details

{"body":{"exceptionBreakpointFilters":[{"default":false,"filter":"cpp_catch","label":"C++ Catch"},{"default":false,"filter":"cpp_throw","label":"C++ Throw"},{"default":false,"filter":"objc_catch","label":"Objective C Catch"},{"default":false,"filter":"objc_throw","label":"Objective C Throw"},{"default":false,"filter":"swift_catch","label":"Swift Catch"},{"default":false,"filter":"swift_throw","label":"Swift Throw"}],"supportTerminateDebuggee":true,"supportsCompletionsRequest":false,"supportsConditionalBreakpoints":true,"supportsConfigurationDoneRequest":true,"supportsDelayedStackTraceLoading":true,"supportsEvaluateForHovers":true,"supportsExceptionInfoRequest":true,"supportsExceptionOptions":true,"supportsFunctionBreakpoints":true,"supportsGotoTargetsRequest":false,"supportsHitConditionalBreakpoints":true,"supportsLoadedSourcesRequest":false,"supportsModulesRequest":false,"supportsProgressReporting":true,"supportsRestartFrame":false,"supportsRestartRequest":false,"supportsRunInTerminalRequest":true,"supportsSetVariable":true,"supportsStepBack":false,"supportsStepInTargetsRequest":false,"supportsValueFormattingOptions":true},"command":"initialize","request_seq":1,"seq":0,"success":true,"type":"response"} --> Content-Length: 1036

Hide Details

{"command":"launch","type":"request","arguments":{"program":"/Users/buildslave/jenkins/workspace/lldb-cmake-sanitized/lldb-build/lldb-test-build.noindex/tools/lldb-vscode/breakpoint/TestVSCode_setBreakpoints.test_functionality/a.out","disableASLR":true,"initCommands":["settings clear -all","settings set symbols.enable-external-lookup false","settings set target.inherit-tcc true","settings set target.detach-on-error false","settings set target.auto-apply-fixits false","settings set plugin.process.gdb-remote.packet-timeout 60","settings set symbols.clang-modules-cache-path \"/Users/buildslave/jenkins/workspace/lldb-cmake-sanitized/lldb-build/lldb-test-build.noindex/module-cache-lldb/lldb-api\"","settings set use-color false","setting set target.prefer-dynamic-value no-dynamic-values","settings set target.env-vars ASAN_OPTIONS=detect_stack_use_after_return=1 DYLD_INSERT_LIBRARIES=/Users/buildslave/jenkins/workspace/lldb-cmake-sanitized/host-compiler/lib/clang/13.0.99/lib/darwin/libclang_rt.asan_osx_dynamic.dylib"]},"seq":2} <-- Content-Length: 923

Hide Details

{"body":{"category":"console","output":"Running initCommands:\n(lldb) settings clear -all\n(lldb) settings set symbols.enable-external-lookup false\n(lldb) settings set target.inherit-tcc true\n(lldb) settings set target.detach-on-error false\n(lldb) settings set target.auto-apply-fixits false\n(lldb) settings set plugin.process.gdb-remote.packet-timeout 60\n(lldb) settings set symbols.clang-modules-cache-path \"/Users/buildslave/jenkins/workspace/lldb-cmake-sanitized/lldb-build/lldb-test-build.noindex/module-cache-lldb/lldb-api\"\n(lldb) settings set use-color false\n(lldb) setting set target.prefer-dynamic-value no-dynamic-values\n(lldb) settings set target.env-vars ASAN_OPTIONS=detect_stack_use_after_return=1 DYLD_INSERT_LIBRARIES=/Users/buildslave/jenkins/workspace/lldb-cmake-sanitized/host-compiler/lib/clang/13.0.99/lib/darwin/libclang_rt.asan_osx_dynamic.dylib\n"},"event":"output","seq":0,"type":"event"} <-- Content-Length: 77

Hide Details

{"command":"launch","request_seq":2,"seq":0,"success":true,"type":"response"} <-- Content-Length: 301

Hide Details

{"body":{"isLocalProcess":true,"name":"/Users/buildslave/jenkins/workspace/lldb-cmake-sanitized/lldb-build/lldb-test-build.noindex/tools/lldb-vscode/breakpoint/TestVSCode_setBreakpoints.test_functionality/a.out","startMethod":"launch","systemProcessId":60860},"event":"process","seq":0,"type":"event"} <-- Content-Length: 46

Hide Details

{"event":"initialized","seq":0,"type":"event"} --> Content-Length: 356

Hide Details

{"command":"setBreakpoints","type":"request","arguments":{"source":{"name":"main-copy.cpp","path":"/Users/buildslave/jenkins/workspace/lldb-cmake-sanitized/lldb-build/lldb-test-build.noindex/tools/lldb-vscode/breakpoint/TestVSCode_setBreakpoints.test_functionality/main-copy.cpp"},"sourceModified":false,"lines":"[39]","breakpoints":[{"line":39}]},"seq":3} <-- Content-Length: 368

Hide Details

{"body":{"breakpoints":[{"id":1,"line":39,"source":{"name":"main-copy.cpp","path":"/Users/buildslave/jenkins/workspace/lldb-cmake-sanitized/lldb-build/lldb-test-build.noindex/tools/lldb-vscode/breakpoint/TestVSCode_setBreakpoints.test_functionality/main-copy.cpp"},"verified":true}]},"command":"setBreakpoints","request_seq":3,"seq":0,"success":true,"type":"response"} --> Content-Length: 71

Hide Details

{"command":"configurationDone","type":"request","arguments":{},"seq":4} <-- Content-Length: 88

Hide Details

{"command":"configurationDone","request_seq":4,"seq":0,"success":true,"type":"response"} <-- Content-Length: 198

Hide Details

{"body":{"allThreadsStopped":true,"description":"breakpoint 1.1","preserveFocusHint":false,"reason":"breakpoint","threadCausedFocus":true,"threadId":263449},"event":"stopped","seq":0,"type":"event"} --> Content-Length: 61

Hide Details

{"command":"threads","type":"request","arguments":{},"seq":5} <-- Content-Length: 132

Hide Details

{"body":{"threads":[{"id":263449,"name":"Thread #1"}]},"command":"threads","request_seq":5,"seq":0,"success":true,"type":"response"} --> Content-Length: 107

Hide Details

{"command":"stackTrace","type":"request","arguments":{"threadId":263449,"startFrame":0,"levels":1},"seq":6} <-- Content-Length: 395

Hide Details

{"body":{"stackFrames":[{"column":20,"id":524288,"line":39,"name":"main","source":{"name":"main-copy.cpp","path":"/Users/buildslave/jenkins/workspace/lldb-cmake-sanitized/lldb-build/lldb-test-build.noindex/tools/lldb-vscode/breakpoint/TestVSCode_setBreakpoints.test_functionality/main-copy.cpp"}}],"totalFrames":2},"command":"stackTrace","request_seq":6,"seq":0,"success":true,"type":"response"} --> Content-Length: 76

Hide Details

{"command":"scopes","type":"request","arguments":{"frameId":524288},"seq":7} <-- Content-Length: 335

Hide Details

{"body":{"scopes":[{"expensive":false,"name":"Locals","namedVariables":7,"variablesReference":1},{"expensive":false,"name":"Globals","namedVariables":0,"variablesReference":2},{"expensive":false,"name":"Registers","namedVariables":3,"variablesReference":3}]},"command":"scopes","request_seq":7,"seq":0,"success":true,"type":"response"} --> Content-Length: 85

Hide Details

{"command":"variables","type":"request","arguments":{"variablesReference":1},"seq":8} <-- Content-Length: 919

Hide Details

{"body":{"variables":[{"evaluateName":"argc","id":0,"name":"argc","type":"int","value":"1","variablesReference":0},{"evaluateName":"argv","id":1,"name":"argv","type":"const char **","value":"0x00007ffeefbff810","variablesReference":5},{"evaluateName":"libother_name","id":2,"name":"libother_name","type":"const char *","value":"0x0000000100000f44 \"libother.dylib\"","variablesReference":6},{"evaluateName":"handle","id":3,"name":"handle","type":"void *","value":"0x000060f0000007c0","variablesReference":7},{"evaluateName":"foo","id":4,"name":"foo","type":"int (*)(int)","value":"0x000000010424af90 (libother.dylib`foo at other-copy.c:1)","variablesReference":8},{"evaluateName":"i","id":5,"name":"i","type":"int","value":"0","variablesReference":0},{"evaluateName":"x","id":6,"name":"x","type":"int","value":"0","variablesReference":0}]},"command":"variables","request_seq":8,"seq":0,"success":true,"type":"response"} --> Content-Length: 375

Hide Details

{"command":"setBreakpoints","type":"request","arguments":{"source":{"name":"main-copy.cpp","path":"/Users/buildslave/jenkins/workspace/lldb-cmake-sanitized/lldb-build/lldb-test-build.noindex/tools/lldb-vscode/breakpoint/TestVSCode_setBreakpoints.test_functionality/main-copy.cpp"},"sourceModified":false,"lines":"[39]","breakpoints":[{"line":39,"condition":"i==4"}]},"seq":9} <-- Content-Length: 368

Hide Details

{"body":{"breakpoints":[{"id":1,"line":39,"source":{"name":"main-copy.cpp","path":"/Users/buildslave/jenkins/workspace/lldb-cmake-sanitized/lldb-build/lldb-test-build.noindex/tools/lldb-vscode/breakpoint/TestVSCode_setBreakpoints.test_functionality/main-copy.cpp"},"verified":true}]},"command":"setBreakpoints","request_seq":9,"seq":0,"success":true,"type":"response"} --> Content-Length: 80

Hide Details

{"command":"continue","type":"request","arguments":{"threadId":263449},"seq":10} <-- Content-Length: 116

Hide Details

{"body":{"allThreadsContinued":true},"command":"continue","request_seq":10,"seq":0,"success":true,"type":"response"} <-- Content-Length: 311

Hide Details

{"body":{"category":"console","output":"/Users/buildslave/jenkins/workspace/lldb-cmake-sanitized/llvm-project/lldb/tools/lldb-vscode/ProgressEvent.cpp:89:64: runtime error: load of value 829960214, which is not a valid value for type 'lldb_vscode::ProgressEventType'\n"},"event":"output","seq":0,"type":"event"} <-- Content-Length: 261

Hide Details

{"body":{"category":"console","output":"SUMMARY: UndefinedBehaviorSanitizer: undefined-behavior /Users/buildslave/jenkins/workspace/lldb-cmake-sanitized/llvm-project/lldb/tools/lldb-vscode/ProgressEvent.cpp:89:64 in \n"},"event":"output","seq":0,"type":"event"} <-- Content-Length: 170

Hide Details

{"body":{"category":"console","output":"PLEASE submit a bug report to https://bugs.llvm.org/ and include the crash backtrace.\n"},"event":"output","seq":0,"type":"event"}

Hide Details

========= END ========= ========= DEBUG ADAPTER PROTOCOL LOGS ========= --> Content-Length: 284

Hide Details

{"command":"initialize","type":"request","arguments":{"adapterID":"lldb-native","clientID":"vscode","columnsStartAt1":true,"linesStartAt1":true,"locale":"en-us","pathFormat":"path","supportsRunInTerminalRequest":true,"supportsVariablePaging":true,"supportsVariableType":true},"seq":1} <-- Content-Length: 1222

Hide Details

{"body":{"exceptionBreakpointFilters":[{"default":false,"filter":"cpp_catch","label":"C++ Catch"},{"default":false,"filter":"cpp_throw","label":"C++ Throw"},{"default":false,"filter":"objc_catch","label":"Objective C Catch"},{"default":false,"filter":"objc_throw","label":"Objective C Throw"},{"default":false,"filter":"swift_catch","label":"Swift Catch"},{"default":false,"filter":"swift_throw","label":"Swift Throw"}],"supportTerminateDebuggee":true,"supportsCompletionsRequest":false,"supportsConditionalBreakpoints":true,"supportsConfigurationDoneRequest":true,"supportsDelayedStackTraceLoading":true,"supportsEvaluateForHovers":true,"supportsExceptionInfoRequest":true,"supportsExceptionOptions":true,"supportsFunctionBreakpoints":true,"supportsGotoTargetsRequest":false,"supportsHitConditionalBreakpoints":true,"supportsLoadedSourcesRequest":false,"supportsModulesRequest":false,"supportsProgressReporting":true,"supportsRestartFrame":false,"supportsRestartRequest":false,"supportsRunInTerminalRequest":true,"supportsSetVariable":true,"supportsStepBack":false,"supportsStepInTargetsRequest":false,"supportsValueFormattingOptions":true},"command":"initialize","request_seq":1,"seq":0,"success":true,"type":"response"} --> Content-Length: 1036

Hide Details

{"command":"launch","type":"request","arguments":{"program":"/Users/buildslave/jenkins/workspace/lldb-cmake-sanitized/lldb-build/lldb-test-build.noindex/tools/lldb-vscode/breakpoint/TestVSCode_setBreakpoints.test_set_and_clear/a.out","disableASLR":true,"initCommands":["settings clear -all","settings set symbols.enable-external-lookup false","settings set target.inherit-tcc true","settings set target.detach-on-error false","settings set target.auto-apply-fixits false","settings set plugin.process.gdb-remote.packet-timeout 60","settings set symbols.clang-modules-cache-path \"/Users/buildslave/jenkins/workspace/lldb-cmake-sanitized/lldb-build/lldb-test-build.noindex/module-cache-lldb/lldb-api\"","settings set use-color false","setting set target.prefer-dynamic-value no-dynamic-values","settings set target.env-vars ASAN_OPTIONS=detect_stack_use_after_return=1 DYLD_INSERT_LIBRARIES=/Users/buildslave/jenkins/workspace/lldb-cmake-sanitized/host-compiler/lib/clang/13.0.99/lib/darwin/libclang_rt.asan_osx_dynamic.dylib"]},"seq":2} <-- Content-Length: 923

Hide Details

{"body":{"category":"console","output":"Running initCommands:\n(lldb) settings clear -all\n(lldb) settings set symbols.enable-external-lookup false\n(lldb) settings set target.inherit-tcc true\n(lldb) settings set target.detach-on-error false\n(lldb) settings set target.auto-apply-fixits false\n(lldb) settings set plugin.process.gdb-remote.packet-timeout 60\n(lldb) settings set symbols.clang-modules-cache-path \"/Users/buildslave/jenkins/workspace/lldb-cmake-sanitized/lldb-build/lldb-test-build.noindex/module-cache-lldb/lldb-api\"\n(lldb) settings set use-color false\n(lldb) setting set target.prefer-dynamic-value no-dynamic-values\n(lldb) settings set target.env-vars ASAN_OPTIONS=detect_stack_use_after_return=1 DYLD_INSERT_LIBRARIES=/Users/buildslave/jenkins/workspace/lldb-cmake-sanitized/host-compiler/lib/clang/13.0.99/lib/darwin/libclang_rt.asan_osx_dynamic.dylib\n"},"event":"output","seq":0,"type":"event"} <-- Content-Length: 77

Hide Details

{"command":"launch","request_seq":2,"seq":0,"success":true,"type":"response"} <-- Content-Length: 301

Hide Details

{"body":{"isLocalProcess":true,"name":"/Users/buildslave/jenkins/workspace/lldb-cmake-sanitized/lldb-build/lldb-test-build.noindex/tools/lldb-vscode/breakpoint/TestVSCode_setBreakpoints.test_set_and_clear/a.out","startMethod":"launch","systemProcessId":60954},"event":"process","seq":0,"type":"event"} <-- Content-Length: 46

Hide Details

{"event":"initialized","seq":0,"type":"event"} --> Content-Length: 386

Hide Details

{"command":"setBreakpoints","type":"request","arguments":{"source":{"name":"main-copy.cpp","path":"/Users/buildslave/jenkins/workspace/lldb-cmake-sanitized/lldb-build/lldb-test-build.noindex/tools/lldb-vscode/breakpoint/TestVSCode_setBreakpoints.test_set_and_clear/main-copy.cpp"},"sourceModified":false,"lines":"[6, 15, 10]","breakpoints":[{"line":6},{"line":15},{"line":10}]},"seq":3} <-- Content-Length: 883

Hide Details

{"body":{"breakpoints":[{"id":1,"line":6,"source":{"name":"main-copy.cpp","path":"/Users/buildslave/jenkins/workspace/lldb-cmake-sanitized/lldb-build/lldb-test-build.noindex/tools/lldb-vscode/breakpoint/TestVSCode_setBreakpoints.test_set_and_clear/main-copy.cpp"},"verified":true},{"id":2,"line":15,"source":{"name":"main-copy.cpp","path":"/Users/buildslave/jenkins/workspace/lldb-cmake-sanitized/lldb-build/lldb-test-build.noindex/tools/lldb-vscode/breakpoint/TestVSCode_setBreakpoints.test_set_and_clear/main-copy.cpp"},"verified":true},{"id":3,"line":10,"source":{"name":"main-copy.cpp","path":"/Users/buildslave/jenkins/workspace/lldb-cmake-sanitized/lldb-build/lldb-test-build.noindex/tools/lldb-vscode/breakpoint/TestVSCode_setBreakpoints.test_set_and_clear/main-copy.cpp"},"verified":true}]},"command":"setBreakpoints","request_seq":3,"seq":0,"success":true,"type":"response"} --> Content-Length: 370

Hide Details

{"command":"setBreakpoints","type":"request","arguments":{"source":{"name":"main-copy.cpp","path":"/Users/buildslave/jenkins/workspace/lldb-cmake-sanitized/lldb-build/lldb-test-build.noindex/tools/lldb-vscode/breakpoint/TestVSCode_setBreakpoints.test_set_and_clear/main-copy.cpp"},"sourceModified":false,"lines":"[6, 15]","breakpoints":[{"line":6},{"line":15}]},"seq":4} <-- Content-Length: 625

Hide Details

{"body":{"breakpoints":[{"id":1,"line":6,"source":{"name":"main-copy.cpp","path":"/Users/buildslave/jenkins/workspace/lldb-cmake-sanitized/lldb-build/lldb-test-build.noindex/tools/lldb-vscode/breakpoint/TestVSCode_setBreakpoints.test_set_and_clear/main-copy.cpp"},"verified":true},{"id":2,"line":15,"source":{"name":"main-copy.cpp","path":"/Users/buildslave/jenkins/workspace/lldb-cmake-sanitized/lldb-build/lldb-test-build.noindex/tools/lldb-vscode/breakpoint/TestVSCode_setBreakpoints.test_set_and_clear/main-copy.cpp"},"verified":true}]},"command":"setBreakpoints","request_seq":4,"seq":0,"success":true,"type":"response"} --> Content-Length: 79

Hide Details

{"command":"_testGetTargetBreakpoints","type":"request","arguments":{},"seq":5} <-- Content-Length: 636

Hide Details

{"body":{"breakpoints":[{"id":1,"line":6,"source":{"name":"main-copy.cpp","path":"/Users/buildslave/jenkins/workspace/lldb-cmake-sanitized/lldb-build/lldb-test-build.noindex/tools/lldb-vscode/breakpoint/TestVSCode_setBreakpoints.test_set_and_clear/main-copy.cpp"},"verified":true},{"id":2,"line":15,"source":{"name":"main-copy.cpp","path":"/Users/buildslave/jenkins/workspace/lldb-cmake-sanitized/lldb-build/lldb-test-build.noindex/tools/lldb-vscode/breakpoint/TestVSCode_setBreakpoints.test_set_and_clear/main-copy.cpp"},"verified":true}]},"command":"_testGetTargetBreakpoints","request_seq":5,"seq":0,"success":true,"type":"response"} --> Content-Length: 343

Hide Details

{"command":"setBreakpoints","type":"request","arguments":{"source":{"name":"main-copy.cpp","path":"/Users/buildslave/jenkins/workspace/lldb-cmake-sanitized/lldb-build/lldb-test-build.noindex/tools/lldb-vscode/breakpoint/TestVSCode_setBreakpoints.test_set_and_clear/main-copy.cpp"},"sourceModified":false,"lines":"[]","breakpoints":[]},"seq":6} <-- Content-Length: 111

Hide Details

{"body":{"breakpoints":[]},"command":"setBreakpoints","request_seq":6,"seq":0,"success":true,"type":"response"} --> Content-Length: 79

Hide Details

{"command":"_testGetTargetBreakpoints","type":"request","arguments":{},"seq":7} <-- Content-Length: 122

Hide Details

{"body":{"breakpoints":[]},"command":"_testGetTargetBreakpoints","request_seq":7,"seq":0,"success":true,"type":"response"} --> Content-Length: 356

Hide Details

{"command":"setBreakpoints","type":"request","arguments":{"source":{"name":"main-copy.cpp","path":"/Users/buildslave/jenkins/workspace/lldb-cmake-sanitized/lldb-build/lldb-test-build.noindex/tools/lldb-vscode/breakpoint/TestVSCode_setBreakpoints.test_set_and_clear/main-copy.cpp"},"sourceModified":false,"lines":"[10]","breakpoints":[{"line":10}]},"seq":8} <-- Content-Length: 368

Hide Details

{"body":{"breakpoints":[{"id":4,"line":10,"source":{"name":"main-copy.cpp","path":"/Users/buildslave/jenkins/workspace/lldb-cmake-sanitized/lldb-build/lldb-test-build.noindex/tools/lldb-vscode/breakpoint/TestVSCode_setBreakpoints.test_set_and_clear/main-copy.cpp"},"verified":true}]},"command":"setBreakpoints","request_seq":8,"seq":0,"success":true,"type":"response"} --> Content-Length: 79

Hide Details

{"command":"_testGetTargetBreakpoints","type":"request","arguments":{},"seq":9} <-- Content-Length: 379

Hide Details

{"body":{"breakpoints":[{"id":4,"line":10,"source":{"name":"main-copy.cpp","path":"/Users/buildslave/jenkins/workspace/lldb-cmake-sanitized/lldb-build/lldb-test-build.noindex/tools/lldb-vscode/breakpoint/TestVSCode_setBreakpoints.test_set_and_clear/main-copy.cpp"},"verified":true}]},"command":"_testGetTargetBreakpoints","request_seq":9,"seq":0,"success":true,"type":"response"} --> Content-Length: 89

Hide Details

{"command":"disconnect","type":"request","arguments":{"terminateDebuggee":true},"seq":10} <-- Content-Length: 45

Hide Details

{"event":"terminated","seq":0,"type":"event"} <-- Content-Length: 63

Hide Details

{"body":{"exitCode":9},"event":"exited","seq":0,"type":"event"} <-- Content-Length: 82

Hide Details

{"command":"disconnect","request_seq":10,"seq":0,"success":true,"type":"response"}

Hide Details

========= END ========= ========= DEBUG ADAPTER PROTOCOL LOGS ========= --> Content-Length: 284

Hide Details

{"command":"initialize","type":"request","arguments":{"adapterID":"lldb-native","clientID":"vscode","columnsStartAt1":true,"linesStartAt1":true,"locale":"en-us","pathFormat":"path","supportsRunInTerminalRequest":true,"supportsVariablePaging":true,"supportsVariableType":true},"seq":1} <-- Content-Length: 1222

Hide Details

{"body":{"exceptionBreakpointFilters":[{"default":false,"filter":"cpp_catch","label":"C++ Catch"},{"default":false,"filter":"cpp_throw","label":"C++ Throw"},{"default":false,"filter":"objc_catch","label":"Objective C Catch"},{"default":false,"filter":"objc_throw","label":"Objective C Throw"},{"default":false,"filter":"swift_catch","label":"Swift Catch"},{"default":false,"filter":"swift_throw","label":"Swift Throw"}],"supportTerminateDebuggee":true,"supportsCompletionsRequest":false,"supportsConditionalBreakpoints":true,"supportsConfigurationDoneRequest":true,"supportsDelayedStackTraceLoading":true,"supportsEvaluateForHovers":true,"supportsExceptionInfoRequest":true,"supportsExceptionOptions":true,"supportsFunctionBreakpoints":true,"supportsGotoTargetsRequest":false,"supportsHitConditionalBreakpoints":true,"supportsLoadedSourcesRequest":false,"supportsModulesRequest":false,"supportsProgressReporting":true,"supportsRestartFrame":false,"supportsRestartRequest":false,"supportsRunInTerminalRequest":true,"supportsSetVariable":true,"supportsStepBack":false,"supportsStepInTargetsRequest":false,"supportsValueFormattingOptions":true},"command":"initialize","request_seq":1,"seq":0,"success":true,"type":"response"} --> Content-Length: 1734

Hide Details

{"command":"launch","type":"request","arguments":{"program":"/Users/buildslave/jenkins/workspace/lldb-cmake-sanitized/lldb-build/lldb-test-build.noindex/tools/lldb-vscode/breakpoint/TestVSCode_setBreakpoints.test_source_map/a.out","disableASLR":true,"initCommands":["settings clear -all","settings set symbols.enable-external-lookup false","settings set target.inherit-tcc true","settings set target.detach-on-error false","settings set target.auto-apply-fixits false","settings set plugin.process.gdb-remote.packet-timeout 60","settings set symbols.clang-modules-cache-path \"/Users/buildslave/jenkins/workspace/lldb-cmake-sanitized/lldb-build/lldb-test-build.noindex/module-cache-lldb/lldb-api\"","settings set use-color false","setting set target.prefer-dynamic-value no-dynamic-values","settings set target.env-vars ASAN_OPTIONS=detect_stack_use_after_return=1 DYLD_INSERT_LIBRARIES=/Users/buildslave/jenkins/workspace/lldb-cmake-sanitized/host-compiler/lib/clang/13.0.99/lib/darwin/libclang_rt.asan_osx_dynamic.dylib"],"sourceMap":[["/Users/buildslave/jenkins/workspace/lldb-cmake-sanitized/lldb-build/lldb-test-build.noindex/tools/lldb-vscode/breakpoint/TestVSCode_setBreakpoints.test_source_map","/Users/buildslave/jenkins/workspace/lldb-cmake-sanitized/lldb-build/lldb-test-build.noindex/tools/lldb-vscode/breakpoint/TestVSCode_setBreakpoints.test_source_map/moved_main"],["/Users/buildslave/jenkins/workspace/lldb-cmake-sanitized/lldb-build/lldb-test-build.noindex/tools/lldb-vscode/breakpoint/TestVSCode_setBreakpoints.test_source_map","/Users/buildslave/jenkins/workspace/lldb-cmake-sanitized/lldb-build/lldb-test-build.noindex/tools/lldb-vscode/breakpoint/TestVSCode_setBreakpoints.test_source_map/moved_other"]]},"seq":2} <-- Content-Length: 923

Hide Details

{"body":{"category":"console","output":"Running initCommands:\n(lldb) settings clear -all\n(lldb) settings set symbols.enable-external-lookup false\n(lldb) settings set target.inherit-tcc true\n(lldb) settings set target.detach-on-error false\n(lldb) settings set target.auto-apply-fixits false\n(lldb) settings set plugin.process.gdb-remote.packet-timeout 60\n(lldb) settings set symbols.clang-modules-cache-path \"/Users/buildslave/jenkins/workspace/lldb-cmake-sanitized/lldb-build/lldb-test-build.noindex/module-cache-lldb/lldb-api\"\n(lldb) settings set use-color false\n(lldb) setting set target.prefer-dynamic-value no-dynamic-values\n(lldb) settings set target.env-vars ASAN_OPTIONS=detect_stack_use_after_return=1 DYLD_INSERT_LIBRARIES=/Users/buildslave/jenkins/workspace/lldb-cmake-sanitized/host-compiler/lib/clang/13.0.99/lib/darwin/libclang_rt.asan_osx_dynamic.dylib\n"},"event":"output","seq":0,"type":"event"} <-- Content-Length: 835

Hide Details

{"body":{"category":"console","output":"Setting source map:\n(lldb) settings set target.source-map \"/Users/buildslave/jenkins/workspace/lldb-cmake-sanitized/lldb-build/lldb-test-build.noindex/tools/lldb-vscode/breakpoint/TestVSCode_setBreakpoints.test_source_map\" \"/Users/buildslave/jenkins/workspace/lldb-cmake-sanitized/lldb-build/lldb-test-build.noindex/tools/lldb-vscode/breakpoint/TestVSCode_setBreakpoints.test_source_map/moved_main\" \"/Users/buildslave/jenkins/workspace/lldb-cmake-sanitized/lldb-build/lldb-test-build.noindex/tools/lldb-vscode/breakpoint/TestVSCode_setBreakpoints.test_source_map\" \"/Users/buildslave/jenkins/workspace/lldb-cmake-sanitized/lldb-build/lldb-test-build.noindex/tools/lldb-vscode/breakpoint/TestVSCode_setBreakpoints.test_source_map/moved_other\" \n"},"event":"output","seq":0,"type":"event"} <-- Content-Length: 77

Hide Details

{"command":"launch","request_seq":2,"seq":0,"success":true,"type":"response"} <-- Content-Length: 298

Hide Details

{"body":{"isLocalProcess":true,"name":"/Users/buildslave/jenkins/workspace/lldb-cmake-sanitized/lldb-build/lldb-test-build.noindex/tools/lldb-vscode/breakpoint/TestVSCode_setBreakpoints.test_source_map/a.out","startMethod":"launch","systemProcessId":61028},"event":"process","seq":0,"type":"event"} <-- Content-Length: 46

Hide Details

{"event":"initialized","seq":0,"type":"event"} --> Content-Length: 362

Hide Details

{"command":"setBreakpoints","type":"request","arguments":{"source":{"name":"main-copy.cpp","path":"/Users/buildslave/jenkins/workspace/lldb-cmake-sanitized/lldb-build/lldb-test-build.noindex/tools/lldb-vscode/breakpoint/TestVSCode_setBreakpoints.test_source_map/moved_main/main-copy.cpp"},"sourceModified":false,"lines":"[6]","breakpoints":[{"line":6}]},"seq":3} <-- Content-Length: 375

Hide Details

{"body":{"breakpoints":[{"id":1,"line":6,"source":{"name":"main-copy.cpp","path":"/Users/buildslave/jenkins/workspace/lldb-cmake-sanitized/lldb-build/lldb-test-build.noindex/tools/lldb-vscode/breakpoint/TestVSCode_setBreakpoints.test_source_map/moved_main/main-copy.cpp"},"verified":true}]},"command":"setBreakpoints","request_seq":3,"seq":0,"success":true,"type":"response"} --> Content-Length: 361

Hide Details

{"command":"setBreakpoints","type":"request","arguments":{"source":{"name":"other-copy.c","path":"/Users/buildslave/jenkins/workspace/lldb-cmake-sanitized/lldb-build/lldb-test-build.noindex/tools/lldb-vscode/breakpoint/TestVSCode_setBreakpoints.test_source_map/moved_other/other-copy.c"},"sourceModified":false,"lines":"[2]","breakpoints":[{"line":2}]},"seq":4} <-- Content-Length: 375

Hide Details

{"body":{"breakpoints":[{"id":2,"line":2,"source":{"name":"other-copy.c","path":"/Users/buildslave/jenkins/workspace/lldb-cmake-sanitized/lldb-build/lldb-test-build.noindex/tools/lldb-vscode/breakpoint/TestVSCode_setBreakpoints.test_source_map/moved_other/other-copy.c"},"verified":false}]},"command":"setBreakpoints","request_seq":4,"seq":0,"success":true,"type":"response"} --> Content-Length: 71

Hide Details

{"command":"configurationDone","type":"request","arguments":{},"seq":5} <-- Content-Length: 88

Hide Details

{"command":"configurationDone","request_seq":5,"seq":0,"success":true,"type":"response"} <-- Content-Length: 120

Hide Details

{"body":{"breakpoint":{"id":2,"line":2,"verified":true},"reason":"changed"},"event":"breakpoint","seq":0,"type":"event"} <-- Content-Length: 198

Hide Details

{"body":{"allThreadsStopped":true,"description":"breakpoint 2.1","preserveFocusHint":false,"reason":"breakpoint","threadCausedFocus":true,"threadId":264093},"event":"stopped","seq":0,"type":"event"} --> Content-Length: 361

Hide Details

{"command":"setBreakpoints","type":"request","arguments":{"source":{"name":"other-copy.c","path":"/Users/buildslave/jenkins/workspace/lldb-cmake-sanitized/lldb-build/lldb-test-build.noindex/tools/lldb-vscode/breakpoint/TestVSCode_setBreakpoints.test_source_map/moved_other/other-copy.c"},"sourceModified":false,"lines":"[2]","breakpoints":[{"line":2}]},"seq":6} <-- Content-Length: 374

Hide Details

{"body":{"breakpoints":[{"id":2,"line":2,"source":{"name":"other-copy.c","path":"/Users/buildslave/jenkins/workspace/lldb-cmake-sanitized/lldb-build/lldb-test-build.noindex/tools/lldb-vscode/breakpoint/TestVSCode_setBreakpoints.test_source_map/moved_other/other-copy.c"},"verified":true}]},"command":"setBreakpoints","request_seq":6,"seq":0,"success":true,"type":"response"} --> Content-Length: 88

Hide Details

{"command":"disconnect","type":"request","arguments":{"terminateDebuggee":true},"seq":7} <-- Content-Length: 45

Hide Details

{"event":"terminated","seq":0,"type":"event"} <-- Content-Length: 63

Hide Details

{"body":{"exitCode":9},"event":"exited","seq":0,"type":"event"} <-- Content-Length: 81

Hide Details

{"command":"disconnect","request_seq":7,"seq":0,"success":true,"type":"response"}

Hide Details

========= END =========

Hide Details

-- Command Output (stderr): -- Change dir to: /Users/buildslave/jenkins/workspace/lldb-cmake-sanitized/llvm-project/lldb/test/API/tools/lldb-vscode/breakpoint runCmd: settings clear -all output:

Hide Details

runCmd: settings set symbols.enable-external-lookup false output:

Hide Details

runCmd: settings set target.inherit-tcc true output:

Hide Details

runCmd: settings set target.detach-on-error false output:

Hide Details

runCmd: settings set target.auto-apply-fixits false output:

Hide Details

runCmd: settings set plugin.process.gdb-remote.packet-timeout 60 output:

Hide Details

runCmd: settings set symbols.clang-modules-cache-path "/Users/buildslave/jenkins/workspace/lldb-cmake-sanitized/lldb-build/lldb-test-build.noindex/module-cache-lldb/lldb-api" output:

Hide Details

runCmd: settings set use-color false output:

Hide Details

runCmd: setting set target.prefer-dynamic-value no-dynamic-values output:

Hide Details

runCmd: settings set target.env-vars ASAN_OPTIONS=detect_stack_use_after_return=1 DYLD_INSERT_LIBRARIES=/Users/buildslave/jenkins/workspace/lldb-cmake-sanitized/host-compiler/lib/clang/13.0.99/lib/darwin/libclang_rt.asan_osx_dynamic.dylib output:

Hide Details

Adding tearDown hook: def cleanup(): if disconnectAutomatically: self.vscode.request_disconnect(terminateDebuggee=True) self.vscode.terminate()

Hide Details

Hide Details

Executing tearDown hook: def cleanup(): if disconnectAutomatically: self.vscode.request_disconnect(terminateDebuggee=True) self.vscode.terminate()

Hide Details

Hide Details

PASS: LLDB (/Users/buildslave/jenkins/workspace/lldb-cmake-sanitized/host-compiler/bin/clang-x86_64) :: test_clear_breakpoints_unset_breakpoints (TestVSCode_setBreakpoints.TestVSCode_setBreakpoints) runCmd: settings clear -all output:

Hide Details

runCmd: settings set symbols.enable-external-lookup false output:

Hide Details

runCmd: settings set target.inherit-tcc true output:

Hide Details

runCmd: settings set target.detach-on-error false output:

Hide Details

runCmd: settings set target.auto-apply-fixits false output:

Hide Details

runCmd: settings set plugin.process.gdb-remote.packet-timeout 60 output:

Hide Details

runCmd: settings set symbols.clang-modules-cache-path "/Users/buildslave/jenkins/workspace/lldb-cmake-sanitized/lldb-build/lldb-test-build.noindex/module-cache-lldb/lldb-api" output:

Hide Details

runCmd: settings set use-color false output:

Hide Details

runCmd: setting set target.prefer-dynamic-value no-dynamic-values output:

Hide Details

runCmd: settings set target.env-vars ASAN_OPTIONS=detect_stack_use_after_return=1 DYLD_INSERT_LIBRARIES=/Users/buildslave/jenkins/workspace/lldb-cmake-sanitized/host-compiler/lib/clang/13.0.99/lib/darwin/libclang_rt.asan_osx_dynamic.dylib output:

Hide Details

Adding tearDown hook: def cleanup(): if disconnectAutomatically: self.vscode.request_disconnect(terminateDebuggee=True) self.vscode.terminate()

Hide Details

Hide Details

FAIL: LLDB (/Users/buildslave/jenkins/workspace/lldb-cmake-sanitized/host-compiler/bin/clang-x86_64) :: test_functionality (TestVSCode_setBreakpoints.TestVSCode_setBreakpoints) Executing tearDown hook: def cleanup(): if disconnectAutomatically: self.vscode.request_disconnect(terminateDebuggee=True) self.vscode.terminate()

Hide Details

Hide Details

CLEANUP ERROR: LLDB (/Users/buildslave/jenkins/workspace/lldb-cmake-sanitized/host-compiler/bin/clang-x86_64) :: test_functionality (TestVSCode_setBreakpoints.TestVSCode_setBreakpoints) Traceback (most recent call last): File "/Users/buildslave/jenkins/workspace/lldb-cmake-sanitized/llvm-project/lldb/third_party/Python/module/unittest2/unittest2/case.py", line 386, in run self.tearDown() File "/Users/buildslave/jenkins/workspace/lldb-cmake-sanitized/llvm-project/lldb/packages/Python/lldbsuite/test/lldbtest.py", line 2095, in tearDown Base.tearDown(self) File "/Users/buildslave/jenkins/workspace/lldb-cmake-sanitized/llvm-project/lldb/packages/Python/lldbsuite/test/lldbtest.py", line 1065, in tearDown hook() # try the plain call and hope it works File "/Users/buildslave/jenkins/workspace/lldb-cmake-sanitized/llvm-project/lldb/packages/Python/lldbsuite/test/tools/lldb-vscode/lldbvscode_testcase.py", line 294, in cleanup self.vscode.request_disconnect(terminateDebuggee=True) File "/Users/buildslave/jenkins/workspace/lldb-cmake-sanitized/llvm-project/lldb/packages/Python/lldbsuite/test/tools/lldb-vscode/vscode.py", line 590, in request_disconnect return self.send_recv(command_dict) File "/Users/buildslave/jenkins/workspace/lldb-cmake-sanitized/llvm-project/lldb/packages/Python/lldbsuite/test/tools/lldb-vscode/vscode.py", line 315, in send_recv self.send_packet(command) File "/Users/buildslave/jenkins/workspace/lldb-cmake-sanitized/llvm-project/lldb/packages/Python/lldbsuite/test/tools/lldb-vscode/vscode.py", line 271, in send_packet self.send.flush() BrokenPipeError: [Errno 32] Broken pipe

Hide Details

runCmd: settings clear -all output:

Hide Details

runCmd: settings set symbols.enable-external-lookup false output:

Hide Details

runCmd: settings set target.inherit-tcc true output:

Hide Details

runCmd: settings set target.detach-on-error false output:

Hide Details

runCmd: settings set target.auto-apply-fixits false output:

Hide Details

runCmd: settings set plugin.process.gdb-remote.packet-timeout 60 output:

Hide Details

runCmd: settings set symbols.clang-modules-cache-path "/Users/buildslave/jenkins/workspace/lldb-cmake-sanitized/lldb-build/lldb-test-build.noindex/module-cache-lldb/lldb-api" output:

Hide Details

runCmd: settings set use-color false output:

Hide Details

runCmd: setting set target.prefer-dynamic-value no-dynamic-values output:

Hide Details

runCmd: settings set target.env-vars ASAN_OPTIONS=detect_stack_use_after_return=1 DYLD_INSERT_LIBRARIES=/Users/buildslave/jenkins/workspace/lldb-cmake-sanitized/host-compiler/lib/clang/13.0.99/lib/darwin/libclang_rt.asan_osx_dynamic.dylib output:

Hide Details

Adding tearDown hook: def cleanup(): if disconnectAutomatically: self.vscode.request_disconnect(terminateDebuggee=True) self.vscode.terminate()

Hide Details

Hide Details

Executing tearDown hook: def cleanup(): if disconnectAutomatically: self.vscode.request_disconnect(terminateDebuggee=True) self.vscode.terminate()

Hide Details

Hide Details

PASS: LLDB (/Users/buildslave/jenkins/workspace/lldb-cmake-sanitized/host-compiler/bin/clang-x86_64) :: test_set_and_clear (TestVSCode_setBreakpoints.TestVSCode_setBreakpoints) runCmd: settings clear -all output:

Hide Details

runCmd: settings set symbols.enable-external-lookup false output:

Hide Details

runCmd: settings set target.inherit-tcc true output:

Hide Details

runCmd: settings set target.detach-on-error false output:

Hide Details

runCmd: settings set target.auto-apply-fixits false output:

Hide Details

runCmd: settings set plugin.process.gdb-remote.packet-timeout 60 output:

Hide Details

runCmd: settings set symbols.clang-modules-cache-path "/Users/buildslave/jenkins/workspace/lldb-cmake-sanitized/lldb-build/lldb-test-build.noindex/module-cache-lldb/lldb-api" output:

Hide Details

runCmd: settings set use-color false output:

Hide Details

runCmd: setting set target.prefer-dynamic-value no-dynamic-values output:

Hide Details

runCmd: settings set target.env-vars ASAN_OPTIONS=detect_stack_use_after_return=1 DYLD_INSERT_LIBRARIES=/Users/buildslave/jenkins/workspace/lldb-cmake-sanitized/host-compiler/lib/clang/13.0.99/lib/darwin/libclang_rt.asan_osx_dynamic.dylib output:

Hide Details

Adding tearDown hook: def cleanup(): if disconnectAutomatically: self.vscode.request_disconnect(terminateDebuggee=True) self.vscode.terminate()

Hide Details

Hide Details

Executing tearDown hook: def cleanup(): if disconnectAutomatically: self.vscode.request_disconnect(terminateDebuggee=True) self.vscode.terminate()

Hide Details

Hide Details

PASS: LLDB (/Users/buildslave/jenkins/workspace/lldb-cmake-sanitized/host-compiler/bin/clang-x86_64) :: test_source_map (TestVSCode_setBreakpoints.TestVSCode_setBreakpoints) Restore dir to: /Users/buildslave/jenkins/workspace/lldb-cmake-sanitized/lldb-build/tools/lldb/test ====================================================================== FAIL: test_functionality (TestVSCode_setBreakpoints.TestVSCode_setBreakpoints) Tests hitting breakpoints and the functionality of a single ---------------------------------------------------------------------- Traceback (most recent call last): File "/Users/buildslave/jenkins/workspace/lldb-cmake-sanitized/llvm-project/lldb/test/API/tools/lldb-vscode/breakpoint/TestVSCode_setBreakpoints.py", line 294, in test_functionality self.continue_to_breakpoints(breakpoint_ids) File "/Users/buildslave/jenkins/workspace/lldb-cmake-sanitized/llvm-project/lldb/packages/Python/lldbsuite/test/tools/lldb-vscode/lldbvscode_testcase.py", line 233, in continue_to_breakpoints self.verify_breakpoint_hit(breakpoint_ids) File "/Users/buildslave/jenkins/workspace/lldb-cmake-sanitized/llvm-project/lldb/packages/Python/lldbsuite/test/tools/lldb-vscode/lldbvscode_testcase.py", line 92, in verify_breakpoint_hit self.assertTrue(False, "breakpoint not hit") AssertionError: False is not True : breakpoint not hit Config=x86_64-/Users/buildslave/jenkins/workspace/lldb-cmake-sanitized/host-compiler/bin/clang ---------------------------------------------------------------------- Ran 4 tests in 9.609s

Hide Details

RESULT: FAILED (3 passes, 1 failures, 0 errors, 0 skipped, 0 expected failures, 0 unexpected successes)

Hide Details

--

Hide Details

******************** PASS: lldb-api :: commands/expression/persistent_types/TestPersistentTypes.py (2034 of 2355) PASS: lldb-unit :: Utility/./UtilityTests/VASprintfTest.NoBufferResize (2035 of 2355) PASS: lldb-unit :: Utility/./UtilityTests/LogChannelEnabledTest.LogVerboseThread (2036 of 2355) PASS: lldb-unit :: Core/./LLDBCoreTests/FormatEntity.LookupAllEntriesInTree (2037 of 2355) PASS: lldb-shell :: Expr/TestMultilineExpr.test (2038 of 2355) PASS: lldb-unit :: ScriptInterpreter/Python/./ScriptInterpreterPythonTests/PythonDataObjectsTest.TestPythonString (2039 of 2355) PASS: lldb-shell :: Register/Core/x86-64-freebsd-addr.test (2040 of 2355) PASS: lldb-unit :: ScriptInterpreter/Python/./ScriptInterpreterPythonTests/PythonDataObjectsTest.TestPythonInteger (2041 of 2355) PASS: lldb-api :: functionalities/data-formatter/data-formatter-stl/libcxx/forward_list/TestDataFormatterLibcxxForwardList.py (2042 of 2355) PASS: lldb-unit :: Process/Utility/./ProcessUtilityTests/RegisterContext_x86Test.FullToAbridgedTagWord (2043 of 2355) PASS: lldb-unit :: Utility/./UtilityTests/StreamTest.PutStringAsRawHex8 (2044 of 2355) PASS: lldb-api :: tools/lldb-vscode/attach/TestVSCode_attach.py (2045 of 2355) PASS: lldb-shell :: SymbolFile/NativePDB/ast-methods.cpp (2046 of 2355) PASS: lldb-shell :: Register/Core/x86-32-linux-gp.test (2047 of 2355) PASS: lldb-unit :: Utility/./UtilityTests/ArchSpecTest.TestParseMachCPUDashSubtypeTripleSimple (2048 of 2355) PASS: lldb-api :: lang/cpp/exceptions/TestCPPExceptionBreakpoints.py (2049 of 2355) PASS: lldb-api :: lang/c/stepping/TestThreadStepInAvoidRegexp.py (2050 of 2355) PASS: lldb-shell :: Breakpoint/split-dwarf-5-addrbase.test (2051 of 2355) PASS: lldb-unit :: Utility/./UtilityTests/UriParserTest.MinimalPath (2052 of 2355) PASS: lldb-unit :: Utility/./UtilityTests/RangeTest.Equal (2053 of 2355) PASS: lldb-unit :: SymbolFile/NativePDB/./SymbolFileNativePDBTests/PDBFPOProgramToDWARFExpressionTests.InvalidOpBinary (2054 of 2355) PASS: lldb-shell :: ObjectFile/wasm/embedded-debug-sections.yaml (2055 of 2355) PASS: lldb-shell :: ObjectFile/ELF/section-overlap.yaml (2056 of 2355) PASS: lldb-api :: functionalities/data-formatter/frameformat_smallstruct/TestFrameFormatSmallStruct.py (2057 of 2355) PASS: lldb-api :: commands/apropos/basic/TestApropos.py (2058 of 2355) PASS: lldb-api :: functionalities/limit-debug-info/TestLimitDebugInfo.py (2059 of 2355) PASS: lldb-unit :: Host/./HostTests/File.GetWaitableHandleFileno (2060 of 2355) PASS: lldb-api :: lang/cpp/limit-debug-info/TestWithLimitDebugInfo.py (2061 of 2355) PASS: lldb-unit :: Utility/./UtilityTests/StringExtractorTest.DecodeHexU8_Underflow (2062 of 2355) PASS: lldb-unit :: Symbol/./SymbolTests/TestTypeSystemClang.TestGetTypeClassTypeOfExpr (2063 of 2355) PASS: lldb-unit :: Utility/./UtilityTests/BinaryStreamTest.PutULEB128SixBytes (2064 of 2355) PASS: lldb-unit :: Utility/./UtilityTests/RangeTest.LessThanInvalid (2065 of 2355) PASS: lldb-unit :: Host/./HostTests/MainLoopTest.ReadObject (2066 of 2355) PASS: lldb-api :: commands/target/stop-hook/enable/TestTargetStopHookEnable.py (2067 of 2355) PASS: lldb-unit :: Utility/./UtilityTests/StringListTest.JoinEmpty (2068 of 2355) PASS: lldb-unit :: Process/Utility/./ProcessUtilityTests/ProcMapTests/LinuxProcMapsTestFixture.ParseMapRegions/1 (2069 of 2355) PASS: lldb-unit :: Language/CLanguages/./LanguageCLanguagesTests/CLanguages.LookupCLanguagesByLanguageType (2070 of 2355) PASS: lldb-unit :: Utility/./UtilityTests/RangeTest.NotEqualInvalid (2071 of 2355) PASS: lldb-api :: tools/lldb-server/inferior-crash/TestGdbRemoteAbort.py (2072 of 2355) PASS: lldb-unit :: ObjectFile/Breakpad/./ObjectFileBreakpadTests/LineRecord.parse (2073 of 2355) PASS: lldb-unit :: Core/./LLDBCoreTests/ModuleSpecTest.TestCOFFFile (2074 of 2355) PASS: lldb-api :: test_utils/TestPExpectTest.py (2075 of 2355) PASS: lldb-api :: tools/lldb-vscode/console/TestVSCode_redirection_to_console.py (2076 of 2355) PASS: lldb-shell :: SymbolFile/DWARF/x86/find-variable-file.cpp (2077 of 2355) PASS: lldb-api :: lang/c/local_variables/TestLocalVariables.py (2078 of 2355) PASS: lldb-unit :: Utility/./UtilityTests/VMRange.ContainsRange (2079 of 2355) PASS: lldb-unit :: Symbol/./SymbolTests/PostfixExpression.ParseFPOProgram (2080 of 2355) PASS: lldb-unit :: Utility/./UtilityTests/BinaryStreamTest.PutULEB128TwoBytes (2081 of 2355) PASS: lldb-unit :: DataFormatter/./LLDBFormatterTests/TypeMatcherTests.GetMatchStringExactName (2082 of 2355) PASS: lldb-api :: commands/expression/import-std-module/no-std-module/TestMissingStdModule.py (2083 of 2355) PASS: lldb-api :: functionalities/multiword-commands/TestMultiWordCommands.py (2084 of 2355) PASS: lldb-unit :: Process/minidump/./LLDBMinidumpTests/MinidumpParserTest.GetMemoryRegionInfoFromMemoryList (2085 of 2355) PASS: lldb-unit :: Utility/./UtilityTests/StringListTest.SetSize (2086 of 2355) PASS: lldb-api :: lang/objc/objc-new-syntax/TestObjCNewSyntaxArray.py (2087 of 2355) PASS: lldb-unit :: Utility/./UtilityTests/ListenerTest.GetEventWait (2088 of 2355) PASS: lldb-api :: python_api/value/TestValueAPI.py (2089 of 2355) PASS: lldb-shell :: Minidump/Windows/find-module.test (2090 of 2355) PASS: lldb-unit :: Utility/./UtilityTests/StringListTest.InsertStringAtIndexStdString (2091 of 2355) PASS: lldb-api :: commands/target/stop-hook/delete/TestTargetStopHookDelete.py (2092 of 2355) PASS: lldb-unit :: Utility/./UtilityTests/DataExtractorTest.GetCStr (2093 of 2355) PASS: lldb-api :: commands/expression/import-std-module/shared_ptr-dbg-info-content/TestSharedPtrDbgInfoContentFromStdModule.py (2094 of 2355) UNSUPPORTED: lldb-shell :: SymbolFile/PDB/type-quals.test (2095 of 2355) PASS: lldb-api :: commands/expression/completion-crash-incomplete-record/TestCompletionCrashIncompleteRecord.py (2096 of 2355) PASS: lldb-api :: functionalities/thread/concurrent_events/TestConcurrentBreakpointsDelayedBreakpointOneWatchpoint.py (2097 of 2355) PASS: lldb-api :: lang/objc/objc-ivar-stripped/TestObjCIvarStripped.py (2098 of 2355) PASS: lldb-api :: lang/cpp/frame-var-anon-unions/TestFrameVariableAnonymousUnions.py (2099 of 2355) PASS: lldb-unit :: Utility/./UtilityTests/StreamTeeTest.AppendStream (2100 of 2355) PASS: lldb-shell :: ObjectFile/ELF/duplicate-section.yaml (2101 of 2355) PASS: lldb-api :: types/TestDoubleTypes.py (2102 of 2355) PASS: lldb-api :: lang/cpp/class-template-parameter-pack/TestClassTemplateParameterPack.py (2103 of 2355) PASS: lldb-unit :: Utility/./UtilityTests/StringLexerTest.GetUnlexed (2104 of 2355) PASS: lldb-api :: commands/expression/completion/TestExprCompletion.py (2105 of 2355) PASS: lldb-api :: commands/expression/char/TestExprsChar.py (2106 of 2355) PASS: lldb-unit :: Utility/./UtilityTests/StreamTest.ShiftOperatorPtr (2107 of 2355) PASS: lldb-unit :: Core/./LLDBCoreTests/SourceLocationSpecTest.Equal (2108 of 2355) PASS: lldb-api :: tools/lldb-vscode/breakpoint-events/TestVSCode_breakpointEvents.py (2109 of 2355) PASS: lldb-api :: lang/cpp/class_types/TestClassTypes.py (2110 of 2355) PASS: lldb-unit :: Process/Utility/./ProcessUtilityTests/ProcMapTests/LinuxProcMapsTestFixture.ParseMapRegions/5 (2111 of 2355) PASS: lldb-unit :: Utility/./UtilityTests/StringListTest.GetMaxStringLengthEqualSize (2112 of 2355) UNSUPPORTED: lldb-shell :: ScriptInterpreter/Lua/breakpoint_oneline_callback.test (2113 of 2355) PASS: lldb-shell :: Register/Core/x86-64-linux-addr.test (2114 of 2355) PASS: lldb-api :: commands/target/auto-install-main-executable/TestAutoInstallMainExecutable.py (2115 of 2355) PASS: lldb-api :: commands/expression/import-std-module/retry-with-std-module/TestRetryWithStdModule.py (2116 of 2355) UNSUPPORTED: lldb-shell :: ScriptInterpreter/Lua/persistent_state.test (2117 of 2355) PASS: lldb-shell :: SymbolFile/NativePDB/load-pdb.cpp (2118 of 2355) PASS: lldb-api :: commands/expression/persistent_ptr_update/TestPersistentPtrUpdate.py (2119 of 2355) PASS: lldb-unit :: Utility/./UtilityTests/BinaryStreamTest.PutSLEB128ThreeBytes (2120 of 2355) PASS: lldb-unit :: Symbol/./SymbolTests/Type.CompilerContextPattern (2121 of 2355) PASS: lldb-unit :: tools/lldb-server/tests/./LLDBServerTests/TestBase.DebugserverEnv (2122 of 2355) PASS: lldb-shell :: Reproducer/TestMultipleTargets.test (2123 of 2355) PASS: lldb-api :: commands/expression/cast_int_to_anonymous_enum/TestCastIntToAnonymousEnum.py (2124 of 2355) PASS: lldb-unit :: Host/./HostTests/SocketTests/SocketTest.DomainListenConnectAccept/ipv6 (2125 of 2355) UNSUPPORTED: lldb-api :: commands/expression/completion-crash-invalid-iterator/TestInvalidIteratorCompletionCrash.py (2126 of 2355) PASS: lldb-unit :: UnwindAssembly/x86/./UnwindAssemblyx86Tests/Testx86AssemblyInspectionEngine.TestPopEBP (2127 of 2355) PASS: lldb-unit :: Expression/./ExpressionTests/CppModuleConfigurationTest.LinuxLocalLibCpp (2128 of 2355) PASS: lldb-api :: commands/process/signal/TestProcessSignal.py (2129 of 2355) PASS: lldb-api :: functionalities/thread/exit_during_step/TestExitDuringStep.py (2130 of 2355) PASS: lldb-unit :: Utility/./UtilityTests/SerializationRountripTest.SerializeDeserializePodReferences (2131 of 2355) PASS: lldb-api :: commands/target/stop-hooks/TestStopHooks.py (2132 of 2355) PASS: lldb-unit :: Utility/./UtilityTests/FileSpecTest.Equal (2133 of 2355) PASS: lldb-api :: functionalities/breakpoint/cpp/TestCPPBreakpointLocations.py (2134 of 2355) UNSUPPORTED: lldb-api :: functionalities/gdb_remote_client/TestQemuAArch64TargetXml.py (2135 of 2355) PASS: lldb-unit :: Utility/./UtilityTests/StringListTest.GetMaxStringLengthIncreasingSize (2136 of 2355) PASS: lldb-unit :: Utility/./UtilityTests/ArgsTest.EscapeLLDBCommandArgument (2137 of 2355) PASS: lldb-unit :: Utility/./UtilityTests/StreamTest.PutULEB128 (2138 of 2355) PASS: lldb-api :: python_api/lldbutil/iter/TestLLDBIterator.py (2139 of 2355) UNSUPPORTED: lldb-shell :: BuildScript/toolchain-clang-cl.test (2140 of 2355) PASS: lldb-unit :: Utility/./UtilityTests/TimeoutTest.Construction (2141 of 2355) PASS: lldb-api :: macosx/lc-note/kern-ver-str/TestKernVerStrLCNOTE.py (2142 of 2355) PASS: lldb-shell :: Driver/TestFile.test (2143 of 2355) PASS: lldb-shell :: Register/Core/x86-64-linux-fp.test (2144 of 2355) PASS: lldb-unit :: Expression/./ExpressionTests/DiagnosticManagerTest.PutString (2145 of 2355) PASS: lldb-unit :: UnwindAssembly/x86/./UnwindAssemblyx86Tests/Testx86AssemblyInspectionEngine.TestPopRBX (2146 of 2355) PASS: lldb-unit :: ScriptInterpreter/Python/./ScriptInterpreterPythonTests/PythonDataObjectsTest.TestPythonTupleInitializerList (2147 of 2355) PASS: lldb-unit :: Utility/./UtilityTests/ArchSpecTest.Compatibility (2148 of 2355) PASS: lldb-unit :: Language/Highlighting/./HighlighterTests/HighlighterTest.ClangIdentifiers (2149 of 2355) PASS: lldb-api :: macosx/nslog/TestDarwinNSLogOutput.py (2150 of 2355) PASS: lldb-unit :: Utility/./UtilityTests/StringListTest.LongestCommonPrefix (2151 of 2355) PASS: lldb-unit :: Utility/./UtilityTests/NameMatchesTest.Equals (2152 of 2355) PASS: lldb-api :: commands/expression/regression-access-function-template-in-record/TestRegressionAccessFunctionTemplateInRecord.py (2153 of 2355) PASS: lldb-unit :: Utility/./UtilityTests/StringListTest.GetMaxStringLengthEmpty (2154 of 2355) XFAIL: lldb-shell :: Register/x86-mm-xmm-write.test (2155 of 2355) PASS: lldb-unit :: Symbol/./SymbolTests/TestTypeSystemClang.TestGetEnumIntegerTypeUnexpectedType (2156 of 2355) PASS: lldb-shell :: ObjectFile/wasm/stripped-debug-sections.yaml (2157 of 2355) PASS: lldb-api :: functionalities/gdb_remote_client/TestNoWatchpointSupportInfo.py (2158 of 2355) PASS: lldb-unit :: Utility/./UtilityTests/RangeTest.Constructor (2159 of 2355) PASS: lldb-shell :: SymbolFile/NativePDB/s_constant.cpp (2160 of 2355) PASS: lldb-unit :: Utility/./UtilityTests/BinaryStreamTest.PutULEB128SevenBytes (2161 of 2355) PASS: lldb-unit :: Utility/./UtilityTests/ArgsTest.TestQuotedUnknownEscape (2162 of 2355) PASS: lldb-unit :: Symbol/./SymbolTests/TestClangASTImporter.CopyTypeTagDecl (2163 of 2355) UNSUPPORTED: lldb-api :: functionalities/tsan/thread_numbers/TestTsanThreadNumbers.py (2164 of 2355) PASS: lldb-unit :: Symbol/./SymbolTests/TestClangASTImporter.MetadataPropagation (2165 of 2355) PASS: lldb-api :: functionalities/thread/concurrent_events/TestConcurrentTwoBreakpointsOneDelaySignal.py (2166 of 2355) PASS: lldb-unit :: Utility/./UtilityTests/UUIDTest.SetFromStringRef (2167 of 2355) PASS: lldb-unit :: Utility/./UtilityTests/StreamTest.PutBytesAsRawHex8ToBigEndian (2168 of 2355) PASS: lldb-api :: functionalities/archives/TestBSDArchives.py (2169 of 2355) PASS: lldb-api :: lang/cpp/namespace/TestNamespace.py (2170 of 2355) PASS: lldb-unit :: Utility/./UtilityTests/ArgsTest.TestSingleQuotedArgWithSpace (2171 of 2355) PASS: lldb-shell :: BuildScript/script-args.test (2172 of 2355) PASS: lldb-api :: python_api/debugger/TestDebuggerAPI.py (2173 of 2355) PASS: lldb-api :: python_api/watchpoint/condition/TestWatchpointConditionAPI.py (2174 of 2355) PASS: lldb-unit :: Core/./LLDBCoreTests/DumpDataExtractorTest.BaseAddress (2175 of 2355) PASS: lldb-shell :: SymbolFile/DWARF/x86/debug-types-line-tables.s (2176 of 2355) UNSUPPORTED: lldb-api :: functionalities/unwind/ehframe/TestEhFrameUnwind.py (2177 of 2355) PASS: lldb-api :: macosx/thread-names/TestInterruptThreadNames.py (2178 of 2355) PASS: lldb-unit :: Utility/./UtilityTests/BinaryStreamTest.PutSLEB128FiveBytes (2179 of 2355) PASS: lldb-unit :: Core/./LLDBCoreTests/SourceLocationSpecTest.FileLineColumnComponents (2180 of 2355) PASS: lldb-api :: functionalities/data-formatter/data-formatter-stl/libcxx/set/TestDataFormatterLibcxxSet.py (2181 of 2355) UNSUPPORTED: lldb-shell :: Unwind/eh-frame-augment-noop.test (2182 of 2355) PASS: lldb-api :: functionalities/data-formatter/data-formatter-objc/TestDataFormatterObjCNSDate.py (2183 of 2355) PASS: lldb-api :: python_api/objc_type/TestObjCType.py (2184 of 2355) PASS: lldb-unit :: Utility/./UtilityTests/DataExtractorTest.GetMaxU64_unchecked (2185 of 2355) UNSUPPORTED: lldb-shell :: SymbolFile/PDB/function-level-linking.test (2186 of 2355) PASS: lldb-unit :: Utility/./UtilityTests/LogTest.Register (2187 of 2355) PASS: lldb-shell :: Settings/TestDisableColor.test (2188 of 2355) PASS: lldb-unit :: Host/./HostTests/SocketTests/SocketTest.TCPGetAddress/ipv6 (2189 of 2355) PASS: lldb-unit :: Utility/./UtilityTests/BroadcasterTest.EventTypeHasListeners (2190 of 2355) PASS: lldb-shell :: SymbolFile/DWARF/x86/parallel-indexing-stress.s (2191 of 2355) PASS: lldb-api :: functionalities/gdb_remote_client/TestqOffsets.py (2192 of 2355) PASS: lldb-unit :: Language/Highlighting/./HighlighterTests/HighlighterTest.DefaultHighlighterWithCursorOutOfBounds (2193 of 2355) PASS: lldb-unit :: Utility/./UtilityTests/RangeTest.ContainsRangeStartingFromZero (2194 of 2355) PASS: lldb-unit :: Utility/./UtilityTests/ArgsTest.ReplaceArgumentAtIndexFarOutOfRange (2195 of 2355) PASS: lldb-unit :: Language/Highlighting/./HighlighterTests/HighlighterTest.ClangPPDirectives (2196 of 2355) PASS: lldb-unit :: Utility/./UtilityTests/RangeTest.Clear (2197 of 2355) PASS: lldb-shell :: SymbolFile/DWARF/x86/dwarf5-atomic.s (2198 of 2355) PASS: lldb-unit :: ScriptInterpreter/Python/./ScriptInterpreterPythonTests/PythonDataObjectsTest.TestPythonListValueEquality (2199 of 2355) PASS: lldb-shell :: SymbolFile/DWARF/x86/DW_AT_const_value.s (2200 of 2355) UNSUPPORTED: lldb-shell :: ScriptInterpreter/Lua/breakpoint_function_callback.test (2201 of 2355) UNSUPPORTED: lldb-shell :: Register/arm-gp-read.test (2202 of 2355) PASS: lldb-shell :: Breakpoint/jit-loader_rtdyld_elf.test (2203 of 2355) PASS: lldb-api :: functionalities/data-formatter/data-formatter-objc/TestDataFormatterObjNSException.py (2204 of 2355) UNSUPPORTED: lldb-api :: functionalities/data-formatter/data-formatter-stl/libstdcpp/list/TestDataFormatterStdList.py (2205 of 2355) PASS: lldb-unit :: DataFormatter/./LLDBFormatterTests/TypeMatcherTests.CreatedBySameMatchStringExactNamePrefixes (2206 of 2355) UNSUPPORTED: lldb-shell :: ScriptInterpreter/Lua/quit.test (2207 of 2355) PASS: lldb-api :: lang/cpp/keywords_enabled/TestCppKeywordsEnabled.py (2208 of 2355) PASS: lldb-api :: lang/c/find_struct_type/TestFindStructTypes.py (2209 of 2355) PASS: lldb-unit :: Core/./LLDBCoreTests/FormatEntityTest.DefinitionConstructionNameAndString (2210 of 2355) PASS: lldb-api :: linux/builtin_trap/TestBuiltinTrap.py (2211 of 2355) PASS: lldb-api :: commands/expression/import-std-module/vector/TestVectorFromStdModule.py (2212 of 2355) PASS: lldb-api :: commands/frame/recognizer/TestFrameRecognizer.py (2213 of 2355) PASS: lldb-unit :: Utility/./UtilityTests/StreamTest.PutMaxHex64ByteOrderLittle (2214 of 2355) UNSUPPORTED: lldb-api :: tools/intel-features/intel-pt/test/TestIntelPTSimpleBinary.py (2215 of 2355) PASS: lldb-api :: commands/expression/import-std-module/list-dbg-info-content/TestDbgInfoContentListFromStdModule.py (2216 of 2355) XFAIL: lldb-shell :: Expr/nodefaultlib.cpp (2217 of 2355) UNSUPPORTED: lldb-api :: android/platform/TestDefaultCacheLineSize.py (2218 of 2355) UNSUPPORTED: lldb-shell :: Register/x86-64-zmm-write.test (2219 of 2355) PASS: lldb-unit :: Process/gdb-remote/./ProcessGdbRemoteTests/GDBRemoteCommunicationTest.ReadPacket_checksum (2220 of 2355) PASS: lldb-shell :: Register/Core/x86-32-linux-addr.test (2221 of 2355) PASS: lldb-unit :: Utility/./UtilityTests/RangeTest.Union (2222 of 2355) PASS: lldb-api :: lang/objc/modules-hash-mismatch/TestClangModulesHashMismatch.py (2223 of 2355) PASS: lldb-api :: functionalities/gdb_remote_client/TestPlatformClient.py (2224 of 2355) PASS: lldb-api :: lang/cpp/modules-import/TestCXXModulesImport.py (2225 of 2355) PASS: lldb-unit :: Utility/./UtilityTests/PassiveReplayTest.InstrumentedBarPtr (2226 of 2355) PASS: lldb-unit :: Utility/./UtilityTests/VMRange.ContainsAddr (2227 of 2355) UNSUPPORTED: lldb-api :: tools/lldb-vscode/disconnect/TestVSCode_disconnect.py (2228 of 2355) PASS: lldb-api :: functionalities/tail_call_frames/thread_step_out_or_return/TestSteppingOutWithArtificialFrames.py (2229 of 2355) PASS: lldb-api :: commands/frame/diagnose/dereference-argument/TestDiagnoseDereferenceArgument.py (2230 of 2355) PASS: lldb-unit :: Expression/./ExpressionTests/DWARFExpression.DW_OP_unknown (2231 of 2355) PASS: lldb-unit :: Expression/./ExpressionTests/DiagnosticManagerTest.GetStringNoDiags (2232 of 2355) PASS: lldb-unit :: Utility/./UtilityTests/SharedCluster.ClusterManager (2233 of 2355) PASS: lldb-api :: lang/objc/foundation/TestConstStrings.py (2234 of 2355) PASS: lldb-api :: lang/cpp/global_variables/TestCPPGlobalVariables.py (2235 of 2355) PASS: lldb-api :: functionalities/data-formatter/compactvectors/TestCompactVectors.py (2236 of 2355) PASS: lldb-api :: functionalities/step_scripted/TestStepScripted.py (2237 of 2355) PASS: lldb-unit :: Utility/./UtilityTests/LogTest.LLDB_LOG_nullptr (2238 of 2355) PASS: lldb-api :: tools/lldb-server/TestGdbRemoteAttachOrWait.py (2239 of 2355) PASS: lldb-unit :: Utility/./UtilityTests/FileSpecTest.FormatFileSpec (2240 of 2355) PASS: lldb-api :: functionalities/thread/concurrent_events/TestConcurrentTwoWatchpointsOneBreakpoint.py (2241 of 2355) PASS: lldb-api :: lang/cpp/symbols/TestSymbols.py (2242 of 2355) PASS: lldb-api :: commands/command/script/import/TestImport.py (2243 of 2355) PASS: lldb-shell :: Reproducer/TestDSYM.test (2244 of 2355) UNSUPPORTED: lldb-api :: functionalities/data-formatter/data-formatter-stl/libstdcpp/iterator/TestDataFormatterStdIterator.py (2245 of 2355) PASS: lldb-api :: functionalities/breakpoint/auto_continue/TestBreakpointAutoContinue.py (2246 of 2355) PASS: lldb-shell :: SymbolFile/DWARF/x86/debug-types-signature-loop.s (2247 of 2355) PASS: lldb-api :: commands/platform/file/read/TestPlatformFileRead.py (2248 of 2355) PASS: lldb-api :: commands/expression/error-limit/TestExprErrorLimit.py (2249 of 2355) XFAIL: lldb-shell :: SymbolFile/DWARF/find-type-in-function.cpp (2250 of 2355) UNSUPPORTED: lldb-api :: functionalities/gdb_remote_client/TestAArch64XMLRegOffsets.py (2251 of 2355) PASS: lldb-unit :: Symbol/./SymbolTests/PostfixExpression.ParseOneExpression (2252 of 2355) PASS: lldb-api :: lang/c/record_decl_in_expr/TestRecordDeclInExpr.py (2253 of 2355) PASS: lldb-shell :: SymbolFile/DWARF/x86/DW_AT_const_value-bitfields.s (2254 of 2355) PASS: lldb-unit :: UnwindAssembly/x86/./UnwindAssemblyx86Tests/Testx86AssemblyInspectionEngine.TestSimple64bitFrameFunction (2255 of 2355) PASS: lldb-api :: commands/expression/timeout/TestCallWithTimeout.py (2256 of 2355) PASS: lldb-shell :: lldb-server/TestErrorMessages.test (2257 of 2355) UNSUPPORTED: lldb-api :: macosx/macCatalystAppMacOSFramework/TestMacCatalystAppWithMacOSFramework.py (2258 of 2355) PASS: lldb-shell :: SymbolFile/DWARF/x86/array-sizes.s (2259 of 2355) PASS: lldb-unit :: Utility/./UtilityTests/StringLexerTest.HasAtLeast (2260 of 2355) PASS: lldb-api :: lang/c/inlines/TestRedefinitionsInInlines.py (2261 of 2355) PASS: lldb-shell :: Commands/command-disassemble.s (2262 of 2355) PASS: lldb-api :: commands/settings/quoting/TestQuoting.py (2263 of 2355) UNSUPPORTED: lldb-shell :: Register/x86-64-ymm16-read.test (2264 of 2355) PASS: lldb-api :: commands/expression/pr35310/TestExprsBug35310.py (2265 of 2355) PASS: lldb-unit :: Utility/./UtilityTests/StringLexerTest.PutBack (2266 of 2355) PASS: lldb-api :: types/TestShortType.py (2267 of 2355) PASS: lldb-api :: lang/cpp/non-type-template-param/TestCppNonTypeTemplateParam.py (2268 of 2355) PASS: lldb-unit :: Utility/./UtilityTests/BinaryStreamTest.PutSLEB128Zero (2269 of 2355) PASS: lldb-api :: tools/lldb-server/TestGdbRemoteAttach.py (2270 of 2355) UNSUPPORTED: lldb-shell :: Expr/TestIRMemoryMapWindows.test (2271 of 2355) PASS: lldb-unit :: Utility/./UtilityTests/RegularExpression.Match (2272 of 2355) PASS: lldb-api :: lang/objc/objc-foundation-dictionary-empty/TestNSDictionary0.py (2273 of 2355) PASS: lldb-unit :: Utility/./UtilityTests/StringExtractorTest.GetHexBytesAvail (2274 of 2355) UNSUPPORTED: lldb-api :: benchmarks/libcxxmap/TestBenchmarkLibcxxMap.py (2275 of 2355) PASS: lldb-shell :: SymbolFile/Breakpad/unwind-via-stack-win.test (2276 of 2355) PASS: lldb-unit :: Utility/./UtilityTests/StringExtractorTest.GetU32LittleEndian (2277 of 2355) PASS: lldb-unit :: Utility/./UtilityTests/BinaryStreamTest.PutSLEB128OneByte (2278 of 2355) PASS: lldb-unit :: Process/gdb-remote/./ProcessGdbRemoteTests/GDBRemoteClientBaseTest.SendContinueAndAsyncPacket (2279 of 2355) PASS: lldb-unit :: Utility/./UtilityTests/StringLexerTest.Next (2280 of 2355) UNSUPPORTED: lldb-api :: macosx/simulator/TestSimulatorPlatform.py (2281 of 2355) PASS: lldb-api :: functionalities/data-formatter/data-formatter-stl/libcxx/function/TestLibCxxFunction.py (2282 of 2355) PASS: lldb-api :: lang/cpp/template-arguments/TestCppTemplateArguments.py (2283 of 2355) PASS: lldb-api :: commands/expression/import-std-module/vector-of-vectors/TestVectorOfVectorsFromStdModule.py (2284 of 2355) PASS: lldb-unit :: UnwindAssembly/x86/./UnwindAssemblyx86Tests/Testx86AssemblyInspectionEngine.Testi386IgnoredRegisters (2285 of 2355) PASS: lldb-unit :: Utility/./UtilityTests/StringListTest.CopyList (2286 of 2355) PASS: lldb-unit :: Utility/./UtilityTests/TimeoutTest.Format (2287 of 2355) PASS: lldb-api :: lang/cpp/type_lookup/TestCppTypeLookup.py (2288 of 2355) PASS: lldb-unit :: Process/gdb-remote/./ProcessGdbRemoteTests/GDBRemoteCommunicationClientTest.GetMemoryRegionInfo (2289 of 2355) PASS: lldb-unit :: Symbol/./SymbolTests/TestTypeSystemClang.TemplateArguments (2290 of 2355) UNSUPPORTED: lldb-shell :: Subprocess/clone-follow-parent-wp.test (2291 of 2355) PASS: lldb-unit :: Utility/./UtilityTests/ArgsTest.TestOverwriteArgs (2292 of 2355) PASS: lldb-unit :: UnwindAssembly/x86/./UnwindAssemblyx86Tests/Testx86AssemblyInspectionEngine.TestPushEDX (2293 of 2355) PASS: lldb-unit :: Process/gdb-remote/./ProcessGdbRemoteTests/GDBRemoteClientBaseTest.SendContinueDelegateInterface (2294 of 2355) PASS: lldb-api :: commands/breakpoint/command/list/TestBreakpointCommandList.py (2295 of 2355) PASS: lldb-unit :: Process/gdb-remote/./ProcessGdbRemoteTests/GDBRemoteClientBaseTest.SendContinueAndInterrupt (2296 of 2355) PASS: lldb-api :: functionalities/data-formatter/refpointer-recursion/TestDataFormatterRefPtrRecursion.py (2297 of 2355) PASS: lldb-shell :: ExecControl/StopHook/stop-hook.test (2298 of 2355) PASS: lldb-shell :: Unwind/trap_frame_sym_ctx.test (2299 of 2355) UNSUPPORTED: lldb-shell :: SymbolFile/Breakpad/stack-cfi-arm.yaml (2300 of 2355) PASS: lldb-unit :: Utility/./UtilityTests/ArgsTest.ReplaceArgumentAtIndexOutOfRange (2301 of 2355) PASS: lldb-unit :: Process/gdb-remote/./ProcessGdbRemoteTests/GDBRemoteCommunicationClientTest.TestPacketSpeedJSON (2302 of 2355) PASS: lldb-unit :: Utility/./UtilityTests/StreamTest.PutBytesAsRawHex8ToMixedEndian (2303 of 2355) PASS: lldb-unit :: Utility/./UtilityTests/RegularExpression.Empty (2304 of 2355) UNSUPPORTED: lldb-shell :: SymbolFile/DWARF/x86/dwarf5-line-strp.s (2305 of 2355) PASS: lldb-shell :: BuildScript/toolchain-clang.test (2306 of 2355) PASS: lldb-unit :: Utility/./UtilityTests/AnsiTerminal.AtEnd (2307 of 2355) PASS: lldb-api :: commands/expression/import-std-module/unique_ptr-dbg-info-content/TestUniquePtrDbgInfoContent.py (2308 of 2355) UNSUPPORTED: lldb-api :: arm/breakpoint-it/TestBreakpointIt.py (2309 of 2355) PASS: lldb-unit :: DataFormatter/./LLDBFormatterTests/StringPrinterTests.SwiftUTF8 (2310 of 2355) PASS: lldb-unit :: Utility/./UtilityTests/CompletionRequest.ShiftArguments (2311 of 2355) PASS: lldb-api :: lang/cpp/bitfields/TestCppBitfields.py (2312 of 2355) PASS: lldb-unit :: Utility/./UtilityTests/NameMatchesTest.Ignore (2313 of 2355) UNSUPPORTED: lldb-api :: lang/objc/rdar-12408181/TestRdar12408181.py (2314 of 2355) PASS: lldb-api :: functionalities/gdb_remote_client/TestRegDefinitionInParts.py (2315 of 2355) PASS: lldb-unit :: SymbolFile/DWARF/./SymbolFileDWARFTests/SymbolFileDWARFTests.ParseArangesSkipErrors (2316 of 2355) PASS: lldb-shell :: SymbolFile/DWARF/x86/find-method-local-struct.cpp (2317 of 2355) PASS: lldb-api :: lang/objc/foundation/TestObjCMethods.py (2318 of 2355) UNSUPPORTED: lldb-api :: tools/lldb-server/libraries-svr4/TestGdbRemoteLibrariesSvr4Support.py (2319 of 2355) PASS: lldb-unit :: ScriptInterpreter/Python/./ScriptInterpreterPythonTests/PythonDataObjectsTest.TestResetting (2320 of 2355) PASS: lldb-unit :: Utility/./UtilityTests/Flags.AllSet (2321 of 2355) PASS: lldb-shell :: SymbolFile/DWARF/x86/win-i386-line-table.s (2322 of 2355) PASS: lldb-shell :: ObjectFile/ELF/minidebuginfo-find-symbols.yaml (2323 of 2355) PASS: lldb-api :: lang/c/local_types/TestUseClosestType.py (2324 of 2355) PASS: lldb-api :: lang/cpp/typeof/TestTypeOfDeclTypeExpr.py (2325 of 2355) PASS: lldb-api :: commands/expression/rdar42038760/TestScalarURem.py (2326 of 2355) PASS: lldb-unit :: Utility/./UtilityTests/DataExtractorTest.GetDoubleUnaligned (2327 of 2355) PASS: lldb-unit :: Process/Utility/./ProcessUtilityTests/ProcSMapTests/LinuxProcSMapsTestFixture.ParseSMapRegions/3 (2328 of 2355) PASS: lldb-unit :: Host/./HostTests/NativeProcessProtocolTest.SetBreakpointFailRead (2329 of 2355) FAIL: lldb-api :: tools/lldb-vscode/breakpoint/TestVSCode_setFunctionBreakpoints.py (2330 of 2355) ******************** TEST 'lldb-api :: tools/lldb-vscode/breakpoint/TestVSCode_setFunctionBreakpoints.py' FAILED ******************** Script: -- /Users/buildslave/jenkins/workspace/lldb-cmake-sanitized/lldb-build/lldb-test-build.noindex/copied-python /Users/buildslave/jenkins/workspace/lldb-cmake-sanitized/llvm-project/lldb/test/API/dotest.py -u CXXFLAGS -u CFLAGS --codesign-identity lldb_codesign --arch x86_64 --build-dir /Users/buildslave/jenkins/workspace/lldb-cmake-sanitized/lldb-build/lldb-test-build.noindex -t --env TERM=vt100 --env LLVM_LIBS_DIR=/Users/buildslave/jenkins/workspace/lldb-cmake-sanitized/lldb-build/./lib --inferior-env ASAN_OPTIONS=detect_stack_use_after_return=1 --inferior-env DYLD_INSERT_LIBRARIES=/Users/buildslave/jenkins/workspace/lldb-cmake-sanitized/host-compiler/lib/clang/13.0.99/lib/darwin/libclang_rt.asan_osx_dynamic.dylib --arch x86_64 --build-dir /Users/buildslave/jenkins/workspace/lldb-cmake-sanitized/lldb-build/lldb-test-build.noindex --lldb-module-cache-dir /Users/buildslave/jenkins/workspace/lldb-cmake-sanitized/lldb-build/lldb-test-build.noindex/module-cache-lldb/lldb-api --clang-module-cache-dir /Users/buildslave/jenkins/workspace/lldb-cmake-sanitized/lldb-build/lldb-test-build.noindex/module-cache-clang/lldb-api --executable /Users/buildslave/jenkins/workspace/lldb-cmake-sanitized/lldb-build/./bin/lldb --compiler /Users/buildslave/jenkins/workspace/lldb-cmake-sanitized/host-compiler/bin/clang --dsymutil /Users/buildslave/jenkins/workspace/lldb-cmake-sanitized/lldb-build/./bin/dsymutil --llvm-tools-dir /Users/buildslave/jenkins/workspace/lldb-cmake-sanitized/lldb-build/./bin --lldb-libs-dir /Users/buildslave/jenkins/workspace/lldb-cmake-sanitized/lldb-build/./lib /Users/buildslave/jenkins/workspace/lldb-cmake-sanitized/llvm-project/lldb/test/API/tools/lldb-vscode/breakpoint -p TestVSCode_setFunctionBreakpoints.py -- Exit Code: 1

Hide Details

Command Output (stdout): -- lldb version 13.0.99 (http://labmaster3.local/git/llvm-project.git revision 07a1f3513e2e3802671a0a4ca1edf2fe577fad03) clang revision 07a1f3513e2e3802671a0a4ca1edf2fe577fad03 llvm revision 07a1f3513e2e3802671a0a4ca1edf2fe577fad03 Skipping the following test categories: ['darwin-log', 'libstdcxx', 'dwo', 'llgs', 'fork'] ========= DEBUG ADAPTER PROTOCOL LOGS ========= --> Content-Length: 284

Hide Details

{"command":"initialize","type":"request","arguments":{"adapterID":"lldb-native","clientID":"vscode","columnsStartAt1":true,"linesStartAt1":true,"locale":"en-us","pathFormat":"path","supportsRunInTerminalRequest":true,"supportsVariablePaging":true,"supportsVariableType":true},"seq":1} <-- Content-Length: 1222

Hide Details

{"body":{"exceptionBreakpointFilters":[{"default":false,"filter":"cpp_catch","label":"C++ Catch"},{"default":false,"filter":"cpp_throw","label":"C++ Throw"},{"default":false,"filter":"objc_catch","label":"Objective C Catch"},{"default":false,"filter":"objc_throw","label":"Objective C Throw"},{"default":false,"filter":"swift_catch","label":"Swift Catch"},{"default":false,"filter":"swift_throw","label":"Swift Throw"}],"supportTerminateDebuggee":true,"supportsCompletionsRequest":false,"supportsConditionalBreakpoints":true,"supportsConfigurationDoneRequest":true,"supportsDelayedStackTraceLoading":true,"supportsEvaluateForHovers":true,"supportsExceptionInfoRequest":true,"supportsExceptionOptions":true,"supportsFunctionBreakpoints":true,"supportsGotoTargetsRequest":false,"supportsHitConditionalBreakpoints":true,"supportsLoadedSourcesRequest":false,"supportsModulesRequest":false,"supportsProgressReporting":true,"supportsRestartFrame":false,"supportsRestartRequest":false,"supportsRunInTerminalRequest":true,"supportsSetVariable":true,"supportsStepBack":false,"supportsStepInTargetsRequest":false,"supportsValueFormattingOptions":true},"command":"initialize","request_seq":1,"seq":0,"success":true,"type":"response"} --> Content-Length: 1044

Hide Details

{"command":"launch","type":"request","arguments":{"program":"/Users/buildslave/jenkins/workspace/lldb-cmake-sanitized/lldb-build/lldb-test-build.noindex/tools/lldb-vscode/breakpoint/TestVSCode_setFunctionBreakpoints.test_functionality/a.out","disableASLR":true,"initCommands":["settings clear -all","settings set symbols.enable-external-lookup false","settings set target.inherit-tcc true","settings set target.detach-on-error false","settings set target.auto-apply-fixits false","settings set plugin.process.gdb-remote.packet-timeout 60","settings set symbols.clang-modules-cache-path \"/Users/buildslave/jenkins/workspace/lldb-cmake-sanitized/lldb-build/lldb-test-build.noindex/module-cache-lldb/lldb-api\"","settings set use-color false","setting set target.prefer-dynamic-value no-dynamic-values","settings set target.env-vars ASAN_OPTIONS=detect_stack_use_after_return=1 DYLD_INSERT_LIBRARIES=/Users/buildslave/jenkins/workspace/lldb-cmake-sanitized/host-compiler/lib/clang/13.0.99/lib/darwin/libclang_rt.asan_osx_dynamic.dylib"]},"seq":2} <-- Content-Length: 923

Hide Details

{"body":{"category":"console","output":"Running initCommands:\n(lldb) settings clear -all\n(lldb) settings set symbols.enable-external-lookup false\n(lldb) settings set target.inherit-tcc true\n(lldb) settings set target.detach-on-error false\n(lldb) settings set target.auto-apply-fixits false\n(lldb) settings set plugin.process.gdb-remote.packet-timeout 60\n(lldb) settings set symbols.clang-modules-cache-path \"/Users/buildslave/jenkins/workspace/lldb-cmake-sanitized/lldb-build/lldb-test-build.noindex/module-cache-lldb/lldb-api\"\n(lldb) settings set use-color false\n(lldb) setting set target.prefer-dynamic-value no-dynamic-values\n(lldb) settings set target.env-vars ASAN_OPTIONS=detect_stack_use_after_return=1 DYLD_INSERT_LIBRARIES=/Users/buildslave/jenkins/workspace/lldb-cmake-sanitized/host-compiler/lib/clang/13.0.99/lib/darwin/libclang_rt.asan_osx_dynamic.dylib\n"},"event":"output","seq":0,"type":"event"} <-- Content-Length: 77

Hide Details

{"command":"launch","request_seq":2,"seq":0,"success":true,"type":"response"} <-- Content-Length: 309

Hide Details

{"body":{"isLocalProcess":true,"name":"/Users/buildslave/jenkins/workspace/lldb-cmake-sanitized/lldb-build/lldb-test-build.noindex/tools/lldb-vscode/breakpoint/TestVSCode_setFunctionBreakpoints.test_functionality/a.out","startMethod":"launch","systemProcessId":66651},"event":"process","seq":0,"type":"event"} <-- Content-Length: 46

Hide Details

{"event":"initialized","seq":0,"type":"event"} --> Content-Length: 109

Hide Details

{"command":"setFunctionBreakpoints","type":"request","arguments":{"breakpoints":[{"name":"twelve"}]},"seq":3} <-- Content-Length: 383

Hide Details

{"body":{"breakpoints":[{"id":1,"line":6,"source":{"name":"main-copy.cpp","path":"/Users/buildslave/jenkins/workspace/lldb-cmake-sanitized/lldb-build/lldb-test-build.noindex/tools/lldb-vscode/breakpoint/TestVSCode_setFunctionBreakpoints.test_functionality/main-copy.cpp"},"verified":true}]},"command":"setFunctionBreakpoints","request_seq":3,"seq":0,"success":true,"type":"response"} --> Content-Length: 71

Hide Details

{"command":"configurationDone","type":"request","arguments":{},"seq":4} <-- Content-Length: 88

Hide Details

{"command":"configurationDone","request_seq":4,"seq":0,"success":true,"type":"response"} <-- Content-Length: 198

Hide Details

{"body":{"allThreadsStopped":true,"description":"breakpoint 1.1","preserveFocusHint":false,"reason":"breakpoint","threadCausedFocus":true,"threadId":291445},"event":"stopped","seq":0,"type":"event"} --> Content-Length: 61

Hide Details

{"command":"threads","type":"request","arguments":{},"seq":5} <-- Content-Length: 132

Hide Details

{"body":{"threads":[{"id":291445,"name":"Thread #1"}]},"command":"threads","request_seq":5,"seq":0,"success":true,"type":"response"} --> Content-Length: 107

Hide Details

{"command":"stackTrace","type":"request","arguments":{"threadId":291445,"startFrame":0,"levels":1},"seq":6} <-- Content-Length: 409

Hide Details

{"body":{"stackFrames":[{"column":15,"id":524288,"line":6,"name":"twelve(int)","source":{"name":"main-copy.cpp","path":"/Users/buildslave/jenkins/workspace/lldb-cmake-sanitized/lldb-build/lldb-test-build.noindex/tools/lldb-vscode/breakpoint/TestVSCode_setFunctionBreakpoints.test_functionality/main-copy.cpp"}}],"totalFrames":4},"command":"stackTrace","request_seq":6,"seq":0,"success":true,"type":"response"} --> Content-Length: 76

Hide Details

{"command":"scopes","type":"request","arguments":{"frameId":524288},"seq":7} <-- Content-Length: 335

Hide Details

{"body":{"scopes":[{"expensive":false,"name":"Locals","namedVariables":1,"variablesReference":1},{"expensive":false,"name":"Globals","namedVariables":0,"variablesReference":2},{"expensive":false,"name":"Registers","namedVariables":3,"variablesReference":3}]},"command":"scopes","request_seq":7,"seq":0,"success":true,"type":"response"} --> Content-Length: 85

Hide Details

{"command":"variables","type":"request","arguments":{"variablesReference":1},"seq":8} <-- Content-Length: 190

Hide Details

{"body":{"variables":[{"evaluateName":"i","id":0,"name":"i","type":"int","value":"0","variablesReference":0}]},"command":"variables","request_seq":8,"seq":0,"success":true,"type":"response"} --> Content-Length: 128

Hide Details

{"command":"setFunctionBreakpoints","type":"request","arguments":{"breakpoints":[{"name":"twelve","condition":"i==4"}]},"seq":9} <-- Content-Length: 383

Hide Details

{"body":{"breakpoints":[{"id":1,"line":6,"source":{"name":"main-copy.cpp","path":"/Users/buildslave/jenkins/workspace/lldb-cmake-sanitized/lldb-build/lldb-test-build.noindex/tools/lldb-vscode/breakpoint/TestVSCode_setFunctionBreakpoints.test_functionality/main-copy.cpp"},"verified":true}]},"command":"setFunctionBreakpoints","request_seq":9,"seq":0,"success":true,"type":"response"} --> Content-Length: 80

Hide Details

{"command":"continue","type":"request","arguments":{"threadId":291445},"seq":10} <-- Content-Length: 116

Hide Details

{"body":{"allThreadsContinued":true},"command":"continue","request_seq":10,"seq":0,"success":true,"type":"response"} <-- Content-Length: 311

Hide Details

{"body":{"category":"console","output":"/Users/buildslave/jenkins/workspace/lldb-cmake-sanitized/llvm-project/lldb/tools/lldb-vscode/ProgressEvent.cpp:89:64: runtime error: load of value 808464432, which is not a valid value for type 'lldb_vscode::ProgressEventType'\n"},"event":"output","seq":0,"type":"event"} <-- Content-Length: 261

Hide Details

{"body":{"category":"console","output":"SUMMARY: UndefinedBehaviorSanitizer: undefined-behavior /Users/buildslave/jenkins/workspace/lldb-cmake-sanitized/llvm-project/lldb/tools/lldb-vscode/ProgressEvent.cpp:89:64 in \n"},"event":"output","seq":0,"type":"event"} <-- Content-Length: 170

Hide Details

{"body":{"category":"console","output":"PLEASE submit a bug report to https://bugs.llvm.org/ and include the crash backtrace.\n"},"event":"output","seq":0,"type":"event"}

Hide Details

========= END ========= ========= DEBUG ADAPTER PROTOCOL LOGS ========= --> Content-Length: 284

Hide Details

{"command":"initialize","type":"request","arguments":{"adapterID":"lldb-native","clientID":"vscode","columnsStartAt1":true,"linesStartAt1":true,"locale":"en-us","pathFormat":"path","supportsRunInTerminalRequest":true,"supportsVariablePaging":true,"supportsVariableType":true},"seq":1} <-- Content-Length: 1222

Hide Details

{"body":{"exceptionBreakpointFilters":[{"default":false,"filter":"cpp_catch","label":"C++ Catch"},{"default":false,"filter":"cpp_throw","label":"C++ Throw"},{"default":false,"filter":"objc_catch","label":"Objective C Catch"},{"default":false,"filter":"objc_throw","label":"Objective C Throw"},{"default":false,"filter":"swift_catch","label":"Swift Catch"},{"default":false,"filter":"swift_throw","label":"Swift Throw"}],"supportTerminateDebuggee":true,"supportsCompletionsRequest":false,"supportsConditionalBreakpoints":true,"supportsConfigurationDoneRequest":true,"supportsDelayedStackTraceLoading":true,"supportsEvaluateForHovers":true,"supportsExceptionInfoRequest":true,"supportsExceptionOptions":true,"supportsFunctionBreakpoints":true,"supportsGotoTargetsRequest":false,"supportsHitConditionalBreakpoints":true,"supportsLoadedSourcesRequest":false,"supportsModulesRequest":false,"supportsProgressReporting":true,"supportsRestartFrame":false,"supportsRestartRequest":false,"supportsRunInTerminalRequest":true,"supportsSetVariable":true,"supportsStepBack":false,"supportsStepInTargetsRequest":false,"supportsValueFormattingOptions":true},"command":"initialize","request_seq":1,"seq":0,"success":true,"type":"response"} --> Content-Length: 1044

Hide Details

{"command":"launch","type":"request","arguments":{"program":"/Users/buildslave/jenkins/workspace/lldb-cmake-sanitized/lldb-build/lldb-test-build.noindex/tools/lldb-vscode/breakpoint/TestVSCode_setFunctionBreakpoints.test_set_and_clear/a.out","disableASLR":true,"initCommands":["settings clear -all","settings set symbols.enable-external-lookup false","settings set target.inherit-tcc true","settings set target.detach-on-error false","settings set target.auto-apply-fixits false","settings set plugin.process.gdb-remote.packet-timeout 60","settings set symbols.clang-modules-cache-path \"/Users/buildslave/jenkins/workspace/lldb-cmake-sanitized/lldb-build/lldb-test-build.noindex/module-cache-lldb/lldb-api\"","settings set use-color false","setting set target.prefer-dynamic-value no-dynamic-values","settings set target.env-vars ASAN_OPTIONS=detect_stack_use_after_return=1 DYLD_INSERT_LIBRARIES=/Users/buildslave/jenkins/workspace/lldb-cmake-sanitized/host-compiler/lib/clang/13.0.99/lib/darwin/libclang_rt.asan_osx_dynamic.dylib"]},"seq":2} <-- Content-Length: 923

Hide Details

{"body":{"category":"console","output":"Running initCommands:\n(lldb) settings clear -all\n(lldb) settings set symbols.enable-external-lookup false\n(lldb) settings set target.inherit-tcc true\n(lldb) settings set target.detach-on-error false\n(lldb) settings set target.auto-apply-fixits false\n(lldb) settings set plugin.process.gdb-remote.packet-timeout 60\n(lldb) settings set symbols.clang-modules-cache-path \"/Users/buildslave/jenkins/workspace/lldb-cmake-sanitized/lldb-build/lldb-test-build.noindex/module-cache-lldb/lldb-api\"\n(lldb) settings set use-color false\n(lldb) setting set target.prefer-dynamic-value no-dynamic-values\n(lldb) settings set target.env-vars ASAN_OPTIONS=detect_stack_use_after_return=1 DYLD_INSERT_LIBRARIES=/Users/buildslave/jenkins/workspace/lldb-cmake-sanitized/host-compiler/lib/clang/13.0.99/lib/darwin/libclang_rt.asan_osx_dynamic.dylib\n"},"event":"output","seq":0,"type":"event"} <-- Content-Length: 77

Hide Details

{"command":"launch","request_seq":2,"seq":0,"success":true,"type":"response"} <-- Content-Length: 309

Hide Details

{"body":{"isLocalProcess":true,"name":"/Users/buildslave/jenkins/workspace/lldb-cmake-sanitized/lldb-build/lldb-test-build.noindex/tools/lldb-vscode/breakpoint/TestVSCode_setFunctionBreakpoints.test_set_and_clear/a.out","startMethod":"launch","systemProcessId":66729},"event":"process","seq":0,"type":"event"} <-- Content-Length: 46

Hide Details

{"event":"initialized","seq":0,"type":"event"} --> Content-Length: 109

Hide Details

{"command":"setFunctionBreakpoints","type":"request","arguments":{"breakpoints":[{"name":"twelve"}]},"seq":3} <-- Content-Length: 383

Hide Details

{"body":{"breakpoints":[{"id":1,"line":6,"source":{"name":"main-copy.cpp","path":"/Users/buildslave/jenkins/workspace/lldb-cmake-sanitized/lldb-build/lldb-test-build.noindex/tools/lldb-vscode/breakpoint/TestVSCode_setFunctionBreakpoints.test_set_and_clear/main-copy.cpp"},"verified":true}]},"command":"setFunctionBreakpoints","request_seq":3,"seq":0,"success":true,"type":"response"} --> Content-Length: 129

Hide Details

{"command":"setFunctionBreakpoints","type":"request","arguments":{"breakpoints":[{"name":"twelve"},{"name":"thirteen"}]},"seq":4} <-- Content-Length: 649

Hide Details

{"body":{"breakpoints":[{"id":1,"line":6,"source":{"name":"main-copy.cpp","path":"/Users/buildslave/jenkins/workspace/lldb-cmake-sanitized/lldb-build/lldb-test-build.noindex/tools/lldb-vscode/breakpoint/TestVSCode_setFunctionBreakpoints.test_set_and_clear/main-copy.cpp"},"verified":true},{"id":2,"line":10,"source":{"name":"main-copy.cpp","path":"/Users/buildslave/jenkins/workspace/lldb-cmake-sanitized/lldb-build/lldb-test-build.noindex/tools/lldb-vscode/breakpoint/TestVSCode_setFunctionBreakpoints.test_set_and_clear/main-copy.cpp"},"verified":true}]},"command":"setFunctionBreakpoints","request_seq":4,"seq":0,"success":true,"type":"response"} --> Content-Length: 109

Hide Details

{"command":"setFunctionBreakpoints","type":"request","arguments":{"breakpoints":[{"name":"twelve"}]},"seq":5} <-- Content-Length: 383

Hide Details

{"body":{"breakpoints":[{"id":1,"line":6,"source":{"name":"main-copy.cpp","path":"/Users/buildslave/jenkins/workspace/lldb-cmake-sanitized/lldb-build/lldb-test-build.noindex/tools/lldb-vscode/breakpoint/TestVSCode_setFunctionBreakpoints.test_set_and_clear/main-copy.cpp"},"verified":true}]},"command":"setFunctionBreakpoints","request_seq":5,"seq":0,"success":true,"type":"response"} --> Content-Length: 79

Hide Details

{"command":"_testGetTargetBreakpoints","type":"request","arguments":{},"seq":6} <-- Content-Length: 386

Hide Details

{"body":{"breakpoints":[{"id":1,"line":6,"source":{"name":"main-copy.cpp","path":"/Users/buildslave/jenkins/workspace/lldb-cmake-sanitized/lldb-build/lldb-test-build.noindex/tools/lldb-vscode/breakpoint/TestVSCode_setFunctionBreakpoints.test_set_and_clear/main-copy.cpp"},"verified":true}]},"command":"_testGetTargetBreakpoints","request_seq":6,"seq":0,"success":true,"type":"response"} --> Content-Length: 92

Hide Details

{"command":"setFunctionBreakpoints","type":"request","arguments":{"breakpoints":[]},"seq":7} <-- Content-Length: 119

Hide Details

{"body":{"breakpoints":[]},"command":"setFunctionBreakpoints","request_seq":7,"seq":0,"success":true,"type":"response"} --> Content-Length: 79

Hide Details

{"command":"_testGetTargetBreakpoints","type":"request","arguments":{},"seq":8} <-- Content-Length: 122

Hide Details

{"body":{"breakpoints":[]},"command":"_testGetTargetBreakpoints","request_seq":8,"seq":0,"success":true,"type":"response"} --> Content-Length: 88

Hide Details

{"command":"disconnect","type":"request","arguments":{"terminateDebuggee":true},"seq":9} <-- Content-Length: 45

Hide Details

{"event":"terminated","seq":0,"type":"event"} <-- Content-Length: 63

Hide Details

{"body":{"exitCode":9},"event":"exited","seq":0,"type":"event"} <-- Content-Length: 81

Hide Details

{"command":"disconnect","request_seq":9,"seq":0,"success":true,"type":"response"}

Hide Details

========= END =========

Hide Details

-- Command Output (stderr): -- Change dir to: /Users/buildslave/jenkins/workspace/lldb-cmake-sanitized/llvm-project/lldb/test/API/tools/lldb-vscode/breakpoint runCmd: settings clear -all output:

Hide Details

runCmd: settings set symbols.enable-external-lookup false output:

Hide Details

runCmd: settings set target.inherit-tcc true output:

Hide Details

runCmd: settings set target.detach-on-error false output:

Hide Details

runCmd: settings set target.auto-apply-fixits false output:

Hide Details

runCmd: settings set plugin.process.gdb-remote.packet-timeout 60 output:

Hide Details

runCmd: settings set symbols.clang-modules-cache-path "/Users/buildslave/jenkins/workspace/lldb-cmake-sanitized/lldb-build/lldb-test-build.noindex/module-cache-lldb/lldb-api" output:

Hide Details

runCmd: settings set use-color false output:

Hide Details

runCmd: setting set target.prefer-dynamic-value no-dynamic-values output:

Hide Details

runCmd: settings set target.env-vars ASAN_OPTIONS=detect_stack_use_after_return=1 DYLD_INSERT_LIBRARIES=/Users/buildslave/jenkins/workspace/lldb-cmake-sanitized/host-compiler/lib/clang/13.0.99/lib/darwin/libclang_rt.asan_osx_dynamic.dylib output:

Hide Details

Adding tearDown hook: def cleanup(): if disconnectAutomatically: self.vscode.request_disconnect(terminateDebuggee=True) self.vscode.terminate()

Hide Details

Hide Details

FAIL: LLDB (/Users/buildslave/jenkins/workspace/lldb-cmake-sanitized/host-compiler/bin/clang-x86_64) :: test_functionality (TestVSCode_setFunctionBreakpoints.TestVSCode_setFunctionBreakpoints) Executing tearDown hook: def cleanup(): if disconnectAutomatically: self.vscode.request_disconnect(terminateDebuggee=True) self.vscode.terminate()

Hide Details

Hide Details

CLEANUP ERROR: LLDB (/Users/buildslave/jenkins/workspace/lldb-cmake-sanitized/host-compiler/bin/clang-x86_64) :: test_functionality (TestVSCode_setFunctionBreakpoints.TestVSCode_setFunctionBreakpoints) Traceback (most recent call last): File "/Users/buildslave/jenkins/workspace/lldb-cmake-sanitized/llvm-project/lldb/third_party/Python/module/unittest2/unittest2/case.py", line 386, in run self.tearDown() File "/Users/buildslave/jenkins/workspace/lldb-cmake-sanitized/llvm-project/lldb/packages/Python/lldbsuite/test/lldbtest.py", line 2095, in tearDown Base.tearDown(self) File "/Users/buildslave/jenkins/workspace/lldb-cmake-sanitized/llvm-project/lldb/packages/Python/lldbsuite/test/lldbtest.py", line 1065, in tearDown hook() # try the plain call and hope it works File "/Users/buildslave/jenkins/workspace/lldb-cmake-sanitized/llvm-project/lldb/packages/Python/lldbsuite/test/tools/lldb-vscode/lldbvscode_testcase.py", line 294, in cleanup self.vscode.request_disconnect(terminateDebuggee=True) File "/Users/buildslave/jenkins/workspace/lldb-cmake-sanitized/llvm-project/lldb/packages/Python/lldbsuite/test/tools/lldb-vscode/vscode.py", line 590, in request_disconnect return self.send_recv(command_dict) File "/Users/buildslave/jenkins/workspace/lldb-cmake-sanitized/llvm-project/lldb/packages/Python/lldbsuite/test/tools/lldb-vscode/vscode.py", line 315, in send_recv self.send_packet(command) File "/Users/buildslave/jenkins/workspace/lldb-cmake-sanitized/llvm-project/lldb/packages/Python/lldbsuite/test/tools/lldb-vscode/vscode.py", line 271, in send_packet self.send.flush() BrokenPipeError: [Errno 32] Broken pipe

Hide Details

runCmd: settings clear -all output:

Hide Details

runCmd: settings set symbols.enable-external-lookup false output:

Hide Details

runCmd: settings set target.inherit-tcc true output:

Hide Details

runCmd: settings set target.detach-on-error false output:

Hide Details

runCmd: settings set target.auto-apply-fixits false output:

Hide Details

runCmd: settings set plugin.process.gdb-remote.packet-timeout 60 output:

Hide Details

runCmd: settings set symbols.clang-modules-cache-path "/Users/buildslave/jenkins/workspace/lldb-cmake-sanitized/lldb-build/lldb-test-build.noindex/module-cache-lldb/lldb-api" output:

Hide Details

runCmd: settings set use-color false output:

Hide Details

runCmd: setting set target.prefer-dynamic-value no-dynamic-values output:

Hide Details

runCmd: settings set target.env-vars ASAN_OPTIONS=detect_stack_use_after_return=1 DYLD_INSERT_LIBRARIES=/Users/buildslave/jenkins/workspace/lldb-cmake-sanitized/host-compiler/lib/clang/13.0.99/lib/darwin/libclang_rt.asan_osx_dynamic.dylib output:

Hide Details

Adding tearDown hook: def cleanup(): if disconnectAutomatically: self.vscode.request_disconnect(terminateDebuggee=True) self.vscode.terminate()

Hide Details

Hide Details

Executing tearDown hook: def cleanup(): if disconnectAutomatically: self.vscode.request_disconnect(terminateDebuggee=True) self.vscode.terminate()

Hide Details

Hide Details

PASS: LLDB (/Users/buildslave/jenkins/workspace/lldb-cmake-sanitized/host-compiler/bin/clang-x86_64) :: test_set_and_clear (TestVSCode_setFunctionBreakpoints.TestVSCode_setFunctionBreakpoints) Restore dir to: /Users/buildslave/jenkins/workspace/lldb-cmake-sanitized/lldb-build/tools/lldb/test ====================================================================== FAIL: test_functionality (TestVSCode_setFunctionBreakpoints.TestVSCode_setFunctionBreakpoints) Tests hitting breakpoints and the functionality of a single ---------------------------------------------------------------------- Traceback (most recent call last): File "/Users/buildslave/jenkins/workspace/lldb-cmake-sanitized/llvm-project/lldb/test/API/tools/lldb-vscode/breakpoint/TestVSCode_setFunctionBreakpoints.py", line 139, in test_functionality self.continue_to_breakpoints(breakpoint_ids) File "/Users/buildslave/jenkins/workspace/lldb-cmake-sanitized/llvm-project/lldb/packages/Python/lldbsuite/test/tools/lldb-vscode/lldbvscode_testcase.py", line 233, in continue_to_breakpoints self.verify_breakpoint_hit(breakpoint_ids) File "/Users/buildslave/jenkins/workspace/lldb-cmake-sanitized/llvm-project/lldb/packages/Python/lldbsuite/test/tools/lldb-vscode/lldbvscode_testcase.py", line 92, in verify_breakpoint_hit self.assertTrue(False, "breakpoint not hit") AssertionError: False is not True : breakpoint not hit Config=x86_64-/Users/buildslave/jenkins/workspace/lldb-cmake-sanitized/host-compiler/bin/clang ---------------------------------------------------------------------- Ran 2 tests in 4.513s

Hide Details

RESULT: FAILED (1 passes, 1 failures, 0 errors, 0 skipped, 0 expected failures, 0 unexpected successes)

Hide Details

--

Hide Details

******************** PASS: lldb-unit :: Host/./HostTests/HostInfoTest.GetHostname (2331 of 2355) PASS: lldb-shell :: SymbolFile/DWARF/x86/find-variable-dwo.cpp (2332 of 2355) PASS: lldb-unit :: Expression/./ExpressionTests/DiagnosticManagerTest.GetStringMultipleDiags (2333 of 2355) PASS: lldb-api :: functionalities/data-formatter/boolreference/TestFormattersBoolRefPtr.py (2334 of 2355) PASS: lldb-unit :: Core/./LLDBCoreTests/RichManglingContextTest.FromCxxMethodName (2335 of 2355) PASS: lldb-api :: functionalities/show_location/TestShowLocationDwarf5.py (2336 of 2355) PASS: lldb-unit :: Utility/./UtilityTests/ArgsTest.GetArgumentArrayRef (2337 of 2355) PASS: lldb-api :: commands/watchpoints/multiple_hits/TestMultipleHits.py (2338 of 2355) PASS: lldb-unit :: Utility/./UtilityTests/EnvironmentTest.EnvpConstruction (2339 of 2355) UNSUPPORTED: lldb-api :: benchmarks/stepping/TestSteppingSpeed.py (2340 of 2355) PASS: lldb-unit :: Utility/./UtilityTests/DeserializerTest.HasData (2341 of 2355) PASS: lldb-shell :: ScriptInterpreter/Python/Crashlog/parser_json.test (2342 of 2355) PASS: lldb-api :: functionalities/data-formatter/data-formatter-stl/libcxx/bitset/TestDataFormatterLibcxxBitset.py (2343 of 2355) PASS: lldb-unit :: Core/./LLDBCoreTests/DumpDataExtractorTest.MultiLine (2344 of 2355) UNSUPPORTED: lldb-api :: functionalities/darwin_log/filter/regex/activity-chain/TestDarwinLogFilterRegexActivityChain.py (2345 of 2355) PASS: lldb-api :: commands/expression/expr-in-syscall/TestExpressionInSyscall.py (2346 of 2355) PASS: lldb-unit :: Utility/./UtilityTests/ScalarTest.SetValueFromData (2347 of 2355) PASS: lldb-shell :: ScriptInterpreter/Python/scripted_breakpoint_lua.test (2348 of 2355) PASS: lldb-shell :: SymbolFile/DWARF/x86/dwp-separate-debug-file.cpp (2349 of 2355) PASS: lldb-api :: functionalities/data-formatter/setvaluefromcstring/TestSetValueFromCString.py (2350 of 2355) PASS: lldb-unit :: Utility/./UtilityTests/Flags.Test (2351 of 2355) PASS: lldb-api :: tools/lldb-server/commandline/TestGdbRemoteConnection.py (2352 of 2355) PASS: lldb-api :: tools/lldb-server/TestGdbRemote_qThreadStopInfo.py (2353 of 2355) PASS: lldb-api :: lang/objc/rdar-11355592/TestRdar11355592.py (2354 of 2355) PASS: lldb-api :: lang/objc/hidden-ivars/TestHiddenIvars.py (2355 of 2355) Slowest Tests: -------------------------------------------------------------------------- 262.42s: lldb-api :: tools/lldb-server/TestLldbGdbServer.py 135.38s: lldb-api :: functionalities/memory-region/TestMemoryRegion.py 129.38s: lldb-api :: api/multithreaded/TestMultithreaded.py 119.70s: lldb-api :: macosx/skinny-corefile/TestSkinnyCorefile.py 91.45s: lldb-api :: functionalities/gdb_remote_client/TestWasm.py 83.09s: lldb-api :: types/TestLongTypesExpr.py 73.57s: lldb-api :: commands/expression/import-std-module/queue/TestQueueFromStdModule.py 71.19s: lldb-api :: lang/objc/exceptions/TestObjCExceptions.py 69.38s: lldb-api :: commands/expression/import-std-module/stack/TestStackFromStdModule.py 65.53s: lldb-api :: lang/cpp/namespace/TestNamespaceLookup.py 63.07s: lldb-api :: lang/objc/objc-new-syntax/TestObjCNewSyntaxLiteral.py 59.72s: lldb-api :: lang/objc/hidden-ivars/TestHiddenIvars.py 57.41s: lldb-api :: lang/objc/foundation/TestObjCMethods.py 56.44s: lldb-api :: commands/expression/import-std-module/vector/TestVectorFromStdModule.py 52.81s: lldb-api :: commands/expression/import-std-module/deque-basic/TestDequeFromStdModule.py 52.49s: lldb-api :: types/TestIntegerTypeExpr.py 51.21s: lldb-api :: python_api/target/TestTargetAPI.py 49.65s: lldb-api :: commands/expression/persist_objc_pointeetype/TestPersistObjCPointeeType.py 49.56s: lldb-api :: tools/lldb-server/TestGdbRemoteThreadsInStopReply.py 48.58s: lldb-api :: commands/expression/import-std-module/vector-dbg-info-content/TestDbgInfoContentVectorFromStdModule.py

Hide Details

Tests Times: -------------------------------------------------------------------------- [ Range ] :: [ Percentage ] :: [ Count ] -------------------------------------------------------------------------- [260s,280s) :: [ ] :: [ 1/2355] [240s,260s) :: [ ] :: [ 0/2355] [220s,240s) :: [ ] :: [ 0/2355] [200s,220s) :: [ ] :: [ 0/2355] [180s,200s) :: [ ] :: [ 0/2355] [160s,180s) :: [ ] :: [ 0/2355] [140s,160s) :: [ ] :: [ 1/2355] [120s,140s) :: [ ] :: [ 2/2355] [100s,120s) :: [ ] :: [ 0/2355] [ 80s,100s) :: [ ] :: [ 2/2355] [ 60s, 80s) :: [ ] :: [ 8/2355] [ 40s, 60s) :: [ ] :: [ 15/2355] [ 20s, 40s) :: [* ] :: [ 73/2355] [ 0s, 20s) :: [************************************** ] :: [2253/2355] -------------------------------------------------------------------------- ******************** Failed Tests (6): lldb-api :: lang/cpp/member-and-local-vars-with-same-name/TestMembersAndLocalsWithSameName.py lldb-api :: macosx/dyld-trie-symbols/TestDyldTrieSymbols.py lldb-api :: macosx/function-starts/TestFunctionStarts.py lldb-api :: tools/lldb-vscode/breakpoint/TestVSCode_setBreakpoints.py lldb-api :: tools/lldb-vscode/breakpoint/TestVSCode_setFunctionBreakpoints.py lldb-api :: tools/lldb-vscode/evaluate/TestVSCode_evaluate.py

Hide Details

Hide Details

Testing Time: 2421.30s Unsupported : 212 Passed : 2127 Expectedly Failed: 10 Failed : 6 FAILED: tools/lldb/test/CMakeFiles/check-lldb cd /Users/buildslave/jenkins/workspace/lldb-cmake-sanitized/lldb-build/tools/lldb/test && /usr/local/Frameworks/Python.framework/Versions/3.7/bin/python3.7 /Users/buildslave/jenkins/workspace/lldb-cmake-sanitized/lldb-build/./bin/llvm-lit -v --time-tests --shuffle --xunit-xml-output=/Users/buildslave/jenkins/workspace/lldb-cmake-sanitized/test/results.xml -v -j 4 --timeout 1200 /Users/buildslave/jenkins/workspace/lldb-cmake-sanitized/lldb-build/tools/lldb/test ninja: build stopped: subcommand failed. Command failed: Command '['/usr/bin/env', 'TERM=vt100', '/usr/local/bin/ninja', '-v', 'check-lldb']' returned non-zero exit status 1. Command: ['/usr/bin/env', 'TERM=vt100', '/usr/local/bin/ninja', '-v', 'check-lldb'] [Pipeline] } [Pipeline] // timeout [Pipeline] } [Pipeline] // stage [Pipeline] stage [Pipeline] { (Declarative: Post Actions) [Pipeline] scanForIssues [Clang (LLVM based)] Sleeping for 5 seconds due to JENKINS-32191... [Clang (LLVM based)] Parsing console log (workspace: '/Users/buildslave/jenkins/workspace/lldb-cmake-sanitized') [Clang (LLVM based)] Successfully parsed console log [Clang (LLVM based)] -> found 5 issues (skipped 3 duplicates) [Clang (LLVM based)] [-ERROR-] Can't create fingerprints for some files: [Clang (LLVM based)] [-ERROR-] - '/Users/buildslave/jenkins/workspace/lldb-cmake-sanitized/lldb-build/{"body":{"category":"console","output":"/Users/buildslave/jenkins/workspace/lldb-cmake-sanitized/llvm-project/lldb/tools/lldb-vscode/ProgressEvent.cpp', IO exception has been thrown: java.nio.file.NoSuchFileException: /Users/buildslave/jenkins/workspace/lldb-cmake-sanitized/lldb-build/{"body":{"category":"console","output":"/Users/buildslave/jenkins/workspace/lldb-cmake-sanitized/llvm-project/lldb/tools/lldb-vscode/ProgressEvent.cpp [Clang (LLVM based)] [-ERROR-] - '/Users/buildslave/jenkins/workspace/lldb-cmake-sanitized/lldb-build/{"body":{"category":"console","output":"/Users/buildslave/jenkins/workspace/lldb-cmake-sanitized/llvm-project/lldb/tools/lldb-vscode/ProgressEvent.cpp', IO exception has been thrown: java.nio.file.NoSuchFileException: /Users/buildslave/jenkins/workspace/lldb-cmake-sanitized/lldb-build/{"body":{"category":"console","output":"/Users/buildslave/jenkins/workspace/lldb-cmake-sanitized/llvm-project/lldb/tools/lldb-vscode/ProgressEvent.cpp [Clang (LLVM based)] Post processing issues on 'green-dragon-23' with source code encoding 'UTF-8' [Clang (LLVM based)] Creating SCM blamer to obtain author and commit information for affected files [Clang (LLVM based)] -> No blamer installed yet. You need to install the 'git-forensics' plugin to enable blaming for Git. [Clang (LLVM based)] Resolving file names for all issues in source directory '/Users/buildslave/jenkins/workspace/lldb-cmake-sanitized' [Clang (LLVM based)] -> resolved paths in source directory (3 found, 1 not found) [Clang (LLVM based)] Resolving module names from module definitions (build.xml, pom.xml, or Manifest.mf files) [Clang (LLVM based)] -> resolved module names for 5 issues [Clang (LLVM based)] Resolving package names (or namespaces) by parsing the affected files [Clang (LLVM based)] -> resolved package names of 4 affected files [Clang (LLVM based)] No filter has been set, publishing all 5 issues [Clang (LLVM based)] Creating fingerprints for all affected code blocks to track issues over different builds [Clang (LLVM based)] -> created fingerprints for 3 issues (skipped 2 issues) [Clang (LLVM based)] Copying affected files to Jenkins' build folder '/Users/Shared/Jenkins/Home/jobs/lldb-cmake-sanitized/builds/1900/files-with-issues' [Clang (LLVM based)] -> 3 copied, 0 not in workspace, 2 not-found, 0 with I/O error [Clang (LLVM based)] Repository miner is not configured, skipping repository mining [Pipeline] junit Recording test results [Checks API] No suitable checks publisher found. [Pipeline] } [Pipeline] // stage [Pipeline] } [Pipeline] // withEnv [Pipeline] } [Pipeline] // node [Pipeline] End of Pipeline ERROR: script returned exit code 1 Finished: FAILURE