Console Output

Skipping 9,558 KB.. Full Log
******************** TEST 'lldb-api :: tools/lldb-vscode/breakpoint/TestVSCode_setBreakpoints.py' FAILED ********************
Script:
--
/Users/buildslave/jenkins/workspace/lldb-cmake-sanitized/lldb-build/lldb-test-build.noindex/copied-python /Users/buildslave/jenkins/workspace/lldb-cmake-sanitized/llvm-project/lldb/test/API/dotest.py -u CXXFLAGS -u CFLAGS --codesign-identity lldb_codesign --arch x86_64 --build-dir /Users/buildslave/jenkins/workspace/lldb-cmake-sanitized/lldb-build/lldb-test-build.noindex -t --env TERM=vt100 --env LLVM_LIBS_DIR=/Users/buildslave/jenkins/workspace/lldb-cmake-sanitized/lldb-build/./lib --inferior-env ASAN_OPTIONS=detect_stack_use_after_return=1 --inferior-env DYLD_INSERT_LIBRARIES=/Users/buildslave/jenkins/workspace/lldb-cmake-sanitized/host-compiler/lib/clang/13.0.99/lib/darwin/libclang_rt.asan_osx_dynamic.dylib --arch x86_64 --build-dir /Users/buildslave/jenkins/workspace/lldb-cmake-sanitized/lldb-build/lldb-test-build.noindex --lldb-module-cache-dir /Users/buildslave/jenkins/workspace/lldb-cmake-sanitized/lldb-build/lldb-test-build.noindex/module-cache-lldb/lldb-api --clang-module-cache-dir /Users/buildslave/jenkins/workspace/lldb-cmake-sanitized/lldb-build/lldb-test-build.noindex/module-cache-clang/lldb-api --executable /Users/buildslave/jenkins/workspace/lldb-cmake-sanitized/lldb-build/./bin/lldb --compiler /Users/buildslave/jenkins/workspace/lldb-cmake-sanitized/host-compiler/bin/clang --dsymutil /Users/buildslave/jenkins/workspace/lldb-cmake-sanitized/lldb-build/./bin/dsymutil --llvm-tools-dir /Users/buildslave/jenkins/workspace/lldb-cmake-sanitized/lldb-build/./bin --lldb-libs-dir /Users/buildslave/jenkins/workspace/lldb-cmake-sanitized/lldb-build/./lib /Users/buildslave/jenkins/workspace/lldb-cmake-sanitized/llvm-project/lldb/test/API/tools/lldb-vscode/breakpoint -p TestVSCode_setBreakpoints.py
--
Exit Code: 1

Hide Details

Command Output (stdout): -- lldb version 13.0.99 (http://labmaster3.local/git/llvm-project.git revision c063946476e083a9a0c5bd397337d1ece4742ec6) clang revision c063946476e083a9a0c5bd397337d1ece4742ec6 llvm revision c063946476e083a9a0c5bd397337d1ece4742ec6 Skipping the following test categories: ['darwin-log', 'libstdcxx', 'dwo', 'llgs', 'fork'] ========= DEBUG ADAPTER PROTOCOL LOGS ========= --> Content-Length: 284

Hide Details

{"command":"initialize","type":"request","arguments":{"adapterID":"lldb-native","clientID":"vscode","columnsStartAt1":true,"linesStartAt1":true,"locale":"en-us","pathFormat":"path","supportsRunInTerminalRequest":true,"supportsVariablePaging":true,"supportsVariableType":true},"seq":1} <-- Content-Length: 1222

Hide Details

{"body":{"exceptionBreakpointFilters":[{"default":false,"filter":"cpp_catch","label":"C++ Catch"},{"default":false,"filter":"cpp_throw","label":"C++ Throw"},{"default":false,"filter":"objc_catch","label":"Objective C Catch"},{"default":false,"filter":"objc_throw","label":"Objective C Throw"},{"default":false,"filter":"swift_catch","label":"Swift Catch"},{"default":false,"filter":"swift_throw","label":"Swift Throw"}],"supportTerminateDebuggee":true,"supportsCompletionsRequest":false,"supportsConditionalBreakpoints":true,"supportsConfigurationDoneRequest":true,"supportsDelayedStackTraceLoading":true,"supportsEvaluateForHovers":true,"supportsExceptionInfoRequest":true,"supportsExceptionOptions":true,"supportsFunctionBreakpoints":true,"supportsGotoTargetsRequest":false,"supportsHitConditionalBreakpoints":true,"supportsLoadedSourcesRequest":false,"supportsModulesRequest":false,"supportsProgressReporting":true,"supportsRestartFrame":false,"supportsRestartRequest":false,"supportsRunInTerminalRequest":true,"supportsSetVariable":true,"supportsStepBack":false,"supportsStepInTargetsRequest":false,"supportsValueFormattingOptions":true},"command":"initialize","request_seq":1,"seq":0,"success":true,"type":"response"} --> Content-Length: 1058

Hide Details

{"command":"launch","type":"request","arguments":{"program":"/Users/buildslave/jenkins/workspace/lldb-cmake-sanitized/lldb-build/lldb-test-build.noindex/tools/lldb-vscode/breakpoint/TestVSCode_setBreakpoints.test_clear_breakpoints_unset_breakpoints/a.out","disableASLR":true,"initCommands":["settings clear -all","settings set symbols.enable-external-lookup false","settings set target.inherit-tcc true","settings set target.detach-on-error false","settings set target.auto-apply-fixits false","settings set plugin.process.gdb-remote.packet-timeout 60","settings set symbols.clang-modules-cache-path \"/Users/buildslave/jenkins/workspace/lldb-cmake-sanitized/lldb-build/lldb-test-build.noindex/module-cache-lldb/lldb-api\"","settings set use-color false","setting set target.prefer-dynamic-value no-dynamic-values","settings set target.env-vars ASAN_OPTIONS=detect_stack_use_after_return=1 DYLD_INSERT_LIBRARIES=/Users/buildslave/jenkins/workspace/lldb-cmake-sanitized/host-compiler/lib/clang/13.0.99/lib/darwin/libclang_rt.asan_osx_dynamic.dylib"]},"seq":2} <-- Content-Length: 923

Hide Details

{"body":{"category":"console","output":"Running initCommands:\n(lldb) settings clear -all\n(lldb) settings set symbols.enable-external-lookup false\n(lldb) settings set target.inherit-tcc true\n(lldb) settings set target.detach-on-error false\n(lldb) settings set target.auto-apply-fixits false\n(lldb) settings set plugin.process.gdb-remote.packet-timeout 60\n(lldb) settings set symbols.clang-modules-cache-path \"/Users/buildslave/jenkins/workspace/lldb-cmake-sanitized/lldb-build/lldb-test-build.noindex/module-cache-lldb/lldb-api\"\n(lldb) settings set use-color false\n(lldb) setting set target.prefer-dynamic-value no-dynamic-values\n(lldb) settings set target.env-vars ASAN_OPTIONS=detect_stack_use_after_return=1 DYLD_INSERT_LIBRARIES=/Users/buildslave/jenkins/workspace/lldb-cmake-sanitized/host-compiler/lib/clang/13.0.99/lib/darwin/libclang_rt.asan_osx_dynamic.dylib\n"},"event":"output","seq":0,"type":"event"} <-- Content-Length: 77

Hide Details

{"command":"launch","request_seq":2,"seq":0,"success":true,"type":"response"} <-- Content-Length: 323

Hide Details

{"body":{"isLocalProcess":true,"name":"/Users/buildslave/jenkins/workspace/lldb-cmake-sanitized/lldb-build/lldb-test-build.noindex/tools/lldb-vscode/breakpoint/TestVSCode_setBreakpoints.test_clear_breakpoints_unset_breakpoints/a.out","startMethod":"launch","systemProcessId":98833},"event":"process","seq":0,"type":"event"} <-- Content-Length: 46

Hide Details

{"event":"initialized","seq":0,"type":"event"} --> Content-Length: 392

Hide Details

{"command":"setBreakpoints","type":"request","arguments":{"source":{"name":"main-copy.cpp","path":"/Users/buildslave/jenkins/workspace/lldb-cmake-sanitized/lldb-build/lldb-test-build.noindex/tools/lldb-vscode/breakpoint/TestVSCode_setBreakpoints.test_clear_breakpoints_unset_breakpoints/main-copy.cpp"},"sourceModified":false,"lines":"[6, 10]","breakpoints":[{"line":6},{"line":10}]},"seq":3} <-- Content-Length: 669

Hide Details

{"body":{"breakpoints":[{"id":1,"line":6,"source":{"name":"main-copy.cpp","path":"/Users/buildslave/jenkins/workspace/lldb-cmake-sanitized/lldb-build/lldb-test-build.noindex/tools/lldb-vscode/breakpoint/TestVSCode_setBreakpoints.test_clear_breakpoints_unset_breakpoints/main-copy.cpp"},"verified":true},{"id":2,"line":10,"source":{"name":"main-copy.cpp","path":"/Users/buildslave/jenkins/workspace/lldb-cmake-sanitized/lldb-build/lldb-test-build.noindex/tools/lldb-vscode/breakpoint/TestVSCode_setBreakpoints.test_clear_breakpoints_unset_breakpoints/main-copy.cpp"},"verified":true}]},"command":"setBreakpoints","request_seq":3,"seq":0,"success":true,"type":"response"} --> Content-Length: 335

Hide Details

{"command":"setBreakpoints","type":"request","arguments":{"source":{"name":"main-copy.cpp","path":"/Users/buildslave/jenkins/workspace/lldb-cmake-sanitized/lldb-build/lldb-test-build.noindex/tools/lldb-vscode/breakpoint/TestVSCode_setBreakpoints.test_clear_breakpoints_unset_breakpoints/main-copy.cpp"},"sourceModified":false},"seq":4} <-- Content-Length: 111

Hide Details

{"body":{"breakpoints":[]},"command":"setBreakpoints","request_seq":4,"seq":0,"success":true,"type":"response"} --> Content-Length: 79

Hide Details

{"command":"_testGetTargetBreakpoints","type":"request","arguments":{},"seq":5} <-- Content-Length: 122

Hide Details

{"body":{"breakpoints":[]},"command":"_testGetTargetBreakpoints","request_seq":5,"seq":0,"success":true,"type":"response"} --> Content-Length: 88

Hide Details

{"command":"disconnect","type":"request","arguments":{"terminateDebuggee":true},"seq":6} <-- Content-Length: 45

Hide Details

{"event":"terminated","seq":0,"type":"event"} <-- Content-Length: 63

Hide Details

{"body":{"exitCode":9},"event":"exited","seq":0,"type":"event"} <-- Content-Length: 81

Hide Details

{"command":"disconnect","request_seq":6,"seq":0,"success":true,"type":"response"}

Hide Details

========= END ========= ========= DEBUG ADAPTER PROTOCOL LOGS ========= --> Content-Length: 284

Hide Details

{"command":"initialize","type":"request","arguments":{"adapterID":"lldb-native","clientID":"vscode","columnsStartAt1":true,"linesStartAt1":true,"locale":"en-us","pathFormat":"path","supportsRunInTerminalRequest":true,"supportsVariablePaging":true,"supportsVariableType":true},"seq":1} <-- Content-Length: 1222

Hide Details

{"body":{"exceptionBreakpointFilters":[{"default":false,"filter":"cpp_catch","label":"C++ Catch"},{"default":false,"filter":"cpp_throw","label":"C++ Throw"},{"default":false,"filter":"objc_catch","label":"Objective C Catch"},{"default":false,"filter":"objc_throw","label":"Objective C Throw"},{"default":false,"filter":"swift_catch","label":"Swift Catch"},{"default":false,"filter":"swift_throw","label":"Swift Throw"}],"supportTerminateDebuggee":true,"supportsCompletionsRequest":false,"supportsConditionalBreakpoints":true,"supportsConfigurationDoneRequest":true,"supportsDelayedStackTraceLoading":true,"supportsEvaluateForHovers":true,"supportsExceptionInfoRequest":true,"supportsExceptionOptions":true,"supportsFunctionBreakpoints":true,"supportsGotoTargetsRequest":false,"supportsHitConditionalBreakpoints":true,"supportsLoadedSourcesRequest":false,"supportsModulesRequest":false,"supportsProgressReporting":true,"supportsRestartFrame":false,"supportsRestartRequest":false,"supportsRunInTerminalRequest":true,"supportsSetVariable":true,"supportsStepBack":false,"supportsStepInTargetsRequest":false,"supportsValueFormattingOptions":true},"command":"initialize","request_seq":1,"seq":0,"success":true,"type":"response"} --> Content-Length: 1036

Hide Details

{"command":"launch","type":"request","arguments":{"program":"/Users/buildslave/jenkins/workspace/lldb-cmake-sanitized/lldb-build/lldb-test-build.noindex/tools/lldb-vscode/breakpoint/TestVSCode_setBreakpoints.test_functionality/a.out","disableASLR":true,"initCommands":["settings clear -all","settings set symbols.enable-external-lookup false","settings set target.inherit-tcc true","settings set target.detach-on-error false","settings set target.auto-apply-fixits false","settings set plugin.process.gdb-remote.packet-timeout 60","settings set symbols.clang-modules-cache-path \"/Users/buildslave/jenkins/workspace/lldb-cmake-sanitized/lldb-build/lldb-test-build.noindex/module-cache-lldb/lldb-api\"","settings set use-color false","setting set target.prefer-dynamic-value no-dynamic-values","settings set target.env-vars ASAN_OPTIONS=detect_stack_use_after_return=1 DYLD_INSERT_LIBRARIES=/Users/buildslave/jenkins/workspace/lldb-cmake-sanitized/host-compiler/lib/clang/13.0.99/lib/darwin/libclang_rt.asan_osx_dynamic.dylib"]},"seq":2} <-- Content-Length: 923

Hide Details

{"body":{"category":"console","output":"Running initCommands:\n(lldb) settings clear -all\n(lldb) settings set symbols.enable-external-lookup false\n(lldb) settings set target.inherit-tcc true\n(lldb) settings set target.detach-on-error false\n(lldb) settings set target.auto-apply-fixits false\n(lldb) settings set plugin.process.gdb-remote.packet-timeout 60\n(lldb) settings set symbols.clang-modules-cache-path \"/Users/buildslave/jenkins/workspace/lldb-cmake-sanitized/lldb-build/lldb-test-build.noindex/module-cache-lldb/lldb-api\"\n(lldb) settings set use-color false\n(lldb) setting set target.prefer-dynamic-value no-dynamic-values\n(lldb) settings set target.env-vars ASAN_OPTIONS=detect_stack_use_after_return=1 DYLD_INSERT_LIBRARIES=/Users/buildslave/jenkins/workspace/lldb-cmake-sanitized/host-compiler/lib/clang/13.0.99/lib/darwin/libclang_rt.asan_osx_dynamic.dylib\n"},"event":"output","seq":0,"type":"event"} <-- Content-Length: 77

Hide Details

{"command":"launch","request_seq":2,"seq":0,"success":true,"type":"response"} <-- Content-Length: 301

Hide Details

{"body":{"isLocalProcess":true,"name":"/Users/buildslave/jenkins/workspace/lldb-cmake-sanitized/lldb-build/lldb-test-build.noindex/tools/lldb-vscode/breakpoint/TestVSCode_setBreakpoints.test_functionality/a.out","startMethod":"launch","systemProcessId":98895},"event":"process","seq":0,"type":"event"} <-- Content-Length: 46

Hide Details

{"event":"initialized","seq":0,"type":"event"} --> Content-Length: 356

Hide Details

{"command":"setBreakpoints","type":"request","arguments":{"source":{"name":"main-copy.cpp","path":"/Users/buildslave/jenkins/workspace/lldb-cmake-sanitized/lldb-build/lldb-test-build.noindex/tools/lldb-vscode/breakpoint/TestVSCode_setBreakpoints.test_functionality/main-copy.cpp"},"sourceModified":false,"lines":"[39]","breakpoints":[{"line":39}]},"seq":3} <-- Content-Length: 368

Hide Details

{"body":{"breakpoints":[{"id":1,"line":39,"source":{"name":"main-copy.cpp","path":"/Users/buildslave/jenkins/workspace/lldb-cmake-sanitized/lldb-build/lldb-test-build.noindex/tools/lldb-vscode/breakpoint/TestVSCode_setBreakpoints.test_functionality/main-copy.cpp"},"verified":true}]},"command":"setBreakpoints","request_seq":3,"seq":0,"success":true,"type":"response"} --> Content-Length: 71

Hide Details

{"command":"configurationDone","type":"request","arguments":{},"seq":4} <-- Content-Length: 88

Hide Details

{"command":"configurationDone","request_seq":4,"seq":0,"success":true,"type":"response"} <-- Content-Length: 199

Hide Details

{"body":{"allThreadsStopped":true,"description":"breakpoint 1.1","preserveFocusHint":false,"reason":"breakpoint","threadCausedFocus":true,"threadId":3007708},"event":"stopped","seq":0,"type":"event"} --> Content-Length: 61

Hide Details

{"command":"threads","type":"request","arguments":{},"seq":5} <-- Content-Length: 133

Hide Details

{"body":{"threads":[{"id":3007708,"name":"Thread #1"}]},"command":"threads","request_seq":5,"seq":0,"success":true,"type":"response"} --> Content-Length: 108

Hide Details

{"command":"stackTrace","type":"request","arguments":{"threadId":3007708,"startFrame":0,"levels":1},"seq":6} <-- Content-Length: 395

Hide Details

{"body":{"stackFrames":[{"column":20,"id":524288,"line":39,"name":"main","source":{"name":"main-copy.cpp","path":"/Users/buildslave/jenkins/workspace/lldb-cmake-sanitized/lldb-build/lldb-test-build.noindex/tools/lldb-vscode/breakpoint/TestVSCode_setBreakpoints.test_functionality/main-copy.cpp"}}],"totalFrames":2},"command":"stackTrace","request_seq":6,"seq":0,"success":true,"type":"response"} --> Content-Length: 76

Hide Details

{"command":"scopes","type":"request","arguments":{"frameId":524288},"seq":7} <-- Content-Length: 335

Hide Details

{"body":{"scopes":[{"expensive":false,"name":"Locals","namedVariables":7,"variablesReference":1},{"expensive":false,"name":"Globals","namedVariables":0,"variablesReference":2},{"expensive":false,"name":"Registers","namedVariables":3,"variablesReference":3}]},"command":"scopes","request_seq":7,"seq":0,"success":true,"type":"response"} --> Content-Length: 85

Hide Details

{"command":"variables","type":"request","arguments":{"variablesReference":1},"seq":8} <-- Content-Length: 919

Hide Details

{"body":{"variables":[{"evaluateName":"argc","id":0,"name":"argc","type":"int","value":"1","variablesReference":0},{"evaluateName":"argv","id":1,"name":"argv","type":"const char **","value":"0x00007ffeefbff810","variablesReference":5},{"evaluateName":"libother_name","id":2,"name":"libother_name","type":"const char *","value":"0x0000000100000f44 \"libother.dylib\"","variablesReference":6},{"evaluateName":"handle","id":3,"name":"handle","type":"void *","value":"0x000060f0000007c0","variablesReference":7},{"evaluateName":"foo","id":4,"name":"foo","type":"int (*)(int)","value":"0x000000010424af90 (libother.dylib`foo at other-copy.c:1)","variablesReference":8},{"evaluateName":"i","id":5,"name":"i","type":"int","value":"0","variablesReference":0},{"evaluateName":"x","id":6,"name":"x","type":"int","value":"0","variablesReference":0}]},"command":"variables","request_seq":8,"seq":0,"success":true,"type":"response"} --> Content-Length: 375

Hide Details

{"command":"setBreakpoints","type":"request","arguments":{"source":{"name":"main-copy.cpp","path":"/Users/buildslave/jenkins/workspace/lldb-cmake-sanitized/lldb-build/lldb-test-build.noindex/tools/lldb-vscode/breakpoint/TestVSCode_setBreakpoints.test_functionality/main-copy.cpp"},"sourceModified":false,"lines":"[39]","breakpoints":[{"line":39,"condition":"i==4"}]},"seq":9} <-- Content-Length: 368

Hide Details

{"body":{"breakpoints":[{"id":1,"line":39,"source":{"name":"main-copy.cpp","path":"/Users/buildslave/jenkins/workspace/lldb-cmake-sanitized/lldb-build/lldb-test-build.noindex/tools/lldb-vscode/breakpoint/TestVSCode_setBreakpoints.test_functionality/main-copy.cpp"},"verified":true}]},"command":"setBreakpoints","request_seq":9,"seq":0,"success":true,"type":"response"} --> Content-Length: 81

Hide Details

{"command":"continue","type":"request","arguments":{"threadId":3007708},"seq":10} <-- Content-Length: 116

Hide Details

{"body":{"allThreadsContinued":true},"command":"continue","request_seq":10,"seq":0,"success":true,"type":"response"} <-- Content-Length: 311

Hide Details

{"body":{"category":"console","output":"/Users/buildslave/jenkins/workspace/lldb-cmake-sanitized/llvm-project/lldb/tools/lldb-vscode/ProgressEvent.cpp:89:64: runtime error: load of value 829960214, which is not a valid value for type 'lldb_vscode::ProgressEventType'\n"},"event":"output","seq":0,"type":"event"} <-- Content-Length: 261

Hide Details

{"body":{"category":"console","output":"SUMMARY: UndefinedBehaviorSanitizer: undefined-behavior /Users/buildslave/jenkins/workspace/lldb-cmake-sanitized/llvm-project/lldb/tools/lldb-vscode/ProgressEvent.cpp:89:64 in \n"},"event":"output","seq":0,"type":"event"} <-- Content-Length: 170

Hide Details

{"body":{"category":"console","output":"PLEASE submit a bug report to https://bugs.llvm.org/ and include the crash backtrace.\n"},"event":"output","seq":0,"type":"event"}

Hide Details

========= END ========= ========= DEBUG ADAPTER PROTOCOL LOGS ========= --> Content-Length: 284

Hide Details

{"command":"initialize","type":"request","arguments":{"adapterID":"lldb-native","clientID":"vscode","columnsStartAt1":true,"linesStartAt1":true,"locale":"en-us","pathFormat":"path","supportsRunInTerminalRequest":true,"supportsVariablePaging":true,"supportsVariableType":true},"seq":1} <-- Content-Length: 1222

Hide Details

{"body":{"exceptionBreakpointFilters":[{"default":false,"filter":"cpp_catch","label":"C++ Catch"},{"default":false,"filter":"cpp_throw","label":"C++ Throw"},{"default":false,"filter":"objc_catch","label":"Objective C Catch"},{"default":false,"filter":"objc_throw","label":"Objective C Throw"},{"default":false,"filter":"swift_catch","label":"Swift Catch"},{"default":false,"filter":"swift_throw","label":"Swift Throw"}],"supportTerminateDebuggee":true,"supportsCompletionsRequest":false,"supportsConditionalBreakpoints":true,"supportsConfigurationDoneRequest":true,"supportsDelayedStackTraceLoading":true,"supportsEvaluateForHovers":true,"supportsExceptionInfoRequest":true,"supportsExceptionOptions":true,"supportsFunctionBreakpoints":true,"supportsGotoTargetsRequest":false,"supportsHitConditionalBreakpoints":true,"supportsLoadedSourcesRequest":false,"supportsModulesRequest":false,"supportsProgressReporting":true,"supportsRestartFrame":false,"supportsRestartRequest":false,"supportsRunInTerminalRequest":true,"supportsSetVariable":true,"supportsStepBack":false,"supportsStepInTargetsRequest":false,"supportsValueFormattingOptions":true},"command":"initialize","request_seq":1,"seq":0,"success":true,"type":"response"} --> Content-Length: 1036

Hide Details

{"command":"launch","type":"request","arguments":{"program":"/Users/buildslave/jenkins/workspace/lldb-cmake-sanitized/lldb-build/lldb-test-build.noindex/tools/lldb-vscode/breakpoint/TestVSCode_setBreakpoints.test_set_and_clear/a.out","disableASLR":true,"initCommands":["settings clear -all","settings set symbols.enable-external-lookup false","settings set target.inherit-tcc true","settings set target.detach-on-error false","settings set target.auto-apply-fixits false","settings set plugin.process.gdb-remote.packet-timeout 60","settings set symbols.clang-modules-cache-path \"/Users/buildslave/jenkins/workspace/lldb-cmake-sanitized/lldb-build/lldb-test-build.noindex/module-cache-lldb/lldb-api\"","settings set use-color false","setting set target.prefer-dynamic-value no-dynamic-values","settings set target.env-vars ASAN_OPTIONS=detect_stack_use_after_return=1 DYLD_INSERT_LIBRARIES=/Users/buildslave/jenkins/workspace/lldb-cmake-sanitized/host-compiler/lib/clang/13.0.99/lib/darwin/libclang_rt.asan_osx_dynamic.dylib"]},"seq":2} <-- Content-Length: 923

Hide Details

{"body":{"category":"console","output":"Running initCommands:\n(lldb) settings clear -all\n(lldb) settings set symbols.enable-external-lookup false\n(lldb) settings set target.inherit-tcc true\n(lldb) settings set target.detach-on-error false\n(lldb) settings set target.auto-apply-fixits false\n(lldb) settings set plugin.process.gdb-remote.packet-timeout 60\n(lldb) settings set symbols.clang-modules-cache-path \"/Users/buildslave/jenkins/workspace/lldb-cmake-sanitized/lldb-build/lldb-test-build.noindex/module-cache-lldb/lldb-api\"\n(lldb) settings set use-color false\n(lldb) setting set target.prefer-dynamic-value no-dynamic-values\n(lldb) settings set target.env-vars ASAN_OPTIONS=detect_stack_use_after_return=1 DYLD_INSERT_LIBRARIES=/Users/buildslave/jenkins/workspace/lldb-cmake-sanitized/host-compiler/lib/clang/13.0.99/lib/darwin/libclang_rt.asan_osx_dynamic.dylib\n"},"event":"output","seq":0,"type":"event"} <-- Content-Length: 77

Hide Details

{"command":"launch","request_seq":2,"seq":0,"success":true,"type":"response"} <-- Content-Length: 301

Hide Details

{"body":{"isLocalProcess":true,"name":"/Users/buildslave/jenkins/workspace/lldb-cmake-sanitized/lldb-build/lldb-test-build.noindex/tools/lldb-vscode/breakpoint/TestVSCode_setBreakpoints.test_set_and_clear/a.out","startMethod":"launch","systemProcessId":98972},"event":"process","seq":0,"type":"event"} <-- Content-Length: 46

Hide Details

{"event":"initialized","seq":0,"type":"event"} --> Content-Length: 386

Hide Details

{"command":"setBreakpoints","type":"request","arguments":{"source":{"name":"main-copy.cpp","path":"/Users/buildslave/jenkins/workspace/lldb-cmake-sanitized/lldb-build/lldb-test-build.noindex/tools/lldb-vscode/breakpoint/TestVSCode_setBreakpoints.test_set_and_clear/main-copy.cpp"},"sourceModified":false,"lines":"[6, 15, 10]","breakpoints":[{"line":6},{"line":15},{"line":10}]},"seq":3} <-- Content-Length: 883

Hide Details

{"body":{"breakpoints":[{"id":1,"line":6,"source":{"name":"main-copy.cpp","path":"/Users/buildslave/jenkins/workspace/lldb-cmake-sanitized/lldb-build/lldb-test-build.noindex/tools/lldb-vscode/breakpoint/TestVSCode_setBreakpoints.test_set_and_clear/main-copy.cpp"},"verified":true},{"id":2,"line":15,"source":{"name":"main-copy.cpp","path":"/Users/buildslave/jenkins/workspace/lldb-cmake-sanitized/lldb-build/lldb-test-build.noindex/tools/lldb-vscode/breakpoint/TestVSCode_setBreakpoints.test_set_and_clear/main-copy.cpp"},"verified":true},{"id":3,"line":10,"source":{"name":"main-copy.cpp","path":"/Users/buildslave/jenkins/workspace/lldb-cmake-sanitized/lldb-build/lldb-test-build.noindex/tools/lldb-vscode/breakpoint/TestVSCode_setBreakpoints.test_set_and_clear/main-copy.cpp"},"verified":true}]},"command":"setBreakpoints","request_seq":3,"seq":0,"success":true,"type":"response"} --> Content-Length: 370

Hide Details

{"command":"setBreakpoints","type":"request","arguments":{"source":{"name":"main-copy.cpp","path":"/Users/buildslave/jenkins/workspace/lldb-cmake-sanitized/lldb-build/lldb-test-build.noindex/tools/lldb-vscode/breakpoint/TestVSCode_setBreakpoints.test_set_and_clear/main-copy.cpp"},"sourceModified":false,"lines":"[6, 15]","breakpoints":[{"line":6},{"line":15}]},"seq":4} <-- Content-Length: 625

Hide Details

{"body":{"breakpoints":[{"id":1,"line":6,"source":{"name":"main-copy.cpp","path":"/Users/buildslave/jenkins/workspace/lldb-cmake-sanitized/lldb-build/lldb-test-build.noindex/tools/lldb-vscode/breakpoint/TestVSCode_setBreakpoints.test_set_and_clear/main-copy.cpp"},"verified":true},{"id":2,"line":15,"source":{"name":"main-copy.cpp","path":"/Users/buildslave/jenkins/workspace/lldb-cmake-sanitized/lldb-build/lldb-test-build.noindex/tools/lldb-vscode/breakpoint/TestVSCode_setBreakpoints.test_set_and_clear/main-copy.cpp"},"verified":true}]},"command":"setBreakpoints","request_seq":4,"seq":0,"success":true,"type":"response"} --> Content-Length: 79

Hide Details

{"command":"_testGetTargetBreakpoints","type":"request","arguments":{},"seq":5} <-- Content-Length: 636

Hide Details

{"body":{"breakpoints":[{"id":1,"line":6,"source":{"name":"main-copy.cpp","path":"/Users/buildslave/jenkins/workspace/lldb-cmake-sanitized/lldb-build/lldb-test-build.noindex/tools/lldb-vscode/breakpoint/TestVSCode_setBreakpoints.test_set_and_clear/main-copy.cpp"},"verified":true},{"id":2,"line":15,"source":{"name":"main-copy.cpp","path":"/Users/buildslave/jenkins/workspace/lldb-cmake-sanitized/lldb-build/lldb-test-build.noindex/tools/lldb-vscode/breakpoint/TestVSCode_setBreakpoints.test_set_and_clear/main-copy.cpp"},"verified":true}]},"command":"_testGetTargetBreakpoints","request_seq":5,"seq":0,"success":true,"type":"response"} --> Content-Length: 343

Hide Details

{"command":"setBreakpoints","type":"request","arguments":{"source":{"name":"main-copy.cpp","path":"/Users/buildslave/jenkins/workspace/lldb-cmake-sanitized/lldb-build/lldb-test-build.noindex/tools/lldb-vscode/breakpoint/TestVSCode_setBreakpoints.test_set_and_clear/main-copy.cpp"},"sourceModified":false,"lines":"[]","breakpoints":[]},"seq":6} <-- Content-Length: 111

Hide Details

{"body":{"breakpoints":[]},"command":"setBreakpoints","request_seq":6,"seq":0,"success":true,"type":"response"} --> Content-Length: 79

Hide Details

{"command":"_testGetTargetBreakpoints","type":"request","arguments":{},"seq":7} <-- Content-Length: 122

Hide Details

{"body":{"breakpoints":[]},"command":"_testGetTargetBreakpoints","request_seq":7,"seq":0,"success":true,"type":"response"} --> Content-Length: 356

Hide Details

{"command":"setBreakpoints","type":"request","arguments":{"source":{"name":"main-copy.cpp","path":"/Users/buildslave/jenkins/workspace/lldb-cmake-sanitized/lldb-build/lldb-test-build.noindex/tools/lldb-vscode/breakpoint/TestVSCode_setBreakpoints.test_set_and_clear/main-copy.cpp"},"sourceModified":false,"lines":"[10]","breakpoints":[{"line":10}]},"seq":8} <-- Content-Length: 368

Hide Details

{"body":{"breakpoints":[{"id":4,"line":10,"source":{"name":"main-copy.cpp","path":"/Users/buildslave/jenkins/workspace/lldb-cmake-sanitized/lldb-build/lldb-test-build.noindex/tools/lldb-vscode/breakpoint/TestVSCode_setBreakpoints.test_set_and_clear/main-copy.cpp"},"verified":true}]},"command":"setBreakpoints","request_seq":8,"seq":0,"success":true,"type":"response"} --> Content-Length: 79

Hide Details

{"command":"_testGetTargetBreakpoints","type":"request","arguments":{},"seq":9} <-- Content-Length: 379

Hide Details

{"body":{"breakpoints":[{"id":4,"line":10,"source":{"name":"main-copy.cpp","path":"/Users/buildslave/jenkins/workspace/lldb-cmake-sanitized/lldb-build/lldb-test-build.noindex/tools/lldb-vscode/breakpoint/TestVSCode_setBreakpoints.test_set_and_clear/main-copy.cpp"},"verified":true}]},"command":"_testGetTargetBreakpoints","request_seq":9,"seq":0,"success":true,"type":"response"} --> Content-Length: 89

Hide Details

{"command":"disconnect","type":"request","arguments":{"terminateDebuggee":true},"seq":10} <-- Content-Length: 45

Hide Details

{"event":"terminated","seq":0,"type":"event"} <-- Content-Length: 63

Hide Details

{"body":{"exitCode":9},"event":"exited","seq":0,"type":"event"} <-- Content-Length: 82

Hide Details

{"command":"disconnect","request_seq":10,"seq":0,"success":true,"type":"response"}

Hide Details

========= END ========= ========= DEBUG ADAPTER PROTOCOL LOGS ========= --> Content-Length: 284

Hide Details

{"command":"initialize","type":"request","arguments":{"adapterID":"lldb-native","clientID":"vscode","columnsStartAt1":true,"linesStartAt1":true,"locale":"en-us","pathFormat":"path","supportsRunInTerminalRequest":true,"supportsVariablePaging":true,"supportsVariableType":true},"seq":1} <-- Content-Length: 1222

Hide Details

{"body":{"exceptionBreakpointFilters":[{"default":false,"filter":"cpp_catch","label":"C++ Catch"},{"default":false,"filter":"cpp_throw","label":"C++ Throw"},{"default":false,"filter":"objc_catch","label":"Objective C Catch"},{"default":false,"filter":"objc_throw","label":"Objective C Throw"},{"default":false,"filter":"swift_catch","label":"Swift Catch"},{"default":false,"filter":"swift_throw","label":"Swift Throw"}],"supportTerminateDebuggee":true,"supportsCompletionsRequest":false,"supportsConditionalBreakpoints":true,"supportsConfigurationDoneRequest":true,"supportsDelayedStackTraceLoading":true,"supportsEvaluateForHovers":true,"supportsExceptionInfoRequest":true,"supportsExceptionOptions":true,"supportsFunctionBreakpoints":true,"supportsGotoTargetsRequest":false,"supportsHitConditionalBreakpoints":true,"supportsLoadedSourcesRequest":false,"supportsModulesRequest":false,"supportsProgressReporting":true,"supportsRestartFrame":false,"supportsRestartRequest":false,"supportsRunInTerminalRequest":true,"supportsSetVariable":true,"supportsStepBack":false,"supportsStepInTargetsRequest":false,"supportsValueFormattingOptions":true},"command":"initialize","request_seq":1,"seq":0,"success":true,"type":"response"} --> Content-Length: 1734

Hide Details

{"command":"launch","type":"request","arguments":{"program":"/Users/buildslave/jenkins/workspace/lldb-cmake-sanitized/lldb-build/lldb-test-build.noindex/tools/lldb-vscode/breakpoint/TestVSCode_setBreakpoints.test_source_map/a.out","disableASLR":true,"initCommands":["settings clear -all","settings set symbols.enable-external-lookup false","settings set target.inherit-tcc true","settings set target.detach-on-error false","settings set target.auto-apply-fixits false","settings set plugin.process.gdb-remote.packet-timeout 60","settings set symbols.clang-modules-cache-path \"/Users/buildslave/jenkins/workspace/lldb-cmake-sanitized/lldb-build/lldb-test-build.noindex/module-cache-lldb/lldb-api\"","settings set use-color false","setting set target.prefer-dynamic-value no-dynamic-values","settings set target.env-vars ASAN_OPTIONS=detect_stack_use_after_return=1 DYLD_INSERT_LIBRARIES=/Users/buildslave/jenkins/workspace/lldb-cmake-sanitized/host-compiler/lib/clang/13.0.99/lib/darwin/libclang_rt.asan_osx_dynamic.dylib"],"sourceMap":[["/Users/buildslave/jenkins/workspace/lldb-cmake-sanitized/lldb-build/lldb-test-build.noindex/tools/lldb-vscode/breakpoint/TestVSCode_setBreakpoints.test_source_map","/Users/buildslave/jenkins/workspace/lldb-cmake-sanitized/lldb-build/lldb-test-build.noindex/tools/lldb-vscode/breakpoint/TestVSCode_setBreakpoints.test_source_map/moved_main"],["/Users/buildslave/jenkins/workspace/lldb-cmake-sanitized/lldb-build/lldb-test-build.noindex/tools/lldb-vscode/breakpoint/TestVSCode_setBreakpoints.test_source_map","/Users/buildslave/jenkins/workspace/lldb-cmake-sanitized/lldb-build/lldb-test-build.noindex/tools/lldb-vscode/breakpoint/TestVSCode_setBreakpoints.test_source_map/moved_other"]]},"seq":2} <-- Content-Length: 923

Hide Details

{"body":{"category":"console","output":"Running initCommands:\n(lldb) settings clear -all\n(lldb) settings set symbols.enable-external-lookup false\n(lldb) settings set target.inherit-tcc true\n(lldb) settings set target.detach-on-error false\n(lldb) settings set target.auto-apply-fixits false\n(lldb) settings set plugin.process.gdb-remote.packet-timeout 60\n(lldb) settings set symbols.clang-modules-cache-path \"/Users/buildslave/jenkins/workspace/lldb-cmake-sanitized/lldb-build/lldb-test-build.noindex/module-cache-lldb/lldb-api\"\n(lldb) settings set use-color false\n(lldb) setting set target.prefer-dynamic-value no-dynamic-values\n(lldb) settings set target.env-vars ASAN_OPTIONS=detect_stack_use_after_return=1 DYLD_INSERT_LIBRARIES=/Users/buildslave/jenkins/workspace/lldb-cmake-sanitized/host-compiler/lib/clang/13.0.99/lib/darwin/libclang_rt.asan_osx_dynamic.dylib\n"},"event":"output","seq":0,"type":"event"} <-- Content-Length: 835

Hide Details

{"body":{"category":"console","output":"Setting source map:\n(lldb) settings set target.source-map \"/Users/buildslave/jenkins/workspace/lldb-cmake-sanitized/lldb-build/lldb-test-build.noindex/tools/lldb-vscode/breakpoint/TestVSCode_setBreakpoints.test_source_map\" \"/Users/buildslave/jenkins/workspace/lldb-cmake-sanitized/lldb-build/lldb-test-build.noindex/tools/lldb-vscode/breakpoint/TestVSCode_setBreakpoints.test_source_map/moved_main\" \"/Users/buildslave/jenkins/workspace/lldb-cmake-sanitized/lldb-build/lldb-test-build.noindex/tools/lldb-vscode/breakpoint/TestVSCode_setBreakpoints.test_source_map\" \"/Users/buildslave/jenkins/workspace/lldb-cmake-sanitized/lldb-build/lldb-test-build.noindex/tools/lldb-vscode/breakpoint/TestVSCode_setBreakpoints.test_source_map/moved_other\" \n"},"event":"output","seq":0,"type":"event"} <-- Content-Length: 77

Hide Details

{"command":"launch","request_seq":2,"seq":0,"success":true,"type":"response"} <-- Content-Length: 298

Hide Details

{"body":{"isLocalProcess":true,"name":"/Users/buildslave/jenkins/workspace/lldb-cmake-sanitized/lldb-build/lldb-test-build.noindex/tools/lldb-vscode/breakpoint/TestVSCode_setBreakpoints.test_source_map/a.out","startMethod":"launch","systemProcessId":99026},"event":"process","seq":0,"type":"event"} <-- Content-Length: 46

Hide Details

{"event":"initialized","seq":0,"type":"event"} --> Content-Length: 362

Hide Details

{"command":"setBreakpoints","type":"request","arguments":{"source":{"name":"main-copy.cpp","path":"/Users/buildslave/jenkins/workspace/lldb-cmake-sanitized/lldb-build/lldb-test-build.noindex/tools/lldb-vscode/breakpoint/TestVSCode_setBreakpoints.test_source_map/moved_main/main-copy.cpp"},"sourceModified":false,"lines":"[6]","breakpoints":[{"line":6}]},"seq":3} <-- Content-Length: 375

Hide Details

{"body":{"breakpoints":[{"id":1,"line":6,"source":{"name":"main-copy.cpp","path":"/Users/buildslave/jenkins/workspace/lldb-cmake-sanitized/lldb-build/lldb-test-build.noindex/tools/lldb-vscode/breakpoint/TestVSCode_setBreakpoints.test_source_map/moved_main/main-copy.cpp"},"verified":true}]},"command":"setBreakpoints","request_seq":3,"seq":0,"success":true,"type":"response"} --> Content-Length: 361

Hide Details

{"command":"setBreakpoints","type":"request","arguments":{"source":{"name":"other-copy.c","path":"/Users/buildslave/jenkins/workspace/lldb-cmake-sanitized/lldb-build/lldb-test-build.noindex/tools/lldb-vscode/breakpoint/TestVSCode_setBreakpoints.test_source_map/moved_other/other-copy.c"},"sourceModified":false,"lines":"[2]","breakpoints":[{"line":2}]},"seq":4} <-- Content-Length: 375

Hide Details

{"body":{"breakpoints":[{"id":2,"line":2,"source":{"name":"other-copy.c","path":"/Users/buildslave/jenkins/workspace/lldb-cmake-sanitized/lldb-build/lldb-test-build.noindex/tools/lldb-vscode/breakpoint/TestVSCode_setBreakpoints.test_source_map/moved_other/other-copy.c"},"verified":false}]},"command":"setBreakpoints","request_seq":4,"seq":0,"success":true,"type":"response"} --> Content-Length: 71

Hide Details

{"command":"configurationDone","type":"request","arguments":{},"seq":5} <-- Content-Length: 88

Hide Details

{"command":"configurationDone","request_seq":5,"seq":0,"success":true,"type":"response"} <-- Content-Length: 120

Hide Details

{"body":{"breakpoint":{"id":2,"line":2,"verified":true},"reason":"changed"},"event":"breakpoint","seq":0,"type":"event"} <-- Content-Length: 199

Hide Details

{"body":{"allThreadsStopped":true,"description":"breakpoint 2.1","preserveFocusHint":false,"reason":"breakpoint","threadCausedFocus":true,"threadId":3008214},"event":"stopped","seq":0,"type":"event"} --> Content-Length: 361

Hide Details

{"command":"setBreakpoints","type":"request","arguments":{"source":{"name":"other-copy.c","path":"/Users/buildslave/jenkins/workspace/lldb-cmake-sanitized/lldb-build/lldb-test-build.noindex/tools/lldb-vscode/breakpoint/TestVSCode_setBreakpoints.test_source_map/moved_other/other-copy.c"},"sourceModified":false,"lines":"[2]","breakpoints":[{"line":2}]},"seq":6} <-- Content-Length: 374

Hide Details

{"body":{"breakpoints":[{"id":2,"line":2,"source":{"name":"other-copy.c","path":"/Users/buildslave/jenkins/workspace/lldb-cmake-sanitized/lldb-build/lldb-test-build.noindex/tools/lldb-vscode/breakpoint/TestVSCode_setBreakpoints.test_source_map/moved_other/other-copy.c"},"verified":true}]},"command":"setBreakpoints","request_seq":6,"seq":0,"success":true,"type":"response"} --> Content-Length: 88

Hide Details

{"command":"disconnect","type":"request","arguments":{"terminateDebuggee":true},"seq":7} <-- Content-Length: 45

Hide Details

{"event":"terminated","seq":0,"type":"event"} <-- Content-Length: 63

Hide Details

{"body":{"exitCode":9},"event":"exited","seq":0,"type":"event"} <-- Content-Length: 81

Hide Details

{"command":"disconnect","request_seq":7,"seq":0,"success":true,"type":"response"}

Hide Details

========= END =========

Hide Details

-- Command Output (stderr): -- Change dir to: /Users/buildslave/jenkins/workspace/lldb-cmake-sanitized/llvm-project/lldb/test/API/tools/lldb-vscode/breakpoint runCmd: settings clear -all output:

Hide Details

runCmd: settings set symbols.enable-external-lookup false output:

Hide Details

runCmd: settings set target.inherit-tcc true output:

Hide Details

runCmd: settings set target.detach-on-error false output:

Hide Details

runCmd: settings set target.auto-apply-fixits false output:

Hide Details

runCmd: settings set plugin.process.gdb-remote.packet-timeout 60 output:

Hide Details

runCmd: settings set symbols.clang-modules-cache-path "/Users/buildslave/jenkins/workspace/lldb-cmake-sanitized/lldb-build/lldb-test-build.noindex/module-cache-lldb/lldb-api" output:

Hide Details

runCmd: settings set use-color false output:

Hide Details

runCmd: setting set target.prefer-dynamic-value no-dynamic-values output:

Hide Details

runCmd: settings set target.env-vars ASAN_OPTIONS=detect_stack_use_after_return=1 DYLD_INSERT_LIBRARIES=/Users/buildslave/jenkins/workspace/lldb-cmake-sanitized/host-compiler/lib/clang/13.0.99/lib/darwin/libclang_rt.asan_osx_dynamic.dylib output:

Hide Details

Adding tearDown hook: def cleanup(): if disconnectAutomatically: self.vscode.request_disconnect(terminateDebuggee=True) self.vscode.terminate()

Hide Details

Hide Details

Executing tearDown hook: def cleanup(): if disconnectAutomatically: self.vscode.request_disconnect(terminateDebuggee=True) self.vscode.terminate()

Hide Details

Hide Details

PASS: LLDB (/Users/buildslave/jenkins/workspace/lldb-cmake-sanitized/host-compiler/bin/clang-x86_64) :: test_clear_breakpoints_unset_breakpoints (TestVSCode_setBreakpoints.TestVSCode_setBreakpoints) runCmd: settings clear -all output:

Hide Details

runCmd: settings set symbols.enable-external-lookup false output:

Hide Details

runCmd: settings set target.inherit-tcc true output:

Hide Details

runCmd: settings set target.detach-on-error false output:

Hide Details

runCmd: settings set target.auto-apply-fixits false output:

Hide Details

runCmd: settings set plugin.process.gdb-remote.packet-timeout 60 output:

Hide Details

runCmd: settings set symbols.clang-modules-cache-path "/Users/buildslave/jenkins/workspace/lldb-cmake-sanitized/lldb-build/lldb-test-build.noindex/module-cache-lldb/lldb-api" output:

Hide Details

runCmd: settings set use-color false output:

Hide Details

runCmd: setting set target.prefer-dynamic-value no-dynamic-values output:

Hide Details

runCmd: settings set target.env-vars ASAN_OPTIONS=detect_stack_use_after_return=1 DYLD_INSERT_LIBRARIES=/Users/buildslave/jenkins/workspace/lldb-cmake-sanitized/host-compiler/lib/clang/13.0.99/lib/darwin/libclang_rt.asan_osx_dynamic.dylib output:

Hide Details

Adding tearDown hook: def cleanup(): if disconnectAutomatically: self.vscode.request_disconnect(terminateDebuggee=True) self.vscode.terminate()

Hide Details

Hide Details

FAIL: LLDB (/Users/buildslave/jenkins/workspace/lldb-cmake-sanitized/host-compiler/bin/clang-x86_64) :: test_functionality (TestVSCode_setBreakpoints.TestVSCode_setBreakpoints) Executing tearDown hook: def cleanup(): if disconnectAutomatically: self.vscode.request_disconnect(terminateDebuggee=True) self.vscode.terminate()

Hide Details

Hide Details

CLEANUP ERROR: LLDB (/Users/buildslave/jenkins/workspace/lldb-cmake-sanitized/host-compiler/bin/clang-x86_64) :: test_functionality (TestVSCode_setBreakpoints.TestVSCode_setBreakpoints) Traceback (most recent call last): File "/Users/buildslave/jenkins/workspace/lldb-cmake-sanitized/llvm-project/lldb/third_party/Python/module/unittest2/unittest2/case.py", line 386, in run self.tearDown() File "/Users/buildslave/jenkins/workspace/lldb-cmake-sanitized/llvm-project/lldb/packages/Python/lldbsuite/test/lldbtest.py", line 2095, in tearDown Base.tearDown(self) File "/Users/buildslave/jenkins/workspace/lldb-cmake-sanitized/llvm-project/lldb/packages/Python/lldbsuite/test/lldbtest.py", line 1065, in tearDown hook() # try the plain call and hope it works File "/Users/buildslave/jenkins/workspace/lldb-cmake-sanitized/llvm-project/lldb/packages/Python/lldbsuite/test/tools/lldb-vscode/lldbvscode_testcase.py", line 294, in cleanup self.vscode.request_disconnect(terminateDebuggee=True) File "/Users/buildslave/jenkins/workspace/lldb-cmake-sanitized/llvm-project/lldb/packages/Python/lldbsuite/test/tools/lldb-vscode/vscode.py", line 590, in request_disconnect return self.send_recv(command_dict) File "/Users/buildslave/jenkins/workspace/lldb-cmake-sanitized/llvm-project/lldb/packages/Python/lldbsuite/test/tools/lldb-vscode/vscode.py", line 315, in send_recv self.send_packet(command) File "/Users/buildslave/jenkins/workspace/lldb-cmake-sanitized/llvm-project/lldb/packages/Python/lldbsuite/test/tools/lldb-vscode/vscode.py", line 271, in send_packet self.send.flush() BrokenPipeError: [Errno 32] Broken pipe

Hide Details

runCmd: settings clear -all output:

Hide Details

runCmd: settings set symbols.enable-external-lookup false output:

Hide Details

runCmd: settings set target.inherit-tcc true output:

Hide Details

runCmd: settings set target.detach-on-error false output:

Hide Details

runCmd: settings set target.auto-apply-fixits false output:

Hide Details

runCmd: settings set plugin.process.gdb-remote.packet-timeout 60 output:

Hide Details

runCmd: settings set symbols.clang-modules-cache-path "/Users/buildslave/jenkins/workspace/lldb-cmake-sanitized/lldb-build/lldb-test-build.noindex/module-cache-lldb/lldb-api" output:

Hide Details

runCmd: settings set use-color false output:

Hide Details

runCmd: setting set target.prefer-dynamic-value no-dynamic-values output:

Hide Details

runCmd: settings set target.env-vars ASAN_OPTIONS=detect_stack_use_after_return=1 DYLD_INSERT_LIBRARIES=/Users/buildslave/jenkins/workspace/lldb-cmake-sanitized/host-compiler/lib/clang/13.0.99/lib/darwin/libclang_rt.asan_osx_dynamic.dylib output:

Hide Details

Adding tearDown hook: def cleanup(): if disconnectAutomatically: self.vscode.request_disconnect(terminateDebuggee=True) self.vscode.terminate()

Hide Details

Hide Details

Executing tearDown hook: def cleanup(): if disconnectAutomatically: self.vscode.request_disconnect(terminateDebuggee=True) self.vscode.terminate()

Hide Details

Hide Details

PASS: LLDB (/Users/buildslave/jenkins/workspace/lldb-cmake-sanitized/host-compiler/bin/clang-x86_64) :: test_set_and_clear (TestVSCode_setBreakpoints.TestVSCode_setBreakpoints) runCmd: settings clear -all output:

Hide Details

runCmd: settings set symbols.enable-external-lookup false output:

Hide Details

runCmd: settings set target.inherit-tcc true output:

Hide Details

runCmd: settings set target.detach-on-error false output:

Hide Details

runCmd: settings set target.auto-apply-fixits false output:

Hide Details

runCmd: settings set plugin.process.gdb-remote.packet-timeout 60 output:

Hide Details

runCmd: settings set symbols.clang-modules-cache-path "/Users/buildslave/jenkins/workspace/lldb-cmake-sanitized/lldb-build/lldb-test-build.noindex/module-cache-lldb/lldb-api" output:

Hide Details

runCmd: settings set use-color false output:

Hide Details

runCmd: setting set target.prefer-dynamic-value no-dynamic-values output:

Hide Details

runCmd: settings set target.env-vars ASAN_OPTIONS=detect_stack_use_after_return=1 DYLD_INSERT_LIBRARIES=/Users/buildslave/jenkins/workspace/lldb-cmake-sanitized/host-compiler/lib/clang/13.0.99/lib/darwin/libclang_rt.asan_osx_dynamic.dylib output:

Hide Details

Adding tearDown hook: def cleanup(): if disconnectAutomatically: self.vscode.request_disconnect(terminateDebuggee=True) self.vscode.terminate()

Hide Details

Hide Details

Executing tearDown hook: def cleanup(): if disconnectAutomatically: self.vscode.request_disconnect(terminateDebuggee=True) self.vscode.terminate()

Hide Details

Hide Details

PASS: LLDB (/Users/buildslave/jenkins/workspace/lldb-cmake-sanitized/host-compiler/bin/clang-x86_64) :: test_source_map (TestVSCode_setBreakpoints.TestVSCode_setBreakpoints) Restore dir to: /Users/buildslave/jenkins/workspace/lldb-cmake-sanitized/lldb-build/tools/lldb/test ====================================================================== FAIL: test_functionality (TestVSCode_setBreakpoints.TestVSCode_setBreakpoints) Tests hitting breakpoints and the functionality of a single ---------------------------------------------------------------------- Traceback (most recent call last): File "/Users/buildslave/jenkins/workspace/lldb-cmake-sanitized/llvm-project/lldb/test/API/tools/lldb-vscode/breakpoint/TestVSCode_setBreakpoints.py", line 294, in test_functionality self.continue_to_breakpoints(breakpoint_ids) File "/Users/buildslave/jenkins/workspace/lldb-cmake-sanitized/llvm-project/lldb/packages/Python/lldbsuite/test/tools/lldb-vscode/lldbvscode_testcase.py", line 233, in continue_to_breakpoints self.verify_breakpoint_hit(breakpoint_ids) File "/Users/buildslave/jenkins/workspace/lldb-cmake-sanitized/llvm-project/lldb/packages/Python/lldbsuite/test/tools/lldb-vscode/lldbvscode_testcase.py", line 92, in verify_breakpoint_hit self.assertTrue(False, "breakpoint not hit") AssertionError: False is not True : breakpoint not hit Config=x86_64-/Users/buildslave/jenkins/workspace/lldb-cmake-sanitized/host-compiler/bin/clang ---------------------------------------------------------------------- Ran 4 tests in 8.962s

Hide Details

RESULT: FAILED (3 passes, 1 failures, 0 errors, 0 skipped, 0 expected failures, 0 unexpected successes)

Hide Details

--

Hide Details

******************** PASS: lldb-api :: lang/objc/modules-non-objc-target/TestObjCModulesNonObjCTarget.py (1328 of 2355) PASS: lldb-unit :: Utility/./UtilityTests/RegisterValueTest.GetScalarValue (1329 of 2355) PASS: lldb-shell :: ScriptInterpreter/None/none.test (1330 of 2355) PASS: lldb-unit :: Core/./LLDBCoreTests/FormatEntity.LookupAllEntriesInTree (1331 of 2355) PASS: lldb-unit :: Process/gdb-remote/./ProcessGdbRemoteTests/GDBRemoteCommunicationClientTest.SyncThreadState (1332 of 2355) UNSUPPORTED: lldb-api :: commands/trace/TestTraceSchema.py (1333 of 2355) PASS: lldb-unit :: Process/Utility/./ProcessUtilityTests/RegisterContext_x86Test.FullToAbridgedTagWord (1334 of 2355) PASS: lldb-shell :: SymbolFile/DWARF/x86/find-inline-method.s (1335 of 2355) PASS: lldb-api :: linux/builtin_trap/TestBuiltinTrap.py (1336 of 2355) PASS: lldb-unit :: Utility/./UtilityTests/PassiveReplayTest.InstrumentedBarRef (1337 of 2355) PASS: lldb-unit :: Interpreter/./InterpreterTests/OptionValueString.DeepCopy (1338 of 2355) PASS: lldb-unit :: Utility/./UtilityTests/StringLexerTest.PutBack (1339 of 2355) PASS: lldb-unit :: Expression/./ExpressionTests/DiagnosticManagerTest.GetStringPreserveOrder (1340 of 2355) PASS: lldb-unit :: DataFormatter/./LLDBFormatterTests/TypeMatcherTests.CreatedBySameMatchString (1341 of 2355) PASS: lldb-shell :: Minidump/Windows/broken-unwind.test (1342 of 2355) PASS: lldb-api :: functionalities/thread/concurrent_events/TestConcurrentCrashWithWatchpoint.py (1343 of 2355) PASS: lldb-api :: python_api/lldbutil/frame/TestFrameUtils.py (1344 of 2355) PASS: lldb-api :: commands/target/create-no-such-arch/TestNoSuchArch.py (1345 of 2355) PASS: lldb-unit :: Utility/./UtilityTests/VASprintfTest.EncodingError (1346 of 2355) PASS: lldb-shell :: ObjectFile/PECOFF/basic-info.yaml (1347 of 2355) PASS: lldb-api :: commands/watchpoints/watchpoint_count/TestWatchpointCount.py (1348 of 2355) PASS: lldb-api :: functionalities/gdb_remote_client/TestHaltFails.py (1349 of 2355) PASS: lldb-api :: lang/c/complex/TestComplexC99.py (1350 of 2355) UNSUPPORTED: lldb-api :: functionalities/longjmp/TestLongjmp.py (1351 of 2355) PASS: lldb-shell :: BuildScript/toolchain-clang.test (1352 of 2355) PASS: lldb-unit :: UnwindAssembly/x86/./UnwindAssemblyx86Tests/Testx86AssemblyInspectionEngine.TestPushRBP (1353 of 2355) PASS: lldb-unit :: Utility/./UtilityTests/StringExtractorTest.GetHexBytes_Partial (1354 of 2355) UNSUPPORTED: lldb-api :: functionalities/tsan/thread_numbers/TestTsanThreadNumbers.py (1355 of 2355) PASS: lldb-api :: functionalities/thread/concurrent_events/TestConcurrentDelayedCrashWithBreakpointSignal.py (1356 of 2355) PASS: lldb-unit :: UnwindAssembly/x86/./UnwindAssemblyx86Tests/Testx86AssemblyInspectionEngine.TestPush0 (1357 of 2355) PASS: lldb-shell :: Reproducer/TestRelativePath.test (1358 of 2355) PASS: lldb-shell :: Expr/TestMultilineExpr.test (1359 of 2355) PASS: lldb-unit :: Core/./LLDBCoreTests/DumpDataExtractorTest.MultiLine (1360 of 2355) PASS: lldb-api :: commands/frame/recognizer/TestFrameRecognizer.py (1361 of 2355) PASS: lldb-api :: lang/c/shared_lib_stripped_symbols/TestSharedLibStrippedSymbols.py (1362 of 2355) PASS: lldb-unit :: Process/minidump/./LLDBMinidumpTests/MinidumpParserTest.GetLinuxProcStatus (1363 of 2355) UNSUPPORTED: lldb-shell :: SymbolFile/PDB/function-nested-block.test (1364 of 2355) PASS: lldb-api :: lang/objc/foundation/TestRuntimeTypes.py (1365 of 2355) PASS: lldb-unit :: Utility/./UtilityTests/ScalarTest.GetValue (1366 of 2355) PASS: lldb-unit :: Utility/./UtilityTests/DataExtractorTest.GetCStrEmpty (1367 of 2355) PASS: lldb-unit :: Process/gdb-remote/./ProcessGdbRemoteTests/GDBRemoteCommunicationClientTest.WriteRegisterNoSuffix (1368 of 2355) PASS: lldb-unit :: DataFormatter/./LLDBFormatterTests/StringPrinterTests.CxxUTF8 (1369 of 2355) PASS: lldb-unit :: Symbol/./SymbolTests/TestTypeSystemClang.TestGetTypeClassTypeOf (1370 of 2355) PASS: lldb-unit :: Platform/./LLDBPlatformTests/PlatformDarwinTest.TestParseVersionBuildDir (1371 of 2355) PASS: lldb-unit :: ScriptInterpreter/Python/./ScriptInterpreterPythonTests/PythonDataObjectsTest.TestOwnedReferences (1372 of 2355) PASS: lldb-shell :: ObjectFile/PECOFF/sections-names.yaml (1373 of 2355) PASS: lldb-shell :: SymbolFile/DWARF/x86/DW_AT_const_value.s (1374 of 2355) PASS: lldb-unit :: Expression/./ExpressionTests/DWARFExpression.DW_OP_stack_value (1375 of 2355) PASS: lldb-unit :: Utility/./UtilityTests/ScalarTest.SetValueFromData (1376 of 2355) PASS: lldb-api :: lang/objc/modules-auto-import/TestModulesAutoImport.py (1377 of 2355) PASS: lldb-api :: commands/expression/scoped_enums/TestScopedEnumType.py (1378 of 2355) PASS: lldb-api :: functionalities/type_get_module/TestTypeGetModule.py (1379 of 2355) PASS: lldb-unit :: Utility/./UtilityTests/RangeTest.LessThanInvalid (1380 of 2355) PASS: lldb-shell :: Commands/command-target-modules-dump-sections.yaml (1381 of 2355) PASS: lldb-api :: commands/source/info/TestSourceInfo.py (1382 of 2355) PASS: lldb-unit :: Language/Highlighting/./HighlighterTests/HighlighterTest.ClangUnterminatedString (1383 of 2355) PASS: lldb-unit :: Utility/./UtilityTests/BinaryStreamTest.PutULEB128SevenBytes (1384 of 2355) PASS: lldb-unit :: Utility/./UtilityTests/BroadcasterTest.EventTypeHasListeners (1385 of 2355) UNSUPPORTED: lldb-api :: benchmarks/expression/TestRepeatedExprs.py (1386 of 2355) PASS: lldb-unit :: SymbolFile/DWARF/./SymbolFileDWARFTests/SymbolFileDWARFTests.TestAbbrevOrder1Start1 (1387 of 2355) PASS: lldb-shell :: Error/assert.test (1388 of 2355) PASS: lldb-shell :: ObjectFile/ELF/minidebuginfo-corrupt-xz.yaml (1389 of 2355) PASS: lldb-unit :: Expression/./ExpressionTests/CppModuleConfigurationTest.Sysroot (1390 of 2355) PASS: lldb-unit :: UnwindAssembly/x86/./UnwindAssemblyx86Tests/Testx86AssemblyInspectionEngine.TestAddRSP (1391 of 2355) PASS: lldb-api :: commands/expression/import-std-module/vector-bool/TestVectorBoolFromStdModule.py (1392 of 2355) PASS: lldb-unit :: UnwindAssembly/x86/./UnwindAssemblyx86Tests/Testx86AssemblyInspectionEngine.Test64bitFramelessBigStackFrame (1393 of 2355) PASS: lldb-unit :: Host/./HostTests/NativeProcessProtocolTest.SetBreakpointFailWrite (1394 of 2355) PASS: lldb-shell :: SymbolFile/NativePDB/globals-bss.cpp (1395 of 2355) PASS: lldb-shell :: ObjectFile/MachO/symtab.yaml (1396 of 2355) PASS: lldb-shell :: SymbolFile/DWARF/x86/dir-separator-posix.s (1397 of 2355) PASS: lldb-shell :: SymbolFile/DWARF/x86/debug_ranges-missing-section.s (1398 of 2355) PASS: lldb-api :: functionalities/data-formatter/data-formatter-enum-format/TestDataFormatterEnumFormat.py (1399 of 2355) PASS: lldb-shell :: ObjectFile/ELF/basic-info.yaml (1400 of 2355) PASS: lldb-shell :: SymbolFile/DWARF/x86/debug-names-compressed.cpp (1401 of 2355) PASS: lldb-shell :: Reproducer/TestDiscard.test (1402 of 2355) PASS: lldb-unit :: Utility/./UtilityTests/Flags.AllClear (1403 of 2355) PASS: lldb-unit :: Utility/./UtilityTests/StringExtractorTest.GetHexBytesAvail_FullString (1404 of 2355) PASS: lldb-unit :: Utility/./UtilityTests/ArchSpecTest.MergeFromMachOUnknown (1405 of 2355) PASS: lldb-unit :: Utility/./UtilityTests/ArchSpecTest.MergeFrom (1406 of 2355) PASS: lldb-unit :: UnwindAssembly/x86/./UnwindAssemblyx86Tests/Testx86AssemblyInspectionEngine.TestLEAVE (1407 of 2355) PASS: lldb-api :: commands/help/TestHelp.py (1408 of 2355) PASS: lldb-api :: functionalities/thread/concurrent_events/TestConcurrentWatchpointWithDelayWatchpointThreads.py (1409 of 2355) PASS: lldb-api :: commands/watchpoints/watchpoint_commands/TestWatchpointCommands.py (1410 of 2355) PASS: lldb-api :: sanity/TestSettingSkipping.py (1411 of 2355) PASS: lldb-unit :: Utility/./UtilityTests/StringLexerTest.NextIf (1412 of 2355) PASS: lldb-unit :: Target/./TargetTests/StackFrameRecognizerTest.NullModuleRegex (1413 of 2355) PASS: lldb-unit :: Host/./HostTests/HostInfoTest.GetHostname (1414 of 2355) PASS: lldb-api :: commands/disassemble/basic/TestDisassembleBreakpoint.py (1415 of 2355) PASS: lldb-unit :: Platform/./LLDBPlatformTests/PlatformAppleSimulatorTest.TestHostPlatformToSim (1416 of 2355) PASS: lldb-shell :: SymbolFile/DWARF/x86/module-ownership.mm (1417 of 2355) PASS: lldb-unit :: Utility/./UtilityTests/Predicate.WaitForValueNotEqualTo (1418 of 2355) PASS: lldb-unit :: Utility/./UtilityTests/CompletionRequest.DuplicateFilteringWithComments (1419 of 2355) PASS: lldb-shell :: ObjectFile/ELF/PT_LOAD-empty.yaml (1420 of 2355) UNSUPPORTED: lldb-api :: tools/lldb-server/TestGdbRemoteModuleInfo.py (1421 of 2355) PASS: lldb-unit :: Utility/./UtilityTests/StringExtractorTest.GetNameColonValueSuccess (1422 of 2355) PASS: lldb-unit :: Host/./HostTests/SocketTests/SocketTest.DomainGetConnectURI/ipv6 (1423 of 2355) PASS: lldb-api :: python_api/lldbutil/iter/TestLLDBIterator.py (1424 of 2355) PASS: lldb-api :: python_api/lldbutil/process/TestPrintStackTraces.py (1425 of 2355) PASS: lldb-api :: commands/frame/diagnose/bad-reference/TestBadReference.py (1426 of 2355) PASS: lldb-api :: functionalities/recursion/TestValueObjectRecursion.py (1427 of 2355) PASS: lldb-shell :: Settings/TestFrameFormatNoColor.test (1428 of 2355) PASS: lldb-shell :: Breakpoint/dummy-target.test (1429 of 2355) PASS: lldb-unit :: UnwindAssembly/x86/./UnwindAssemblyx86Tests/Testx86AssemblyInspectionEngine.TestReturnDetect (1430 of 2355) PASS: lldb-shell :: ObjectFile/Breakpad/sections-trailing-func.test (1431 of 2355) PASS: lldb-api :: lang/objc/modules-app-update/TestClangModulesAppUpdate.py (1432 of 2355) PASS: lldb-unit :: Core/./LLDBCoreTests/DumpDataExtractorTest.NullStream (1433 of 2355) PASS: lldb-unit :: Utility/./UtilityTests/ArgsTest.AppendArguments (1434 of 2355) PASS: lldb-api :: functionalities/thread/concurrent_events/TestConcurrentDelaySignalWatch.py (1435 of 2355) PASS: lldb-shell :: SymbolFile/DWARF/x86/debug_loc-aslr.s (1436 of 2355) PASS: lldb-api :: commands/log/invalid-args/TestInvalidArgsLog.py (1437 of 2355) PASS: lldb-api :: tools/lldb-server/TestGdbRemoteExpeditedRegisters.py (1438 of 2355) PASS: lldb-unit :: Utility/./UtilityTests/StreamTest.ChangingByteOrder (1439 of 2355) PASS: lldb-api :: functionalities/archives/TestBSDArchives.py (1440 of 2355) UNSUPPORTED: lldb-api :: commands/trace/TestTraceLoad.py (1441 of 2355) PASS: lldb-unit :: Utility/./UtilityTests/OptionsWithRawTest.ArgsButNoLeadingDash (1442 of 2355) PASS: lldb-unit :: Utility/./UtilityTests/RangeDataVector.FindEntryThatContains (1443 of 2355) PASS: lldb-api :: lang/objc/foundation/TestSymbolTable.py (1444 of 2355) PASS: lldb-api :: macosx/DBGSourcePathRemapping/TestDSYMSourcePathRemapping.py (1445 of 2355) PASS: lldb-api :: functionalities/thread/thread_specific_break/TestThreadSpecificBreakpoint.py (1446 of 2355) PASS: lldb-unit :: Symbol/./SymbolTests/TestTypeSystemClang.TestGetEnumIntegerTypeBasicTypes (1447 of 2355) PASS: lldb-api :: lang/cpp/this_class_type_mixing/TestThisClassTypeMixing.py (1448 of 2355) PASS: lldb-api :: commands/expression/persistent_types/TestNestedPersistentTypes.py (1449 of 2355) PASS: lldb-unit :: Utility/./UtilityTests/LogChannelTest.EnableOptions (1450 of 2355) PASS: lldb-unit :: Host/./HostTests/HostInfoTest.GetAugmentedArchSpec (1451 of 2355) PASS: lldb-api :: functionalities/wrong_commands/TestWrongCommands.py (1452 of 2355) PASS: lldb-shell :: Settings/TestEchoCommands.test (1453 of 2355) PASS: lldb-api :: lang/cpp/extern_c/TestExternCSymbols.py (1454 of 2355) PASS: lldb-unit :: Language/Highlighting/./HighlighterTests/HighlighterTest.ClangBraces (1455 of 2355) PASS: lldb-api :: commands/expression/vector_of_enums/TestVectorOfEnums.py (1456 of 2355) PASS: lldb-unit :: Utility/./UtilityTests/StringExtractorTest.DecodeHexU8_InvalidHex (1457 of 2355) PASS: lldb-api :: functionalities/data-formatter/data-formatter-objc/TestDataFormatterObjCPlain.py (1458 of 2355) PASS: lldb-unit :: Language/Highlighting/./HighlighterTests/HighlighterTest.Keywords (1459 of 2355) PASS: lldb-unit :: Utility/./UtilityTests/ScalarTest.Equality (1460 of 2355) PASS: lldb-api :: functionalities/data-formatter/data-formatter-disabling/TestDataFormatterDisabling.py (1461 of 2355) PASS: lldb-unit :: Host/./HostTests/ConnectionFileDescriptorTest.TCPGetURIv6 (1462 of 2355) PASS: lldb-shell :: SymbolFile/DWARF/x86/debug_loc_and_loclists.s (1463 of 2355) PASS: lldb-unit :: UnwindAssembly/x86/./UnwindAssemblyx86Tests/Testx86AssemblyInspectionEngine.TestSpArithx86_64Augmented (1464 of 2355) PASS: lldb-unit :: UnwindAssembly/x86/./UnwindAssemblyx86Tests/Testx86AssemblyInspectionEngine.TestPushRBX (1465 of 2355) PASS: lldb-api :: functionalities/thread/concurrent_events/TestConcurrentTwoWatchpointsOneBreakpoint.py (1466 of 2355) PASS: lldb-api :: lang/cpp/this/TestCPPThis.py (1467 of 2355) PASS: lldb-api :: functionalities/thread/concurrent_events/TestConcurrentSignalWatch.py (1468 of 2355) PASS: lldb-unit :: Utility/./UtilityTests/UriParserTest.Minimal (1469 of 2355) PASS: lldb-unit :: UnwindAssembly/x86/./UnwindAssemblyx86Tests/Testx86AssemblyInspectionEngine.TestPushR13 (1470 of 2355) PASS: lldb-unit :: Language/Highlighting/./HighlighterTests/HighlighterTest.HighlighterSelectionType (1471 of 2355) PASS: lldb-api :: lang/objc/unicode-string/TestUnicodeString.py (1472 of 2355) PASS: lldb-unit :: Utility/./UtilityTests/CompletionRequest.Constructor (1473 of 2355) PASS: lldb-shell :: SymbolFile/DWARF/clang-ast-from-dwarf-unamed-and-anon-structs.cpp (1474 of 2355) PASS: lldb-unit :: Utility/./UtilityTests/StreamTeeTest.CopyConstructor (1475 of 2355) PASS: lldb-api :: commands/expression/import-std-module/forward_decl_from_module/TestForwardDeclFromStdModule.py (1476 of 2355) PASS: lldb-shell :: Quit/TestQuitExitCodeImplicit0.test (1477 of 2355) PASS: lldb-shell :: Register/Core/x86-64-freebsd-addr.test (1478 of 2355) PASS: lldb-shell :: Unwind/trap_frame_sym_ctx.test (1479 of 2355) PASS: lldb-api :: commands/expression/rdar44436068/Test128BitsInteger.py (1480 of 2355) PASS: lldb-api :: lang/objcxx/class-name-clash/TestNameClash.py (1481 of 2355) PASS: lldb-api :: python_api/name_lookup/TestNameLookup.py (1482 of 2355) PASS: lldb-api :: lang/objc/objc-property/TestObjCProperty.py (1483 of 2355) XFAIL: lldb-shell :: Register/x86-64-ymm-write.test (1484 of 2355) PASS: lldb-api :: lang/cpp/nsimport/TestCppNsImport.py (1485 of 2355) PASS: lldb-api :: commands/target/stop-hooks/TestStopHookScripted.py (1486 of 2355) PASS: lldb-shell :: Driver/TestCommands.test (1487 of 2355) PASS: lldb-api :: functionalities/data-formatter/data-formatter-skip-summary/TestDataFormatterSkipSummary.py (1488 of 2355) PASS: lldb-unit :: Utility/./UtilityTests/StreamTest.PutMaxHex64ByteOrderBig (1489 of 2355) PASS: lldb-unit :: Host/./HostTests/File.GetStreamFromDescriptor (1490 of 2355) PASS: lldb-unit :: UnwindAssembly/x86/./UnwindAssemblyx86Tests/Testx86AssemblyInspectionEngine.TestPushEBX (1491 of 2355) PASS: lldb-api :: python_api/formatters/TestFormattersSBAPI.py (1492 of 2355) PASS: lldb-shell :: SymbolFile/DWARF/dwo-relative-path.s (1493 of 2355) PASS: lldb-unit :: ScriptInterpreter/Python/./ScriptInterpreterPythonTests/PythonDataObjectsTest.TestPythonFile (1494 of 2355) PASS: lldb-unit :: Utility/./UtilityTests/UriParserTest.PortOverflow (1495 of 2355) PASS: lldb-api :: commands/target/modules/search-paths/insert/TestTargetModulesSearchpathsInsert.py (1496 of 2355) PASS: lldb-unit :: Expression/./ExpressionTests/CppModuleConfigurationTest.UnrelatedLibrary (1497 of 2355) UNSUPPORTED: lldb-api :: functionalities/breakpoint/hardware_breakpoints/write_memory_with_hw_breakpoint/TestWriteMemoryWithHWBreakpoint.py (1498 of 2355) PASS: lldb-shell :: SymbolFile/Breakpad/symtab-macho.test (1499 of 2355) PASS: lldb-unit :: Utility/./UtilityTests/RangeTest.ContainsAddrInvalid (1500 of 2355) PASS: lldb-api :: lang/cpp/namespace_conflicts/TestNamespaceConflicts.py (1501 of 2355) PASS: lldb-unit :: ObjectFile/Breakpad/./ObjectFileBreakpadTests/PublicRecord.parse (1502 of 2355) PASS: lldb-api :: functionalities/breakpoint/breakpoint_by_file_colon_line/TestBreakpointByFileColonLine.py (1503 of 2355) PASS: lldb-api :: functionalities/data-formatter/data-formatter-stl/libcxx/unordered/TestDataFormatterUnordered.py (1504 of 2355) PASS: lldb-unit :: Utility/./UtilityTests/StreamTeeTest.SetStreamAtIndexOverwrite (1505 of 2355) PASS: lldb-shell :: ObjectFile/ELF/PT_LOAD.yaml (1506 of 2355) PASS: lldb-unit :: SymbolFile/NativePDB/./SymbolFileNativePDBTests/PDBFPOProgramToDWARFExpressionTests.InvalidAssignmentSingle (1507 of 2355) PASS: lldb-api :: tools/lldb-vscode/attach/TestVSCode_attach.py (1508 of 2355) UNSUPPORTED: lldb-api :: functionalities/gdb_remote_client/TestQemuAArch64TargetXml.py (1509 of 2355) PASS: lldb-api :: commands/expression/import-std-module/iterator/TestIteratorFromStdModule.py (1510 of 2355) PASS: lldb-unit :: Utility/./UtilityTests/ArgsTest.BareSingleQuote (1511 of 2355) PASS: lldb-unit :: Host/./HostTests/SocketAddressTest.Set (1512 of 2355) PASS: lldb-api :: functionalities/data-formatter/data-formatter-stl/libcxx/list/loop/TestDataFormatterLibcxxListLoop.py (1513 of 2355) PASS: lldb-api :: functionalities/thread/concurrent_events/TestConcurrentManyCrash.py (1514 of 2355) PASS: lldb-unit :: Host/./HostTests/SocketTests/SocketTest.DomainGetConnectURI/ipv4 (1515 of 2355) UNSUPPORTED: lldb-shell :: Register/arm-gp-read.test (1516 of 2355) PASS: lldb-shell :: SymbolFile/DWARF/x86/split-dwarf-inlining.cpp (1517 of 2355) PASS: lldb-unit :: Utility/./UtilityTests/TildeExpressionResolver.ResolveFullPath (1518 of 2355) PASS: lldb-shell :: SymbolFile/Breakpad/unwind-via-stack-win.test (1519 of 2355) PASS: lldb-api :: functionalities/data-formatter/poarray/TestPrintObjectArray.py (1520 of 2355) PASS: lldb-api :: functionalities/postmortem/elf-core/thread_crash/TestLinuxCoreThreads.py (1521 of 2355) PASS: lldb-api :: commands/expression/namespace_local_var_same_name_obj_c/TestNamespaceLocalVarSameNameObjC.py (1522 of 2355) PASS: lldb-api :: lang/objc/objc-struct-return/TestObjCStructReturn.py (1523 of 2355) PASS: lldb-unit :: Utility/./UtilityTests/StringListTest.InsertStringAtIndexOutOfBounds (1524 of 2355) PASS: lldb-unit :: Utility/./UtilityTests/ScalarTest.CastOperations (1525 of 2355) PASS: lldb-api :: lang/c/cpp_keyword_identifiers/TestCppKeywordsAsCIdentifiers.py (1526 of 2355) PASS: lldb-api :: functionalities/data-formatter/data-formatter-stl/libcxx/deque/TestDataFormatterLibcxxDeque.py (1527 of 2355) PASS: lldb-unit :: Expression/./ExpressionTests/DWARFExpression.DW_OP_pick (1528 of 2355) PASS: lldb-unit :: SymbolFile/NativePDB/./SymbolFileNativePDBTests/PDBFPOProgramToDWARFExpressionTests.SingleAssignmentRegisterRef (1529 of 2355) PASS: lldb-api :: functionalities/thread/concurrent_events/TestConcurrentDelaySignalBreak.py (1530 of 2355) PASS: lldb-api :: commands/platform/basic/TestPlatformPython.py (1531 of 2355) PASS: lldb-shell :: SymbolFile/NativePDB/disassembly.cpp (1532 of 2355) PASS: lldb-api :: commands/expression/two-files/TestObjCTypeQueryFromOtherCompileUnit.py (1533 of 2355) UNSUPPORTED: lldb-api :: commands/register/register/aarch64_sve_registers/rw_access_dynamic_resize/TestSVEThreadedDynamic.py (1534 of 2355) PASS: lldb-unit :: Utility/./UtilityTests/AnsiTerminal.Basic (1535 of 2355) PASS: lldb-api :: commands/expression/ir-interpreter/TestIRInterpreter.py (1536 of 2355) PASS: lldb-api :: functionalities/memory/read/TestMemoryRead.py (1537 of 2355) PASS: lldb-unit :: ObjectFile/Breakpad/./ObjectFileBreakpadTests/StackWinRecord.parse (1538 of 2355) PASS: lldb-unit :: Language/Highlighting/./HighlighterTests/HighlighterTest.ClangSquareBrackets (1539 of 2355) PASS: lldb-shell :: Process/TestEnvironment.test (1540 of 2355) PASS: lldb-api :: lang/cpp/call-function/TestCallCPPFunction.py (1541 of 2355) PASS: lldb-api :: lang/cpp/virtual-functions/TestCppVirtualFunctions.py (1542 of 2355) PASS: lldb-unit :: Process/minidump/./LLDBMinidumpTests/MinidumpParserTest.GetMemoryRegionInfo (1543 of 2355) PASS: lldb-unit :: Process/gdb-remote/./ProcessGdbRemoteTests/GDBRemoteClientBaseTest.SendContinueDelegateStructuredDataReceipt (1544 of 2355) PASS: lldb-shell :: ObjectFile/MachO/lc_version_min.yaml (1545 of 2355) PASS: lldb-shell :: SymbolFile/NativePDB/tag-types.cpp (1546 of 2355) PASS: lldb-unit :: Host/./HostTests/FileSystemTest.MakeAbsolute (1547 of 2355) PASS: lldb-unit :: Utility/./UtilityTests/RangeTest.NotEqual (1548 of 2355) PASS: lldb-api :: functionalities/breakpoint/cpp_exception/TestCPPExceptionBreakpoint.py (1549 of 2355) PASS: lldb-api :: lang/cpp/bitfields/TestCppBitfields.py (1550 of 2355) PASS: lldb-api :: functionalities/tail_call_frames/cross_object/TestCrossObjectTailCalls.py (1551 of 2355) PASS: lldb-shell :: SymbolFile/NativePDB/load-pdb.cpp (1552 of 2355) PASS: lldb-api :: functionalities/data-formatter/cstring-utf8-summary/TestCstringUnicode.py (1553 of 2355) PASS: lldb-unit :: Symbol/./SymbolTests/TestClangASTImporter.CompleteFwdDeclWithOtherOrigin (1554 of 2355) PASS: lldb-unit :: Utility/./UtilityTests/StreamTest.Indent (1555 of 2355) PASS: lldb-unit :: Utility/./UtilityTests/UriParserTest.BracketedHostnamePort (1556 of 2355) PASS: lldb-shell :: SymbolFile/DWARF/x86/parallel-indexing-stress.s (1557 of 2355) UNSUPPORTED: lldb-api :: python_api/disassemble-raw-data/TestDisassemble_VST1_64.py (1558 of 2355) PASS: lldb-unit :: Core/./LLDBCoreTests/SourceLocationSpecTest.Compare (1559 of 2355) PASS: lldb-api :: python_api/symbol-context/two-files/TestSymbolContextTwoFiles.py (1560 of 2355) PASS: lldb-api :: functionalities/thread/concurrent_events/TestConcurrentTwoBreakpointsOneWatchpoint.py (1561 of 2355) PASS: lldb-unit :: Utility/./UtilityTests/StringListTest.SplitIntoLinesSingleTrailingCR (1562 of 2355) PASS: lldb-api :: macosx/duplicate-archive-members/TestDuplicateMembers.py (1563 of 2355) PASS: lldb-api :: functionalities/thread/step_until/TestStepUntil.py (1564 of 2355) UNSUPPORTED: lldb-api :: lang/objc/objc-dynamic-value/TestObjCDynamicValue.py (1565 of 2355) PASS: lldb-unit :: Host/./HostTests/SocketTests/SocketTest.TCPListen0ConnectAccept/ipv4 (1566 of 2355) PASS: lldb-api :: commands/session/save/TestSessionSave.py (1567 of 2355) PASS: lldb-api :: python_api/value/TestValueAPI.py (1568 of 2355) PASS: lldb-api :: commands/expression/context-object/TestContextObject.py (1569 of 2355) PASS: lldb-unit :: ScriptInterpreter/Python/./ScriptInterpreterPythonTests/PythonDataObjectsTest.TestModuleNameResolutionNoDot (1570 of 2355) PASS: lldb-unit :: Utility/./UtilityTests/FileSpecTest.Equal (1571 of 2355) PASS: lldb-unit :: Utility/./UtilityTests/DataExtractorTest.GetMaxU64 (1572 of 2355) PASS: lldb-api :: functionalities/load_using_paths/TestLoadUsingPaths.py (1573 of 2355) PASS: lldb-unit :: Utility/./UtilityTests/RangeTest.ContainsEndInclusiveInvalid (1574 of 2355) PASS: lldb-unit :: Symbol/./SymbolTests/TestClangASTImporter.CopyTypeTagDecl (1575 of 2355) PASS: lldb-unit :: Utility/./UtilityTests/LogChannelTest.Disable (1576 of 2355) PASS: lldb-shell :: Driver/TestRepl.test (1577 of 2355) PASS: lldb-unit :: Utility/./UtilityTests/StringListTest.AppendListCStringArray (1578 of 2355) PASS: lldb-api :: functionalities/thread/crash_during_step/TestCrashDuringStep.py (1579 of 2355) PASS: lldb-api :: functionalities/tail_call_frames/inlining_and_tail_calls/TestInliningAndTailCalls.py (1580 of 2355) PASS: lldb-shell :: Driver/TestConvenienceVariables.test (1581 of 2355) PASS: lldb-api :: functionalities/memory/tag/TestMemoryTag.py (1582 of 2355) PASS: lldb-unit :: Utility/./UtilityTests/StringLexerTest.Next (1583 of 2355) PASS: lldb-unit :: Utility/./UtilityTests/StringExtractorTest.GetHexU8_Extra (1584 of 2355) UNSUPPORTED: lldb-api :: functionalities/unwind/ehframe/TestEhFrameUnwind.py (1585 of 2355) PASS: lldb-api :: lang/objc/print-obj/TestPrintObj.py (1586 of 2355) PASS: lldb-unit :: DataFormatter/./LLDBFormatterTests/TypeMatcherTests.CreatedBySameMatchStringExactNamePrefixes (1587 of 2355) PASS: lldb-unit :: Utility/./UtilityTests/UriParserTest.BadPort2 (1588 of 2355) PASS: lldb-api :: functionalities/data-formatter/data-formatter-stl/libcxx/function/TestLibCxxFunction.py (1589 of 2355) PASS: lldb-api :: commands/expression/pr35310/TestExprsBug35310.py (1590 of 2355) PASS: lldb-unit :: SymbolFile/NativePDB/./SymbolFileNativePDBTests/PDBFPOProgramToDWARFExpressionTests.DependencyChain (1591 of 2355) UNSUPPORTED: lldb-api :: functionalities/darwin_log/source/debug/TestDarwinLogSourceDebug.py (1592 of 2355) UNSUPPORTED: lldb-api :: commands/expression/macros/TestMacros.py (1593 of 2355) PASS: lldb-api :: functionalities/data-formatter/data-formatter-caching/TestDataFormatterCaching.py (1594 of 2355) PASS: lldb-unit :: Core/./LLDBCoreTests/FormatEntityTest.DefinitionConstructionNameTypeData (1595 of 2355) UNSUPPORTED: lldb-api :: benchmarks/continue/TestBenchmarkContinue.py (1596 of 2355) PASS: lldb-api :: functionalities/data-formatter/data-formatter-stl/libcxx/atomic/TestLibCxxAtomic.py (1597 of 2355) PASS: lldb-unit :: ScriptInterpreter/Python/./ScriptInterpreterPythonTests/PythonDataObjectsTest.TestCallable (1598 of 2355) PASS: lldb-api :: tools/lldb-server/inferior-crash/TestGdbRemoteSegFault.py (1599 of 2355) PASS: lldb-api :: commands/expression/import-std-module/list/TestListFromStdModule.py (1600 of 2355) PASS: lldb-api :: python_api/sbstructureddata/TestStructuredDataAPI.py (1601 of 2355) UNSUPPORTED: lldb-api :: commands/register/register/intel_xtended_registers/mpx_offset_intersection/TestMPXOffsetIntersection.py (1602 of 2355) PASS: lldb-unit :: Utility/./UtilityTests/OptionsWithRawTest.LeadingSpaceArgs (1603 of 2355) PASS: lldb-unit :: Process/gdb-remote/./ProcessGdbRemoteTests/GDBRemoteCommunicationTest.ReadPacket_checksum (1604 of 2355) PASS: lldb-unit :: Utility/./UtilityTests/StructuredDataTest.ParseJSONFromFile (1605 of 2355) PASS: lldb-api :: commands/expression/formatters/TestFormatters.py (1606 of 2355) PASS: lldb-unit :: Host/./HostTests/FileSystemTest.OpenErrno (1607 of 2355) PASS: lldb-unit :: Utility/./UtilityTests/RangeTest.NotEqualInvalid (1608 of 2355) PASS: lldb-unit :: Utility/./UtilityTests/ConstStringTest.YAML (1609 of 2355) PASS: lldb-api :: commands/expression/ignore-artificial-constructors/TestIgnoreArtificialConstructors.py (1610 of 2355) PASS: lldb-unit :: Host/./HostTests/PipeTest.OpenAsReader (1611 of 2355) PASS: lldb-api :: functionalities/breakpoint/breakpoint_options/TestBreakpointOptions.py (1612 of 2355) PASS: lldb-api :: commands/expression/test/TestExprs.py (1613 of 2355) PASS: lldb-unit :: UnwindAssembly/x86/./UnwindAssemblyx86Tests/Testx86AssemblyInspectionEngine.TestPopRBX (1614 of 2355) PASS: lldb-unit :: Utility/./UtilityTests/StringListTest.ShiftCString (1615 of 2355) PASS: lldb-unit :: Utility/./UtilityTests/StringListTest.ForRangeEmpty (1616 of 2355) PASS: lldb-unit :: Interpreter/./InterpreterTests/CompletionTest.DirCompletionUsername (1617 of 2355) PASS: lldb-unit :: Utility/./UtilityTests/ArgsTest.ReplaceArgumentAtIndexLonger (1618 of 2355) PASS: lldb-api :: lang/c/anonymous/TestAnonymous.py (1619 of 2355) PASS: lldb-unit :: Utility/./UtilityTests/RangeTest.ClearWithStarAddress (1620 of 2355) PASS: lldb-unit :: UnwindAssembly/x86/./UnwindAssemblyx86Tests/Testx86AssemblyInspectionEngine.TestPushEDI (1621 of 2355) PASS: lldb-shell :: Driver/TestUseColor.test (1622 of 2355) PASS: lldb-unit :: Utility/./UtilityTests/ArchSpecTest.Compatibility (1623 of 2355) UNSUPPORTED: lldb-shell :: ScriptInterpreter/Lua/breakpoint_oneline_callback.test (1624 of 2355) PASS: lldb-unit :: Utility/./UtilityTests/ScalarTest.ExtractBitfield (1625 of 2355) PASS: lldb-unit :: Host/./HostTests/NativeProcessProtocolTest.ReadCStringFromMemory (1626 of 2355) PASS: lldb-unit :: Utility/./UtilityTests/ScalarTest.SetValueFromCString (1627 of 2355) PASS: lldb-api :: lang/c/unions/TestUnionMembers.py (1628 of 2355) PASS: lldb-api :: commands/target/auto-install-main-executable/TestAutoInstallMainExecutable.py (1629 of 2355) PASS: lldb-unit :: Utility/./UtilityTests/Flags.AnyClear (1630 of 2355) UNSUPPORTED: lldb-shell :: Unwind/eh-frame-small-fde.test (1631 of 2355) PASS: lldb-unit :: Platform/./LLDBPlatformTests/PlatformDarwinTest.FindComponentInPath (1632 of 2355) PASS: lldb-api :: commands/expression/import-std-module/basic/TestImportStdModule.py (1633 of 2355) PASS: lldb-unit :: Utility/./UtilityTests/StreamTest.PutRawBytesToLittleEndian (1634 of 2355) PASS: lldb-shell :: ObjectFile/PECOFF/dep-modules.yaml (1635 of 2355) PASS: lldb-unit :: Language/Highlighting/./HighlighterTests/HighlighterTest.DefaultHighlighterWithCursor (1636 of 2355) XFAIL: lldb-shell :: SymbolFile/DWARF/find-type-in-function.cpp (1637 of 2355) PASS: lldb-unit :: Expression/./ExpressionTests/DWARFExpressionMockProcessTest.DW_OP_deref (1638 of 2355) UNSUPPORTED: lldb-api :: tools/lldb-vscode/disconnect/TestVSCode_disconnect.py (1639 of 2355) PASS: lldb-unit :: Utility/./UtilityTests/StringExtractorTest.GetNameColonValueContainsColon (1640 of 2355) PASS: lldb-api :: commands/frame/diagnose/complicated-expression/TestComplicatedExpression.py (1641 of 2355) PASS: lldb-unit :: Utility/./UtilityTests/ArgsTest.ReplaceArgumentAtIndexEqual (1642 of 2355) UNSUPPORTED: lldb-api :: commands/watchpoints/multi_watchpoint_slots/TestWatchpointMultipleSlots.py (1643 of 2355) PASS: lldb-unit :: Utility/./UtilityTests/BinaryStreamTest.PutULEB128FourBytes (1644 of 2355) PASS: lldb-unit :: Utility/./UtilityTests/XcodeSDKTest.ParseTest (1645 of 2355) PASS: lldb-unit :: Expression/./ExpressionTests/CppModuleConfigurationTest.AmbiguousLibCpp (1646 of 2355) XFAIL: lldb-shell :: Register/x86-mm-xmm-read.test (1647 of 2355) UNSUPPORTED: lldb-api :: macosx/macCatalystAppMacOSFramework/TestMacCatalystAppWithMacOSFramework.py (1648 of 2355) PASS: lldb-shell :: Reproducer/TestFinalize.test (1649 of 2355) PASS: lldb-unit :: UnwindAssembly/x86/./UnwindAssemblyx86Tests/Testx86AssemblyInspectionEngine.TestSpillRegToStackViaMOVx86_64 (1650 of 2355) PASS: lldb-api :: lang/objc/modules-objc-property/TestModulesObjCProperty.py (1651 of 2355) PASS: lldb-api :: functionalities/thread/concurrent_events/TestConcurrentSignalDelayWatch.py (1652 of 2355) PASS: lldb-unit :: UnwindAssembly/x86/./UnwindAssemblyx86Tests/Testx86AssemblyInspectionEngine.TestPopR15 (1653 of 2355) PASS: lldb-api :: commands/expression/unwind_expression/TestUnwindExpression.py (1654 of 2355) PASS: lldb-unit :: Language/Highlighting/./HighlighterTests/HighlighterTest.ClangCursorOutOfBounds (1655 of 2355) PASS: lldb-api :: functionalities/gdb_remote_client/TestWriteMemory.py (1656 of 2355) PASS: lldb-api :: lang/c/inlines/TestRedefinitionsInInlines.py (1657 of 2355) PASS: lldb-api :: lang/cpp/typedef/TestCppTypedef.py (1658 of 2355) PASS: lldb-unit :: Utility/./UtilityTests/BinaryStreamTest.PutSLEB128Zero (1659 of 2355) PASS: lldb-unit :: Symbol/./SymbolTests/TestTypeSystemClang.TestRecordHasFields (1660 of 2355) PASS: lldb-api :: lang/cpp/reference-to-outer-type/TestCppReferenceToOuterClass.py (1661 of 2355) PASS: lldb-unit :: Host/./HostTests/ConnectionFileDescriptorTest.TCPGetURIv4 (1662 of 2355) PASS: lldb-api :: python_api/get-value-32bit-int/TestGetValue32BitInt.py (1663 of 2355) PASS: lldb-unit :: DataFormatter/./LLDBFormatterTests/TypeMatcherTests.GetMatchStringRegex (1664 of 2355) UNSUPPORTED: lldb-shell :: Register/x86-gp-read.test (1665 of 2355) PASS: lldb-api :: commands/watchpoints/watchpoint_events/TestWatchpointEvents.py (1666 of 2355) PASS: lldb-unit :: Host/./HostTests/FileSystemTest.GetByteSize (1667 of 2355) UNSUPPORTED: lldb-shell :: Process/Windows/exception_access_violation.cpp (1668 of 2355) PASS: lldb-api :: python_api/sbplatform/TestSBPlatform.py (1669 of 2355) PASS: lldb-unit :: Utility/./UtilityTests/RangeTest.Union (1670 of 2355) PASS: lldb-api :: commands/expression/options/TestExprOptions.py (1671 of 2355) PASS: lldb-api :: functionalities/thread/thread_exit/TestThreadExit.py (1672 of 2355) PASS: lldb-api :: tools/lldb-server/inferior-crash/TestGdbRemoteAbort.py (1673 of 2355) PASS: lldb-api :: functionalities/thread/concurrent_events/TestConcurrentSignalBreak.py (1674 of 2355) PASS: lldb-api :: python_api/watchpoint/TestSetWatchpoint.py (1675 of 2355) PASS: lldb-unit :: Language/Highlighting/./HighlighterTests/HighlighterTest.ClangCursorPosAfterOtherToken (1676 of 2355) PASS: lldb-unit :: Utility/./UtilityTests/RangeVector.CombineConsecutiveRanges (1677 of 2355) PASS: lldb-unit :: Utility/./UtilityTests/StringExtractorTest.DecodeHexU8_Underflow (1678 of 2355) PASS: lldb-unit :: Utility/./UtilityTests/DeserializerTest.HasData (1679 of 2355) PASS: lldb-api :: commands/expression/fixits/TestFixIts.py (1680 of 2355) PASS: lldb-unit :: Host/./HostTests/SocketTests/SocketTest.UDPConnect/ipv4 (1681 of 2355) PASS: lldb-unit :: Utility/./UtilityTests/XcodeSDKTest.GetSDKTypeForTriple (1682 of 2355) PASS: lldb-unit :: Utility/./UtilityTests/ConstStringTest.CompareStringRef (1683 of 2355) UNSUPPORTED: lldb-shell :: Register/aarch64-gp-read.test (1684 of 2355) PASS: lldb-shell :: ObjectFile/wasm/unified-debug-sections.yaml (1685 of 2355) PASS: lldb-api :: lang/objc/bitfield_ivars/TestBitfieldIvars.py (1686 of 2355) PASS: lldb-unit :: Utility/./UtilityTests/CompletionRequest.TryCompleteCurrentArgBad (1687 of 2355) PASS: lldb-unit :: Utility/./UtilityTests/ArgsTest.TestSingleArgWithQuotedSpace (1688 of 2355) PASS: lldb-unit :: Utility/./UtilityTests/IndexToObjectTest.ObjectForIndex (1689 of 2355) PASS: lldb-unit :: Host/./HostTests/MainLoopTest.ReadObject (1690 of 2355) PASS: lldb-unit :: Expression/./ExpressionTests/ClangHostTest.MacOSX (1691 of 2355) PASS: lldb-api :: lang/objcxx/cpp_keywords_enabled/TestObjCppKeywordsEnabled.py (1692 of 2355) PASS: lldb-api :: lang/c/enum_types/TestEnumTypes.py (1693 of 2355) PASS: lldb-api :: functionalities/data-formatter/data-formatter-objc/cmtime/TestDataFormatterCMTime.py (1694 of 2355) PASS: lldb-unit :: Utility/./UtilityTests/LogChannelEnabledTest.log_options (1695 of 2355) PASS: lldb-api :: functionalities/jitloader_gdb/TestJITLoaderGDB.py (1696 of 2355) PASS: lldb-api :: commands/expression/import-std-module/deque-basic/TestDequeFromStdModule.py (1697 of 2355) PASS: lldb-api :: commands/command/delete/TestCommandDelete.py (1698 of 2355) PASS: lldb-unit :: ScriptInterpreter/Python/./ScriptInterpreterPythonTests/PythonDataObjectsTest.TestExtractingUInt64ThroughStructuredData (1699 of 2355) PASS: lldb-unit :: Utility/./UtilityTests/TimerTest.CategoryTimes (1700 of 2355) PASS: lldb-api :: functionalities/breakpoint/breakpoint_hit_count/TestBreakpointHitCount.py (1701 of 2355) PASS: lldb-shell :: Register/Core/x86-64-netbsd-fp.test (1702 of 2355) PASS: lldb-unit :: Expression/./ExpressionTests/CppModuleConfigurationTest.IgnoreLibStdCpp (1703 of 2355) PASS: lldb-api :: functionalities/data-formatter/nssetsynth/TestNSSetSynthetic.py (1704 of 2355) UNSUPPORTED: lldb-api :: functionalities/darwin_log/filter/exact_match/activity-chain/TestDarwinLogFilterMatchActivityChain.py (1705 of 2355) PASS: lldb-shell :: VSCode/TestOptions.test (1706 of 2355) PASS: lldb-api :: commands/frame/var/TestFrameVar.py (1707 of 2355) PASS: lldb-unit :: Expression/./ExpressionTests/ClangExpressionDeclMapTest.TestPersistentDeclLookup (1708 of 2355) PASS: lldb-unit :: Process/minidump/./LLDBMinidumpTests/MinidumpParserTest.GetPidWindows (1709 of 2355) PASS: lldb-api :: functionalities/data-formatter/data-formatter-objc/TestDataFormatterObjCKVO.py (1710 of 2355) PASS: lldb-unit :: UnwindAssembly/x86/./UnwindAssemblyx86Tests/Testx86AssemblyInspectionEngine.TestPushImm (1711 of 2355) PASS: lldb-api :: lang/cpp/pointer_to_member_type_depending_on_parent_size/TestPointerToMemberTypeDependingOnParentSize.py (1712 of 2355) PASS: lldb-api :: functionalities/thread/concurrent_events/TestConcurrentTwoWatchpointsOneSignal.py (1713 of 2355) PASS: lldb-api :: functionalities/thread/exit_during_break/TestExitDuringBreak.py (1714 of 2355) PASS: lldb-unit :: Utility/./UtilityTests/AnsiTerminal.AtEnd (1715 of 2355) PASS: lldb-shell :: SymbolFile/DWARF/x86/find-variable-file.cpp (1716 of 2355) PASS: lldb-api :: functionalities/thread/concurrent_events/TestConcurrentWatchBreak.py (1717 of 2355) PASS: lldb-shell :: Reproducer/TestVersionCheck.test (1718 of 2355) PASS: lldb-api :: types/TestRecursiveTypes.py (1719 of 2355) PASS: lldb-unit :: UnwindAssembly/x86/./UnwindAssemblyx86Tests/Testx86AssemblyInspectionEngine.TestPopRBP (1720 of 2355) PASS: lldb-api :: functionalities/conditional_break/TestConditionalBreak.py (1721 of 2355) PASS: lldb-unit :: Language/Highlighting/./HighlighterTests/HighlighterTest.FallbackHighlighter (1722 of 2355) PASS: lldb-shell :: BuildScript/compiler-full-path.test (1723 of 2355) PASS: lldb-api :: python_api/debugger/TestDebuggerAPI.py (1724 of 2355) PASS: lldb-unit :: Core/./LLDBCoreTests/FormatEntityTest.DefinitionConstructionNameAndType (1725 of 2355) PASS: lldb-api :: lang/cpp/template-arguments/TestCppTemplateArguments.py (1726 of 2355) PASS: lldb-api :: tools/lldb-server/TestGdbRemoteSingleStep.py (1727 of 2355) PASS: lldb-shell :: ScriptInterpreter/Python/scripted_breakpoint_lua.test (1728 of 2355) UNSUPPORTED: lldb-api :: linux/add-symbols/TestTargetSymbolsAddCommand.py (1729 of 2355) PASS: lldb-unit :: Utility/./UtilityTests/StreamTest.PutBytesAsRawHex8ToMixedEndian (1730 of 2355) PASS: lldb-api :: tools/lldb-vscode/stackTrace/TestVSCode_stackTrace.py (1731 of 2355) PASS: lldb-shell :: ScriptInterpreter/Python/sb_address_exception.test (1732 of 2355) XFAIL: lldb-shell :: Expr/nodefaultlib.cpp (1733 of 2355) PASS: lldb-api :: functionalities/data-formatter/data-formatter-synthval/TestDataFormatterSynthVal.py (1734 of 2355) PASS: lldb-shell :: Breakpoint/breakpoint-command.test (1735 of 2355) PASS: lldb-unit :: Core/./LLDBCoreTests/RichManglingContextTest.Basic (1736 of 2355) PASS: lldb-api :: lang/c/set_values/TestSetValues.py (1737 of 2355) PASS: lldb-api :: commands/expression/persist_objc_pointeetype/TestPersistObjCPointeeType.py (1738 of 2355) PASS: lldb-unit :: Process/gdb-remote/./ProcessGdbRemoteTests/PortMapTest.AllowPort (1739 of 2355) PASS: lldb-api :: commands/watchpoints/watchpoint_commands/condition/TestWatchpointConditionCmd.py (1740 of 2355) PASS: lldb-api :: arm/emulation/TestEmulations.py (1741 of 2355) PASS: lldb-api :: functionalities/process_crash_info/TestProcessCrashInfo.py (1742 of 2355) PASS: lldb-unit :: Utility/./UtilityTests/StreamTest.ShiftOperatorPtr (1743 of 2355) PASS: lldb-unit :: Utility/./UtilityTests/ArgsTest.StringListConstructor (1744 of 2355) UNSUPPORTED: lldb-shell :: SymbolFile/PDB/expressions.test (1745 of 2355) PASS: lldb-api :: commands/expression/unicode-in-variable/TestUnicodeInVariable.py (1746 of 2355) PASS: lldb-api :: lang/cpp/std-function-step-into-callable/TestStdFunctionStepIntoCallable.py (1747 of 2355) PASS: lldb-shell :: Commands/command-breakpoint-col.test (1748 of 2355) PASS: lldb-unit :: Utility/./UtilityTests/StringExtractorTest.GetHexU8_Underflow2_NoEof (1749 of 2355) PASS: lldb-shell :: ObjectFile/ELF/avr-basic-info.yaml (1750 of 2355) PASS: lldb-shell :: SymbolFile/DWARF/x86/find-basic-function.cpp (1751 of 2355) UNSUPPORTED: lldb-shell :: SymbolFile/PDB/type-quals.test (1752 of 2355) PASS: lldb-shell :: Breakpoint/debug_addrx.test (1753 of 2355) PASS: lldb-unit :: tools/lldb-server/tests/./LLDBServerTests/TestBase.LaunchModePreservesEnvironment (1754 of 2355) PASS: lldb-unit :: Utility/./UtilityTests/VMRange.IsValid (1755 of 2355) PASS: lldb-unit :: Host/./HostTests/NativeProcessProtocolTest.SetBreakpointFailVerify (1756 of 2355) PASS: lldb-api :: python_api/frame/get-variables/TestGetVariables.py (1757 of 2355) PASS: lldb-api :: functionalities/gdb_remote_client/TestThreadSelectionBug.py (1758 of 2355) PASS: lldb-api :: tools/lldb-vscode/console/TestVSCode_redirection_to_console.py (1759 of 2355) UNSUPPORTED: lldb-shell :: SymbolFile/Breakpad/stack-cfi-arm.yaml (1760 of 2355) PASS: lldb-unit :: Host/./HostTests/MainLoopTest.TerminatesImmediately (1761 of 2355) PASS: lldb-unit :: Utility/./UtilityTests/ReproducerTest.SetCapture (1762 of 2355) PASS: lldb-unit :: Utility/./UtilityTests/ArgsTest.TestInsertArg (1763 of 2355) PASS: lldb-shell :: SymbolFile/DWARF/x86/win-i386-line-table.s (1764 of 2355) PASS: lldb-api :: lang/cpp/const_this/TestConstThis.py (1765 of 2355) PASS: lldb-shell :: Driver/TestHelp.test (1766 of 2355) PASS: lldb-shell :: SymbolFile/DWARF/x86/DW_AT_location-DW_AT_const_value.s (1767 of 2355) PASS: lldb-unit :: Utility/./UtilityTests/ConstStringTest.FromMidOfBufferStringRef (1768 of 2355) PASS: lldb-api :: python_api/process/read-mem-cstring/TestReadMemCString.py (1769 of 2355) PASS: lldb-api :: functionalities/data-formatter/data-formatter-stl/libcxx/vbool/TestDataFormatterLibcxxVBool.py (1770 of 2355) PASS: lldb-api :: lang/cpp/nested-class-other-compilation-unit/TestNestedClassWithParentInAnotherCU.py (1771 of 2355) PASS: lldb-unit :: Utility/./UtilityTests/StringListTest.JoinSingle (1772 of 2355) PASS: lldb-unit :: Utility/./UtilityTests/ScalarTest.Division (1773 of 2355) PASS: lldb-shell :: Minidump/Windows/find-module.test (1774 of 2355) PASS: lldb-api :: functionalities/value_md5_crash/TestValueMD5Crash.py (1775 of 2355) PASS: lldb-api :: functionalities/data-formatter/summary-string-onfail/Test-rdar-9974002.py (1776 of 2355) PASS: lldb-api :: functionalities/tail_call_frames/disambiguate_tail_call_seq/TestDisambiguateTailCallSeq.py (1777 of 2355) PASS: lldb-unit :: Utility/./UtilityTests/StreamTeeTest.DefaultConstructor (1778 of 2355) PASS: lldb-unit :: Host/./HostTests/NativeProcessProtocolTest.ReadCStringFromMemory_CrossPageBoundary (1779 of 2355) PASS: lldb-api :: lang/cpp/class-template-parameter-pack/TestClassTemplateParameterPack.py (1780 of 2355) UNSUPPORTED: lldb-api :: benchmarks/libcxxmap/TestBenchmarkLibcxxMap.py (1781 of 2355) PASS: lldb-unit :: Editline/./EditlineTests/EditlineTestFixture.EditlineReceivesSingleLineText (1782 of 2355) PASS: lldb-api :: functionalities/data-formatter/compactvectors/TestCompactVectors.py (1783 of 2355) UNSUPPORTED: lldb-api :: functionalities/data-formatter/data-formatter-stl/libstdcpp/iterator/TestDataFormatterStdIterator.py (1784 of 2355) PASS: lldb-unit :: Language/Highlighting/./HighlighterTests/HighlighterTest.ClangTrailingBackslashBeforeNewline (1785 of 2355) PASS: lldb-shell :: SymbolFile/DWARF/x86/DW_OP_piece-struct.s (1786 of 2355) PASS: lldb-api :: tools/lldb-server/memory-allocation/TestGdbRemoteMemoryAllocation.py (1787 of 2355) PASS: lldb-api :: functionalities/show_location/TestShowLocationDwarf5.py (1788 of 2355) PASS: lldb-api :: functionalities/signal/raise/TestRaise.py (1789 of 2355) PASS: lldb-unit :: Core/./LLDBCoreTests/CommunicationTest.SynchronizeWhileClosing (1790 of 2355) PASS: lldb-shell :: Breakpoint/jit-loader_jitlink_elf.test (1791 of 2355) PASS: lldb-api :: commands/settings/use_source_cache/TestUseSourceCache.py (1792 of 2355) PASS: lldb-unit :: Host/./HostTests/SocketTests/SocketTest.TCPGetAddress/ipv4 (1793 of 2355) PASS: lldb-unit :: Language/Highlighting/./HighlighterTests/HighlighterTest.ClangIdentifiers (1794 of 2355) PASS: lldb-shell :: ScriptInterpreter/Python/command_relative_import.test (1795 of 2355) PASS: lldb-api :: lang/objc/single-entry-dictionary/TestObjCSingleEntryDictionary.py (1796 of 2355) PASS: lldb-shell :: Register/x86-64-read.test (1797 of 2355) PASS: lldb-unit :: Interpreter/./InterpreterTests/OptionValueArgs.DeepCopy (1798 of 2355) PASS: lldb-shell :: SymbolFile/Breakpad/line-table-discontinuous-file-ids.test (1799 of 2355) PASS: lldb-api :: functionalities/data-formatter/data-formatter-synthtype/TestDataFormatterSynthType.py (1800 of 2355) PASS: lldb-api :: functionalities/rerun/TestRerun.py (1801 of 2355) PASS: lldb-unit :: Utility/./UtilityTests/UriParserTest.BracketedHostnameWithPortIPv4 (1802 of 2355) PASS: lldb-api :: functionalities/data-formatter/data-formatter-categories/TestDataFormatterCategories.py (1803 of 2355) PASS: lldb-unit :: Utility/./UtilityTests/FileSpecTest.PrependPathComponent (1804 of 2355) PASS: lldb-unit :: Utility/./UtilityTests/BinaryStreamTest.PutULEB128One (1805 of 2355) PASS: lldb-api :: functionalities/data-formatter/varscript_formatting/TestDataFormatterVarScriptFormatting.py (1806 of 2355) PASS: lldb-api :: functionalities/data-formatter/data-formatter-proper-plurals/TestFormattersOneIsSingular.py (1807 of 2355) XFAIL: lldb-shell :: Register/x86-64-fp-write.test (1808 of 2355) PASS: lldb-shell :: Breakpoint/split-dwarf5-debug-stroffsets.test (1809 of 2355) PASS: lldb-api :: python_api/sblaunchinfo/TestSBLaunchInfo.py (1810 of 2355) PASS: lldb-api :: python_api/signals/TestSignalsAPI.py (1811 of 2355) PASS: lldb-unit :: Utility/./UtilityTests/BinaryStreamTest.PutSLEB128EightBytes (1812 of 2355) PASS: lldb-api :: lang/cpp/symbols/TestSymbols.py (1813 of 2355) PASS: lldb-api :: commands/command/script/import/TestImport.py (1814 of 2355) PASS: lldb-shell :: Driver/TestCore.test (1815 of 2355) PASS: lldb-shell :: SymbolFile/DWARF/x86/DW_AT_declaration-with-children.s (1816 of 2355) UNSUPPORTED: lldb-api :: commands/gui/viewlarge/TestGuiViewLarge.py (1817 of 2355) PASS: lldb-api :: functionalities/find-line-entry/TestFindLineEntry.py (1818 of 2355) PASS: lldb-unit :: Utility/./UtilityTests/UriParserTest.BracketedHostnameWithColon (1819 of 2355) PASS: lldb-unit :: Utility/./UtilityTests/ScalarTest.APIntConstructor (1820 of 2355) PASS: lldb-shell :: SymbolFile/DWARF/x86/find-basic-namespace.cpp (1821 of 2355) PASS: lldb-api :: lang/cpp/non-type-template-param/TestCppNonTypeTemplateParam.py (1822 of 2355) XFAIL: lldb-shell :: Register/x86-mm-xmm-write.test (1823 of 2355) PASS: lldb-unit :: Host/./HostTests/Host.GetEnvironment (1824 of 2355) PASS: lldb-unit :: Host/./HostTests/MainLoopTest.TwoSignalCallbacks (1825 of 2355) PASS: lldb-shell :: ObjectFile/PECOFF/basic-info-arm.yaml (1826 of 2355) UNSUPPORTED: lldb-api :: lang/objc/rdar-12408181/TestRdar12408181.py (1827 of 2355) PASS: lldb-unit :: Language/Highlighting/./HighlighterTests/HighlighterTest.ClangPreserveNewLine (1828 of 2355) PASS: lldb-unit :: Utility/./UtilityTests/UUIDTest.Validity (1829 of 2355) UNSUPPORTED: lldb-shell :: Reproducer/TestLuaImport.test (1830 of 2355) UNSUPPORTED: lldb-api :: commands/gui/breakpoints/TestGuiBreakpoints.py (1831 of 2355) PASS: lldb-api :: lang/c/forward/TestForwardDeclaration.py (1832 of 2355) PASS: lldb-unit :: SymbolFile/NativePDB/./SymbolFileNativePDBTests/PDBFPOProgramToDWARFExpressionTests.UnresolvedCyclicRegisterAssignmentReference (1833 of 2355) PASS: lldb-unit :: Utility/./UtilityTests/UriParserTest.LongPath (1834 of 2355) PASS: lldb-api :: functionalities/source-map/TestTargetSourceMap.py (1835 of 2355) PASS: lldb-api :: commands/expression/import-std-module/unique_ptr-dbg-info-content/TestUniquePtrDbgInfoContent.py (1836 of 2355) UNSUPPORTED: lldb-api :: functionalities/data-formatter/data-formatter-stl/libstdcpp/vector/TestDataFormatterStdVector.py (1837 of 2355) PASS: lldb-api :: commands/expression/import_builtin_fileid/TestImportBuiltinFileID.py (1838 of 2355) PASS: lldb-shell :: SymbolFile/Breakpad/line-table-edgecases.test (1839 of 2355) PASS: lldb-shell :: Register/x86-64-gp-read.test (1840 of 2355) PASS: lldb-shell :: Minidump/breakpad-symbols.test (1841 of 2355) PASS: lldb-unit :: Host/./HostTests/NativeProcessProtocolTest.ReadMemoryWithoutTrap (1842 of 2355) PASS: lldb-unit :: Process/gdb-remote/./ProcessGdbRemoteTests/GDBRemoteClientBaseTest.SendContinueAndLateInterrupt (1843 of 2355) PASS: lldb-shell :: ObjectFile/ELF/PT_LOAD-overlap-PT_TLS.yaml (1844 of 2355) PASS: lldb-unit :: Utility/./UtilityTests/StreamTeeTest.AppendStream (1845 of 2355) PASS: lldb-unit :: Utility/./UtilityTests/ArgsTest.TestQuotedTrailingBackslash (1846 of 2355) PASS: lldb-shell :: ObjectFile/ELF/null-jmprel.yaml (1847 of 2355) PASS: lldb-unit :: Language/Highlighting/./HighlighterTests/HighlighterTest.HighlighterSelectionPath (1848 of 2355) UNSUPPORTED: lldb-shell :: BuildScript/toolchain-msvc.test (1849 of 2355) PASS: lldb-shell :: ObjectFile/Breakpad/uuid-matching-mac.test (1850 of 2355) PASS: lldb-unit :: SymbolFile/DWARF/./SymbolFileDWARFTests/SymbolFileDWARFTests.ParseArangesSkipErrors (1851 of 2355) PASS: lldb-api :: functionalities/thread/backtrace_limit/TestBacktraceLimit.py (1852 of 2355) PASS: lldb-unit :: ScriptInterpreter/Python/./ScriptInterpreterPythonTests/PythonDataObjectsTest.TestPythonTupleSize (1853 of 2355) PASS: lldb-unit :: Utility/./UtilityTests/VASprintfTest.BufferResize (1854 of 2355) PASS: lldb-unit :: Host/./HostTests/NativeProcessProtocolTest.SetBreakpointFailRead (1855 of 2355) PASS: lldb-unit :: Process/Utility/./ProcessUtilityTests/ProcSMapTests/LinuxProcSMapsTestFixture.ParseSMapRegions/8 (1856 of 2355) PASS: lldb-api :: commands/expression/codegen-crash-import-def-arraytype-element/TestImportDefinitionArrayType.py (1857 of 2355) PASS: lldb-api :: functionalities/breakpoint/breakpoint_locations/TestBreakpointLocations.py (1858 of 2355) UNSUPPORTED: lldb-api :: commands/register/register/aarch64_dynamic_regset/TestArm64DynamicRegsets.py (1859 of 2355) PASS: lldb-api :: functionalities/avoids-fd-leak/TestFdLeak.py (1860 of 2355) PASS: lldb-api :: api/multiple-targets/TestMultipleTargets.py (1861 of 2355) PASS: lldb-unit :: Utility/./UtilityTests/StringListTest.InsertStringAtIndexStart (1862 of 2355) PASS: lldb-unit :: Utility/./UtilityTests/SerializationRountripTest.SerializeDeserializeCStringArray (1863 of 2355) PASS: lldb-api :: functionalities/postmortem/netbsd-core/TestNetBSDCore.py (1864 of 2355) PASS: lldb-unit :: Utility/./UtilityTests/LogTest.Unregister (1865 of 2355) PASS: lldb-shell :: SymbolFile/DWARF/x86/dwp-debug-types.s (1866 of 2355) PASS: lldb-unit :: Utility/./UtilityTests/EnvironmentTest.EnvpConstruction (1867 of 2355) PASS: lldb-unit :: Target/./TargetTests/PathMappingListTest.RelativeTests (1868 of 2355) PASS: lldb-unit :: Language/CPlusPlus/./LanguageCPlusPlusTests/CPlusPlusLanguage.MethodNameParsing (1869 of 2355) PASS: lldb-unit :: Utility/./UtilityTests/ArchSpecTest.TestParseMachCPUDashSubtypeTripleExtra (1870 of 2355) PASS: lldb-shell :: SymbolFile/NativePDB/s_constant.cpp (1871 of 2355) UNSUPPORTED: lldb-shell :: ScriptInterpreter/Lua/io.test (1872 of 2355) PASS: lldb-shell :: Expr/TestIRMemoryMap.test (1873 of 2355) PASS: lldb-shell :: SymbolFile/DWARF/x86/dwarf5_tu_index_abbrev_offset.s (1874 of 2355) PASS: lldb-api :: commands/expression/call-function/TestCallStopAndContinue.py (1875 of 2355) PASS: lldb-api :: functionalities/data-formatter/data-formatter-stl/libcxx/optional/TestDataFormatterLibcxxOptional.py (1876 of 2355) PASS: lldb-api :: commands/watchpoints/watchpoint_on_vectors/TestValueOfVectorVariable.py (1877 of 2355) PASS: lldb-shell :: Minidump/fb-dump.test (1878 of 2355) PASS: lldb-unit :: SymbolFile/DWARF/./SymbolFileDWARFTests/SymbolFileDWARFTests.ParseArangesIgnoreEmpty (1879 of 2355) PASS: lldb-unit :: Signals/./SignalsTests/UnixSignalsTest.Iteration (1880 of 2355) PASS: lldb-api :: functionalities/target-new-solib-notifications/TestModuleLoadedNotifys.py (1881 of 2355) PASS: lldb-api :: tools/lldb-vscode/module/TestVSCode_module.py (1882 of 2355) PASS: lldb-api :: commands/expression/import-std-module/weak_ptr/TestWeakPtrFromStdModule.py (1883 of 2355) PASS: lldb-shell :: Breakpoint/debug_rnglist_offset_pair.test (1884 of 2355) PASS: lldb-unit :: UnwindAssembly/x86/./UnwindAssemblyx86Tests/Testx86AssemblyInspectionEngine.TestPushECX (1885 of 2355) PASS: lldb-unit :: UnwindAssembly/x86/./UnwindAssemblyx86Tests/Testx86AssemblyInspectionEngine.TestCALLNextInsn (1886 of 2355) PASS: lldb-unit :: Editline/./EditlineTests/EditlineTestFixture.EditlineReceivesMultiLineText (1887 of 2355) PASS: lldb-api :: tools/lldb-vscode/console/TestVSCode_console.py (1888 of 2355) UNSUPPORTED: lldb-shell :: Subprocess/clone-follow-parent.test (1889 of 2355) PASS: lldb-unit :: Utility/./UtilityTests/StringListTest.ShiftMove (1890 of 2355) PASS: lldb-unit :: Utility/./UtilityTests/GeneratorTest.YamlMultiProvider (1891 of 2355) PASS: lldb-api :: types/TestFloatTypes.py (1892 of 2355) PASS: lldb-unit :: Utility/./UtilityTests/OptionsWithRawTest.ArgsButNoDelimiter (1893 of 2355) PASS: lldb-api :: functionalities/postmortem/elf-core/gcore/TestGCore.py (1894 of 2355) PASS: lldb-unit :: ScriptInterpreter/Python/./ScriptInterpreterPythonTests/PythonDataObjectsTest.TestPythonIntegerToStructuredInteger (1895 of 2355) PASS: lldb-unit :: Utility/./UtilityTests/RecordReplayTest.ValidSequence (1896 of 2355) PASS: lldb-shell :: Quit/TestQuitExitCodeTooManyArgs.test (1897 of 2355) PASS: lldb-unit :: Utility/./UtilityTests/RangeTest.Slide (1898 of 2355) PASS: lldb-api :: test_utils/TestPExpectTest.py (1899 of 2355) PASS: lldb-unit :: UnwindAssembly/x86/./UnwindAssemblyx86Tests/Testx86AssemblyInspectionEngine.TestPopEDI (1900 of 2355) PASS: lldb-unit :: Utility/./UtilityTests/UriParserTest.SchemeHostSeparator2 (1901 of 2355) PASS: lldb-unit :: Utility/./UtilityTests/StringExtractorTest.GetHexU8_InvalidHex (1902 of 2355) XFAIL: lldb-shell :: Register/x86-fp-write.test (1903 of 2355) PASS: lldb-shell :: SymbolFile/DWARF/x86/childless-compile-unit.s (1904 of 2355) UNSUPPORTED: lldb-shell :: SymbolFile/dissassemble-entry-point.s (1905 of 2355) PASS: lldb-unit :: debugserver/./debugserverTests/RNBSocket.LoopBackConnectIPv4 (1906 of 2355) PASS: lldb-api :: functionalities/breakpoint/source_regexp/TestSourceRegexBreakpoints.py (1907 of 2355) PASS: lldb-shell :: SymbolFile/DWARF/x86/compilercontext.ll (1908 of 2355) PASS: lldb-unit :: Host/./HostTests/SocketTests/SocketTest.TCPGetAddress/ipv6 (1909 of 2355) PASS: lldb-unit :: Host/./HostTests/SocketTests/SocketTest.TCPListen0ConnectAccept/ipv6 (1910 of 2355) PASS: lldb-api :: macosx/indirect_symbol/TestIndirectSymbols.py (1911 of 2355) PASS: lldb-unit :: Utility/./UtilityTests/StringListTest.GetMaxStringLengthEmpty (1912 of 2355) PASS: lldb-api :: functionalities/breakpoint/breakpoint_names/TestBreakpointNames.py (1913 of 2355) PASS: lldb-api :: lang/c/strings/TestCStrings.py (1914 of 2355) PASS: lldb-unit :: Utility/./UtilityTests/RangeTest.ContainsAddr (1915 of 2355) PASS: lldb-api :: commands/platform/basic/TestPlatformCommand.py (1916 of 2355) PASS: lldb-shell :: SymbolFile/DWARF/x86/debug_aranges-empty-section.s (1917 of 2355) PASS: lldb-api :: functionalities/data-formatter/data-formatter-cpp/TestDataFormatterCpp.py (1918 of 2355) PASS: lldb-unit :: Expression/./ExpressionTests/DiagnosticManagerTest.GetStringSeverityLabels (1919 of 2355) PASS: lldb-unit :: Utility/./UtilityTests/BinaryStreamTest.PutULEB128TwoBytes (1920 of 2355) PASS: lldb-api :: lang/c/shared_lib/TestSharedLib.py (1921 of 2355) UNSUPPORTED: lldb-api :: tools/lldb-server/registers-target-xml-reading/TestGdbRemoteTargetXmlPacket.py (1922 of 2355) PASS: lldb-unit :: Utility/./UtilityTests/VMRange.Reset (1923 of 2355) PASS: lldb-unit :: Process/minidump/./LLDBMinidumpTests/MinidumpParserTest.GetPid (1924 of 2355) PASS: lldb-unit :: Utility/./UtilityTests/OptionsWithRawTest.SingleWhitespaceInput (1925 of 2355) PASS: lldb-api :: commands/process/launch-with-shellexpand/TestLaunchWithShellExpand.py (1926 of 2355) UNSUPPORTED: lldb-shell :: SymbolFile/PDB/pointers.test (1927 of 2355) UNSUPPORTED: lldb-shell :: SymbolFile/NativePDB/ast-functions-msvc.cpp (1928 of 2355) PASS: lldb-api :: lang/objc/objc++/TestObjCXX.py (1929 of 2355) PASS: lldb-unit :: Utility/./UtilityTests/VMRange.ContainsRange (1930 of 2355) PASS: lldb-unit :: ScriptInterpreter/Python/./ScriptInterpreterPythonTests/PythonDataObjectsTest.TestPythonIntegerToStr (1931 of 2355) PASS: lldb-api :: lang/cpp/class_types/TestClassTypesDisassembly.py (1932 of 2355) PASS: lldb-unit :: UnwindAssembly/x86/./UnwindAssemblyx86Tests/Testx86AssemblyInspectionEngine.TestPushESI (1933 of 2355) PASS: lldb-unit :: Process/minidump/./LLDBMinidumpTests/MinidumpParserTest.GetMemoryRegionInfoLinuxMaps (1934 of 2355) PASS: lldb-unit :: Utility/./UtilityTests/ArgsTest.GetQuotedCommandString (1935 of 2355) PASS: lldb-api :: lang/cpp/accelerator-table/TestCPPAccelerator.py (1936 of 2355) PASS: lldb-api :: commands/command/script/TestCommandScript.py (1937 of 2355) PASS: lldb-unit :: ScriptInterpreter/Python/./ScriptInterpreterPythonTests/PythonDataObjectsTest.TestPythonTupleInitializerList (1938 of 2355) PASS: lldb-unit :: Process/gdb-remote/./ProcessGdbRemoteTests/GDBRemoteCommunicationClientTest.SaveRestoreRegistersNoSuffix (1939 of 2355) PASS: lldb-shell :: Register/Core/x86-64-linux-fp.test (1940 of 2355) PASS: lldb-unit :: Language/Highlighting/./HighlighterTests/HighlighterTest.ClangTrailingBackslashWithWhitespace (1941 of 2355) PASS: lldb-unit :: Process/Utility/./ProcessUtilityTests/ProcMapTests/LinuxProcMapsTestFixture.ParseMapRegions/5 (1942 of 2355) PASS: lldb-api :: functionalities/multidebugger_commands/TestMultipleDebuggersCommands.py (1943 of 2355) PASS: lldb-unit :: Utility/./UtilityTests/StringListTest.InsertStringAtIndexMove (1944 of 2355) UNSUPPORTED: lldb-api :: functionalities/tsan/global_location/TestTsanGlobalLocation.py (1945 of 2355) UNSUPPORTED: lldb-shell :: Unwind/eh-frame-augment-noop.test (1946 of 2355) PASS: lldb-api :: lang/c/complex_int/TestComplexInt.py (1947 of 2355) PASS: lldb-api :: types/TestLongTypes.py (1948 of 2355) PASS: lldb-shell :: Reproducer/TestGDBRemoteRepro.test (1949 of 2355) PASS: lldb-shell :: Unwind/thread-step-out-ret-addr-check.test (1950 of 2355) PASS: lldb-unit :: Utility/./UtilityTests/OptionsWithRawTest.WhitespaceInput (1951 of 2355) PASS: lldb-unit :: ScriptInterpreter/Python/./ScriptInterpreterPythonTests/PythonDataObjectsTest.TestPythonString (1952 of 2355) PASS: lldb-shell :: ScriptInterpreter/None/import_module.test (1953 of 2355) PASS: lldb-unit :: Thread/./ThreadTests/ThreadTest.SetStopInfo (1954 of 2355) PASS: lldb-shell :: ObjectFile/ELF/short-build-id.yaml (1955 of 2355) PASS: lldb-api :: lang/cpp/class-template-non-type-parameter-pack/TestClassTemplateNonTypeParameterPack.py (1956 of 2355) PASS: lldb-unit :: Utility/./UtilityTests/FileSpecTest.EqualDotsPosixRoot (1957 of 2355) PASS: lldb-unit :: Utility/./UtilityTests/ListenerTest.GetEventWait (1958 of 2355) PASS: lldb-unit :: Utility/./UtilityTests/StatusTest.Formatv (1959 of 2355) UNSUPPORTED: lldb-shell :: SymbolFile/PDB/typedefs.test (1960 of 2355) PASS: lldb-api :: functionalities/plugins/python_os_plugin/TestPythonOSPlugin.py (1961 of 2355) PASS: lldb-unit :: Utility/./UtilityTests/ArgsTest.TestOverwriteArgs (1962 of 2355) PASS: lldb-api :: lang/objc/hidden-ivars/TestHiddenIvars.py (1963 of 2355) PASS: lldb-api :: lang/objc/ivar-IMP/TestObjCiVarIMP.py (1964 of 2355) PASS: lldb-unit :: Symbol/./SymbolTests/TestClangASTImporter.MetadataPropagationAfterCopying (1965 of 2355) PASS: lldb-unit :: Process/Utility/./ProcessUtilityTests/ProcSMapTests/LinuxProcSMapsTestFixture.ParseSMapRegions/2 (1966 of 2355) PASS: lldb-unit :: Utility/./UtilityTests/ArgsTest.GetShellSafeArgument (1967 of 2355) PASS: lldb-unit :: Host/./HostTests/FileSystemTest.EnumerateDirectory (1968 of 2355) PASS: lldb-unit :: Utility/./UtilityTests/Flags.Test (1969 of 2355) XFAIL: lldb-shell :: Register/x86-64-fp-read.test (1970 of 2355) PASS: lldb-api :: lang/cpp/covariant-return-types/TestCovariantReturnTypes.py (1971 of 2355) PASS: lldb-unit :: Process/./ProcessEventDataTests/ProcessEventDataTest.ShouldStop (1972 of 2355) PASS: lldb-unit :: Utility/./UtilityTests/FileSpecTest.CopyByAppendingPathComponent (1973 of 2355) UNSUPPORTED: lldb-shell :: ScriptInterpreter/Lua/breakpoint_callback.test (1974 of 2355) PASS: lldb-unit :: Utility/./UtilityTests/StringExtractorTest.GetHexU8_InvalidHex_NoEof (1975 of 2355) PASS: lldb-api :: functionalities/gdb_remote_client/TestIOSSimulator.py (1976 of 2355) PASS: lldb-unit :: Utility/./UtilityTests/StatusTest.ErrorCodeConstructor (1977 of 2355) PASS: lldb-unit :: UnwindAssembly/x86/./UnwindAssemblyx86Tests/Testx86AssemblyInspectionEngine.Test32bitFramelessSmallStackFrame (1978 of 2355) PASS: lldb-api :: commands/platform/file/close/TestPlatformFileClose.py (1979 of 2355) PASS: lldb-unit :: Symbol/./SymbolTests/TestTypeSystemClang.TestGetTypeClassTypeOfExpr (1980 of 2355) PASS: lldb-api :: commands/frame/var-scope/TestFrameVariableScope.py (1981 of 2355) PASS: lldb-unit :: Process/Utility/./ProcessUtilityTests/ProcMapTests/LinuxProcMapsTestFixture.ParseMapRegions/1 (1982 of 2355) UNSUPPORTED: lldb-shell :: SymbolFile/NativePDB/local-variables.cpp (1983 of 2355) PASS: lldb-api :: functionalities/data-formatter/data-formatter-stl/libcxx/iterator/TestDataFormatterLibccIterator.py (1984 of 2355) PASS: lldb-api :: macosx/nslog/TestDarwinNSLogOutput.py (1985 of 2355) PASS: lldb-unit :: Core/./LLDBCoreTests/MangledTest.NameIndexes_FindFunctionSymbols (1986 of 2355) PASS: lldb-unit :: Utility/./UtilityTests/RecordReplayTest.InstrumentedBarPtr (1987 of 2355) PASS: lldb-shell :: Settings/TestModuleCacheSanity.test (1988 of 2355) PASS: lldb-api :: functionalities/data-formatter/data-formatter-objc/nsindexpath/TestDataFormatterNSIndexPath.py (1989 of 2355) PASS: lldb-unit :: Symbol/./SymbolTests/Type.CompilerContextPattern (1990 of 2355) PASS: lldb-api :: commands/log/basic/TestLogging.py (1991 of 2355) PASS: lldb-api :: commands/expression/radar_9531204/TestPrintfAfterUp.py (1992 of 2355) UNSUPPORTED: lldb-api :: lang/c/typedef/Testtypedef.py (1993 of 2355) PASS: lldb-shell :: Register/Core/x86-32-netbsd-addr.test (1994 of 2355) PASS: lldb-unit :: SymbolFile/DWARF/./SymbolFileDWARFTests/SymbolFileDWARFTests.TestAbilitiesForDWARF (1995 of 2355) PASS: lldb-shell :: Register/x86-64-ymm-read.test (1996 of 2355) UNSUPPORTED: lldb-shell :: Register/x86-64-ymm16-read.test (1997 of 2355) PASS: lldb-api :: commands/expression/persistent_ptr_update/TestPersistentPtrUpdate.py (1998 of 2355) PASS: lldb-unit :: UnwindAssembly/x86/./UnwindAssemblyx86Tests/Testx86AssemblyInspectionEngine.Test32bitFramelessBigStackFrame (1999 of 2355) PASS: lldb-api :: functionalities/data-formatter/data-formatter-script/TestDataFormatterScript.py (2000 of 2355) PASS: lldb-api :: lang/cpp/member-and-local-vars-with-same-name/TestMembersAndLocalsWithSameName.py (2001 of 2355) PASS: lldb-unit :: Utility/./UtilityTests/DataExtractorTest.GetCStrAtNullOffset (2002 of 2355) PASS: lldb-api :: lang/cpp/breakpoint-commands/TestCPPBreakpointCommands.py (2003 of 2355) PASS: lldb-api :: macosx/profile_vrs_detach/TestDetachVrsProfile.py (2004 of 2355) PASS: lldb-unit :: Core/./LLDBCoreTests/MangledTest.ResultForValidRustV0Name (2005 of 2355) PASS: lldb-api :: sample_test/TestSampleInlineTest.py (2006 of 2355) UNSUPPORTED: lldb-api :: lang/objc/modules-update/TestClangModulesUpdate.py (2007 of 2355) PASS: lldb-unit :: Utility/./UtilityTests/ScalarTest.Scalar_512 (2008 of 2355) PASS: lldb-unit :: Utility/./UtilityTests/StringListTest.Join (2009 of 2355) PASS: lldb-unit :: Symbol/./SymbolTests/TestCreateClassTemplateDecl.FindExistingTemplates (2010 of 2355) PASS: lldb-unit :: Utility/./UtilityTests/LogChannelTest.List (2011 of 2355) UNSUPPORTED: lldb-shell :: SymbolFile/PDB/variables.test (2012 of 2355) UNSUPPORTED: lldb-shell :: Register/x86-gp-write.test (2013 of 2355) PASS: lldb-api :: commands/command/invalid-args/TestInvalidArgsCommand.py (2014 of 2355) PASS: lldb-unit :: Interpreter/./InterpreterTests/OptionArgParserTest.toScriptLanguage (2015 of 2355) PASS: lldb-unit :: Utility/./UtilityTests/StatusTest.ErrorConstructor (2016 of 2355) PASS: lldb-shell :: ScriptInterpreter/Python/Crashlog/json.test (2017 of 2355) PASS: lldb-unit :: Process/gdb-remote/./ProcessGdbRemoteTests/GDBRemoteCommunicationClientTest.ReadRegister (2018 of 2355) PASS: lldb-shell :: SymbolFile/DWARF/DW_AT_range-DW_FORM_sec_offset.s (2019 of 2355) PASS: lldb-unit :: Utility/./UtilityTests/LogTest.Register (2020 of 2355) UNSUPPORTED: lldb-api :: commands/register/register/aarch64_sve_registers/rw_access_static_config/TestSVERegisters.py (2021 of 2355) PASS: lldb-unit :: Utility/./UtilityTests/ConstStringTest.MangledCounterpart (2022 of 2355) PASS: lldb-api :: commands/platform/process/list/TestProcessList.py (2023 of 2355) PASS: lldb-api :: functionalities/data-formatter/data-formatter-stl/libcxx/set/TestDataFormatterLibcxxSet.py (2024 of 2355) PASS: lldb-unit :: Utility/./UtilityTests/StateTest.Formatv (2025 of 2355) PASS: lldb-unit :: Utility/./UtilityTests/ConstStringTest.CompareConstString (2026 of 2355) PASS: lldb-api :: functionalities/gdb_remote_client/TestTargetXMLArch.py (2027 of 2355) PASS: lldb-shell :: Quit/TestQuitExitCodeHexA.test (2028 of 2355) PASS: lldb-unit :: Symbol/./SymbolTests/TestScratchTypeSystemClang.InferSubASTFromLangOpts (2029 of 2355) PASS: lldb-shell :: SymbolFile/DWARF/x86/dwarf5-atomic.s (2030 of 2355) UNSUPPORTED: lldb-shell :: Expr/TestIRMemoryMapWindows.test (2031 of 2355) PASS: lldb-api :: commands/expression/argument_passing_restrictions/TestArgumentPassingRestrictions.py (2032 of 2355) PASS: lldb-unit :: Process/gdb-remote/./ProcessGdbRemoteTests/PortMapTest.Constructors (2033 of 2355) PASS: lldb-api :: functionalities/data-formatter/data-formatter-globals/TestDataFormatterGlobals.py (2034 of 2355) PASS: lldb-api :: commands/expression/po_verbosity/TestPoVerbosity.py (2035 of 2355) PASS: lldb-unit :: Utility/./UtilityTests/XcodeSDKTest.SDKSupportsModules (2036 of 2355) PASS: lldb-shell :: SymbolFile/DWARF/x86/dwarf5-debug_line-file-index.s (2037 of 2355) PASS: lldb-api :: functionalities/float-display/TestFloatDisplay.py (2038 of 2355) PASS: lldb-shell :: Process/Optimization.test (2039 of 2355) PASS: lldb-unit :: Utility/./UtilityTests/UserIDResolver.GetGroupName (2040 of 2355) PASS: lldb-shell :: ObjectFile/ELF/build-id-case.yaml (2041 of 2355) PASS: lldb-api :: lang/c/global_variables/TestGlobalVariables.py (2042 of 2355) PASS: lldb-unit :: Utility/./UtilityTests/SerializationRountripTest.SerializeDeserializeObjectReference (2043 of 2355) PASS: lldb-shell :: Register/Core/x86-32-netbsd-gp.test (2044 of 2355) PASS: lldb-shell :: SymbolFile/DWARF/x86/find-function-regex.cpp (2045 of 2355) PASS: lldb-api :: functionalities/data-formatter/data-formatter-objc/TestDataFormatterObjCNSContainer.py (2046 of 2355) PASS: lldb-api :: commands/expression/call-function/TestCallStdStringFunction.py (2047 of 2355) PASS: lldb-unit :: Utility/./UtilityTests/PassiveReplayTest.InstrumentedBarPtr (2048 of 2355) PASS: lldb-unit :: Interpreter/./InterpreterTests/OptionValueFileColonLine.setFromString (2049 of 2355) PASS: lldb-unit :: SymbolFile/DWARF/./SymbolFileDWARFTests/SymbolFileDWARFTests.TestAbbrevMissingTerminator (2050 of 2355) PASS: lldb-api :: functionalities/deleted-executable/TestDeletedExecutable.py (2051 of 2355) PASS: lldb-api :: functionalities/data-formatter/data-formatter-stl/libcxx/multiset/TestDataFormatterLibcxxMultiSet.py (2052 of 2355) UNSUPPORTED: lldb-api :: functionalities/tsan/cpp_global_location/TestTsanCPPGlobalLocation.py (2053 of 2355) PASS: lldb-api :: functionalities/reproducers/fs-case-sensitivity/TestReproducerFSCaseSensitivity.py (2054 of 2355) PASS: lldb-unit :: Target/./TargetTests/PathMappingListTest.CrossPlatformTests (2055 of 2355) PASS: lldb-api :: functionalities/thread/num_threads/TestNumThreads.py (2056 of 2355) PASS: lldb-unit :: Utility/./UtilityTests/StringExtractorTest.GetU32LittleEndian (2057 of 2355) PASS: lldb-unit :: Utility/./UtilityTests/OptionsWithRawTest.UnterminatedQuote (2058 of 2355) PASS: lldb-unit :: Utility/./UtilityTests/StringExtractorTest.GetNameColonValueNoColon (2059 of 2355) PASS: lldb-api :: python_api/findvalue_duplist/TestSBFrameFindValue.py (2060 of 2355) PASS: lldb-unit :: Utility/./UtilityTests/StreamTeeTest.SetStreamAtIndexOutOfBounds (2061 of 2355) PASS: lldb-shell :: ObjectFile/ELF/base-address.yaml (2062 of 2355) PASS: lldb-shell :: SymbolFile/DWARF/x86/find-basic-type.cpp (2063 of 2355) PASS: lldb-api :: commands/expression/import-std-module/retry-with-std-module/TestRetryWithStdModule.py (2064 of 2355) PASS: lldb-api :: lang/objcxx/objcxx-ivar-vector/TestIvarVector.py (2065 of 2355) PASS: lldb-api :: tools/lldb-server/TestLldbGdbServer.py (2066 of 2355) PASS: lldb-shell :: ObjectFile/Breakpad/breakpad-identification.test (2067 of 2355) PASS: lldb-api :: functionalities/breakpoint/breakpoint_by_line_and_column/TestBreakpointByLineAndColumn.py (2068 of 2355) PASS: lldb-shell :: Driver/TestTarget.test (2069 of 2355) PASS: lldb-api :: lang/cpp/limit-debug-info/TestWithLimitDebugInfo.py (2070 of 2355) PASS: lldb-unit :: Utility/./UtilityTests/Flags.AnySet (2071 of 2355) PASS: lldb-shell :: Register/x86-multithread-read.test (2072 of 2355) PASS: lldb-unit :: SymbolFile/NativePDB/./SymbolFileNativePDBTests/PDBFPOProgramToDWARFExpressionTests.UnknownOp (2073 of 2355) PASS: lldb-unit :: UnwindAssembly/x86/./UnwindAssemblyx86Tests/Testx86AssemblyInspectionEngine.TestSimple64bitFrameFunction (2074 of 2355) PASS: lldb-api :: functionalities/unwind/noreturn/module-end/TestNoReturnModuleEnd.py (2075 of 2355) PASS: lldb-api :: macosx/lc-note/kern-ver-str/TestKernVerStrLCNOTE.py (2076 of 2355) PASS: lldb-unit :: Utility/./UtilityTests/StringExtractorTest.GetHexBytesAvail_OddPair (2077 of 2355) PASS: lldb-unit :: Utility/./UtilityTests/FileSpecTest.IsRelative (2078 of 2355) UNSUPPORTED: lldb-api :: macosx/simulator/TestSimulatorPlatform.py (2079 of 2355) PASS: lldb-api :: functionalities/tail_call_frames/ambiguous_tail_call_seq1/TestAmbiguousTailCallSeq1.py (2080 of 2355) PASS: lldb-unit :: Utility/./UtilityTests/TimeoutTest.Construction (2081 of 2355) PASS: lldb-shell :: Minidump/dump-all.test (2082 of 2355) PASS: lldb-unit :: Utility/./UtilityTests/StreamTest.PutHex64ByteOrderLittle (2083 of 2355) PASS: lldb-api :: functionalities/gdb_remote_client/TestStopPCs.py (2084 of 2355) PASS: lldb-api :: types/TestFloatTypesExpr.py (2085 of 2355) PASS: lldb-api :: python_api/sbtype_typeclass/TestSBTypeTypeClass.py (2086 of 2355) PASS: lldb-unit :: Utility/./UtilityTests/FileSpecTest.EqualDotsPosix (2087 of 2355) PASS: lldb-api :: commands/expression/persistent_types/TestPersistentTypes.py (2088 of 2355) PASS: lldb-api :: functionalities/multiword-commands/TestMultiWordCommands.py (2089 of 2355) PASS: lldb-unit :: Utility/./UtilityTests/StringListTest.GetMaxStringLengthDecreasingSize (2090 of 2355) PASS: lldb-unit :: Utility/./UtilityTests/ArgsTest.TestSingleArg (2091 of 2355) PASS: lldb-api :: functionalities/gdb_remote_client/TestPlatformClient.py (2092 of 2355) PASS: lldb-shell :: ObjectFile/ELF/PT_LOAD-overlap-PT_INTERP.yaml (2093 of 2355) PASS: lldb-api :: functionalities/thread/concurrent_events/TestConcurrentTwoBreakpointsOneDelaySignal.py (2094 of 2355) PASS: lldb-api :: lang/cpp/rvalue-references/TestRvalueReferences.py (2095 of 2355) PASS: lldb-shell :: SymbolFile/DWARF/x86/DW_AT_low_pc-addrx.s (2096 of 2355) PASS: lldb-api :: lang/objc/modules/TestObjCModules.py (2097 of 2355) PASS: lldb-shell :: SymbolFile/DWARF/x86/apple-index-is-used.cpp (2098 of 2355) PASS: lldb-unit :: Process/minidump/./LLDBMinidumpTests/MinidumpParserTest.MinidumpModuleOrder (2099 of 2355) PASS: lldb-unit :: ObjectFile/Breakpad/./ObjectFileBreakpadTests/InfoRecord.parse (2100 of 2355) PASS: lldb-api :: tools/lldb-server/register-reading/TestGdbRemoteGPacket.py (2101 of 2355) PASS: lldb-api :: lang/cpp/namespace/TestNamespace.py (2102 of 2355) PASS: lldb-api :: functionalities/data-formatter/data-formatter-stl/libcxx/tuple/TestDataFormatterLibcxxTuple.py (2103 of 2355) PASS: lldb-unit :: Symbol/./SymbolTests/TestTypeSystemClang.TestGetEnumIntegerTypeUnexpectedType (2104 of 2355) PASS: lldb-api :: commands/expression/function_template_specialization_temp_args/TestFunctionTemplateSpecializationTempArgs.py (2105 of 2355) PASS: lldb-api :: functionalities/non-overlapping-index-variable-i/TestIndexVariable.py (2106 of 2355) UNSUPPORTED: lldb-api :: commands/register/register/intel_xtended_registers/mpx_bound_violation/TestBoundViolation.py (2107 of 2355) PASS: lldb-unit :: Utility/./UtilityTests/RangeTest.SlideZero (2108 of 2355) PASS: lldb-api :: lang/cpp/function-qualifiers/TestCppFunctionQualifiers.py (2109 of 2355) PASS: lldb-unit :: Utility/./UtilityTests/BinaryStreamTest.PutULEB128OneByte (2110 of 2355) PASS: lldb-unit :: Utility/./UtilityTests/StreamTeeTest.Write (2111 of 2355) PASS: lldb-unit :: Utility/./UtilityTests/RecordReplayTest.InvalidSequence (2112 of 2355) PASS: lldb-unit :: Utility/./UtilityTests/LogChannelEnabledTest.LLDB_LOG_ERROR (2113 of 2355) PASS: lldb-shell :: ObjectFile/ELF/compressed-sections.yaml (2114 of 2355) PASS: lldb-api :: api/command-return-object/TestSBCommandReturnObject.py (2115 of 2355) PASS: lldb-shell :: ObjectFile/MachO/lc_build_version.yaml (2116 of 2355) PASS: lldb-shell :: Quit/TestQuitExitCodeNonInt.test (2117 of 2355) PASS: lldb-api :: python_api/sbvalue_const_addrof/TestSBValueConstAddrOf.py (2118 of 2355) PASS: lldb-unit :: Utility/./UtilityTests/StreamTest.PutBytesAsRawHex8ToBigEndian (2119 of 2355) PASS: lldb-api :: functionalities/thread_plan/TestThreadPlanCommands.py (2120 of 2355) PASS: lldb-shell :: SymbolFile/DWARF/x86/dwarf5_locations.s (2121 of 2355) PASS: lldb-unit :: Utility/./UtilityTests/SerializationRountripTest.SerializeDeserializePod (2122 of 2355) PASS: lldb-api :: macosx/find-dsym/deep-bundle/TestDeepBundle.py (2123 of 2355) PASS: lldb-api :: api/multithreaded/TestMultithreaded.py (2124 of 2355) UNSUPPORTED: lldb-api :: tools/lldb-server/TestGdbRemoteCompletion.py (2125 of 2355) PASS: lldb-api :: functionalities/thread/concurrent_events/TestConcurrentWatchpointDelayWatchpointOneBreakpoint.py (2126 of 2355) UNSUPPORTED: lldb-shell :: Watchpoint/netbsd-nouserdbregs.test (2127 of 2355) UNSUPPORTED: lldb-shell :: SymbolFile/PDB/udt-layout.test (2128 of 2355) PASS: lldb-shell :: Reproducer/TestProcessList.test (2129 of 2355) PASS: lldb-unit :: Utility/./UtilityTests/RegularExpression.Invalid (2130 of 2355) PASS: lldb-unit :: Utility/./UtilityTests/BroadcasterTest.BroadcastEvent (2131 of 2355) PASS: lldb-unit :: Signals/./SignalsTests/UnixSignalsTest.GetInfo (2132 of 2355) PASS: lldb-unit :: Process/minidump/./LLDBMinidumpTests/MinidumpParserTest.MinidumpDuplicateModuleSeparateCode (2133 of 2355) PASS: lldb-api :: commands/expression/timeout/TestCallWithTimeout.py (2134 of 2355) PASS: lldb-unit :: Symbol/./SymbolTests/SymbolsTest.LocateExecutableSymbolFileForUnknownExecutableAndMissingSymbolFile (2135 of 2355) PASS: lldb-api :: macosx/load-kext/TestLoadKext.py (2136 of 2355) PASS: lldb-shell :: SymbolFile/symbol-binding.test (2137 of 2355) UNSUPPORTED: lldb-api :: commands/expression/multiline-completion/TestMultilineCompletion.py (2138 of 2355) PASS: lldb-api :: lang/cpp/gmodules/TestWithModuleDebugging.py (2139 of 2355) PASS: lldb-api :: python_api/sbdata/TestSBData.py (2140 of 2355) PASS: lldb-api :: functionalities/breakpoint/breakpoint_conditions/TestBreakpointConditions.py (2141 of 2355) PASS: lldb-unit :: Expression/./ExpressionTests/DWARFExpression.DW_OP_convert (2142 of 2355) PASS: lldb-api :: lang/cpp/llvm-style/TestLLVMStyle.py (2143 of 2355) PASS: lldb-unit :: Core/./LLDBCoreTests/RichManglingContextTest.FromCxxMethodName (2144 of 2355) PASS: lldb-api :: functionalities/thread/concurrent_events/TestConcurrentManyBreakpoints.py (2145 of 2355) PASS: lldb-unit :: Utility/./UtilityTests/ArgsTest.TestArgv (2146 of 2355) PASS: lldb-api :: python_api/type/TestTypeList.py (2147 of 2355) PASS: lldb-shell :: Reproducer/TestDriverOptions.test (2148 of 2355) PASS: lldb-api :: lang/objc/warnings-in-expr-parser/TestObjCWarningsInExprParser.py (2149 of 2355) PASS: lldb-unit :: Expression/./ExpressionTests/DiagnosticManagerTest.GetStringMultipleDiags (2150 of 2355) PASS: lldb-api :: functionalities/postmortem/mach-core/TestMachCore.py (2151 of 2355) PASS: lldb-api :: macosx/add-dsym/TestAddDsymMidExecutionCommand.py (2152 of 2355) PASS: lldb-shell :: SymbolFile/DWARF/x86/subprogram_ranges.test (2153 of 2355) PASS: lldb-api :: lang/c/conflicting-symbol/TestConflictingSymbol.py (2154 of 2355) UNSUPPORTED: lldb-api :: tools/lldb-server/TestGdbRemoteFork.py (2155 of 2355) PASS: lldb-unit :: ScriptInterpreter/Python/./ScriptInterpreterPythonTests/PythonDataObjectsTest.TestObjectAttributes (2156 of 2355) PASS: lldb-unit :: Process/gdb-remote/./ProcessGdbRemoteTests/GDBRemoteCommunicationClientTest.GetModulesInfo_UUID20 (2157 of 2355) PASS: lldb-unit :: Utility/./UtilityTests/BinaryStreamTest.PutSLEB128SixBytes (2158 of 2355) PASS: lldb-unit :: UnwindAssembly/x86/./UnwindAssemblyx86Tests/Testx86AssemblyInspectionEngine.TestStackRealignMSVC_i386 (2159 of 2355) PASS: lldb-shell :: SymbolFile/DWARF/x86/find-qualified-variable.cpp (2160 of 2355) PASS: lldb-unit :: ObjectFile/Breakpad/./ObjectFileBreakpadTests/FuncRecord.parse (2161 of 2355) PASS: lldb-api :: types/TestCharTypeExpr.py (2162 of 2355) UNSUPPORTED: lldb-shell :: SymbolFile/PDB/class-layout.test (2163 of 2355) PASS: lldb-unit :: Utility/./UtilityTests/CompletionRequest.ShiftArguments (2164 of 2355) PASS: lldb-api :: lang/cpp/breakpoint_in_member_func_w_non_primitive_params/TestBreakpointInMemberFuncWNonPrimitiveParams.py (2165 of 2355) PASS: lldb-api :: functionalities/thread/backtrace_all/TestBacktraceAll.py (2166 of 2355) PASS: lldb-unit :: ScriptInterpreter/Python/./ScriptInterpreterPythonTests/PythonDataObjectsTest.TestBorrowedReferences (2167 of 2355) PASS: lldb-unit :: UnwindAssembly/x86/./UnwindAssemblyx86Tests/Testx86AssemblyInspectionEngine.TestPushEDX (2168 of 2355) PASS: lldb-unit :: Process/gdb-remote/./ProcessGdbRemoteTests/GDBRemoteClientBaseTest.SendContinueAndAsyncSignal (2169 of 2355) PASS: lldb-unit :: Language/Highlighting/./HighlighterTests/HighlighterTest.Colons (2170 of 2355) PASS: lldb-shell :: Commands/CommandScriptImmediateOutput/CommandScriptImmediateOutputFile.test (2171 of 2355) PASS: lldb-api :: commands/apropos/with-process/TestAproposWithProcess.py (2172 of 2355) PASS: lldb-unit :: Process/minidump/./LLDBMinidumpTests/MinidumpParserTest.FindMemoryRange (2173 of 2355) PASS: lldb-api :: functionalities/unwind/sigtramp/TestSigtrampUnwind.py (2174 of 2355) UNSUPPORTED: lldb-api :: functionalities/unwind/aarch64_unwind_pac/TestAArch64UnwindPAC.py (2175 of 2355) PASS: lldb-api :: functionalities/memory/cache/TestMemoryCache.py (2176 of 2355) PASS: lldb-api :: functionalities/data-formatter/setvaluefromcstring/TestSetValueFromCString.py (2177 of 2355) PASS: lldb-unit :: Process/Utility/./ProcessUtilityTests/ProcMapTests/LinuxProcMapsTestFixture.ParseMapRegions/0 (2178 of 2355) PASS: lldb-shell :: SymbolFile/NativePDB/locate-pdb.cpp (2179 of 2355) PASS: lldb-api :: commands/frame/diagnose/array/TestArray.py (2180 of 2355) PASS: lldb-shell :: ObjectFile/ELF/section-types-edgecases.yaml (2181 of 2355) PASS: lldb-shell :: SymbolFile/DWARF/x86/debug-types-address-ranges.s (2182 of 2355) PASS: lldb-api :: commands/expression/import-std-module/conflicts/TestStdModuleWithConflicts.py (2183 of 2355) PASS: lldb-api :: lang/cpp/template-specialization-type/TestTemplateSpecializationType.py (2184 of 2355) PASS: lldb-unit :: Utility/./UtilityTests/DataExtractorTest.GetBitfield (2185 of 2355) PASS: lldb-unit :: Utility/./UtilityTests/OptionsWithRawTest.EmptyArgsOnlySuffix (2186 of 2355) PASS: lldb-api :: functionalities/data-formatter/data-formatter-stl/libcxx/forward_list/TestDataFormatterLibcxxForwardList.py (2187 of 2355) PASS: lldb-unit :: Utility/./UtilityTests/SerializationRountripTest.SerializeDeserializeObjectPointer (2188 of 2355) PASS: lldb-unit :: SymbolFile/NativePDB/./SymbolFileNativePDBTests/PDBFPOProgramToDWARFExpressionTests.MissingTargetRegister (2189 of 2355) PASS: lldb-unit :: Interpreter/./InterpreterTests/OptionArgParserTest.toChar (2190 of 2355) PASS: lldb-api :: functionalities/data-formatter/data-formatter-stl/libstdcpp/unique_ptr/invalid/TestDataFormatterInvalidStdUniquePtr.py (2191 of 2355) PASS: lldb-api :: lang/objc/modules-incomplete/TestIncompleteModules.py (2192 of 2355) PASS: lldb-shell :: Reproducer/TestDebugSymbols.test (2193 of 2355) PASS: lldb-shell :: Breakpoint/split-dwarf-5-addrbase.test (2194 of 2355) PASS: lldb-unit :: Utility/./UtilityTests/RecordReplayTest.InstrumentedBar (2195 of 2355) PASS: lldb-api :: commands/expression/static-initializers/TestStaticInitializers.py (2196 of 2355) PASS: lldb-shell :: Subprocess/fork-follow-parent.test (2197 of 2355) PASS: lldb-unit :: Symbol/./SymbolTests/TestClangASTImporter.DeportTypeTagDecl (2198 of 2355) PASS: lldb-unit :: Utility/./UtilityTests/DataExtractorTest.GetSLEB128_bit63 (2199 of 2355) PASS: lldb-unit :: Utility/./UtilityTests/CompletionRequest.TryCompleteCurrentArgMode (2200 of 2355) PASS: lldb-shell :: Reproducer/Modules/TestModuleCXX.test (2201 of 2355) PASS: lldb-api :: functionalities/postmortem/minidump-new/TestMiniDumpNew.py (2202 of 2355) UNSUPPORTED: lldb-api :: tools/lldb-server/TestGdbRemoteAuxvSupport.py (2203 of 2355) PASS: lldb-unit :: ScriptInterpreter/Python/./ScriptInterpreterPythonTests/PythonDataObjectsTest.TestPythonDictionaryToStructuredDictionary (2204 of 2355) PASS: lldb-api :: functionalities/gdb_remote_client/TestArmRegisterDefinition.py (2205 of 2355) PASS: lldb-unit :: Host/./HostTests/FileSystemTest.GetPermissions (2206 of 2355) PASS: lldb-api :: commands/platform/sdk/TestPlatformSDK.py (2207 of 2355) PASS: lldb-api :: python_api/watchpoint/watchlocation/TestTargetWatchAddress.py (2208 of 2355) PASS: lldb-shell :: SymbolFile/DWARF/x86/debug_rnglists.s (2209 of 2355) PASS: lldb-api :: sanity/TestModuleCacheSanity.py (2210 of 2355) UNSUPPORTED: lldb-api :: functionalities/tsan/basic/TestTsanBasic.py (2211 of 2355) PASS: lldb-unit :: UnwindAssembly/x86/./UnwindAssemblyx86Tests/Testx86AssemblyInspectionEngine.TestAddESP (2212 of 2355) PASS: lldb-api :: functionalities/data-formatter/data-formatter-objc/TestDataFormatterObjCNSData.py (2213 of 2355) UNSUPPORTED: lldb-api :: functionalities/ubsan/basic/TestUbsanBasic.py (2214 of 2355) PASS: lldb-unit :: SymbolFile/NativePDB/./SymbolFileNativePDBTests/PDBFPOProgramToDWARFExpressionTests.UnresolvedDependentCyclicRegisterAssignmentReference (2215 of 2355) PASS: lldb-api :: functionalities/data-formatter/data-formatter-objc/TestDataFormatterObjCNSBundle.py (2216 of 2355) PASS: lldb-unit :: Utility/./UtilityTests/SerializationRountripTest.SerializeDeserializeCStringArrayNullptr (2217 of 2355) PASS: lldb-unit :: Utility/./UtilityTests/UriParserTest.SchemeHostSeparator4 (2218 of 2355) PASS: lldb-unit :: debugserver/./debugserverTests/JSON.Parse (2219 of 2355) PASS: lldb-api :: functionalities/signal/TestSendSignal.py (2220 of 2355) PASS: lldb-unit :: Utility/./UtilityTests/StringExtractorTest.GetHexBytesAvail (2221 of 2355) PASS: lldb-shell :: Reproducer/Functionalities/TestImageList.test (2222 of 2355) UNSUPPORTED: lldb-api :: benchmarks/stepping/TestSteppingSpeed.py (2223 of 2355) PASS: lldb-api :: commands/expression/import-std-module/vector-of-vectors/TestVectorOfVectorsFromStdModule.py (2224 of 2355) PASS: lldb-api :: functionalities/type_completion/TestTypeCompletion.py (2225 of 2355) PASS: lldb-unit :: Utility/./UtilityTests/StringExtractorTest.GetHexU8_Underflow (2226 of 2355) PASS: lldb-api :: functionalities/data-formatter/var-in-aggregate-misuse/TestVarInAggregateMisuse.py (2227 of 2355) PASS: lldb-unit :: Utility/./UtilityTests/StreamTest.PutHex32ByteOrderLittle (2228 of 2355) PASS: lldb-unit :: Host/./HostTests/HostInfoTestInitialization.InitTwice (2229 of 2355) UNSUPPORTED: lldb-shell :: SymbolFile/PDB/compilands.test (2230 of 2355) PASS: lldb-unit :: Utility/./UtilityTests/StringExtractorTest.GetHexU8_Exact_NoEof (2231 of 2355) PASS: lldb-unit :: DataFormatter/./LLDBFormatterTests/TypeMatcherTests.RegexMatchPart (2232 of 2355) PASS: lldb-api :: python_api/watchpoint/watchlocation/TestSetWatchlocation.py (2233 of 2355) PASS: lldb-unit :: Utility/./UtilityTests/FileSpecTest.OperatorBool (2234 of 2355) PASS: lldb-unit :: Utility/./UtilityTests/Flags.Reset (2235 of 2355) PASS: lldb-unit :: Core/./LLDBCoreTests/ModuleSpecTest.TestMachOFile (2236 of 2355) PASS: lldb-unit :: Process/Utility/./ProcessUtilityTests/ProcMapTests/LinuxProcMapsTestFixture.ParseMapRegions/7 (2237 of 2355) UNSUPPORTED: lldb-api :: functionalities/gdb_remote_client/TestWasm.py (2238 of 2355) PASS: lldb-api :: python_api/sbenvironment/TestSBEnvironment.py (2239 of 2355) PASS: lldb-unit :: Utility/./UtilityTests/ProcessInstanceInfo.DumpTable (2240 of 2355) PASS: lldb-unit :: Utility/./UtilityTests/StringListTest.PopBack (2241 of 2355) PASS: lldb-shell :: Breakpoint/single-file-split-dwarf.test (2242 of 2355) PASS: lldb-unit :: Expression/./ExpressionTests/DiagnosticManagerTest.PutStringMultiple (2243 of 2355) UNSUPPORTED: lldb-api :: macosx/posix_spawn/TestLaunchProcessPosixSpawn.py (2244 of 2355) PASS: lldb-unit :: Platform/Android/./AdbClientTests/AdbClientTest.CreateByDeviceId_ByEnvVar (2245 of 2355) PASS: lldb-unit :: ObjectFile/MachO/./ObjectFileMachOTests/ObjectFileMachOTest.ModuleFromSharedCacheInfo (2246 of 2355) PASS: lldb-unit :: Utility/./UtilityTests/BinaryStreamTest.PutULEB128ThreeBytes (2247 of 2355) PASS: lldb-shell :: Register/Core/x86-64-netbsd-addr.test (2248 of 2355) PASS: lldb-api :: functionalities/data-formatter/language_category_updates/TestDataFormatterLanguageCategoryUpdates.py (2249 of 2355) PASS: lldb-api :: lang/cpp/elaborated-types/TestElaboratedTypes.py (2250 of 2355) PASS: lldb-api :: api/listeners/TestListener.py (2251 of 2355) PASS: lldb-unit :: Utility/./UtilityTests/StringExtractorTest.DecodeHexU8_Underflow2 (2252 of 2355) PASS: lldb-unit :: Symbol/./SymbolTests/TestTypeSystemClang.TestFunctionTemplateConstruction (2253 of 2355) PASS: lldb-api :: lang/c/function_types/TestFunctionTypes.py (2254 of 2355) PASS: lldb-api :: functionalities/inferior-changed/TestInferiorChanged.py (2255 of 2355) PASS: lldb-api :: functionalities/plugins/python_os_plugin/stepping_plugin_threads/TestOSPluginStepping.py (2256 of 2355) UNSUPPORTED: lldb-api :: functionalities/thread/multi_break/TestMultipleBreakpoints.py (2257 of 2355) PASS: lldb-shell :: ObjectFile/ELF/section-addresses.yaml (2258 of 2355) UNSUPPORTED: lldb-api :: functionalities/breakpoint/breakpoint_callback_command_source/TestBreakpointCallbackCommandSource.py (2259 of 2355) PASS: lldb-api :: functionalities/data-formatter/nsdictionarysynth/TestNSDictionarySynthetic.py (2260 of 2355) PASS: lldb-shell :: SymbolFile/DWARF/x86/dir-separator-no-comp-dir-relative-name.s (2261 of 2355) UNSUPPORTED: lldb-shell :: BuildScript/toolchain-clang-cl.test (2262 of 2355) PASS: lldb-api :: lang/objc/modules-compile-error/TestModulesCompileError.py (2263 of 2355) PASS: lldb-unit :: Utility/./UtilityTests/FileSpecTest.AppendPathComponent (2264 of 2355) PASS: lldb-api :: python_api/module_section/TestModuleAndSection.py (2265 of 2355) PASS: lldb-api :: functionalities/breakpoint/breakpoint_command/TestBreakpointCommandsFromPython.py (2266 of 2355) PASS: lldb-api :: lang/objc/objc-stepping/TestObjCStepping.py (2267 of 2355) PASS: lldb-unit :: Process/minidump/./LLDBMinidumpTests/MinidumpParserTest.GetMemoryRegionInfoLinuxMapsError (2268 of 2355) PASS: lldb-unit :: Utility/./UtilityTests/ScalarTest.TruncOrExtendTo (2269 of 2355) PASS: lldb-api :: lang/cpp/struct_with_keyword_name/TestStructWithKeywordName.py (2270 of 2355) PASS: lldb-api :: functionalities/fat_archives/TestFatArchives.py (2271 of 2355) PASS: lldb-api :: tools/lldb-server/TestGdbRemote_qThreadStopInfo.py (2272 of 2355) PASS: lldb-unit :: Process/minidump/./LLDBMinidumpTests/MinidumpParserTest.GetThreadContext_x86_32_wow64 (2273 of 2355) PASS: lldb-api :: functionalities/pre_run_dylibs/TestPreRunDylibs.py (2274 of 2355) PASS: lldb-unit :: Symbol/./SymbolTests/TestTypeSystemClang.TestDisplayNameEmpty (2275 of 2355) PASS: lldb-unit :: Utility/./UtilityTests/StringListTest.GetMaxStringLengthEqualSize (2276 of 2355) PASS: lldb-api :: python_api/watchpoint/condition/TestWatchpointConditionAPI.py (2277 of 2355) PASS: lldb-unit :: UnwindAssembly/x86/./UnwindAssemblyx86Tests/Testx86AssemblyInspectionEngine.Test32BitOnlyInstruction (2278 of 2355) PASS: lldb-unit :: Process/gdb-remote/./ProcessGdbRemoteTests/GDBRemoteClientBaseTest.SendContinueAndWait (2279 of 2355) PASS: lldb-unit :: Symbol/./SymbolTests/TestTypeSystemClang.TestGetBasicTypeFromName (2280 of 2355) UNSUPPORTED: lldb-api :: functionalities/darwin_log/filter/exact_match/message/TestDarwinLogFilterMatchMessage.py (2281 of 2355) PASS: lldb-unit :: Platform/./LLDBPlatformTests/PlatformAppleSimulatorTest.TestSimHasSimEnvionament (2282 of 2355) PASS: lldb-unit :: SymbolFile/NativePDB/./SymbolFileNativePDBTests/PDBFPOProgramToDWARFExpressionTests.InvalidAssignmentMultiple (2283 of 2355) PASS: lldb-unit :: SymbolFile/DWARF/./SymbolFileDWARFTests/SymbolFileDWARFTests.ParseAranges (2284 of 2355) UNSUPPORTED: lldb-shell :: Register/aarch64-fp-read.test (2285 of 2355) PASS: lldb-unit :: Core/./LLDBCoreTests/UniqueCStringMap.NoDefaultConstructor (2286 of 2355) PASS: lldb-api :: lang/objc/direct-dispatch-step/TestObjCDirectDispatchStepping.py (2287 of 2355) PASS: lldb-unit :: UnwindAssembly/x86/./UnwindAssemblyx86Tests/Testx86AssemblyInspectionEngine.TestDisassemblyJunkBytes (2288 of 2355) PASS: lldb-api :: functionalities/data-formatter/data-formatter-stl/libcxx/vector/TestDataFormatterLibcxxVector.py (2289 of 2355) PASS: lldb-api :: functionalities/unwind/zeroth_frame/TestZerothFrame.py (2290 of 2355) PASS: lldb-unit :: Expression/./ExpressionTests/ClangHostTest.ComputeClangResourceDirectory (2291 of 2355) PASS: lldb-unit :: Utility/./UtilityTests/StringListTest.Clear (2292 of 2355) PASS: lldb-api :: functionalities/data-formatter/array_typedef/TestArrayTypedef.py (2293 of 2355) PASS: lldb-api :: commands/expression/inline-namespace/TestInlineNamespace.py (2294 of 2355) PASS: lldb-unit :: Utility/./UtilityTests/StringListTest.JoinEmpty (2295 of 2355) PASS: lldb-shell :: SymbolFile/NativePDB/ast-functions.cpp (2296 of 2355) PASS: lldb-unit :: Expression/./ExpressionTests/ClangExpressionDeclMapTest.TestUnknownIdentifierLookup (2297 of 2355) PASS: lldb-unit :: Expression/./ExpressionTests/DiagnosticManagerTest.AppendMessageSubsequentDiags (2298 of 2355) PASS: lldb-unit :: Utility/./UtilityTests/UserIDResolver.GetUserName (2299 of 2355) PASS: lldb-unit :: ObjectFile/ELF/./ObjectFileELFTests/ObjectFileELFTest.GetModuleSpecifications_EarlySectionHeaders (2300 of 2355) PASS: lldb-unit :: Symbol/./SymbolTests/TestTypeSystemClang.TestGetBasicTypeFromEnum (2301 of 2355) UNSUPPORTED: lldb-api :: commands/platform/connect/TestPlatformConnect.py (2302 of 2355) UNSUPPORTED: lldb-api :: functionalities/process_save_core/TestProcessSaveCore.py (2303 of 2355) PASS: lldb-api :: functionalities/tail_call_frames/thread_step_out_or_return/TestSteppingOutWithArtificialFrames.py (2304 of 2355) PASS: lldb-api :: functionalities/data-formatter/data-formatter-synth/TestDataFormatterSynth.py (2305 of 2355) PASS: lldb-unit :: Utility/./UtilityTests/LogChannelEnabledTest.LogThread (2306 of 2355) PASS: lldb-unit :: Utility/./UtilityTests/StringListTest.RemoveBlankLines (2307 of 2355) UNSUPPORTED: lldb-api :: functionalities/darwin_log/filter/exact_match/activity/TestDarwinLogFilterMatchActivity.py (2308 of 2355) PASS: lldb-shell :: ObjectFile/MachO/subsections.yaml (2309 of 2355) PASS: lldb-api :: python_api/function_symbol/TestDisasmAPI.py (2310 of 2355) UNSUPPORTED: lldb-shell :: SymbolFile/NativePDB/stack_unwinding01.cpp (2311 of 2355) PASS: lldb-unit :: Utility/./UtilityTests/RangeTest.SetRangeBase (2312 of 2355) PASS: lldb-api :: commands/expression/completion/TestExprCompletion.py (2313 of 2355) PASS: lldb-unit :: API/./APITests/SBCommandInterpreterTest.SingleWordCommand (2314 of 2355) PASS: lldb-unit :: Utility/./UtilityTests/StreamTest.AddressSize (2315 of 2355) PASS: lldb-api :: terminal/TestSTTYBeforeAndAfter.py (2316 of 2355) PASS: lldb-shell :: Host/TestCustomShell.test (2317 of 2355) PASS: lldb-api :: lang/c/step-target/TestStepTarget.py (2318 of 2355) PASS: lldb-unit :: Language/CPlusPlus/./LanguageCPlusPlusTests/CPlusPlusLanguage.ExtractContextAndIdentifier (2319 of 2355) PASS: lldb-unit :: Utility/./UtilityTests/StringListTest.LongestCommonPrefixDuplicateElement (2320 of 2355) PASS: lldb-api :: commands/expression/import-std-module/stack/TestStackFromStdModule.py (2321 of 2355) PASS: lldb-unit :: Core/./LLDBCoreTests/ModuleSpecTest.TestELFFile (2322 of 2355) PASS: lldb-api :: functionalities/tail_call_frames/sbapi_support/TestTailCallFrameSBAPI.py (2323 of 2355) PASS: lldb-api :: functionalities/set-data/TestSetData.py (2324 of 2355) PASS: lldb-unit :: Utility/./UtilityTests/ArgsTest.TestSingleQuotedArgWithSpace (2325 of 2355) PASS: lldb-unit :: ScriptInterpreter/Python/./ScriptInterpreterPythonTests/PythonDataObjectsTest.TestPythonCallableCheck (2326 of 2355) PASS: lldb-unit :: Host/./HostTests/FileSystemTest.Readable (2327 of 2355) PASS: lldb-unit :: Utility/./UtilityTests/FileSpecTest.GetPath (2328 of 2355) PASS: lldb-unit :: Process/minidump/./LLDBMinidumpTests/MinidumpParserTest.FindMemoryRangeWithFullMemoryMinidump (2329 of 2355) PASS: lldb-unit :: UnwindAssembly/x86/./UnwindAssemblyx86Tests/Testx86AssemblyInspectionEngine.TestPopEBP (2330 of 2355) UNSUPPORTED: lldb-shell :: Register/x86-ymm-write.test (2331 of 2355) PASS: lldb-unit :: Process/Utility/./ProcessUtilityTests/ProcSMapTests/LinuxProcSMapsTestFixture.ParseSMapRegions/3 (2332 of 2355) PASS: lldb-unit :: Utility/./UtilityTests/StreamTest.PutHex8 (2333 of 2355) PASS: lldb-unit :: Utility/./UtilityTests/RegularExpression.Match (2334 of 2355) PASS: lldb-api :: functionalities/thread/step_out/TestThreadStepOut.py (2335 of 2355) PASS: lldb-shell :: Reproducer/TestCrash.test (2336 of 2355) PASS: lldb-api :: commands/expression/import-std-module/array/TestArrayFromStdModule.py (2337 of 2355) PASS: lldb-shell :: Driver/TestProcessAttach.test (2338 of 2355) PASS: lldb-api :: lang/objc/foundation/TestObjCMethods.py (2339 of 2355) PASS: lldb-unit :: Symbol/./SymbolTests/TestCreateClassTemplateDecl.FindExistingTemplatesWithParameterPack (2340 of 2355) PASS: lldb-shell :: SymbolFile/Breakpad/stack-cfi-parsing.test (2341 of 2355) UNSUPPORTED: lldb-api :: commands/register/register/intel_xtended_registers/TestMPXRegisters.py (2342 of 2355) PASS: lldb-unit :: Utility/./UtilityTests/SerializationRountripTest.SerializeDeserializeCStringArrayNullptrElem (2343 of 2355) PASS: lldb-api :: lang/cpp/wchar_t/TestCxxWCharT.py (2344 of 2355) PASS: lldb-unit :: Utility/./UtilityTests/StreamTest.PutNHex8 (2345 of 2355) UNSUPPORTED: lldb-api :: lang/objc/foundation/TestFoundationDisassembly.py (2346 of 2355) PASS: lldb-shell :: SymbolFile/DWARF/x86/gnu-style-compression.cpp (2347 of 2355) PASS: lldb-unit :: Utility/./UtilityTests/UriParserTest.Empty (2348 of 2355) PASS: lldb-api :: functionalities/data-formatter/type_summary_list_arg/TestTypeSummaryListArg.py (2349 of 2355) PASS: lldb-api :: functionalities/inferior-crashing/recursive-inferior/TestRecursiveInferiorStep.py (2350 of 2355) PASS: lldb-api :: lang/objc/variadic_methods/TestVariadicMethods.py (2351 of 2355) PASS: lldb-unit :: Expression/./ExpressionTests/CppModuleConfigurationTest.Linux (2352 of 2355) PASS: lldb-api :: commands/expression/cast_int_to_anonymous_enum/TestCastIntToAnonymousEnum.py (2353 of 2355) PASS: lldb-api :: python_api/frame/TestFrames.py (2354 of 2355) PASS: lldb-api :: lang/objc/foundation/TestObjCMethodsNSError.py (2355 of 2355) Slowest Tests: -------------------------------------------------------------------------- 263.11s: lldb-api :: tools/lldb-server/TestLldbGdbServer.py 131.66s: lldb-api :: functionalities/memory-region/TestMemoryRegion.py 127.25s: lldb-api :: api/multithreaded/TestMultithreaded.py 106.84s: lldb-api :: macosx/skinny-corefile/TestSkinnyCorefile.py 91.36s: lldb-api :: functionalities/gdb_remote_client/TestWasm.py 84.81s: lldb-api :: types/TestLongTypesExpr.py 79.20s: lldb-api :: lang/objc/exceptions/TestObjCExceptions.py 70.69s: lldb-api :: commands/expression/import-std-module/queue/TestQueueFromStdModule.py 69.93s: lldb-api :: commands/expression/import-std-module/stack/TestStackFromStdModule.py 66.45s: lldb-api :: lang/cpp/namespace/TestNamespaceLookup.py 64.33s: lldb-api :: lang/objc/objc-new-syntax/TestObjCNewSyntaxLiteral.py 63.87s: lldb-api :: commands/expression/import-std-module/deque-dbg-info-content/TestDbgInfoContentDequeFromStdModule.py 60.63s: lldb-api :: lang/objc/hidden-ivars/TestHiddenIvars.py 59.10s: lldb-api :: lang/objc/foundation/TestObjCMethods.py 57.94s: lldb-api :: commands/expression/import-std-module/vector/TestVectorFromStdModule.py 57.07s: lldb-api :: types/TestIntegerTypeExpr.py 50.82s: lldb-api :: commands/expression/import-std-module/deque-basic/TestDequeFromStdModule.py 50.63s: lldb-api :: tools/lldb-server/TestGdbRemoteThreadsInStopReply.py 50.13s: lldb-api :: python_api/target/TestTargetAPI.py 48.91s: lldb-api :: lang/objc/objc-new-syntax/TestObjCNewSyntaxArray.py

Hide Details

Tests Times: -------------------------------------------------------------------------- [ Range ] :: [ Percentage ] :: [ Count ] -------------------------------------------------------------------------- [260s,280s) :: [ ] :: [ 1/2355] [240s,260s) :: [ ] :: [ 0/2355] [220s,240s) :: [ ] :: [ 0/2355] [200s,220s) :: [ ] :: [ 0/2355] [180s,200s) :: [ ] :: [ 0/2355] [160s,180s) :: [ ] :: [ 0/2355] [140s,160s) :: [ ] :: [ 1/2355] [120s,140s) :: [ ] :: [ 1/2355] [100s,120s) :: [ ] :: [ 1/2355] [ 80s,100s) :: [ ] :: [ 3/2355] [ 60s, 80s) :: [ ] :: [ 9/2355] [ 40s, 60s) :: [ ] :: [ 13/2355] [ 20s, 40s) :: [* ] :: [ 68/2355] [ 0s, 20s) :: [************************************** ] :: [2258/2355] -------------------------------------------------------------------------- ******************** Failed Tests (3): lldb-api :: tools/lldb-vscode/breakpoint/TestVSCode_setBreakpoints.py lldb-api :: tools/lldb-vscode/breakpoint/TestVSCode_setFunctionBreakpoints.py lldb-api :: tools/lldb-vscode/evaluate/TestVSCode_evaluate.py

Hide Details

Hide Details

Testing Time: 2431.97s Unsupported : 212 Passed : 2130 Expectedly Failed: 10 Failed : 3 FAILED: tools/lldb/test/CMakeFiles/check-lldb cd /Users/buildslave/jenkins/workspace/lldb-cmake-sanitized/lldb-build/tools/lldb/test && /usr/local/Frameworks/Python.framework/Versions/3.7/bin/python3.7 /Users/buildslave/jenkins/workspace/lldb-cmake-sanitized/lldb-build/./bin/llvm-lit -v --time-tests --shuffle --xunit-xml-output=/Users/buildslave/jenkins/workspace/lldb-cmake-sanitized/test/results.xml -v -j 4 --timeout 1200 /Users/buildslave/jenkins/workspace/lldb-cmake-sanitized/lldb-build/tools/lldb/test ninja: build stopped: subcommand failed. Command failed: Command '['/usr/bin/env', 'TERM=vt100', '/usr/local/bin/ninja', '-v', 'check-lldb']' returned non-zero exit status 1. Command: ['/usr/bin/env', 'TERM=vt100', '/usr/local/bin/ninja', '-v', 'check-lldb'] [Pipeline] } [Pipeline] // timeout [Pipeline] } [Pipeline] // stage [Pipeline] stage [Pipeline] { (Declarative: Post Actions) [Pipeline] scanForIssues [Clang (LLVM based)] Sleeping for 5 seconds due to JENKINS-32191... [Clang (LLVM based)] Parsing console log (workspace: '/Users/buildslave/jenkins/workspace/lldb-cmake-sanitized') [Clang (LLVM based)] Successfully parsed console log [Clang (LLVM based)] -> found 5 issues (skipped 3 duplicates) [Clang (LLVM based)] [-ERROR-] Can't create fingerprints for some files: [Clang (LLVM based)] [-ERROR-] - '/Users/buildslave/jenkins/workspace/lldb-cmake-sanitized/lldb-build/{"body":{"category":"console","output":"/Users/buildslave/jenkins/workspace/lldb-cmake-sanitized/llvm-project/lldb/tools/lldb-vscode/ProgressEvent.cpp', IO exception has been thrown: java.nio.file.NoSuchFileException: /Users/buildslave/jenkins/workspace/lldb-cmake-sanitized/lldb-build/{"body":{"category":"console","output":"/Users/buildslave/jenkins/workspace/lldb-cmake-sanitized/llvm-project/lldb/tools/lldb-vscode/ProgressEvent.cpp [Clang (LLVM based)] [-ERROR-] - '/Users/buildslave/jenkins/workspace/lldb-cmake-sanitized/lldb-build/{"body":{"category":"console","output":"/Users/buildslave/jenkins/workspace/lldb-cmake-sanitized/llvm-project/lldb/tools/lldb-vscode/ProgressEvent.cpp', IO exception has been thrown: java.nio.file.NoSuchFileException: /Users/buildslave/jenkins/workspace/lldb-cmake-sanitized/lldb-build/{"body":{"category":"console","output":"/Users/buildslave/jenkins/workspace/lldb-cmake-sanitized/llvm-project/lldb/tools/lldb-vscode/ProgressEvent.cpp [Clang (LLVM based)] Post processing issues on 'green-dragon-23' with source code encoding 'UTF-8' [Clang (LLVM based)] Creating SCM blamer to obtain author and commit information for affected files [Clang (LLVM based)] -> No blamer installed yet. You need to install the 'git-forensics' plugin to enable blaming for Git. [Clang (LLVM based)] Resolving file names for all issues in source directory '/Users/buildslave/jenkins/workspace/lldb-cmake-sanitized' [Clang (LLVM based)] -> resolved paths in source directory (3 found, 1 not found) [Clang (LLVM based)] Resolving module names from module definitions (build.xml, pom.xml, or Manifest.mf files) [Clang (LLVM based)] -> resolved module names for 5 issues [Clang (LLVM based)] Resolving package names (or namespaces) by parsing the affected files [Clang (LLVM based)] -> resolved package names of 4 affected files [Clang (LLVM based)] No filter has been set, publishing all 5 issues [Clang (LLVM based)] Creating fingerprints for all affected code blocks to track issues over different builds [Clang (LLVM based)] -> created fingerprints for 3 issues (skipped 2 issues) [Clang (LLVM based)] Copying affected files to Jenkins' build folder '/Users/Shared/Jenkins/Home/jobs/lldb-cmake-sanitized/builds/1901/files-with-issues' [Clang (LLVM based)] -> 3 copied, 0 not in workspace, 2 not-found, 0 with I/O error [Clang (LLVM based)] Repository miner is not configured, skipping repository mining [Pipeline] junit Recording test results [Checks API] No suitable checks publisher found. [Pipeline] } [Pipeline] // stage [Pipeline] } [Pipeline] // withEnv [Pipeline] } [Pipeline] // node [Pipeline] End of Pipeline ERROR: script returned exit code 1 Finished: FAILURE