Console Output

Skipping 9,652 KB.. Full Log
PASS: lldb-api :: functionalities/unwind/sigtramp/TestSigtrampUnwind.py (1867 of 2355)
PASS: lldb-shell :: ObjectFile/ELF/PT_LOAD-overlap-PT_TLS.yaml (1868 of 2355)
PASS: lldb-api :: commands/expression/anonymous-struct/TestCallUserAnonTypedef.py (1869 of 2355)
PASS: lldb-shell :: Driver/LocalLLDBInit.test (1870 of 2355)
PASS: lldb-shell :: Commands/command-disassemble.s (1871 of 2355)
UNSUPPORTED: lldb-shell :: ScriptInterpreter/Lua/lua-python.test (1872 of 2355)
PASS: lldb-api :: functionalities/data-formatter/data-formatter-stl/libcxx/string/TestDataFormatterLibcxxString.py (1873 of 2355)
PASS: lldb-api :: lang/objc/objc-checker/TestObjCCheckers.py (1874 of 2355)
PASS: lldb-unit :: Utility/./UtilityTests/StringLexerTest.PutBack (1875 of 2355)
UNSUPPORTED: lldb-api :: functionalities/tty/TestTerminal.py (1876 of 2355)
PASS: lldb-api :: python_api/value/linked_list/TestValueAPILinkedList.py (1877 of 2355)
PASS: lldb-api :: commands/expression/import-std-module/shared_ptr/TestSharedPtrFromStdModule.py (1878 of 2355)
PASS: lldb-shell :: Breakpoint/split-dwarf-5-addrbase.test (1879 of 2355)
PASS: lldb-unit :: Symbol/./SymbolTests/TestClangASTImporter.MetadataPropagation (1880 of 2355)
PASS: lldb-api :: functionalities/data-formatter/ostypeformatting/TestFormattersOsType.py (1881 of 2355)
PASS: lldb-unit :: Host/./HostTests/HostInfoTest.GetXcodeSDK (1882 of 2355)
PASS: lldb-api :: tools/lldb-server/TestGdbRemoteAttach.py (1883 of 2355)
PASS: lldb-api :: commands/process/launch-with-shellexpand/TestLaunchWithShellExpand.py (1884 of 2355)
PASS: lldb-unit :: Utility/./UtilityTests/StringListTest.CopyListSingle (1885 of 2355)
PASS: lldb-unit :: Utility/./UtilityTests/Flags.AllClear (1886 of 2355)
PASS: lldb-unit :: Utility/./UtilityTests/StringListTest.AppendList (1887 of 2355)
UNSUPPORTED: lldb-api :: lang/cpp/function-template-parameter-pack/TestFunctionTemplateParameterPack.py (1888 of 2355)
PASS: lldb-unit :: Expression/./ExpressionTests/ClangHostTest.MacOSX (1889 of 2355)
PASS: lldb-unit :: ObjectFile/ELF/./ObjectFileELFTests/ObjectFileELFTest.GetModuleSpecifications_EarlySectionHeaders (1890 of 2355)
PASS: lldb-api :: functionalities/thread_plan/TestThreadPlanCommands.py (1891 of 2355)
PASS: lldb-unit :: ObjectFile/Breakpad/./ObjectFileBreakpadTests/Record.classify (1892 of 2355)
PASS: lldb-shell :: SymbolFile/DWARF/x86/DW_AT_location-DW_AT_const_value.s (1893 of 2355)
PASS: lldb-unit :: ScriptInterpreter/Python/./ScriptInterpreterPythonTests/PythonDataObjectsTest.TestPythonListValueEquality (1894 of 2355)
PASS: lldb-unit :: Symbol/./SymbolTests/TestTypeSystemClang.TestOwningModule (1895 of 2355)
UNSUPPORTED: lldb-api :: functionalities/tsan/cpp_global_location/TestTsanCPPGlobalLocation.py (1896 of 2355)
PASS: lldb-unit :: Process/minidump/./LLDBMinidumpTests/MinidumpParserTest.GetPidWindows (1897 of 2355)
PASS: lldb-unit :: Utility/./UtilityTests/AnsiTerminal.Basic (1898 of 2355)
PASS: lldb-api :: lang/cpp/template-arguments/TestCppTemplateArguments.py (1899 of 2355)
PASS: lldb-api :: functionalities/thread/thread_exit/TestThreadExit.py (1900 of 2355)
UNSUPPORTED: lldb-shell :: Subprocess/clone-follow-parent.test (1901 of 2355)
PASS: lldb-api :: python_api/process/io/TestProcessIO.py (1902 of 2355)
PASS: lldb-unit :: SymbolFile/DWARF/./SymbolFileDWARFTests/SymbolFileDWARFTests.ParseArangesNonzeroSegmentSize (1903 of 2355)
PASS: lldb-unit :: Expression/./ExpressionTests/CppModuleConfigurationTest.Sysroot (1904 of 2355)
PASS: lldb-unit :: ObjectFile/Breakpad/./ObjectFileBreakpadTests/StackWinRecord.parse (1905 of 2355)
PASS: lldb-shell :: SymbolFile/DWARF/x86/dwarf5-index-is-used.cpp (1906 of 2355)
PASS: lldb-api :: functionalities/data-formatter/data-formatter-stl/libcxx/optional/TestDataFormatterLibcxxOptional.py (1907 of 2355)
PASS: lldb-api :: api/command-return-object/TestSBCommandReturnObject.py (1908 of 2355)
PASS: lldb-unit :: Utility/./UtilityTests/RegisterValueTest.GetScalarValue (1909 of 2355)
PASS: lldb-api :: functionalities/non-overlapping-index-variable-i/TestIndexVariable.py (1910 of 2355)
PASS: lldb-unit :: Host/./HostTests/SocketTests/SocketTest.UDPConnect/ipv6 (1911 of 2355)
PASS: lldb-unit :: Symbol/./SymbolTests/TestTypeSystemClang.TestGetEnumIntegerTypeBasicTypes (1912 of 2355)
PASS: lldb-api :: functionalities/inferior-assert/TestInferiorAssert.py (1913 of 2355)
PASS: lldb-api :: functionalities/memory/tag/TestMemoryTag.py (1914 of 2355)
PASS: lldb-api :: functionalities/mtc/simple/TestMTCSimple.py (1915 of 2355)
PASS: lldb-shell :: Minidump/memory-region.yaml (1916 of 2355)
PASS: lldb-shell :: Register/Core/x86-64-freebsd-addr.test (1917 of 2355)
PASS: lldb-api :: commands/watchpoints/step_over_watchpoint/TestStepOverWatchpoint.py (1918 of 2355)
PASS: lldb-unit :: Symbol/./SymbolTests/TestTypeSystemClang.TestConvertAccessTypeToAccessSpecifier (1919 of 2355)
PASS: lldb-api :: api/multiple-debuggers/TestMultipleDebuggers.py (1920 of 2355)
PASS: lldb-api :: lang/objc/objc-foundation-dictionary-empty/TestNSDictionary0.py (1921 of 2355)
UNSUPPORTED: lldb-shell :: SymbolFile/PDB/ast-restore.test (1922 of 2355)
PASS: lldb-unit :: Utility/./UtilityTests/UriParserTest.SchemeHostSeparator3 (1923 of 2355)
PASS: lldb-api :: functionalities/data-formatter/setvaluefromcstring/TestSetValueFromCString.py (1924 of 2355)
PASS: lldb-api :: tools/lldb-server/TestGdbRemoteExitCode.py (1925 of 2355)
PASS: lldb-unit :: Utility/./UtilityTests/StreamTest.Indent (1926 of 2355)
PASS: lldb-api :: lang/objc/modules-incomplete/TestIncompleteModules.py (1927 of 2355)
PASS: lldb-api :: commands/expression/import-std-module/forward_list-dbg-info-content/TestDbgInfoContentForwardListFromStdModule.py (1928 of 2355)
PASS: lldb-unit :: Symbol/./SymbolTests/TestTypeSystemClang.TestIsClangType (1929 of 2355)
PASS: lldb-unit :: SymbolFile/NativePDB/./SymbolFileNativePDBTests/PDBFPOProgramToDWARFExpressionTests.MissingTargetRegister (1930 of 2355)
PASS: lldb-api :: lang/cpp/bool/TestCPPBool.py (1931 of 2355)
PASS: lldb-api :: lang/objc/foundation/TestSymbolTable.py (1932 of 2355)
PASS: lldb-api :: lang/cpp/namespace/TestNamespaceLookup.py (1933 of 2355)
PASS: lldb-unit :: Process/Utility/./ProcessUtilityTests/ProcSMapTests/LinuxProcSMapsTestFixture.ParseSMapRegions/1 (1934 of 2355)
PASS: lldb-unit :: Process/Utility/./ProcessUtilityTests/ProcMapTests/LinuxProcMapsTestFixture.ParseMapRegions/6 (1935 of 2355)
XFAIL: lldb-shell :: Register/x86-mm-xmm-read.test (1936 of 2355)
PASS: lldb-unit :: ScriptInterpreter/Python/./ScriptInterpreterPythonTests/PythonDataObjectsTest.TestDictionaryResolutionWithDot (1937 of 2355)
PASS: lldb-api :: commands/expression/error-limit/TestExprErrorLimit.py (1938 of 2355)
PASS: lldb-unit :: Utility/./UtilityTests/StringLexerTest.HasAtLeast (1939 of 2355)
PASS: lldb-unit :: Utility/./UtilityTests/RangeTest.Copy (1940 of 2355)
PASS: lldb-unit :: Process/minidump/./LLDBMinidumpTests/MinidumpParserTest.MinidumpDuplicateModuleSeparateCode (1941 of 2355)
PASS: lldb-unit :: Host/./HostTests/SocketTests/SocketTest.UDPConnect/ipv4 (1942 of 2355)
PASS: lldb-api :: driver/batch_mode/TestBatchMode.py (1943 of 2355)
PASS: lldb-api :: types/TestIntegerTypeExpr.py (1944 of 2355)
PASS: lldb-unit :: Host/./HostTests/SocketTests/SocketTest.TCPListen0ConnectAccept/ipv6 (1945 of 2355)
PASS: lldb-unit :: Host/./HostTests/FileActionTest.Open (1946 of 2355)
UNSUPPORTED: lldb-api :: functionalities/gdb_remote_client/TestQemuAArch64TargetXml.py (1947 of 2355)
PASS: lldb-api :: tools/lldb-vscode/stackTrace/TestVSCode_stackTrace.py (1948 of 2355)
PASS: lldb-unit :: Utility/./UtilityTests/BinaryStreamTest.PutULEB128SevenBytes (1949 of 2355)
PASS: lldb-unit :: Utility/./UtilityTests/BinaryStreamTest.PutULEB128One (1950 of 2355)
PASS: lldb-api :: types/TestFloatTypes.py (1951 of 2355)
PASS: lldb-shell :: SymbolFile/DWARF/x86/subprogram_ranges.test (1952 of 2355)
PASS: lldb-api :: commands/target/stop-hooks/TestStopHooks.py (1953 of 2355)
PASS: lldb-unit :: Utility/./UtilityTests/OptionsWithRawTest.SingleWordSuffix (1954 of 2355)
PASS: lldb-api :: python_api/get-value-32bit-int/TestGetValue32BitInt.py (1955 of 2355)
PASS: lldb-unit :: Utility/./UtilityTests/SubsystemRAIITest.SubsystemWithErrorSuccess (1956 of 2355)
PASS: lldb-unit :: Utility/./UtilityTests/StreamTest.PutRawBytesToBigEndian (1957 of 2355)
PASS: lldb-unit :: Utility/./UtilityTests/BinaryStreamTest.PutSLEB128NineBytes (1958 of 2355)
PASS: lldb-unit :: ScriptInterpreter/Python/./ScriptInterpreterPythonTests/PythonDataObjectsTest.TestPythonCallableCheck (1959 of 2355)
PASS: lldb-unit :: debugserver/./debugserverTests/RNBSocket.LoopBackListenIPv4 (1960 of 2355)
PASS: lldb-api :: api/listeners/TestListener.py (1961 of 2355)
UNSUPPORTED: lldb-shell :: Unwind/basic-block-sections.test (1962 of 2355)
PASS: lldb-api :: functionalities/inferior-changed/TestInferiorChanged.py (1963 of 2355)
UNSUPPORTED: lldb-api :: tools/lldb-vscode/disconnect/TestVSCode_disconnect.py (1964 of 2355)
PASS: lldb-unit :: Host/./HostTests/SocketTests/SocketTest.TCPListen0GetPort/ipv4 (1965 of 2355)
PASS: lldb-unit :: Process/Utility/./ProcessUtilityTests/ProcSMapTests/LinuxProcSMapsTestFixture.ParseSMapRegions/0 (1966 of 2355)
PASS: lldb-shell :: Reproducer/TestWorkingDir.test (1967 of 2355)
PASS: lldb-api :: functionalities/rerun/TestRerun.py (1968 of 2355)
PASS: lldb-unit :: Utility/./UtilityTests/StringListTest.SplitIntoLines (1969 of 2355)
PASS: lldb-unit :: Process/gdb-remote/./ProcessGdbRemoteTests/PortMapTest.FreePort (1970 of 2355)
PASS: lldb-shell :: ScriptInterpreter/Python/scripted_breakpoint_lua.test (1971 of 2355)
UNSUPPORTED: lldb-shell :: ScriptInterpreter/Lua/watchpoint_callback.test (1972 of 2355)
PASS: lldb-unit :: Host/./HostTests/File.GetStreamFromDescriptor (1973 of 2355)
PASS: lldb-unit :: Expression/./ExpressionTests/DiagnosticManagerTest.GetStringMultiline (1974 of 2355)
PASS: lldb-unit :: Process/minidump/./LLDBMinidumpTests/MinidumpParserTest.GetThreadContext_x86_32_wow64 (1975 of 2355)
PASS: lldb-api :: lang/cpp/dereferencing_references/TestCPPDereferencingReferences.py (1976 of 2355)
PASS: lldb-unit :: SymbolFile/NativePDB/./SymbolFileNativePDBTests/PDBFPOProgramToDWARFExpressionTests.UnknownOp (1977 of 2355)
PASS: lldb-unit :: Language/Highlighting/./HighlighterTests/HighlighterTest.ClangCursorPosEndOfLine (1978 of 2355)
PASS: lldb-shell :: SymbolFile/DWARF/x86/debug-types-basic.test (1979 of 2355)
PASS: lldb-api :: commands/settings/use_source_cache/TestUseSourceCache.py (1980 of 2355)
PASS: lldb-unit :: Utility/./UtilityTests/StringListTest.AppendStringCString (1981 of 2355)
PASS: lldb-unit :: Utility/./UtilityTests/RangeTest.Constructor (1982 of 2355)
PASS: lldb-api :: commands/watchpoints/watchpoint_size/TestWatchpointSizes.py (1983 of 2355)
PASS: lldb-api :: python_api/lldbutil/frame/TestFrameUtils.py (1984 of 2355)
PASS: lldb-api :: lang/cpp/reference-to-outer-type/TestCppReferenceToOuterClass.py (1985 of 2355)
PASS: lldb-shell :: ScriptInterpreter/Python/Crashlog/parser_json.test (1986 of 2355)
PASS: lldb-api :: commands/target/modules/search-paths/insert/TestTargetModulesSearchpathsInsert.py (1987 of 2355)
PASS: lldb-unit :: Utility/./UtilityTests/ArgsTest.TestArgv (1988 of 2355)
PASS: lldb-unit :: Utility/./UtilityTests/DataExtractorTest.PeekData (1989 of 2355)
PASS: lldb-api :: commands/register/register/register_command/TestRegisters.py (1990 of 2355)
PASS: lldb-api :: lang/cpp/rvalue-references/TestRvalueReferences.py (1991 of 2355)
UNSUPPORTED: lldb-shell :: ScriptInterpreter/Lua/breakpoint_callback.test (1992 of 2355)
PASS: lldb-unit :: Utility/./UtilityTests/StreamTest.AddressRangeSize (1993 of 2355)
PASS: lldb-unit :: Language/Highlighting/./HighlighterTests/HighlighterTest.ClangPreserveNewLine (1994 of 2355)
PASS: lldb-unit :: Target/./TargetTests/PathMappingListTest.AbsoluteTests (1995 of 2355)
FAIL: lldb-api :: functionalities/data-formatter/data-formatter-stl/libcxx/unordered/TestDataFormatterUnordered.py (1996 of 2355)
******************** TEST 'lldb-api :: functionalities/data-formatter/data-formatter-stl/libcxx/unordered/TestDataFormatterUnordered.py' FAILED ********************
Script:
--
/Users/buildslave/jenkins/workspace/lldb-cmake-sanitized/lldb-build/lldb-test-build.noindex/copied-python /Users/buildslave/jenkins/workspace/lldb-cmake-sanitized/llvm-project/lldb/test/API/dotest.py -u CXXFLAGS -u CFLAGS --codesign-identity lldb_codesign --arch x86_64 --build-dir /Users/buildslave/jenkins/workspace/lldb-cmake-sanitized/lldb-build/lldb-test-build.noindex -t --env TERM=vt100 --env LLVM_LIBS_DIR=/Users/buildslave/jenkins/workspace/lldb-cmake-sanitized/lldb-build/./lib --inferior-env ASAN_OPTIONS=detect_stack_use_after_return=1 --inferior-env DYLD_INSERT_LIBRARIES=/Users/buildslave/jenkins/workspace/lldb-cmake-sanitized/host-compiler/lib/clang/13.0.99/lib/darwin/libclang_rt.asan_osx_dynamic.dylib --arch x86_64 --build-dir /Users/buildslave/jenkins/workspace/lldb-cmake-sanitized/lldb-build/lldb-test-build.noindex --lldb-module-cache-dir /Users/buildslave/jenkins/workspace/lldb-cmake-sanitized/lldb-build/lldb-test-build.noindex/module-cache-lldb/lldb-api --clang-module-cache-dir /Users/buildslave/jenkins/workspace/lldb-cmake-sanitized/lldb-build/lldb-test-build.noindex/module-cache-clang/lldb-api --executable /Users/buildslave/jenkins/workspace/lldb-cmake-sanitized/lldb-build/./bin/lldb --compiler /Users/buildslave/jenkins/workspace/lldb-cmake-sanitized/host-compiler/bin/clang --dsymutil /Users/buildslave/jenkins/workspace/lldb-cmake-sanitized/lldb-build/./bin/dsymutil --llvm-tools-dir /Users/buildslave/jenkins/workspace/lldb-cmake-sanitized/lldb-build/./bin --lldb-libs-dir /Users/buildslave/jenkins/workspace/lldb-cmake-sanitized/lldb-build/./lib /Users/buildslave/jenkins/workspace/lldb-cmake-sanitized/llvm-project/lldb/test/API/functionalities/data-formatter/data-formatter-stl/libcxx/unordered -p TestDataFormatterUnordered.py
--
Exit Code: 1

Hide Details

Command Output (stdout): -- lldb version 13.0.99 (http://labmaster3.local/git/llvm-project.git revision 95923c0ba245377205f783607aaacbf8c667b353) clang revision 95923c0ba245377205f783607aaacbf8c667b353 llvm revision 95923c0ba245377205f783607aaacbf8c667b353 Skipping the following test categories: ['darwin-log', 'libstdcxx', 'dwo', 'llgs', 'fork']

Hide Details

-- Command Output (stderr): -- Change dir to: /Users/buildslave/jenkins/workspace/lldb-cmake-sanitized/llvm-project/lldb/test/API/functionalities/data-formatter/data-formatter-stl/libcxx/unordered runCmd: settings clear -all output:

Hide Details

runCmd: settings set symbols.enable-external-lookup false output:

Hide Details

runCmd: settings set target.inherit-tcc true output:

Hide Details

runCmd: settings set target.detach-on-error false output:

Hide Details

runCmd: settings set target.auto-apply-fixits false output:

Hide Details

runCmd: settings set plugin.process.gdb-remote.packet-timeout 60 output:

Hide Details

runCmd: settings set symbols.clang-modules-cache-path "/Users/buildslave/jenkins/workspace/lldb-cmake-sanitized/lldb-build/lldb-test-build.noindex/module-cache-lldb/lldb-api" output:

Hide Details

runCmd: settings set use-color false output:

Hide Details

runCmd: setting set target.prefer-dynamic-value no-dynamic-values output:

Hide Details

runCmd: settings set target.env-vars ASAN_OPTIONS=detect_stack_use_after_return=1 DYLD_INSERT_LIBRARIES=/Users/buildslave/jenkins/workspace/lldb-cmake-sanitized/host-compiler/lib/clang/13.0.99/lib/darwin/libclang_rt.asan_osx_dynamic.dylib output:

Hide Details

runCmd: file /Users/buildslave/jenkins/workspace/lldb-cmake-sanitized/lldb-build/lldb-test-build.noindex/functionalities/data-formatter/data-formatter-stl/libcxx/unordered/TestDataFormatterUnordered.test_with_run_command_dsym/a.out output: Current executable set to '/Users/buildslave/jenkins/workspace/lldb-cmake-sanitized/lldb-build/lldb-test-build.noindex/functionalities/data-formatter/data-formatter-stl/libcxx/unordered/TestDataFormatterUnordered.test_with_run_command_dsym/a.out' (x86_64).

Hide Details

Hide Details

runCmd: breakpoint set -p "Set break point at this line." output: Breakpoint 1: 6 locations.

Hide Details

Hide Details

Expecting pattern: ^Breakpoint (?P<bpno>[0-9]+): (?P<num_locations>[0-9]+) locations\.$ Matched

Hide Details

runCmd: run output: Process 90530 stopped * thread #1, queue = 'com.apple.main-thread', stop reason = breakpoint 1.1 frame #0: 0x0000000100001727 a.out`main at main.cpp:35:2 32 map.emplace(3,"this"); 33 map.emplace(4,"is"); 34 map.emplace(5,"me"); -> 35 thefoo_rw(); // Set break point at this line. ^ 36 37 intstr_mmap mmap; 38 mmap.emplace(1,"hello"); Process 90530 launched: '/Users/buildslave/jenkins/workspace/lldb-cmake-sanitized/lldb-build/lldb-test-build.noindex/functionalities/data-formatter/data-formatter-stl/libcxx/unordered/TestDataFormatterUnordered.test_with_run_command_dsym/a.out' (x86_64)

Hide Details

Hide Details

runCmd: thread list output: Process 90530 stopped * thread #1: tid = 0x32c980, 0x0000000100001727 a.out`main at main.cpp:35:2, queue = 'com.apple.main-thread', stop reason = breakpoint 1.1

Hide Details

Hide Details

Ran command: "thread list"

Hide Details

Got output: Process 90530 stopped * thread #1: tid = 0x32c980, 0x0000000100001727 a.out`main at main.cpp:35:2, queue = 'com.apple.main-thread', stop reason = breakpoint 1.1

Hide Details

Expecting sub string: "stopped" (was found) Expecting sub string: "stop reason = breakpoint" (was found)

Hide Details

Adding tearDown hook: def cleanup(): self.runCmd('type format clear', check=False) self.runCmd('type summary clear', check=False) self.runCmd('type filter clear', check=False) self.runCmd('type synth clear', check=False) self.runCmd( "settings set target.max-children-count 256", check=False)

Hide Details

Hide Details

runCmd: frame variable map output: (std::unordered_map<int, std::basic_string<char, std::char_traits<char>, std::allocator<char> >, std::hash<int>, std::equal_to<int>, std::allocator<std::pair<const int, std::basic_string<char, std::char_traits<char>, std::allocator<char> > > > >) map = size=5 { [0] = { __cc = (first = 5, second = "me") } [1] = { __cc = (first = 4, second = "is") } [2] = { __cc = (first = 3, second = "this") } [3] = { __cc = (first = 2, second = "world") } [4] = { __cc = (first = 1, second = "hello") } }

Hide Details

Hide Details

Ran command: "frame variable map"

Hide Details

Got output: (std::unordered_map<int, std::basic_string<char, std::char_traits<char>, std::allocator<char> >, std::hash<int>, std::equal_to<int>, std::allocator<std::pair<const int, std::basic_string<char, std::char_traits<char>, std::allocator<char> > > > >) map = size=5 { [0] = { __cc = (first = 5, second = "me") } [1] = { __cc = (first = 4, second = "is") } [2] = { __cc = (first = 3, second = "this") } [3] = { __cc = (first = 2, second = "world") } [4] = { __cc = (first = 1, second = "hello") } }

Hide Details

Expecting regex pattern: "std::unordered_map" (was found, matched "std::unordered_map") Expecting regex pattern: "size=5 {" (was found, matched "size=5 {") Expecting regex pattern: "hello" (was found, matched "hello") Expecting regex pattern: "world" (was found, matched "world") Expecting regex pattern: "this" (was found, matched "this") Expecting regex pattern: "is" (was found, matched "is") Expecting regex pattern: "me" (was found, matched "me")

Hide Details

runCmd: frame variable map output: (std::unordered_map<int, std::basic_string<char, std::char_traits<char>, std::allocator<char> >, std::hash<int>, std::equal_to<int>, std::allocator<std::pair<const int, std::basic_string<char, std::char_traits<char>, std::allocator<char> > > > >) map = size=5 { [0] = { __cc = (first = 5, second = "me") } [1] = { __cc = (first = 4, second = "is") } [2] = { __cc = (first = 3, second = "this") } [3] = { __cc = (first = 2, second = "world") } [4] = { __cc = (first = 1, second = "hello") } }

Hide Details

Hide Details

Ran command: "frame variable map"

Hide Details

Got output: (std::unordered_map<int, std::basic_string<char, std::char_traits<char>, std::allocator<char> >, std::hash<int>, std::equal_to<int>, std::allocator<std::pair<const int, std::basic_string<char, std::char_traits<char>, std::allocator<char> > > > >) map = size=5 { [0] = { __cc = (first = 5, second = "me") } [1] = { __cc = (first = 4, second = "is") } [2] = { __cc = (first = 3, second = "this") } [3] = { __cc = (first = 2, second = "world") } [4] = { __cc = (first = 1, second = "hello") } }

Hide Details

Expecting regex pattern: "std::unordered_map" (was found, matched "std::unordered_map") Expecting regex pattern: "size=5 {" (was found, matched "size=5 {") Expecting regex pattern: "hello" (was found, matched "hello") Expecting regex pattern: "world" (was found, matched "world") Expecting regex pattern: "this" (was found, matched "this") Expecting regex pattern: "is" (was found, matched "is") Expecting regex pattern: "me" (was found, matched "me")

Hide Details

runCmd: continue output: Process 90530 resuming Process 90530 stopped * thread #1, queue = 'com.apple.main-thread', stop reason = breakpoint 1.2 frame #0: 0x000000010000183f a.out`main at main.cpp:44:2 41 mmap.emplace(3,"this"); 42 mmap.emplace(3,"this"); 43 mmap.emplace(3,"this"); -> 44 thefoo_rw(); // Set break point at this line. ^ 45 46 int_set iset; 47 iset.emplace(1);

Hide Details

Hide Details

runCmd: frame variable mmap output: (std::unordered_multimap<int, std::basic_string<char, std::char_traits<char>, std::allocator<char> >, std::hash<int>, std::equal_to<int>, std::allocator<std::pair<const int, std::basic_string<char, std::char_traits<char>, std::allocator<char> > > > >) mmap = size=6 { [0] = { __cc = (first = 3, second = "this") } [1] = { __cc = (first = 3, second = "this") } [2] = { __cc = (first = 3, second = "this") } [3] = { __cc = (first = 2, second = "hello") } [4] = { __cc = (first = 2, second = "world") } [5] = { __cc = (first = 1, second = "hello") } }

Hide Details

Hide Details

Ran command: "frame variable mmap"

Hide Details

Got output: (std::unordered_multimap<int, std::basic_string<char, std::char_traits<char>, std::allocator<char> >, std::hash<int>, std::equal_to<int>, std::allocator<std::pair<const int, std::basic_string<char, std::char_traits<char>, std::allocator<char> > > > >) mmap = size=6 { [0] = { __cc = (first = 3, second = "this") } [1] = { __cc = (first = 3, second = "this") } [2] = { __cc = (first = 3, second = "this") } [3] = { __cc = (first = 2, second = "hello") } [4] = { __cc = (first = 2, second = "world") } [5] = { __cc = (first = 1, second = "hello") } }

Hide Details

Expecting regex pattern: "std::unordered_multimap" (was found, matched "std::unordered_multimap") Expecting regex pattern: "size=6 {" (was found, matched "size=6 {") Expecting regex pattern: "first = 3" (was found, matched "first = 3") Expecting regex pattern: "second = "this"" (was found, matched "second = "this"") Expecting regex pattern: "first = 2" (was found, matched "first = 2") Expecting regex pattern: "second = "hello"" (was found, matched "second = "hello"")

Hide Details

runCmd: frame variable mmap output: (std::unordered_multimap<int, std::basic_string<char, std::char_traits<char>, std::allocator<char> >, std::hash<int>, std::equal_to<int>, std::allocator<std::pair<const int, std::basic_string<char, std::char_traits<char>, std::allocator<char> > > > >) mmap = size=6 { [0] = { __cc = (first = 3, second = "this") } [1] = { __cc = (first = 3, second = "this") } [2] = { __cc = (first = 3, second = "this") } [3] = { __cc = (first = 2, second = "hello") } [4] = { __cc = (first = 2, second = "world") } [5] = { __cc = (first = 1, second = "hello") } }

Hide Details

Hide Details

Ran command: "frame variable mmap"

Hide Details

Got output: (std::unordered_multimap<int, std::basic_string<char, std::char_traits<char>, std::allocator<char> >, std::hash<int>, std::equal_to<int>, std::allocator<std::pair<const int, std::basic_string<char, std::char_traits<char>, std::allocator<char> > > > >) mmap = size=6 { [0] = { __cc = (first = 3, second = "this") } [1] = { __cc = (first = 3, second = "this") } [2] = { __cc = (first = 3, second = "this") } [3] = { __cc = (first = 2, second = "hello") } [4] = { __cc = (first = 2, second = "world") } [5] = { __cc = (first = 1, second = "hello") } }

Hide Details

Expecting regex pattern: "std::unordered_multimap" (was found, matched "std::unordered_multimap") Expecting regex pattern: "size=6 {" (was found, matched "size=6 {") Expecting regex pattern: "first = 3" (was found, matched "first = 3") Expecting regex pattern: "second = "this"" (was found, matched "second = "this"") Expecting regex pattern: "first = 2" (was found, matched "first = 2") Expecting regex pattern: "second = "hello"" (was found, matched "second = "hello"")

Hide Details

runCmd: continue output: Process 90530 resuming Process 90530 stopped * thread #1, queue = 'com.apple.main-thread', stop reason = breakpoint 1.3 frame #0: 0x0000000100001927 a.out`main at main.cpp:52:2 49 iset.emplace(3); 50 iset.emplace(4); 51 iset.emplace(5); -> 52 thefoo_rw(); // Set break point at this line. ^ 53 54 str_set sset; 55 sset.emplace("hello");

Hide Details

Hide Details

runCmd: frame variable iset output: (std::unordered_set<int, std::hash<int>, std::equal_to<int>, std::allocator<int> >) iset = size=5 { [0] = 5 [1] = 4 [2] = 3 [3] = 2 [4] = 1 }

Hide Details

Hide Details

Ran command: "frame variable iset"

Hide Details

Got output: (std::unordered_set<int, std::hash<int>, std::equal_to<int>, std::allocator<int> >) iset = size=5 { [0] = 5 [1] = 4 [2] = 3 [3] = 2 [4] = 1 }

Hide Details

Expecting regex pattern: "std::unordered_set" (was found, matched "std::unordered_set") Expecting regex pattern: "size=5 {" (was found, matched "size=5 {") Expecting regex pattern: "\[\d\] = 5" (was found, matched "[0] = 5") Expecting regex pattern: "\[\d\] = 3" (was found, matched "[2] = 3") Expecting regex pattern: "\[\d\] = 2" (was found, matched "[3] = 2")

Hide Details

runCmd: frame variable iset output: (std::unordered_set<int, std::hash<int>, std::equal_to<int>, std::allocator<int> >) iset = size=5 { [0] = 5 [1] = 4 [2] = 3 [3] = 2 [4] = 1 }

Hide Details

Hide Details

Ran command: "frame variable iset"

Hide Details

Got output: (std::unordered_set<int, std::hash<int>, std::equal_to<int>, std::allocator<int> >) iset = size=5 { [0] = 5 [1] = 4 [2] = 3 [3] = 2 [4] = 1 }

Hide Details

Expecting regex pattern: "std::unordered_set" (was found, matched "std::unordered_set") Expecting regex pattern: "size=5 {" (was found, matched "size=5 {") Expecting regex pattern: "\[\d\] = 5" (was found, matched "[0] = 5") Expecting regex pattern: "\[\d\] = 3" (was found, matched "[2] = 3") Expecting regex pattern: "\[\d\] = 2" (was found, matched "[3] = 2")

Hide Details

runCmd: continue output: Process 90530 resuming Process 90530 stopped * thread #1, queue = 'com.apple.main-thread', stop reason = breakpoint 1.4 frame #0: 0x00000001000019dd a.out`main at main.cpp:60:2 57 sset.emplace("this"); 58 sset.emplace("is"); 59 sset.emplace("me"); -> 60 thefoo_rw(); // Set break point at this line. ^ 61 62 int_mset imset; 63 imset.emplace(1);

Hide Details

Hide Details

runCmd: frame variable sset output: (std::unordered_set<std::basic_string<char, std::char_traits<char>, std::allocator<char> >, std::hash<std::basic_string<char, std::char_traits<char>, std::allocator<char> > >, std::equal_to<std::basic_string<char, std::char_traits<char>, std::allocator<char> > >, std::allocator<std::basic_string<char, std::char_traits<char>, std::allocator<char> > > >) sset = size=5 { [0] = "is" [1] = "world" [2] = "me" [3] = "this" [4] = "hello" }

Hide Details

Hide Details

Ran command: "frame variable sset"

Hide Details

Got output: (std::unordered_set<std::basic_string<char, std::char_traits<char>, std::allocator<char> >, std::hash<std::basic_string<char, std::char_traits<char>, std::allocator<char> > >, std::equal_to<std::basic_string<char, std::char_traits<char>, std::allocator<char> > >, std::allocator<std::basic_string<char, std::char_traits<char>, std::allocator<char> > > >) sset = size=5 { [0] = "is" [1] = "world" [2] = "me" [3] = "this" [4] = "hello" }

Hide Details

Expecting regex pattern: "std::unordered_set" (was found, matched "std::unordered_set") Expecting regex pattern: "size=5 {" (was found, matched "size=5 {") Expecting regex pattern: "\[\d\] = "is"" (was found, matched "[0] = "is"") Expecting regex pattern: "\[\d\] = "world"" (was found, matched "[1] = "world"") Expecting regex pattern: "\[\d\] = "hello"" (was found, matched "[4] = "hello"")

Hide Details

runCmd: frame variable sset output: (std::unordered_set<std::basic_string<char, std::char_traits<char>, std::allocator<char> >, std::hash<std::basic_string<char, std::char_traits<char>, std::allocator<char> > >, std::equal_to<std::basic_string<char, std::char_traits<char>, std::allocator<char> > >, std::allocator<std::basic_string<char, std::char_traits<char>, std::allocator<char> > > >) sset = size=5 { [0] = "is" [1] = "world" [2] = "me" [3] = "this" [4] = "hello" }

Hide Details

Hide Details

Ran command: "frame variable sset"

Hide Details

Got output: (std::unordered_set<std::basic_string<char, std::char_traits<char>, std::allocator<char> >, std::hash<std::basic_string<char, std::char_traits<char>, std::allocator<char> > >, std::equal_to<std::basic_string<char, std::char_traits<char>, std::allocator<char> > >, std::allocator<std::basic_string<char, std::char_traits<char>, std::allocator<char> > > >) sset = size=5 { [0] = "is" [1] = "world" [2] = "me" [3] = "this" [4] = "hello" }

Hide Details

Expecting regex pattern: "std::unordered_set" (was found, matched "std::unordered_set") Expecting regex pattern: "size=5 {" (was found, matched "size=5 {") Expecting regex pattern: "\[\d\] = "is"" (was found, matched "[0] = "is"") Expecting regex pattern: "\[\d\] = "world"" (was found, matched "[1] = "world"") Expecting regex pattern: "\[\d\] = "hello"" (was found, matched "[4] = "hello"")

Hide Details

runCmd: continue output: Process 90530 resuming Process 90530 stopped * thread #1, queue = 'com.apple.main-thread', stop reason = breakpoint 1.5 frame #0: 0x0000000100001acb a.out`main at main.cpp:69:2 66 imset.emplace(3); 67 imset.emplace(3); 68 imset.emplace(3); -> 69 thefoo_rw(); // Set break point at this line. ^ 70 71 str_mset smset; 72 smset.emplace("hello");

Hide Details

Hide Details

runCmd: frame variable imset output: (std::unordered_multiset<int, std::hash<int>, std::equal_to<int>, std::allocator<int> >) imset = size=6 { [0] = 3 [1] = 3 [2] = 3 [3] = 2 [4] = 2 [5] = 1 }

Hide Details

Hide Details

Ran command: "frame variable imset"

Hide Details

Got output: (std::unordered_multiset<int, std::hash<int>, std::equal_to<int>, std::allocator<int> >) imset = size=6 { [0] = 3 [1] = 3 [2] = 3 [3] = 2 [4] = 2 [5] = 1 }

Hide Details

Expecting regex pattern: "std::unordered_multiset" (was found, matched "std::unordered_multiset") Expecting regex pattern: "size=6 {" (was found, matched "size=6 {") Expecting regex pattern: "(\[\d\] = 3(\n|.)+){3}" (was found, matched "[0] = 3 [1] = 3 [2] = 3 [3] = 2 [4] = 2 [5] = 1 } ") Expecting regex pattern: "\[\d\] = 2" (was found, matched "[3] = 2") Expecting regex pattern: "\[\d\] = 1" (was found, matched "[5] = 1")

Hide Details

runCmd: frame variable imset output: (std::unordered_multiset<int, std::hash<int>, std::equal_to<int>, std::allocator<int> >) imset = size=6 { [0] = 3 [1] = 3 [2] = 3 [3] = 2 [4] = 2 [5] = 1 }

Hide Details

Hide Details

Ran command: "frame variable imset"

Hide Details

Got output: (std::unordered_multiset<int, std::hash<int>, std::equal_to<int>, std::allocator<int> >) imset = size=6 { [0] = 3 [1] = 3 [2] = 3 [3] = 2 [4] = 2 [5] = 1 }

Hide Details

Expecting regex pattern: "std::unordered_multiset" (was found, matched "std::unordered_multiset") Expecting regex pattern: "size=6 {" (was found, matched "size=6 {") Expecting regex pattern: "(\[\d\] = 3(\n|.)+){3}" (was found, matched "[0] = 3 [1] = 3 [2] = 3 [3] = 2 [4] = 2 [5] = 1 } ") Expecting regex pattern: "\[\d\] = 2" (was found, matched "[3] = 2") Expecting regex pattern: "\[\d\] = 1" (was found, matched "[5] = 1")

Hide Details

runCmd: continue output: Process 90530 resuming Process 90530 stopped * thread #1, queue = 'com.apple.main-thread', stop reason = breakpoint 1.6 frame #0: 0x0000000100001b63 a.out`main at main.cpp:77:2 74 smset.emplace("world"); 75 smset.emplace("is"); 76 smset.emplace("is"); -> 77 thefoo_rw(); // Set break point at this line. ^ 78 79 return 0; 80 }

Hide Details

Hide Details

runCmd: frame variable smset output: (std::unordered_multiset<std::basic_string<char, std::char_traits<char>, std::allocator<char> >, std::hash<std::basic_string<char, std::char_traits<char>, std::allocator<char> > >, std::equal_to<std::basic_string<char, std::char_traits<char>, std::allocator<char> > >, std::allocator<std::basic_string<char, std::char_traits<char>, std::allocator<char> > > >) smset = size=5 { [0] = "is" [1] = "is" [2] = "world" [3] = "world" [4] = "hello" }

Hide Details

Hide Details

Ran command: "frame variable smset"

Hide Details

Got output: (std::unordered_multiset<std::basic_string<char, std::char_traits<char>, std::allocator<char> >, std::hash<std::basic_string<char, std::char_traits<char>, std::allocator<char> > >, std::equal_to<std::basic_string<char, std::char_traits<char>, std::allocator<char> > >, std::allocator<std::basic_string<char, std::char_traits<char>, std::allocator<char> > > >) smset = size=5 { [0] = "is" [1] = "is" [2] = "world" [3] = "world" [4] = "hello" }

Hide Details

Expecting regex pattern: "std::unordered_multiset" (was found, matched "std::unordered_multiset") Expecting regex pattern: "size=5 {" (was found, matched "size=5 {") Expecting regex pattern: "(\[\d\] = "is"(\n|.)+){2}" (was found, matched "[0] = "is" [1] = "is" [2] = "world" [3] = "world" [4] = "hello" } ") Expecting regex pattern: "(\[\d\] = "world"(\n|.)+){2}" (was found, matched "[2] = "world" [3] = "world" [4] = "hello" } ")

Hide Details

runCmd: frame variable smset output: (std::unordered_multiset<std::basic_string<char, std::char_traits<char>, std::allocator<char> >, std::hash<std::basic_string<char, std::char_traits<char>, std::allocator<char> > >, std::equal_to<std::basic_string<char, std::char_traits<char>, std::allocator<char> > >, std::allocator<std::basic_string<char, std::char_traits<char>, std::allocator<char> > > >) smset = size=5 { [0] = "is" [1] = "is" [2] = "world" [3] = "world" [4] = "hello" }

Hide Details

Hide Details

Ran command: "frame variable smset"

Hide Details

Got output: (std::unordered_multiset<std::basic_string<char, std::char_traits<char>, std::allocator<char> >, std::hash<std::basic_string<char, std::char_traits<char>, std::allocator<char> > >, std::equal_to<std::basic_string<char, std::char_traits<char>, std::allocator<char> > >, std::allocator<std::basic_string<char, std::char_traits<char>, std::allocator<char> > > >) smset = size=5 { [0] = "is" [1] = "is" [2] = "world" [3] = "world" [4] = "hello" }

Hide Details

Expecting regex pattern: "std::unordered_multiset" (was found, matched "std::unordered_multiset") Expecting regex pattern: "size=5 {" (was found, matched "size=5 {") Expecting regex pattern: "(\[\d\] = "is"(\n|.)+){2}" (was found, matched "[0] = "is" [1] = "is" [2] = "world" [3] = "world" [4] = "hello" } ") Expecting regex pattern: "(\[\d\] = "world"(\n|.)+){2}" (was found, matched "[2] = "world" [3] = "world" [4] = "hello" } ")

Hide Details

runCmd: continue output: Process 90530 resuming Process 90530 exited with status = 0 (0x00000000)

Hide Details

Hide Details

<bound method SBProcess.Kill of <lldb.SBProcess; proxy of <Swig Object of type 'lldb::SBProcess *' at 0x108ba2a50> >>: success

Hide Details

Executing tearDown hook: def cleanup(): self.runCmd('type format clear', check=False) self.runCmd('type summary clear', check=False) self.runCmd('type filter clear', check=False) self.runCmd('type synth clear', check=False) self.runCmd( "settings set target.max-children-count 256", check=False)

Hide Details

Hide Details

runCmd: type format clear check of return status not required output:

Hide Details

runCmd: type summary clear check of return status not required output:

Hide Details

runCmd: type filter clear check of return status not required output:

Hide Details

runCmd: type synth clear check of return status not required output:

Hide Details

runCmd: settings set target.max-children-count 256 check of return status not required output:

Hide Details

PASS: LLDB (/Users/buildslave/jenkins/workspace/lldb-cmake-sanitized/host-compiler/bin/clang-x86_64) :: test_with_run_command_dsym (TestDataFormatterUnordered.LibcxxUnorderedDataFormatterTestCase) runCmd: settings clear -all output:

Hide Details

runCmd: settings set symbols.enable-external-lookup false output:

Hide Details

runCmd: settings set target.inherit-tcc true output:

Hide Details

runCmd: settings set target.detach-on-error false output:

Hide Details

runCmd: settings set target.auto-apply-fixits false output:

Hide Details

runCmd: settings set plugin.process.gdb-remote.packet-timeout 60 output:

Hide Details

runCmd: settings set symbols.clang-modules-cache-path "/Users/buildslave/jenkins/workspace/lldb-cmake-sanitized/lldb-build/lldb-test-build.noindex/module-cache-lldb/lldb-api" output:

Hide Details

runCmd: settings set use-color false output:

Hide Details

runCmd: setting set target.prefer-dynamic-value no-dynamic-values output:

Hide Details

runCmd: settings set target.env-vars ASAN_OPTIONS=detect_stack_use_after_return=1 DYLD_INSERT_LIBRARIES=/Users/buildslave/jenkins/workspace/lldb-cmake-sanitized/host-compiler/lib/clang/13.0.99/lib/darwin/libclang_rt.asan_osx_dynamic.dylib output:

Hide Details

runCmd: file /Users/buildslave/jenkins/workspace/lldb-cmake-sanitized/lldb-build/lldb-test-build.noindex/functionalities/data-formatter/data-formatter-stl/libcxx/unordered/TestDataFormatterUnordered.test_with_run_command_dwarf/a.out output: Current executable set to '/Users/buildslave/jenkins/workspace/lldb-cmake-sanitized/lldb-build/lldb-test-build.noindex/functionalities/data-formatter/data-formatter-stl/libcxx/unordered/TestDataFormatterUnordered.test_with_run_command_dwarf/a.out' (x86_64).

Hide Details

Hide Details

runCmd: breakpoint set -p "Set break point at this line." output: Breakpoint 1: 6 locations.

Hide Details

Hide Details

Expecting pattern: ^Breakpoint (?P<bpno>[0-9]+): (?P<num_locations>[0-9]+) locations\.$ Matched

Hide Details

runCmd: run output: Process 90601 stopped * thread #1, queue = 'com.apple.main-thread', stop reason = breakpoint 1.1 frame #0: 0x0000000100001727 a.out`main at main.cpp:35:2 32 map.emplace(3,"this"); 33 map.emplace(4,"is"); 34 map.emplace(5,"me"); -> 35 thefoo_rw(); // Set break point at this line. ^ 36 37 intstr_mmap mmap; 38 mmap.emplace(1,"hello"); Process 90601 launched: '/Users/buildslave/jenkins/workspace/lldb-cmake-sanitized/lldb-build/lldb-test-build.noindex/functionalities/data-formatter/data-formatter-stl/libcxx/unordered/TestDataFormatterUnordered.test_with_run_command_dwarf/a.out' (x86_64)

Hide Details

Hide Details

runCmd: thread list output: Process 90601 stopped * thread #1: tid = 0x32caae, 0x0000000100001727 a.out`main at main.cpp:35:2, queue = 'com.apple.main-thread', stop reason = breakpoint 1.1

Hide Details

Hide Details

Ran command: "thread list"

Hide Details

Got output: Process 90601 stopped * thread #1: tid = 0x32caae, 0x0000000100001727 a.out`main at main.cpp:35:2, queue = 'com.apple.main-thread', stop reason = breakpoint 1.1

Hide Details

Expecting sub string: "stopped" (was found) Expecting sub string: "stop reason = breakpoint" (was found)

Hide Details

Adding tearDown hook: def cleanup(): self.runCmd('type format clear', check=False) self.runCmd('type summary clear', check=False) self.runCmd('type filter clear', check=False) self.runCmd('type synth clear', check=False) self.runCmd( "settings set target.max-children-count 256", check=False)

Hide Details

Hide Details

runCmd: frame variable map output: (std::unordered_map<int, std::basic_string<char, std::char_traits<char>, std::allocator<char> >, std::hash<int>, std::equal_to<int>, std::allocator<std::pair<const int, std::basic_string<char, std::char_traits<char>, std::allocator<char> > > > >) map = size=5 { [0] = { __cc = (first = 5, second = "me") } [1] = { __cc = (first = 4, second = "is") } [2] = { __cc = (first = 3, second = "this") } [3] = { __cc = (first = 2, second = "world") } [4] = { __cc = (first = 1, second = "hello") } }

Hide Details

Hide Details

Ran command: "frame variable map"

Hide Details

Got output: (std::unordered_map<int, std::basic_string<char, std::char_traits<char>, std::allocator<char> >, std::hash<int>, std::equal_to<int>, std::allocator<std::pair<const int, std::basic_string<char, std::char_traits<char>, std::allocator<char> > > > >) map = size=5 { [0] = { __cc = (first = 5, second = "me") } [1] = { __cc = (first = 4, second = "is") } [2] = { __cc = (first = 3, second = "this") } [3] = { __cc = (first = 2, second = "world") } [4] = { __cc = (first = 1, second = "hello") } }

Hide Details

Expecting regex pattern: "std::unordered_map" (was found, matched "std::unordered_map") Expecting regex pattern: "size=5 {" (was found, matched "size=5 {") Expecting regex pattern: "hello" (was found, matched "hello") Expecting regex pattern: "world" (was found, matched "world") Expecting regex pattern: "this" (was found, matched "this") Expecting regex pattern: "is" (was found, matched "is") Expecting regex pattern: "me" (was found, matched "me")

Hide Details

runCmd: frame variable map output: (std::unordered_map<int, std::basic_string<char, std::char_traits<char>, std::allocator<char> >, std::hash<int>, std::equal_to<int>, std::allocator<std::pair<const int, std::basic_string<char, std::char_traits<char>, std::allocator<char> > > > >) map = size=5 { [0] = { __cc = (first = 5, second = "me") } [1] = { __cc = (first = 4, second = "is") } [2] = { __cc = (first = 3, second = "this") } [3] = { __cc = (first = 2, second = "world") } [4] = { __cc = (first = 1, second = "hello") } }

Hide Details

Hide Details

Ran command: "frame variable map"

Hide Details

Got output: (std::unordered_map<int, std::basic_string<char, std::char_traits<char>, std::allocator<char> >, std::hash<int>, std::equal_to<int>, std::allocator<std::pair<const int, std::basic_string<char, std::char_traits<char>, std::allocator<char> > > > >) map = size=5 { [0] = { __cc = (first = 5, second = "me") } [1] = { __cc = (first = 4, second = "is") } [2] = { __cc = (first = 3, second = "this") } [3] = { __cc = (first = 2, second = "world") } [4] = { __cc = (first = 1, second = "hello") } }

Hide Details

Expecting regex pattern: "std::unordered_map" (was found, matched "std::unordered_map") Expecting regex pattern: "size=5 {" (was found, matched "size=5 {") Expecting regex pattern: "hello" (was found, matched "hello") Expecting regex pattern: "world" (was found, matched "world") Expecting regex pattern: "this" (was found, matched "this") Expecting regex pattern: "is" (was found, matched "is") Expecting regex pattern: "me" (was found, matched "me")

Hide Details

runCmd: continue output: Process 90601 resuming Process 90601 stopped * thread #1, queue = 'com.apple.main-thread', stop reason = breakpoint 1.2 frame #0: 0x000000010000183f a.out`main at main.cpp:44:2 41 mmap.emplace(3,"this"); 42 mmap.emplace(3,"this"); 43 mmap.emplace(3,"this"); -> 44 thefoo_rw(); // Set break point at this line. ^ 45 46 int_set iset; 47 iset.emplace(1);

Hide Details

Hide Details

runCmd: frame variable mmap output: (std::unordered_multimap<int, std::basic_string<char, std::char_traits<char>, std::allocator<char> >, std::hash<int>, std::equal_to<int>, std::allocator<std::pair<const int, std::basic_string<char, std::char_traits<char>, std::allocator<char> > > > >) mmap = size=6 { [0] = { __cc = (first = 3, second = "this") } [1] = { __cc = (first = 3, second = "this") } [2] = { __cc = (first = 3, second = "this") } [3] = { __cc = (first = 2, second = "hello") } [4] = { __cc = (first = 2, second = "world") } [5] = { __cc = (first = 1, second = "hello") } }

Hide Details

Hide Details

Ran command: "frame variable mmap"

Hide Details

Got output: (std::unordered_multimap<int, std::basic_string<char, std::char_traits<char>, std::allocator<char> >, std::hash<int>, std::equal_to<int>, std::allocator<std::pair<const int, std::basic_string<char, std::char_traits<char>, std::allocator<char> > > > >) mmap = size=6 { [0] = { __cc = (first = 3, second = "this") } [1] = { __cc = (first = 3, second = "this") } [2] = { __cc = (first = 3, second = "this") } [3] = { __cc = (first = 2, second = "hello") } [4] = { __cc = (first = 2, second = "world") } [5] = { __cc = (first = 1, second = "hello") } }

Hide Details

Expecting regex pattern: "std::unordered_multimap" (was found, matched "std::unordered_multimap") Expecting regex pattern: "size=6 {" (was found, matched "size=6 {") Expecting regex pattern: "first = 3" (was found, matched "first = 3") Expecting regex pattern: "second = "this"" (was found, matched "second = "this"") Expecting regex pattern: "first = 2" (was found, matched "first = 2") Expecting regex pattern: "second = "hello"" (was found, matched "second = "hello"")

Hide Details

runCmd: frame variable mmap output: (std::unordered_multimap<int, std::basic_string<char, std::char_traits<char>, std::allocator<char> >, std::hash<int>, std::equal_to<int>, std::allocator<std::pair<const int, std::basic_string<char, std::char_traits<char>, std::allocator<char> > > > >) mmap = size=6 { [0] = { __cc = (first = 3, second = "this") } [1] = { __cc = (first = 3, second = "this") } [2] = { __cc = (first = 3, second = "this") } [3] = { __cc = (first = 2, second = "hello") } [4] = { __cc = (first = 2, second = "world") } [5] = { __cc = (first = 1, second = "hello") } }

Hide Details

Hide Details

Ran command: "frame variable mmap"

Hide Details

Got output: (std::unordered_multimap<int, std::basic_string<char, std::char_traits<char>, std::allocator<char> >, std::hash<int>, std::equal_to<int>, std::allocator<std::pair<const int, std::basic_string<char, std::char_traits<char>, std::allocator<char> > > > >) mmap = size=6 { [0] = { __cc = (first = 3, second = "this") } [1] = { __cc = (first = 3, second = "this") } [2] = { __cc = (first = 3, second = "this") } [3] = { __cc = (first = 2, second = "hello") } [4] = { __cc = (first = 2, second = "world") } [5] = { __cc = (first = 1, second = "hello") } }

Hide Details

Expecting regex pattern: "std::unordered_multimap" (was found, matched "std::unordered_multimap") Expecting regex pattern: "size=6 {" (was found, matched "size=6 {") Expecting regex pattern: "first = 3" (was found, matched "first = 3") Expecting regex pattern: "second = "this"" (was found, matched "second = "this"") Expecting regex pattern: "first = 2" (was found, matched "first = 2") Expecting regex pattern: "second = "hello"" (was found, matched "second = "hello"")

Hide Details

runCmd: continue output: Process 90601 resuming Process 90601 stopped * thread #1, queue = 'com.apple.main-thread', stop reason = breakpoint 1.3 frame #0: 0x0000000100001927 a.out`main at main.cpp:52:2 49 iset.emplace(3); 50 iset.emplace(4); 51 iset.emplace(5); -> 52 thefoo_rw(); // Set break point at this line. ^ 53 54 str_set sset; 55 sset.emplace("hello");

Hide Details

Hide Details

runCmd: frame variable iset output: (std::unordered_set<int, std::hash<int>, std::equal_to<int>, std::allocator<int> >) iset = size=5 { [0] = 5 [1] = 4 [2] = 3 [3] = 2 [4] = 1 }

Hide Details

Hide Details

Ran command: "frame variable iset"

Hide Details

Got output: (std::unordered_set<int, std::hash<int>, std::equal_to<int>, std::allocator<int> >) iset = size=5 { [0] = 5 [1] = 4 [2] = 3 [3] = 2 [4] = 1 }

Hide Details

Expecting regex pattern: "std::unordered_set" (was found, matched "std::unordered_set") Expecting regex pattern: "size=5 {" (was found, matched "size=5 {") Expecting regex pattern: "\[\d\] = 5" (was found, matched "[0] = 5") Expecting regex pattern: "\[\d\] = 3" (was found, matched "[2] = 3") Expecting regex pattern: "\[\d\] = 2" (was found, matched "[3] = 2")

Hide Details

runCmd: frame variable iset output: (std::unordered_set<int, std::hash<int>, std::equal_to<int>, std::allocator<int> >) iset = size=5 { [0] = 5 [1] = 4 [2] = 3 [3] = 2 [4] = 1 }

Hide Details

Hide Details

Ran command: "frame variable iset"

Hide Details

Got output: (std::unordered_set<int, std::hash<int>, std::equal_to<int>, std::allocator<int> >) iset = size=5 { [0] = 5 [1] = 4 [2] = 3 [3] = 2 [4] = 1 }

Hide Details

Expecting regex pattern: "std::unordered_set" (was found, matched "std::unordered_set") Expecting regex pattern: "size=5 {" (was found, matched "size=5 {") Expecting regex pattern: "\[\d\] = 5" (was found, matched "[0] = 5") Expecting regex pattern: "\[\d\] = 3" (was found, matched "[2] = 3") Expecting regex pattern: "\[\d\] = 2" (was found, matched "[3] = 2")

Hide Details

runCmd: continue output: Process 90601 resuming Process 90601 stopped * thread #1, queue = 'com.apple.main-thread', stop reason = breakpoint 1.4 frame #0: 0x00000001000019dd a.out`main at main.cpp:60:2 57 sset.emplace("this"); 58 sset.emplace("is"); 59 sset.emplace("me"); -> 60 thefoo_rw(); // Set break point at this line. ^ 61 62 int_mset imset; 63 imset.emplace(1);

Hide Details

Hide Details

runCmd: frame variable sset output: (std::unordered_set<std::basic_string<char, std::char_traits<char>, std::allocator<char> >, std::hash<std::basic_string<char, std::char_traits<char>, std::allocator<char> > >, std::equal_to<std::basic_string<char, std::char_traits<char>, std::allocator<char> > >, std::allocator<std::basic_string<char, std::char_traits<char>, std::allocator<char> > > >) sset = size=5 { [0] = "is" [1] = "world" [2] = "me" [3] = "this" [4] = "hello" }

Hide Details

Hide Details

Ran command: "frame variable sset"

Hide Details

Got output: (std::unordered_set<std::basic_string<char, std::char_traits<char>, std::allocator<char> >, std::hash<std::basic_string<char, std::char_traits<char>, std::allocator<char> > >, std::equal_to<std::basic_string<char, std::char_traits<char>, std::allocator<char> > >, std::allocator<std::basic_string<char, std::char_traits<char>, std::allocator<char> > > >) sset = size=5 { [0] = "is" [1] = "world" [2] = "me" [3] = "this" [4] = "hello" }

Hide Details

Expecting regex pattern: "std::unordered_set" (was found, matched "std::unordered_set") Expecting regex pattern: "size=5 {" (was found, matched "size=5 {") Expecting regex pattern: "\[\d\] = "is"" (was found, matched "[0] = "is"") Expecting regex pattern: "\[\d\] = "world"" (was found, matched "[1] = "world"") Expecting regex pattern: "\[\d\] = "hello"" (was found, matched "[4] = "hello"")

Hide Details

runCmd: frame variable sset output: (std::unordered_set<std::basic_string<char, std::char_traits<char>, std::allocator<char> >, std::hash<std::basic_string<char, std::char_traits<char>, std::allocator<char> > >, std::equal_to<std::basic_string<char, std::char_traits<char>, std::allocator<char> > >, std::allocator<std::basic_string<char, std::char_traits<char>, std::allocator<char> > > >) sset = size=5 { [0] = "is" [1] = "world" [2] = "me" [3] = "this" [4] = "hello" }

Hide Details

Hide Details

Ran command: "frame variable sset"

Hide Details

Got output: (std::unordered_set<std::basic_string<char, std::char_traits<char>, std::allocator<char> >, std::hash<std::basic_string<char, std::char_traits<char>, std::allocator<char> > >, std::equal_to<std::basic_string<char, std::char_traits<char>, std::allocator<char> > >, std::allocator<std::basic_string<char, std::char_traits<char>, std::allocator<char> > > >) sset = size=5 { [0] = "is" [1] = "world" [2] = "me" [3] = "this" [4] = "hello" }

Hide Details

Expecting regex pattern: "std::unordered_set" (was found, matched "std::unordered_set") Expecting regex pattern: "size=5 {" (was found, matched "size=5 {") Expecting regex pattern: "\[\d\] = "is"" (was found, matched "[0] = "is"") Expecting regex pattern: "\[\d\] = "world"" (was found, matched "[1] = "world"") Expecting regex pattern: "\[\d\] = "hello"" (was found, matched "[4] = "hello"")

Hide Details

runCmd: continue output: Process 90601 resuming Process 90601 stopped * thread #1, queue = 'com.apple.main-thread', stop reason = breakpoint 1.5 frame #0: 0x0000000100001acb a.out`main at main.cpp:69:2 66 imset.emplace(3); 67 imset.emplace(3); 68 imset.emplace(3); -> 69 thefoo_rw(); // Set break point at this line. ^ 70 71 str_mset smset; 72 smset.emplace("hello");

Hide Details

Hide Details

runCmd: frame variable imset output: (std::unordered_multiset<int, std::hash<int>, std::equal_to<int>, std::allocator<int> >) imset = size=6 { [0] = 3 [1] = 3 [2] = 3 [3] = 2 [4] = 2 [5] = 1 }

Hide Details

Hide Details

Ran command: "frame variable imset"

Hide Details

Got output: (std::unordered_multiset<int, std::hash<int>, std::equal_to<int>, std::allocator<int> >) imset = size=6 { [0] = 3 [1] = 3 [2] = 3 [3] = 2 [4] = 2 [5] = 1 }

Hide Details

Expecting regex pattern: "std::unordered_multiset" (was found, matched "std::unordered_multiset") Expecting regex pattern: "size=6 {" (was found, matched "size=6 {") Expecting regex pattern: "(\[\d\] = 3(\n|.)+){3}" (was found, matched "[0] = 3 [1] = 3 [2] = 3 [3] = 2 [4] = 2 [5] = 1 } ") Expecting regex pattern: "\[\d\] = 2" (was found, matched "[3] = 2") Expecting regex pattern: "\[\d\] = 1" (was found, matched "[5] = 1")

Hide Details

runCmd: frame variable imset output: (std::unordered_multiset<int, std::hash<int>, std::equal_to<int>, std::allocator<int> >) imset = size=6 { [0] = 3 [1] = 3 [2] = 3 [3] = 2 [4] = 2 [5] = 1 }

Hide Details

Hide Details

Ran command: "frame variable imset"

Hide Details

Got output: (std::unordered_multiset<int, std::hash<int>, std::equal_to<int>, std::allocator<int> >) imset = size=6 { [0] = 3 [1] = 3 [2] = 3 [3] = 2 [4] = 2 [5] = 1 }

Hide Details

Expecting regex pattern: "std::unordered_multiset" (was found, matched "std::unordered_multiset") Expecting regex pattern: "size=6 {" (was found, matched "size=6 {") Expecting regex pattern: "(\[\d\] = 3(\n|.)+){3}" (was found, matched "[0] = 3 [1] = 3 [2] = 3 [3] = 2 [4] = 2 [5] = 1 } ") Expecting regex pattern: "\[\d\] = 2" (was found, matched "[3] = 2") Expecting regex pattern: "\[\d\] = 1" (was found, matched "[5] = 1")

Hide Details

runCmd: continue output: Process 90601 resuming Process 90601 stopped * thread #1, queue = 'com.apple.main-thread', stop reason = breakpoint 1.6 frame #0: 0x0000000100001b63 a.out`main at main.cpp:77:2 74 smset.emplace("world"); 75 smset.emplace("is"); 76 smset.emplace("is"); -> 77 thefoo_rw(); // Set break point at this line. ^ 78 79 return 0; 80 }

Hide Details

Hide Details

runCmd: frame variable smset output: (std::unordered_multiset<std::basic_string<char, std::char_traits<char>, std::allocator<char> >, std::hash<std::basic_string<char, std::char_traits<char>, std::allocator<char> > >, std::equal_to<std::basic_string<char, std::char_traits<char>, std::allocator<char> > >, std::allocator<std::basic_string<char, std::char_traits<char>, std::allocator<char> > > >) smset = size=5 { [0] = "is" [1] = "is" [2] = "world" [3] = "world" [4] = "hello" }

Hide Details

Hide Details

Ran command: "frame variable smset"

Hide Details

Got output: (std::unordered_multiset<std::basic_string<char, std::char_traits<char>, std::allocator<char> >, std::hash<std::basic_string<char, std::char_traits<char>, std::allocator<char> > >, std::equal_to<std::basic_string<char, std::char_traits<char>, std::allocator<char> > >, std::allocator<std::basic_string<char, std::char_traits<char>, std::allocator<char> > > >) smset = size=5 { [0] = "is" [1] = "is" [2] = "world" [3] = "world" [4] = "hello" }

Hide Details

Expecting regex pattern: "std::unordered_multiset" (was found, matched "std::unordered_multiset") Expecting regex pattern: "size=5 {" (was found, matched "size=5 {") Expecting regex pattern: "(\[\d\] = "is"(\n|.)+){2}" (was found, matched "[0] = "is" [1] = "is" [2] = "world" [3] = "world" [4] = "hello" } ") Expecting regex pattern: "(\[\d\] = "world"(\n|.)+){2}" (was found, matched "[2] = "world" [3] = "world" [4] = "hello" } ")

Hide Details

runCmd: frame variable smset output: (std::unordered_multiset<std::basic_string<char, std::char_traits<char>, std::allocator<char> >, std::hash<std::basic_string<char, std::char_traits<char>, std::allocator<char> > >, std::equal_to<std::basic_string<char, std::char_traits<char>, std::allocator<char> > >, std::allocator<std::basic_string<char, std::char_traits<char>, std::allocator<char> > > >) smset = size=5 { [0] = "is" [1] = "is" [2] = "world" [3] = "world" [4] = "hello" }

Hide Details

Hide Details

Ran command: "frame variable smset"

Hide Details

Got output: (std::unordered_multiset<std::basic_string<char, std::char_traits<char>, std::allocator<char> >, std::hash<std::basic_string<char, std::char_traits<char>, std::allocator<char> > >, std::equal_to<std::basic_string<char, std::char_traits<char>, std::allocator<char> > >, std::allocator<std::basic_string<char, std::char_traits<char>, std::allocator<char> > > >) smset = size=5 { [0] = "is" [1] = "is" [2] = "world" [3] = "world" [4] = "hello" }

Hide Details

Expecting regex pattern: "std::unordered_multiset" (was found, matched "std::unordered_multiset") Expecting regex pattern: "size=5 {" (was found, matched "size=5 {") Expecting regex pattern: "(\[\d\] = "is"(\n|.)+){2}" (was found, matched "[0] = "is" [1] = "is" [2] = "world" [3] = "world" [4] = "hello" } ") Expecting regex pattern: "(\[\d\] = "world"(\n|.)+){2}" (was found, matched "[2] = "world" [3] = "world" [4] = "hello" } ")

Hide Details

runCmd: continue output: Process 90601 resuming Process 90601 exited with status = 0 (0x00000000)

Hide Details

Hide Details

<bound method SBProcess.Kill of <lldb.SBProcess; proxy of <Swig Object of type 'lldb::SBProcess *' at 0x1085c3ae0> >>: success

Hide Details

Executing tearDown hook: def cleanup(): self.runCmd('type format clear', check=False) self.runCmd('type summary clear', check=False) self.runCmd('type filter clear', check=False) self.runCmd('type synth clear', check=False) self.runCmd( "settings set target.max-children-count 256", check=False)

Hide Details

Hide Details

runCmd: type format clear check of return status not required output:

Hide Details

runCmd: type summary clear check of return status not required output:

Hide Details

runCmd: type filter clear check of return status not required output:

Hide Details

runCmd: type synth clear check of return status not required output:

Hide Details

runCmd: settings set target.max-children-count 256 check of return status not required output:

Hide Details

PASS: LLDB (/Users/buildslave/jenkins/workspace/lldb-cmake-sanitized/host-compiler/bin/clang-x86_64) :: test_with_run_command_dwarf (TestDataFormatterUnordered.LibcxxUnorderedDataFormatterTestCase) UNSUPPORTED: LLDB (/Users/buildslave/jenkins/workspace/lldb-cmake-sanitized/host-compiler/bin/clang-x86_64) :: test_with_run_command_dwo (TestDataFormatterUnordered.LibcxxUnorderedDataFormatterTestCase) (test case does not fall in any category of interest for this run) runCmd: settings clear -all output:

Hide Details

runCmd: settings set symbols.enable-external-lookup false output:

Hide Details

runCmd: settings set target.inherit-tcc true output:

Hide Details

runCmd: settings set target.detach-on-error false output:

Hide Details

runCmd: settings set target.auto-apply-fixits false output:

Hide Details

runCmd: settings set plugin.process.gdb-remote.packet-timeout 60 output:

Hide Details

runCmd: settings set symbols.clang-modules-cache-path "/Users/buildslave/jenkins/workspace/lldb-cmake-sanitized/lldb-build/lldb-test-build.noindex/module-cache-lldb/lldb-api" output:

Hide Details

runCmd: settings set use-color false output:

Hide Details

runCmd: setting set target.prefer-dynamic-value no-dynamic-values output:

Hide Details

runCmd: settings set target.env-vars ASAN_OPTIONS=detect_stack_use_after_return=1 DYLD_INSERT_LIBRARIES=/Users/buildslave/jenkins/workspace/lldb-cmake-sanitized/host-compiler/lib/clang/13.0.99/lib/darwin/libclang_rt.asan_osx_dynamic.dylib output:

Hide Details

runCmd: file /Users/buildslave/jenkins/workspace/lldb-cmake-sanitized/lldb-build/lldb-test-build.noindex/functionalities/data-formatter/data-formatter-stl/libcxx/unordered/TestDataFormatterUnordered.test_with_run_command_gmodules/a.out output: Current executable set to '/Users/buildslave/jenkins/workspace/lldb-cmake-sanitized/lldb-build/lldb-test-build.noindex/functionalities/data-formatter/data-formatter-stl/libcxx/unordered/TestDataFormatterUnordered.test_with_run_command_gmodules/a.out' (x86_64).

Hide Details

Hide Details

runCmd: breakpoint set -p "Set break point at this line." output: Breakpoint 1: 6 locations.

Hide Details

Hide Details

Expecting pattern: ^Breakpoint (?P<bpno>[0-9]+): (?P<num_locations>[0-9]+) locations\.$ Matched

Hide Details

runCmd: run runCmd failed! error: process exited with status -1 (tried to attach to process already being debugged)

Hide Details

Hide Details

Command 'run' failed!

Hide Details

FAIL: LLDB (/Users/buildslave/jenkins/workspace/lldb-cmake-sanitized/host-compiler/bin/clang-x86_64) :: test_with_run_command_gmodules (TestDataFormatterUnordered.LibcxxUnorderedDataFormatterTestCase) <bound method SBProcess.Kill of <lldb.SBProcess; proxy of <Swig Object of type 'lldb::SBProcess *' at 0x108b3b720> >>: success

Hide Details

Restore dir to: /Users/buildslave/jenkins/workspace/lldb-cmake-sanitized/lldb-build/tools/lldb/test ====================================================================== FAIL: test_with_run_command_gmodules (TestDataFormatterUnordered.LibcxxUnorderedDataFormatterTestCase) ---------------------------------------------------------------------- Traceback (most recent call last): File "/Users/buildslave/jenkins/workspace/lldb-cmake-sanitized/llvm-project/lldb/packages/Python/lldbsuite/test/lldbtest.py", line 1830, in test_method return attrvalue(self) File "/Users/buildslave/jenkins/workspace/lldb-cmake-sanitized/llvm-project/lldb/test/API/functionalities/data-formatter/data-formatter-stl/libcxx/unordered/TestDataFormatterUnordered.py", line 29, in test_with_run_command self.runCmd("run", RUN_SUCCEEDED) File "/Users/buildslave/jenkins/workspace/lldb-cmake-sanitized/llvm-project/lldb/packages/Python/lldbsuite/test/lldbtest.py", line 2161, in runCmd msg if (msg) else CMD_MSG(cmd)) AssertionError: False is not True : Process is launched successfully Error output: error: process exited with status -1 (tried to attach to process already being debugged)

Hide Details

Config=x86_64-/Users/buildslave/jenkins/workspace/lldb-cmake-sanitized/host-compiler/bin/clang ---------------------------------------------------------------------- Ran 4 tests in 41.292s

Hide Details

RESULT: FAILED (2 passes, 1 failures, 0 errors, 1 skipped, 0 expected failures, 0 unexpected successes)

Hide Details

--

Hide Details

******************** PASS: lldb-unit :: Utility/./UtilityTests/VMRange.ContainsAddr (1997 of 2355) PASS: lldb-unit :: ObjectFile/Breakpad/./ObjectFileBreakpadTests/PublicRecord.parse (1998 of 2355) PASS: lldb-unit :: Expression/./ExpressionTests/CppModuleConfigurationTest.MissingUsrInclude (1999 of 2355) PASS: lldb-unit :: ScriptInterpreter/Python/./ScriptInterpreterPythonTests/PythonDataObjectsTest.TestOwnedReferences (2000 of 2355) PASS: lldb-unit :: Target/./TargetTests/ModuleCacheTest.GetAndPutUuidExists (2001 of 2355) UNSUPPORTED: lldb-shell :: SymbolFile/PDB/typedefs.test (2002 of 2355) PASS: lldb-unit :: Process/gdb-remote/./ProcessGdbRemoteTests/GDBRemoteCommunicationServerTest.SendErrorResponse_ErrorList (2003 of 2355) PASS: lldb-shell :: Reproducer/TestDSYM.test (2004 of 2355) UNSUPPORTED: lldb-api :: functionalities/thread/break_after_join/TestBreakAfterJoin.py (2005 of 2355) UNSUPPORTED: lldb-api :: functionalities/data-formatter/data-formatter-stl/libstdcpp/smart_ptr/TestDataFormatterStdSmartPtr.py (2006 of 2355) PASS: lldb-unit :: Utility/./UtilityTests/StringListTest.SplitIntoLinesSingleTrailingCR (2007 of 2355) PASS: lldb-unit :: Language/Highlighting/./HighlighterTests/HighlighterTest.HighlighterSelectionPath (2008 of 2355) FAIL: lldb-api :: python_api/frame/TestFrames.py (2009 of 2355) ******************** TEST 'lldb-api :: python_api/frame/TestFrames.py' FAILED ******************** Script: -- /Users/buildslave/jenkins/workspace/lldb-cmake-sanitized/lldb-build/lldb-test-build.noindex/copied-python /Users/buildslave/jenkins/workspace/lldb-cmake-sanitized/llvm-project/lldb/test/API/dotest.py -u CXXFLAGS -u CFLAGS --codesign-identity lldb_codesign --arch x86_64 --build-dir /Users/buildslave/jenkins/workspace/lldb-cmake-sanitized/lldb-build/lldb-test-build.noindex -t --env TERM=vt100 --env LLVM_LIBS_DIR=/Users/buildslave/jenkins/workspace/lldb-cmake-sanitized/lldb-build/./lib --inferior-env ASAN_OPTIONS=detect_stack_use_after_return=1 --inferior-env DYLD_INSERT_LIBRARIES=/Users/buildslave/jenkins/workspace/lldb-cmake-sanitized/host-compiler/lib/clang/13.0.99/lib/darwin/libclang_rt.asan_osx_dynamic.dylib --arch x86_64 --build-dir /Users/buildslave/jenkins/workspace/lldb-cmake-sanitized/lldb-build/lldb-test-build.noindex --lldb-module-cache-dir /Users/buildslave/jenkins/workspace/lldb-cmake-sanitized/lldb-build/lldb-test-build.noindex/module-cache-lldb/lldb-api --clang-module-cache-dir /Users/buildslave/jenkins/workspace/lldb-cmake-sanitized/lldb-build/lldb-test-build.noindex/module-cache-clang/lldb-api --executable /Users/buildslave/jenkins/workspace/lldb-cmake-sanitized/lldb-build/./bin/lldb --compiler /Users/buildslave/jenkins/workspace/lldb-cmake-sanitized/host-compiler/bin/clang --dsymutil /Users/buildslave/jenkins/workspace/lldb-cmake-sanitized/lldb-build/./bin/dsymutil --llvm-tools-dir /Users/buildslave/jenkins/workspace/lldb-cmake-sanitized/lldb-build/./bin --lldb-libs-dir /Users/buildslave/jenkins/workspace/lldb-cmake-sanitized/lldb-build/./lib /Users/buildslave/jenkins/workspace/lldb-cmake-sanitized/llvm-project/lldb/test/API/python_api/frame -p TestFrames.py -- Exit Code: 1

Hide Details

Command Output (stdout): -- lldb version 13.0.99 (http://labmaster3.local/git/llvm-project.git revision 95923c0ba245377205f783607aaacbf8c667b353) clang revision 95923c0ba245377205f783607aaacbf8c667b353 llvm revision 95923c0ba245377205f783607aaacbf8c667b353 Skipping the following test categories: ['darwin-log', 'libstdcxx', 'dwo', 'llgs', 'fork'] frame #0: 0x0000000100000e51 a.out`c(val=3, ch='C') at main.c:32:18 Stack trace for thread id=0x32cbbe name=None queue=com.apple.main-thread stop reason=breakpoint frame #0: 0x00000100000e51 a.out`c at main.c:32 ((int)val=3, (char)ch='C') frame #1: 0x00000100000e37 a.out`b at main.c:27 ((int)val=2, (char)ch='B') frame #2: 0x00000100000da1 a.out`a at main.c:15 ((int)val=1, (char)ch='A') frame #3: 0x00000100000eb5 a.out`main at main.c:40 ((int)argc=1, (const char **)argv=0x00007ffeefbff900) frame #4: 0x007fff6b5f3cc9 libdyld.dylib`start + 1 frame #0: 0x0000000100000e5d a.out`c(val=3, ch='C') at main.c:34:36 Stack trace for thread id=0x32cbbe name=None queue=com.apple.main-thread stop reason=plancomplete frame #0: 0x00000100000e5d a.out`c at main.c:34 ((int)val=3, (char)ch='C') frame #1: 0x00000100000e37 a.out`b at main.c:27 ((int)val=2, (char)ch='B') frame #2: 0x00000100000da1 a.out`a at main.c:15 ((int)val=1, (char)ch='A') frame #3: 0x00000100000eb5 a.out`main at main.c:40 ((int)argc=1, (const char **)argv=0x00007ffeefbff900) frame #4: 0x007fff6b5f3cc9 libdyld.dylib`start + 1 frame #0: 0x0000000100000e37 a.out`b(val=2, ch='B') at main.c:27:5 Stack trace for thread id=0x32cbbe name=None queue=com.apple.main-thread stop reason=plancomplete frame #0: 0x00000100000e37 a.out`b at main.c:27 ((int)val=2, (char)ch='B') frame #1: 0x00000100000da1 a.out`a at main.c:15 ((int)val=1, (char)ch='A') frame #2: 0x00000100000eb5 a.out`main at main.c:40 ((int)argc=1, (const char **)argv=0x00007ffeefbff900) frame #3: 0x007fff6b5f3cc9 libdyld.dylib`start + 1 frame #0: 0x0000000100000e51 a.out`c(val=3, ch='C') at main.c:32:18 Stack trace for thread id=0x32cc1b name=None queue=com.apple.main-thread stop reason=breakpoint frame #0: 0x00000100000e51 a.out`c at main.c:32 ((int)val=3, (char)ch='C') frame #1: 0x00000100000e37 a.out`b at main.c:27 ((int)val=2, (char)ch='B') frame #2: 0x00000100000da1 a.out`a at main.c:15 ((int)val=1, (char)ch='A') frame #3: 0x00000100000eb5 a.out`main at main.c:40 ((int)argc=1, (const char **)argv=0x00007ffeefbff8d8) frame #4: 0x007fff6b5f3cc9 libdyld.dylib`start + 1 frame #5: 0x007fff6b5f3cc9 libdyld.dylib`start + 1 frame #0: 0x0000000100000e5d a.out`c(val=3, ch='C') at main.c:34:36 Stack trace for thread id=0x32cc1b name=None queue=com.apple.main-thread stop reason=plancomplete frame #0: 0x00000100000e5d a.out`c at main.c:34 ((int)val=3, (char)ch='C') frame #1: 0x00000100000e37 a.out`b at main.c:27 ((int)val=2, (char)ch='B') frame #2: 0x00000100000da1 a.out`a at main.c:15 ((int)val=1, (char)ch='A') frame #3: 0x00000100000eb5 a.out`main at main.c:40 ((int)argc=1, (const char **)argv=0x00007ffeefbff8d8) frame #4: 0x007fff6b5f3cc9 libdyld.dylib`start + 1 frame #5: 0x007fff6b5f3cc9 libdyld.dylib`start + 1 frame #0: 0x0000000100000e37 a.out`b(val=2, ch='B') at main.c:27:5 Stack trace for thread id=0x32cc1b name=None queue=com.apple.main-thread stop reason=plancomplete frame #0: 0x00000100000e37 a.out`b at main.c:27 ((int)val=2, (char)ch='B') frame #1: 0x00000100000da1 a.out`a at main.c:15 ((int)val=1, (char)ch='A') frame #2: 0x00000100000eb5 a.out`main at main.c:40 ((int)argc=1, (const char **)argv=0x00007ffeefbff8d8) frame #3: 0x007fff6b5f3cc9 libdyld.dylib`start + 1 frame #4: 0x007fff6b5f3cc9 libdyld.dylib`start + 1 frame: frame #0: 0x0000000100000e51 a.out`c(val=3, ch='C') at main.c:32:18 val1: No value val2: No value frame: frame #0: 0x0000000100000e51 a.out`c(val=3, ch='C') at main.c:32:18 val1: No value val2: No value frame: frame #0: 0x0000000100000e51 a.out`c(val=3, ch='C') at main.c:32:18 val1: No value val2: No value frame: frame #0: 0x0000000100000e51 a.out`c(val=3, ch='C') at main.c:32:18 frame: frame #1: 0x0000000100000e37 a.out`b(val=2, ch='B') at main.c:27:12 frame: frame #2: 0x0000000100000da1 a.out`a(val=1, ch='A') at main.c:15:16 frame: frame #0: 0x0000000100000e51 a.out`c(val=3, ch='C') at main.c:32:18 frame: frame #1: 0x0000000100000e37 a.out`b(val=2, ch='B') at main.c:27:12 frame: frame #2: 0x0000000100000ed8 a.out`main(argc=1, argv=0x00007ffeefbff8c8) at main.c:43:14 frame: frame #0: 0x0000000100000e51 a.out`c(val=4, ch='B') at main.c:32:18 frame: frame #1: 0x0000000100000dc8 a.out`a(val=3, ch='A') at main.c:17:16 frame: frame #2: 0x0000000100000efb a.out`main(argc=1, argv=0x00007ffeefbff8c8) at main.c:46:14 Full stack traces when stopped on the breakpoint 'c': c((int)val=3, (char)ch='C') b((int)val=2, (char)ch='B') a((int)val=1, (char)ch='A') --- c((int)val=3, (char)ch='C') b((int)val=2, (char)ch='B') main((int)argc=1, (const char **)argv=0x00007ffeefbff8c8) --- c((int)val=4, (char)ch='B') a((int)val=3, (char)ch='A') main((int)argc=1, (const char **)argv=0x00007ffeefbff8c8) ---

Hide Details

frame: frame #0: 0x0000000100000e51 a.out`c(val=3, ch='C') at main.c:32:18 frame: frame #1: 0x0000000100000e37 a.out`b(val=2, ch='B') at main.c:27:12 frame: frame #2: 0x0000000100000da1 a.out`a(val=1, ch='A') at main.c:15:16 frame: frame #0: 0x0000000100000e51 a.out`c(val=3, ch='C') at main.c:32:18 frame: frame #1: 0x0000000100000e37 a.out`b(val=2, ch='B') at main.c:27:12 frame: frame #2: 0x0000000100000ed8 a.out`main(argc=1, argv=0x00007ffeefbff8c8) at main.c:43:14 frame: frame #0: 0x0000000100000e51 a.out`c(val=4, ch='B') at main.c:32:18 frame: frame #1: 0x0000000100000dc8 a.out`a(val=3, ch='A') at main.c:17:16 frame: frame #2: 0x0000000100000efb a.out`main(argc=1, argv=0x00007ffeefbff8c8) at main.c:46:14 Full stack traces when stopped on the breakpoint 'c': c((int)val=3, (char)ch='C') b((int)val=2, (char)ch='B') a((int)val=1, (char)ch='A') --- c((int)val=3, (char)ch='C') b((int)val=2, (char)ch='B') main((int)argc=1, (const char **)argv=0x00007ffeefbff8c8) --- c((int)val=4, (char)ch='B') a((int)val=3, (char)ch='A') main((int)argc=1, (const char **)argv=0x00007ffeefbff8c8) ---

Hide Details

frame: frame #0: 0x0000000100000e51 a.out`c(val=3, ch='C') at main.c:32:18 frame: frame #1: 0x0000000100000e37 a.out`b(val=2, ch='B') at main.c:27:12 frame: frame #2: 0x0000000100000da1 a.out`a(val=1, ch='A') at main.c:15:16 frame: frame #0: 0x0000000100000e51 a.out`c(val=3, ch='C') at main.c:32:18 frame: frame #1: 0x0000000100000e37 a.out`b(val=2, ch='B') at main.c:27:12 frame: frame #2: 0x0000000100000ed8 a.out`main(argc=1, argv=0x00007ffeefbff8c0) at main.c:43:14 frame: frame #0: 0x0000000100000e51 a.out`c(val=4, ch='B') at main.c:32:18 frame: frame #1: 0x0000000100000dc8 a.out`a(val=3, ch='A') at main.c:17:16 frame: frame #2: 0x0000000100000efb a.out`main(argc=1, argv=0x00007ffeefbff8c0) at main.c:46:14 Full stack traces when stopped on the breakpoint 'c': c((int)val=3, (char)ch='C') b((int)val=2, (char)ch='B') a((int)val=1, (char)ch='A') --- c((int)val=3, (char)ch='C') b((int)val=2, (char)ch='B') main((int)argc=1, (const char **)argv=0x00007ffeefbff8c0) --- c((int)val=4, (char)ch='B') a((int)val=3, (char)ch='A') main((int)argc=1, (const char **)argv=0x00007ffeefbff8c0) ---

Hide Details

Hide Details

-- Command Output (stderr): -- Change dir to: /Users/buildslave/jenkins/workspace/lldb-cmake-sanitized/llvm-project/lldb/test/API/python_api/frame runCmd: settings clear -all output:

Hide Details

runCmd: settings set symbols.enable-external-lookup false output:

Hide Details

runCmd: settings set target.inherit-tcc true output:

Hide Details

runCmd: settings set target.detach-on-error false output:

Hide Details

runCmd: settings set target.auto-apply-fixits false output:

Hide Details

runCmd: settings set plugin.process.gdb-remote.packet-timeout 60 output:

Hide Details

runCmd: settings set symbols.clang-modules-cache-path "/Users/buildslave/jenkins/workspace/lldb-cmake-sanitized/lldb-build/lldb-test-build.noindex/module-cache-lldb/lldb-api" output:

Hide Details

runCmd: settings set use-color false output:

Hide Details

runCmd: setting set target.prefer-dynamic-value no-dynamic-values output:

Hide Details

runCmd: settings set target.env-vars ASAN_OPTIONS=detect_stack_use_after_return=1 DYLD_INSERT_LIBRARIES=/Users/buildslave/jenkins/workspace/lldb-cmake-sanitized/host-compiler/lib/clang/13.0.99/lib/darwin/libclang_rt.asan_osx_dynamic.dylib output:

Hide Details

breakpoint: SBBreakpoint: id = 1, name = 'c', module = a.out, locations = 1

Hide Details

<bound method SBProcess.Kill of <lldb.SBProcess; proxy of <Swig Object of type 'lldb::SBProcess *' at 0x10ddbc7e0> >>: success

Hide Details

PASS: LLDB (/Users/buildslave/jenkins/workspace/lldb-cmake-sanitized/host-compiler/bin/clang-x86_64) :: test_frame_api_IsEqual_dsym (TestFrames.FrameAPITestCase) runCmd: settings clear -all output:

Hide Details

runCmd: settings set symbols.enable-external-lookup false output:

Hide Details

runCmd: settings set target.inherit-tcc true output:

Hide Details

runCmd: settings set target.detach-on-error false output:

Hide Details

runCmd: settings set target.auto-apply-fixits false output:

Hide Details

runCmd: settings set plugin.process.gdb-remote.packet-timeout 60 output:

Hide Details

runCmd: settings set symbols.clang-modules-cache-path "/Users/buildslave/jenkins/workspace/lldb-cmake-sanitized/lldb-build/lldb-test-build.noindex/module-cache-lldb/lldb-api" output:

Hide Details

runCmd: settings set use-color false output:

Hide Details

runCmd: setting set target.prefer-dynamic-value no-dynamic-values output:

Hide Details

runCmd: settings set target.env-vars ASAN_OPTIONS=detect_stack_use_after_return=1 DYLD_INSERT_LIBRARIES=/Users/buildslave/jenkins/workspace/lldb-cmake-sanitized/host-compiler/lib/clang/13.0.99/lib/darwin/libclang_rt.asan_osx_dynamic.dylib output:

Hide Details

breakpoint: SBBreakpoint: id = 1, name = 'c', module = a.out, locations = 1

Hide Details

<bound method SBProcess.Kill of <lldb.SBProcess; proxy of <Swig Object of type 'lldb::SBProcess *' at 0x10d547ae0> >>: success

Hide Details

PASS: LLDB (/Users/buildslave/jenkins/workspace/lldb-cmake-sanitized/host-compiler/bin/clang-x86_64) :: test_frame_api_IsEqual_dwarf (TestFrames.FrameAPITestCase) UNSUPPORTED: LLDB (/Users/buildslave/jenkins/workspace/lldb-cmake-sanitized/host-compiler/bin/clang-x86_64) :: test_frame_api_IsEqual_dwo (TestFrames.FrameAPITestCase) (test case does not fall in any category of interest for this run) runCmd: settings clear -all output:

Hide Details

runCmd: settings set symbols.enable-external-lookup false output:

Hide Details

runCmd: settings set target.inherit-tcc true output:

Hide Details

runCmd: settings set target.detach-on-error false output:

Hide Details

runCmd: settings set target.auto-apply-fixits false output:

Hide Details

runCmd: settings set plugin.process.gdb-remote.packet-timeout 60 output:

Hide Details

runCmd: settings set symbols.clang-modules-cache-path "/Users/buildslave/jenkins/workspace/lldb-cmake-sanitized/lldb-build/lldb-test-build.noindex/module-cache-lldb/lldb-api" output:

Hide Details

runCmd: settings set use-color false output:

Hide Details

runCmd: setting set target.prefer-dynamic-value no-dynamic-values output:

Hide Details

runCmd: settings set target.env-vars ASAN_OPTIONS=detect_stack_use_after_return=1 DYLD_INSERT_LIBRARIES=/Users/buildslave/jenkins/workspace/lldb-cmake-sanitized/host-compiler/lib/clang/13.0.99/lib/darwin/libclang_rt.asan_osx_dynamic.dylib output:

Hide Details

breakpoint: SBBreakpoint: id = 1, name = 'c', module = a.out, locations = 1

Hide Details

FAIL: LLDB (/Users/buildslave/jenkins/workspace/lldb-cmake-sanitized/host-compiler/bin/clang-x86_64) :: test_frame_api_IsEqual_gmodules (TestFrames.FrameAPITestCase) <bound method SBProcess.Kill of <lldb.SBProcess; proxy of <Swig Object of type 'lldb::SBProcess *' at 0x10dd9af90> >>: success

Hide Details

runCmd: settings clear -all output:

Hide Details

runCmd: settings set symbols.enable-external-lookup false output:

Hide Details

runCmd: settings set target.inherit-tcc true output:

Hide Details

runCmd: settings set target.detach-on-error false output:

Hide Details

runCmd: settings set target.auto-apply-fixits false output:

Hide Details

runCmd: settings set plugin.process.gdb-remote.packet-timeout 60 output:

Hide Details

runCmd: settings set symbols.clang-modules-cache-path "/Users/buildslave/jenkins/workspace/lldb-cmake-sanitized/lldb-build/lldb-test-build.noindex/module-cache-lldb/lldb-api" output:

Hide Details

runCmd: settings set use-color false output:

Hide Details

runCmd: setting set target.prefer-dynamic-value no-dynamic-values output:

Hide Details

runCmd: settings set target.env-vars ASAN_OPTIONS=detect_stack_use_after_return=1 DYLD_INSERT_LIBRARIES=/Users/buildslave/jenkins/workspace/lldb-cmake-sanitized/host-compiler/lib/clang/13.0.99/lib/darwin/libclang_rt.asan_osx_dynamic.dylib output:

Hide Details

breakpoint: SBBreakpoint: id = 1, name = 'c', module = a.out, locations = 1

Hide Details

<bound method SBProcess.Kill of <lldb.SBProcess; proxy of <Swig Object of type 'lldb::SBProcess *' at 0x10d547ae0> >>: success

Hide Details

PASS: LLDB (/Users/buildslave/jenkins/workspace/lldb-cmake-sanitized/host-compiler/bin/clang-x86_64) :: test_frame_api_boundary_condition_dsym (TestFrames.FrameAPITestCase) runCmd: settings clear -all output:

Hide Details

runCmd: settings set symbols.enable-external-lookup false output:

Hide Details

runCmd: settings set target.inherit-tcc true output:

Hide Details

runCmd: settings set target.detach-on-error false output:

Hide Details

runCmd: settings set target.auto-apply-fixits false output:

Hide Details

runCmd: settings set plugin.process.gdb-remote.packet-timeout 60 output:

Hide Details

runCmd: settings set symbols.clang-modules-cache-path "/Users/buildslave/jenkins/workspace/lldb-cmake-sanitized/lldb-build/lldb-test-build.noindex/module-cache-lldb/lldb-api" output:

Hide Details

runCmd: settings set use-color false output:

Hide Details

runCmd: setting set target.prefer-dynamic-value no-dynamic-values output:

Hide Details

runCmd: settings set target.env-vars ASAN_OPTIONS=detect_stack_use_after_return=1 DYLD_INSERT_LIBRARIES=/Users/buildslave/jenkins/workspace/lldb-cmake-sanitized/host-compiler/lib/clang/13.0.99/lib/darwin/libclang_rt.asan_osx_dynamic.dylib output:

Hide Details

breakpoint: SBBreakpoint: id = 1, name = 'c', module = a.out, locations = 1

Hide Details

<bound method SBProcess.Kill of <lldb.SBProcess; proxy of <Swig Object of type 'lldb::SBProcess *' at 0x10db689f0> >>: success

Hide Details

PASS: LLDB (/Users/buildslave/jenkins/workspace/lldb-cmake-sanitized/host-compiler/bin/clang-x86_64) :: test_frame_api_boundary_condition_dwarf (TestFrames.FrameAPITestCase) UNSUPPORTED: LLDB (/Users/buildslave/jenkins/workspace/lldb-cmake-sanitized/host-compiler/bin/clang-x86_64) :: test_frame_api_boundary_condition_dwo (TestFrames.FrameAPITestCase) (test case does not fall in any category of interest for this run) runCmd: settings clear -all output:

Hide Details

runCmd: settings set symbols.enable-external-lookup false output:

Hide Details

runCmd: settings set target.inherit-tcc true output:

Hide Details

runCmd: settings set target.detach-on-error false output:

Hide Details

runCmd: settings set target.auto-apply-fixits false output:

Hide Details

runCmd: settings set plugin.process.gdb-remote.packet-timeout 60 output:

Hide Details

runCmd: settings set symbols.clang-modules-cache-path "/Users/buildslave/jenkins/workspace/lldb-cmake-sanitized/lldb-build/lldb-test-build.noindex/module-cache-lldb/lldb-api" output:

Hide Details

runCmd: settings set use-color false output:

Hide Details

runCmd: setting set target.prefer-dynamic-value no-dynamic-values output:

Hide Details

runCmd: settings set target.env-vars ASAN_OPTIONS=detect_stack_use_after_return=1 DYLD_INSERT_LIBRARIES=/Users/buildslave/jenkins/workspace/lldb-cmake-sanitized/host-compiler/lib/clang/13.0.99/lib/darwin/libclang_rt.asan_osx_dynamic.dylib output:

Hide Details

breakpoint: SBBreakpoint: id = 1, name = 'c', module = a.out, locations = 1

Hide Details

<bound method SBProcess.Kill of <lldb.SBProcess; proxy of <Swig Object of type 'lldb::SBProcess *' at 0x10d547ae0> >>: success

Hide Details

PASS: LLDB (/Users/buildslave/jenkins/workspace/lldb-cmake-sanitized/host-compiler/bin/clang-x86_64) :: test_frame_api_boundary_condition_gmodules (TestFrames.FrameAPITestCase) runCmd: settings clear -all output:

Hide Details

runCmd: settings set symbols.enable-external-lookup false output:

Hide Details

runCmd: settings set target.inherit-tcc true output:

Hide Details

runCmd: settings set target.detach-on-error false output:

Hide Details

runCmd: settings set target.auto-apply-fixits false output:

Hide Details

runCmd: settings set plugin.process.gdb-remote.packet-timeout 60 output:

Hide Details

runCmd: settings set symbols.clang-modules-cache-path "/Users/buildslave/jenkins/workspace/lldb-cmake-sanitized/lldb-build/lldb-test-build.noindex/module-cache-lldb/lldb-api" output:

Hide Details

runCmd: settings set use-color false output:

Hide Details

runCmd: setting set target.prefer-dynamic-value no-dynamic-values output:

Hide Details

runCmd: settings set target.env-vars ASAN_OPTIONS=detect_stack_use_after_return=1 DYLD_INSERT_LIBRARIES=/Users/buildslave/jenkins/workspace/lldb-cmake-sanitized/host-compiler/lib/clang/13.0.99/lib/darwin/libclang_rt.asan_osx_dynamic.dylib output:

Hide Details

breakpoint: SBBreakpoint: id = 1, name = 'c', module = a.out, locations = 1

Hide Details

looking at: c((int)val=3, (char)ch='C') b((int)val=2, (char)ch='B') a((int)val=1, (char)ch='A') --- c((int)val=3, (char)ch='C') b((int)val=2, (char)ch='B') main((int)argc=1, (const char **)argv=0x00007ffeefbff8c8) --- c((int)val=4, (char)ch='B') a((int)val=3, (char)ch='A') main((int)argc=1, (const char **)argv=0x00007ffeefbff8c8) ---

Hide Details

Hide Details

Checking string: "c((int)val=3, (char)ch='C') b((int)val=2, (char)ch='B') a((int)val=1, (char)ch='A') --- c((int)val=3, (char)ch='C') b((int)val=2, (char)ch='B') main((int)argc=1, (const char **)argv=0x00007ffeefbff8c8) --- c((int)val=4, (char)ch='B') a((int)val=3, (char)ch='A') main((int)argc=1, (const char **)argv=0x00007ffeefbff8c8) --- "

Hide Details

Expecting sub string: "a((int)val=1, (char)ch='A')" (was found) Expecting sub string: "a((int)val=3, (char)ch='A')" (was found)

Hide Details

<bound method SBProcess.Kill of <lldb.SBProcess; proxy of <Swig Object of type 'lldb::SBProcess *' at 0x10db689f0> >>: success

Hide Details

PASS: LLDB (/Users/buildslave/jenkins/workspace/lldb-cmake-sanitized/host-compiler/bin/clang-x86_64) :: test_get_arg_vals_for_call_stack_dsym (TestFrames.FrameAPITestCase) runCmd: settings clear -all output:

Hide Details

runCmd: settings set symbols.enable-external-lookup false output:

Hide Details

runCmd: settings set target.inherit-tcc true output:

Hide Details

runCmd: settings set target.detach-on-error false output:

Hide Details

runCmd: settings set target.auto-apply-fixits false output:

Hide Details

runCmd: settings set plugin.process.gdb-remote.packet-timeout 60 output:

Hide Details

runCmd: settings set symbols.clang-modules-cache-path "/Users/buildslave/jenkins/workspace/lldb-cmake-sanitized/lldb-build/lldb-test-build.noindex/module-cache-lldb/lldb-api" output:

Hide Details

runCmd: settings set use-color false output:

Hide Details

runCmd: setting set target.prefer-dynamic-value no-dynamic-values output:

Hide Details

runCmd: settings set target.env-vars ASAN_OPTIONS=detect_stack_use_after_return=1 DYLD_INSERT_LIBRARIES=/Users/buildslave/jenkins/workspace/lldb-cmake-sanitized/host-compiler/lib/clang/13.0.99/lib/darwin/libclang_rt.asan_osx_dynamic.dylib output:

Hide Details

breakpoint: SBBreakpoint: id = 1, name = 'c', module = a.out, locations = 1

Hide Details

looking at: c((int)val=3, (char)ch='C') b((int)val=2, (char)ch='B') a((int)val=1, (char)ch='A') --- c((int)val=3, (char)ch='C') b((int)val=2, (char)ch='B') main((int)argc=1, (const char **)argv=0x00007ffeefbff8c8) --- c((int)val=4, (char)ch='B') a((int)val=3, (char)ch='A') main((int)argc=1, (const char **)argv=0x00007ffeefbff8c8) ---

Hide Details

Hide Details

Checking string: "c((int)val=3, (char)ch='C') b((int)val=2, (char)ch='B') a((int)val=1, (char)ch='A') --- c((int)val=3, (char)ch='C') b((int)val=2, (char)ch='B') main((int)argc=1, (const char **)argv=0x00007ffeefbff8c8) --- c((int)val=4, (char)ch='B') a((int)val=3, (char)ch='A') main((int)argc=1, (const char **)argv=0x00007ffeefbff8c8) --- "

Hide Details

Expecting sub string: "a((int)val=1, (char)ch='A')" (was found) Expecting sub string: "a((int)val=3, (char)ch='A')" (was found)

Hide Details

<bound method SBProcess.Kill of <lldb.SBProcess; proxy of <Swig Object of type 'lldb::SBProcess *' at 0x10d5479f0> >>: success

Hide Details

PASS: LLDB (/Users/buildslave/jenkins/workspace/lldb-cmake-sanitized/host-compiler/bin/clang-x86_64) :: test_get_arg_vals_for_call_stack_dwarf (TestFrames.FrameAPITestCase) UNSUPPORTED: LLDB (/Users/buildslave/jenkins/workspace/lldb-cmake-sanitized/host-compiler/bin/clang-x86_64) :: test_get_arg_vals_for_call_stack_dwo (TestFrames.FrameAPITestCase) (test case does not fall in any category of interest for this run) runCmd: settings clear -all output:

Hide Details

runCmd: settings set symbols.enable-external-lookup false output:

Hide Details

runCmd: settings set target.inherit-tcc true output:

Hide Details

runCmd: settings set target.detach-on-error false output:

Hide Details

runCmd: settings set target.auto-apply-fixits false output:

Hide Details

runCmd: settings set plugin.process.gdb-remote.packet-timeout 60 output:

Hide Details

runCmd: settings set symbols.clang-modules-cache-path "/Users/buildslave/jenkins/workspace/lldb-cmake-sanitized/lldb-build/lldb-test-build.noindex/module-cache-lldb/lldb-api" output:

Hide Details

runCmd: settings set use-color false output:

Hide Details

runCmd: setting set target.prefer-dynamic-value no-dynamic-values output:

Hide Details

runCmd: settings set target.env-vars ASAN_OPTIONS=detect_stack_use_after_return=1 DYLD_INSERT_LIBRARIES=/Users/buildslave/jenkins/workspace/lldb-cmake-sanitized/host-compiler/lib/clang/13.0.99/lib/darwin/libclang_rt.asan_osx_dynamic.dylib output:

Hide Details

breakpoint: SBBreakpoint: id = 1, name = 'c', module = a.out, locations = 1

Hide Details

looking at: c((int)val=3, (char)ch='C') b((int)val=2, (char)ch='B') a((int)val=1, (char)ch='A') --- c((int)val=3, (char)ch='C') b((int)val=2, (char)ch='B') main((int)argc=1, (const char **)argv=0x00007ffeefbff8c0) --- c((int)val=4, (char)ch='B') a((int)val=3, (char)ch='A') main((int)argc=1, (const char **)argv=0x00007ffeefbff8c0) ---

Hide Details

Hide Details

Checking string: "c((int)val=3, (char)ch='C') b((int)val=2, (char)ch='B') a((int)val=1, (char)ch='A') --- c((int)val=3, (char)ch='C') b((int)val=2, (char)ch='B') main((int)argc=1, (const char **)argv=0x00007ffeefbff8c0) --- c((int)val=4, (char)ch='B') a((int)val=3, (char)ch='A') main((int)argc=1, (const char **)argv=0x00007ffeefbff8c0) --- "

Hide Details

Expecting sub string: "a((int)val=1, (char)ch='A')" (was found) Expecting sub string: "a((int)val=3, (char)ch='A')" (was found)

Hide Details

<bound method SBProcess.Kill of <lldb.SBProcess; proxy of <Swig Object of type 'lldb::SBProcess *' at 0x10dd9af90> >>: success

Hide Details

PASS: LLDB (/Users/buildslave/jenkins/workspace/lldb-cmake-sanitized/host-compiler/bin/clang-x86_64) :: test_get_arg_vals_for_call_stack_gmodules (TestFrames.FrameAPITestCase) Restore dir to: /Users/buildslave/jenkins/workspace/lldb-cmake-sanitized/lldb-build/tools/lldb/test ====================================================================== FAIL: test_frame_api_IsEqual_gmodules (TestFrames.FrameAPITestCase) Exercise SBFrame API IsEqual. ---------------------------------------------------------------------- Traceback (most recent call last): File "/Users/buildslave/jenkins/workspace/lldb-cmake-sanitized/llvm-project/lldb/packages/Python/lldbsuite/test/lldbtest.py", line 1830, in test_method return attrvalue(self) File "/Users/buildslave/jenkins/workspace/lldb-cmake-sanitized/llvm-project/lldb/test/API/python_api/frame/TestFrames.py", line 185, in test_frame_api_IsEqual PROCESS_STOPPED) AssertionError: 10 != 5 : Process status should be stopped Config=x86_64-/Users/buildslave/jenkins/workspace/lldb-cmake-sanitized/host-compiler/bin/clang ---------------------------------------------------------------------- Ran 12 tests in 60.156s

Hide Details

RESULT: FAILED (8 passes, 1 failures, 0 errors, 3 skipped, 0 expected failures, 0 unexpected successes)

Hide Details

--

Hide Details

******************** PASS: lldb-unit :: Utility/./UtilityTests/RangeDataVector.FindEntryIndexesThatContain (2010 of 2355) PASS: lldb-unit :: ObjectFile/Breakpad/./ObjectFileBreakpadTests/StackCFIRecord.parse (2011 of 2355) PASS: lldb-unit :: SymbolFile/DWARF/./SymbolFileDWARFTests/SymbolFileDWARFTests.TestAbbrevInvalidNULLTag (2012 of 2355) PASS: lldb-unit :: Expression/./ExpressionTests/DWARFExpression.DW_OP_stack_value (2013 of 2355) PASS: lldb-api :: functionalities/data-formatter/data-formatter-stl/libcxx/tuple/TestDataFormatterLibcxxTuple.py (2014 of 2355) FAIL: lldb-api :: commands/expression/static-initializers/TestStaticInitializers.py (2015 of 2355) ******************** TEST 'lldb-api :: commands/expression/static-initializers/TestStaticInitializers.py' FAILED ******************** Script: -- /Users/buildslave/jenkins/workspace/lldb-cmake-sanitized/lldb-build/lldb-test-build.noindex/copied-python /Users/buildslave/jenkins/workspace/lldb-cmake-sanitized/llvm-project/lldb/test/API/dotest.py -u CXXFLAGS -u CFLAGS --codesign-identity lldb_codesign --arch x86_64 --build-dir /Users/buildslave/jenkins/workspace/lldb-cmake-sanitized/lldb-build/lldb-test-build.noindex -t --env TERM=vt100 --env LLVM_LIBS_DIR=/Users/buildslave/jenkins/workspace/lldb-cmake-sanitized/lldb-build/./lib --inferior-env ASAN_OPTIONS=detect_stack_use_after_return=1 --inferior-env DYLD_INSERT_LIBRARIES=/Users/buildslave/jenkins/workspace/lldb-cmake-sanitized/host-compiler/lib/clang/13.0.99/lib/darwin/libclang_rt.asan_osx_dynamic.dylib --arch x86_64 --build-dir /Users/buildslave/jenkins/workspace/lldb-cmake-sanitized/lldb-build/lldb-test-build.noindex --lldb-module-cache-dir /Users/buildslave/jenkins/workspace/lldb-cmake-sanitized/lldb-build/lldb-test-build.noindex/module-cache-lldb/lldb-api --clang-module-cache-dir /Users/buildslave/jenkins/workspace/lldb-cmake-sanitized/lldb-build/lldb-test-build.noindex/module-cache-clang/lldb-api --executable /Users/buildslave/jenkins/workspace/lldb-cmake-sanitized/lldb-build/./bin/lldb --compiler /Users/buildslave/jenkins/workspace/lldb-cmake-sanitized/host-compiler/bin/clang --dsymutil /Users/buildslave/jenkins/workspace/lldb-cmake-sanitized/lldb-build/./bin/dsymutil --llvm-tools-dir /Users/buildslave/jenkins/workspace/lldb-cmake-sanitized/lldb-build/./bin --lldb-libs-dir /Users/buildslave/jenkins/workspace/lldb-cmake-sanitized/lldb-build/./lib /Users/buildslave/jenkins/workspace/lldb-cmake-sanitized/llvm-project/lldb/test/API/commands/expression/static-initializers -p TestStaticInitializers.py -- Exit Code: 1

Hide Details

Command Output (stdout): -- lldb version 13.0.99 (http://labmaster3.local/git/llvm-project.git revision 95923c0ba245377205f783607aaacbf8c667b353) clang revision 95923c0ba245377205f783607aaacbf8c667b353 llvm revision 95923c0ba245377205f783607aaacbf8c667b353 Skipping the following test categories: ['darwin-log', 'libstdcxx', 'dwo', 'llgs', 'fork']

Hide Details

-- Command Output (stderr): -- Change dir to: /Users/buildslave/jenkins/workspace/lldb-cmake-sanitized/llvm-project/lldb/test/API/commands/expression/static-initializers runCmd: settings clear -all output:

Hide Details

runCmd: settings set symbols.enable-external-lookup false output:

Hide Details

runCmd: settings set target.inherit-tcc true output:

Hide Details

runCmd: settings set target.detach-on-error false output:

Hide Details

runCmd: settings set target.auto-apply-fixits false output:

Hide Details

runCmd: settings set plugin.process.gdb-remote.packet-timeout 60 output:

Hide Details

runCmd: settings set symbols.clang-modules-cache-path "/Users/buildslave/jenkins/workspace/lldb-cmake-sanitized/lldb-build/lldb-test-build.noindex/module-cache-lldb/lldb-api" output:

Hide Details

runCmd: settings set use-color false output:

Hide Details

runCmd: setting set target.prefer-dynamic-value no-dynamic-values output:

Hide Details

runCmd: settings set target.env-vars ASAN_OPTIONS=detect_stack_use_after_return=1 DYLD_INSERT_LIBRARIES=/Users/buildslave/jenkins/workspace/lldb-cmake-sanitized/host-compiler/lib/clang/13.0.99/lib/darwin/libclang_rt.asan_osx_dynamic.dylib output:

Hide Details

runCmd: settings set target.env-vars ASAN_OPTIONS=detect_stack_use_after_return=1 DYLD_INSERT_LIBRARIES=/Users/buildslave/jenkins/workspace/lldb-cmake-sanitized/host-compiler/lib/clang/13.0.99/lib/darwin/libclang_rt.asan_osx_dynamic.dylib output:

Hide Details

runCmd: expr -p -- struct Foo { Foo() { inc_counter(); } }; Foo f; output:

Hide Details

Ran command: "expr -p -- struct Foo { Foo() { inc_counter(); } }; Foo f;"

Hide Details

Got output:

Hide Details

Hide Details

<bound method SBProcess.Kill of <lldb.SBProcess; proxy of <Swig Object of type 'lldb::SBProcess *' at 0x107a40930> >>: success

Hide Details

PASS: LLDB (/Users/buildslave/jenkins/workspace/lldb-cmake-sanitized/host-compiler/bin/clang-x86_64) :: test_dsym (TestStaticInitializers.StaticInitializers) runCmd: settings clear -all output:

Hide Details

runCmd: settings set symbols.enable-external-lookup false output:

Hide Details

runCmd: settings set target.inherit-tcc true output:

Hide Details

runCmd: settings set target.detach-on-error false output:

Hide Details

runCmd: settings set target.auto-apply-fixits false output:

Hide Details

runCmd: settings set plugin.process.gdb-remote.packet-timeout 60 output:

Hide Details

runCmd: settings set symbols.clang-modules-cache-path "/Users/buildslave/jenkins/workspace/lldb-cmake-sanitized/lldb-build/lldb-test-build.noindex/module-cache-lldb/lldb-api" output:

Hide Details

runCmd: settings set use-color false output:

Hide Details

runCmd: setting set target.prefer-dynamic-value no-dynamic-values output:

Hide Details

runCmd: settings set target.env-vars ASAN_OPTIONS=detect_stack_use_after_return=1 DYLD_INSERT_LIBRARIES=/Users/buildslave/jenkins/workspace/lldb-cmake-sanitized/host-compiler/lib/clang/13.0.99/lib/darwin/libclang_rt.asan_osx_dynamic.dylib output:

Hide Details

runCmd: settings set target.env-vars ASAN_OPTIONS=detect_stack_use_after_return=1 DYLD_INSERT_LIBRARIES=/Users/buildslave/jenkins/workspace/lldb-cmake-sanitized/host-compiler/lib/clang/13.0.99/lib/darwin/libclang_rt.asan_osx_dynamic.dylib output:

Hide Details

FAIL: LLDB (/Users/buildslave/jenkins/workspace/lldb-cmake-sanitized/host-compiler/bin/clang-x86_64) :: test_dwarf (TestStaticInitializers.StaticInitializers) <bound method SBProcess.Kill of <lldb.SBProcess; proxy of <Swig Object of type 'lldb::SBProcess *' at 0x106ce4ae0> >>: success

Hide Details

UNSUPPORTED: LLDB (/Users/buildslave/jenkins/workspace/lldb-cmake-sanitized/host-compiler/bin/clang-x86_64) :: test_dwo (TestStaticInitializers.StaticInitializers) (test case does not fall in any category of interest for this run) runCmd: settings clear -all output:

Hide Details

runCmd: settings set symbols.enable-external-lookup false output:

Hide Details

runCmd: settings set target.inherit-tcc true output:

Hide Details

runCmd: settings set target.detach-on-error false output:

Hide Details

runCmd: settings set target.auto-apply-fixits false output:

Hide Details

runCmd: settings set plugin.process.gdb-remote.packet-timeout 60 output:

Hide Details

runCmd: settings set symbols.clang-modules-cache-path "/Users/buildslave/jenkins/workspace/lldb-cmake-sanitized/lldb-build/lldb-test-build.noindex/module-cache-lldb/lldb-api" output:

Hide Details

runCmd: settings set use-color false output:

Hide Details

runCmd: setting set target.prefer-dynamic-value no-dynamic-values output:

Hide Details

runCmd: settings set target.env-vars ASAN_OPTIONS=detect_stack_use_after_return=1 DYLD_INSERT_LIBRARIES=/Users/buildslave/jenkins/workspace/lldb-cmake-sanitized/host-compiler/lib/clang/13.0.99/lib/darwin/libclang_rt.asan_osx_dynamic.dylib output:

Hide Details

runCmd: settings set target.env-vars ASAN_OPTIONS=detect_stack_use_after_return=1 DYLD_INSERT_LIBRARIES=/Users/buildslave/jenkins/workspace/lldb-cmake-sanitized/host-compiler/lib/clang/13.0.99/lib/darwin/libclang_rt.asan_osx_dynamic.dylib output:

Hide Details

runCmd: expr -p -- struct Foo2 { Foo2() { do_abort(); } }; Foo2 f; check of return status not required runCmd failed! error: expression failed to parse: error: couldn't run static initializer:

Hide Details

Hide Details

Hide Details

Ran command: "expr -p -- struct Foo2 { Foo2() { do_abort(); } }; Foo2 f;"

Hide Details

Got output: error: expression failed to parse: error: couldn't run static initializer:

Hide Details

Hide Details

Expecting sub string: "error: couldn't run static initializer:" (was found)

Hide Details

<bound method SBProcess.Kill of <lldb.SBProcess; proxy of <Swig Object of type 'lldb::SBProcess *' at 0x1072c3990> >>: success

Hide Details

PASS: LLDB (/Users/buildslave/jenkins/workspace/lldb-cmake-sanitized/host-compiler/bin/clang-x86_64) :: test_failing_init_dsym (TestStaticInitializers.StaticInitializers) runCmd: settings clear -all output:

Hide Details

runCmd: settings set symbols.enable-external-lookup false output:

Hide Details

runCmd: settings set target.inherit-tcc true output:

Hide Details

runCmd: settings set target.detach-on-error false output:

Hide Details

runCmd: settings set target.auto-apply-fixits false output:

Hide Details

runCmd: settings set plugin.process.gdb-remote.packet-timeout 60 output:

Hide Details

runCmd: settings set symbols.clang-modules-cache-path "/Users/buildslave/jenkins/workspace/lldb-cmake-sanitized/lldb-build/lldb-test-build.noindex/module-cache-lldb/lldb-api" output:

Hide Details

runCmd: settings set use-color false output:

Hide Details

runCmd: setting set target.prefer-dynamic-value no-dynamic-values output:

Hide Details

runCmd: settings set target.env-vars ASAN_OPTIONS=detect_stack_use_after_return=1 DYLD_INSERT_LIBRARIES=/Users/buildslave/jenkins/workspace/lldb-cmake-sanitized/host-compiler/lib/clang/13.0.99/lib/darwin/libclang_rt.asan_osx_dynamic.dylib output:

Hide Details

runCmd: settings set target.env-vars ASAN_OPTIONS=detect_stack_use_after_return=1 DYLD_INSERT_LIBRARIES=/Users/buildslave/jenkins/workspace/lldb-cmake-sanitized/host-compiler/lib/clang/13.0.99/lib/darwin/libclang_rt.asan_osx_dynamic.dylib output:

Hide Details

runCmd: expr -p -- struct Foo2 { Foo2() { do_abort(); } }; Foo2 f; check of return status not required runCmd failed! error: expression failed to parse: error: couldn't run static initializer:

Hide Details

Hide Details

Hide Details

Ran command: "expr -p -- struct Foo2 { Foo2() { do_abort(); } }; Foo2 f;"

Hide Details

Got output: error: expression failed to parse: error: couldn't run static initializer:

Hide Details

Hide Details

Expecting sub string: "error: couldn't run static initializer:" (was found)

Hide Details

<bound method SBProcess.Kill of <lldb.SBProcess; proxy of <Swig Object of type 'lldb::SBProcess *' at 0x106ce4a20> >>: success

Hide Details

PASS: LLDB (/Users/buildslave/jenkins/workspace/lldb-cmake-sanitized/host-compiler/bin/clang-x86_64) :: test_failing_init_dwarf (TestStaticInitializers.StaticInitializers) UNSUPPORTED: LLDB (/Users/buildslave/jenkins/workspace/lldb-cmake-sanitized/host-compiler/bin/clang-x86_64) :: test_failing_init_dwo (TestStaticInitializers.StaticInitializers) (test case does not fall in any category of interest for this run) runCmd: settings clear -all output:

Hide Details

runCmd: settings set symbols.enable-external-lookup false output:

Hide Details

runCmd: settings set target.inherit-tcc true output:

Hide Details

runCmd: settings set target.detach-on-error false output:

Hide Details

runCmd: settings set target.auto-apply-fixits false output:

Hide Details

runCmd: settings set plugin.process.gdb-remote.packet-timeout 60 output:

Hide Details

runCmd: settings set symbols.clang-modules-cache-path "/Users/buildslave/jenkins/workspace/lldb-cmake-sanitized/lldb-build/lldb-test-build.noindex/module-cache-lldb/lldb-api" output:

Hide Details

runCmd: settings set use-color false output:

Hide Details

runCmd: setting set target.prefer-dynamic-value no-dynamic-values output:

Hide Details

runCmd: settings set target.env-vars ASAN_OPTIONS=detect_stack_use_after_return=1 DYLD_INSERT_LIBRARIES=/Users/buildslave/jenkins/workspace/lldb-cmake-sanitized/host-compiler/lib/clang/13.0.99/lib/darwin/libclang_rt.asan_osx_dynamic.dylib output:

Hide Details

runCmd: settings set target.env-vars ASAN_OPTIONS=detect_stack_use_after_return=1 DYLD_INSERT_LIBRARIES=/Users/buildslave/jenkins/workspace/lldb-cmake-sanitized/host-compiler/lib/clang/13.0.99/lib/darwin/libclang_rt.asan_osx_dynamic.dylib output:

Hide Details

runCmd: expr -p -- struct Foo2 { Foo2() { do_abort(); } }; Foo2 f; check of return status not required runCmd failed! error: expression failed to parse: error: No module map file in /Users/buildslave/jenkins/workspace/lldb-cmake-sanitized/host-compiler/include/c++/v1

Hide Details

error: couldn't run static initializer:

Hide Details

Hide Details

Hide Details

Ran command: "expr -p -- struct Foo2 { Foo2() { do_abort(); } }; Foo2 f;"

Hide Details

Got output: error: expression failed to parse: error: No module map file in /Users/buildslave/jenkins/workspace/lldb-cmake-sanitized/host-compiler/include/c++/v1

Hide Details

error: couldn't run static initializer:

Hide Details

Hide Details

Expecting sub string: "error: couldn't run static initializer:" (was found)

Hide Details

<bound method SBProcess.Kill of <lldb.SBProcess; proxy of <Swig Object of type 'lldb::SBProcess *' at 0x1072c3990> >>: success

Hide Details

PASS: LLDB (/Users/buildslave/jenkins/workspace/lldb-cmake-sanitized/host-compiler/bin/clang-x86_64) :: test_failing_init_gmodules (TestStaticInitializers.StaticInitializers) runCmd: settings clear -all output:

Hide Details

runCmd: settings set symbols.enable-external-lookup false output:

Hide Details

runCmd: settings set target.inherit-tcc true output:

Hide Details

runCmd: settings set target.detach-on-error false output:

Hide Details

runCmd: settings set target.auto-apply-fixits false output:

Hide Details

runCmd: settings set plugin.process.gdb-remote.packet-timeout 60 output:

Hide Details

runCmd: settings set symbols.clang-modules-cache-path "/Users/buildslave/jenkins/workspace/lldb-cmake-sanitized/lldb-build/lldb-test-build.noindex/module-cache-lldb/lldb-api" output:

Hide Details

runCmd: settings set use-color false output:

Hide Details

runCmd: setting set target.prefer-dynamic-value no-dynamic-values output:

Hide Details

runCmd: settings set target.env-vars ASAN_OPTIONS=detect_stack_use_after_return=1 DYLD_INSERT_LIBRARIES=/Users/buildslave/jenkins/workspace/lldb-cmake-sanitized/host-compiler/lib/clang/13.0.99/lib/darwin/libclang_rt.asan_osx_dynamic.dylib output:

Hide Details

runCmd: settings set target.env-vars ASAN_OPTIONS=detect_stack_use_after_return=1 DYLD_INSERT_LIBRARIES=/Users/buildslave/jenkins/workspace/lldb-cmake-sanitized/host-compiler/lib/clang/13.0.99/lib/darwin/libclang_rt.asan_osx_dynamic.dylib output:

Hide Details

runCmd: expr -p -- struct Foo { Foo() { inc_counter(); } }; Foo f; output:

Hide Details

Ran command: "expr -p -- struct Foo { Foo() { inc_counter(); } }; Foo f;"

Hide Details

Got output:

Hide Details

Hide Details

<bound method SBProcess.Kill of <lldb.SBProcess; proxy of <Swig Object of type 'lldb::SBProcess *' at 0x106ce4a20> >>: success

Hide Details

PASS: LLDB (/Users/buildslave/jenkins/workspace/lldb-cmake-sanitized/host-compiler/bin/clang-x86_64) :: test_gmodules (TestStaticInitializers.StaticInitializers) runCmd: settings clear -all output:

Hide Details

runCmd: settings set symbols.enable-external-lookup false output:

Hide Details

runCmd: settings set target.inherit-tcc true output:

Hide Details

runCmd: settings set target.detach-on-error false output:

Hide Details

runCmd: settings set target.auto-apply-fixits false output:

Hide Details

runCmd: settings set plugin.process.gdb-remote.packet-timeout 60 output:

Hide Details

runCmd: settings set symbols.clang-modules-cache-path "/Users/buildslave/jenkins/workspace/lldb-cmake-sanitized/lldb-build/lldb-test-build.noindex/module-cache-lldb/lldb-api" output:

Hide Details

runCmd: settings set use-color false output:

Hide Details

runCmd: setting set target.prefer-dynamic-value no-dynamic-values output:

Hide Details

runCmd: settings set target.env-vars ASAN_OPTIONS=detect_stack_use_after_return=1 DYLD_INSERT_LIBRARIES=/Users/buildslave/jenkins/workspace/lldb-cmake-sanitized/host-compiler/lib/clang/13.0.99/lib/darwin/libclang_rt.asan_osx_dynamic.dylib output:

Hide Details

runCmd: expr -p -- int i = 0; struct Foo3 { Foo3() { ++i; } }; Foo3 f; check of return status not required runCmd failed! error: expression failed to parse: error: Top-level code needs to be inserted into a runnable target, but the target can't be run

Hide Details

Hide Details

Ran command: "expr -p -- int i = 0; struct Foo3 { Foo3() { ++i; } }; Foo3 f;"

Hide Details

Got output: error: expression failed to parse: error: Top-level code needs to be inserted into a runnable target, but the target can't be run

Hide Details

Expecting sub string: "Top-level code needs to be inserted into a runnable target" (was found)

Hide Details

PASS: LLDB (/Users/buildslave/jenkins/workspace/lldb-cmake-sanitized/host-compiler/bin/clang-x86_64) :: test_without_process_dsym (TestStaticInitializers.StaticInitializers) runCmd: settings clear -all output:

Hide Details

runCmd: settings set symbols.enable-external-lookup false output:

Hide Details

runCmd: settings set target.inherit-tcc true output:

Hide Details

runCmd: settings set target.detach-on-error false output:

Hide Details

runCmd: settings set target.auto-apply-fixits false output:

Hide Details

runCmd: settings set plugin.process.gdb-remote.packet-timeout 60 output:

Hide Details

runCmd: settings set symbols.clang-modules-cache-path "/Users/buildslave/jenkins/workspace/lldb-cmake-sanitized/lldb-build/lldb-test-build.noindex/module-cache-lldb/lldb-api" output:

Hide Details

runCmd: settings set use-color false output:

Hide Details

runCmd: setting set target.prefer-dynamic-value no-dynamic-values output:

Hide Details

runCmd: settings set target.env-vars ASAN_OPTIONS=detect_stack_use_after_return=1 DYLD_INSERT_LIBRARIES=/Users/buildslave/jenkins/workspace/lldb-cmake-sanitized/host-compiler/lib/clang/13.0.99/lib/darwin/libclang_rt.asan_osx_dynamic.dylib output:

Hide Details

runCmd: expr -p -- int i = 0; struct Foo3 { Foo3() { ++i; } }; Foo3 f; check of return status not required runCmd failed! error: expression failed to parse: error: Top-level code needs to be inserted into a runnable target, but the target can't be run

Hide Details

Hide Details

Ran command: "expr -p -- int i = 0; struct Foo3 { Foo3() { ++i; } }; Foo3 f;"

Hide Details

Got output: error: expression failed to parse: error: Top-level code needs to be inserted into a runnable target, but the target can't be run

Hide Details

Expecting sub string: "Top-level code needs to be inserted into a runnable target" (was found)

Hide Details

PASS: LLDB (/Users/buildslave/jenkins/workspace/lldb-cmake-sanitized/host-compiler/bin/clang-x86_64) :: test_without_process_dwarf (TestStaticInitializers.StaticInitializers) UNSUPPORTED: LLDB (/Users/buildslave/jenkins/workspace/lldb-cmake-sanitized/host-compiler/bin/clang-x86_64) :: test_without_process_dwo (TestStaticInitializers.StaticInitializers) (test case does not fall in any category of interest for this run) runCmd: settings clear -all output:

Hide Details

runCmd: settings set symbols.enable-external-lookup false output:

Hide Details

runCmd: settings set target.inherit-tcc true output:

Hide Details

runCmd: settings set target.detach-on-error false output:

Hide Details

runCmd: settings set target.auto-apply-fixits false output:

Hide Details

runCmd: settings set plugin.process.gdb-remote.packet-timeout 60 output:

Hide Details

runCmd: settings set symbols.clang-modules-cache-path "/Users/buildslave/jenkins/workspace/lldb-cmake-sanitized/lldb-build/lldb-test-build.noindex/module-cache-lldb/lldb-api" output:

Hide Details

runCmd: settings set use-color false output:

Hide Details

runCmd: setting set target.prefer-dynamic-value no-dynamic-values output:

Hide Details

runCmd: settings set target.env-vars ASAN_OPTIONS=detect_stack_use_after_return=1 DYLD_INSERT_LIBRARIES=/Users/buildslave/jenkins/workspace/lldb-cmake-sanitized/host-compiler/lib/clang/13.0.99/lib/darwin/libclang_rt.asan_osx_dynamic.dylib output:

Hide Details

runCmd: expr -p -- int i = 0; struct Foo3 { Foo3() { ++i; } }; Foo3 f; check of return status not required runCmd failed! error: expression failed to parse: error: Top-level code needs to be inserted into a runnable target, but the target can't be run

Hide Details

Hide Details

Ran command: "expr -p -- int i = 0; struct Foo3 { Foo3() { ++i; } }; Foo3 f;"

Hide Details

Got output: error: expression failed to parse: error: Top-level code needs to be inserted into a runnable target, but the target can't be run

Hide Details

Expecting sub string: "Top-level code needs to be inserted into a runnable target" (was found)

Hide Details

PASS: LLDB (/Users/buildslave/jenkins/workspace/lldb-cmake-sanitized/host-compiler/bin/clang-x86_64) :: test_without_process_gmodules (TestStaticInitializers.StaticInitializers) Restore dir to: /Users/buildslave/jenkins/workspace/lldb-cmake-sanitized/lldb-build/tools/lldb/test ====================================================================== FAIL: test_dwarf (TestStaticInitializers.StaticInitializers) Test a static initializer. ---------------------------------------------------------------------- Traceback (most recent call last): File "/Users/buildslave/jenkins/workspace/lldb-cmake-sanitized/llvm-project/lldb/packages/Python/lldbsuite/test/lldbtest.py", line 1830, in test_method return attrvalue(self) File "/Users/buildslave/jenkins/workspace/lldb-cmake-sanitized/llvm-project/lldb/packages/Python/lldbsuite/test/decorators.py", line 119, in wrapper func(*args, **kwargs) File "/Users/buildslave/jenkins/workspace/lldb-cmake-sanitized/llvm-project/lldb/test/API/commands/expression/static-initializers/TestStaticInitializers.py", line 17, in test lldb.SBFileSpec("main.cpp", False)) File "/Users/buildslave/jenkins/workspace/lldb-cmake-sanitized/llvm-project/lldb/packages/Python/lldbsuite/test/lldbutil.py", line 971, in run_to_source_breakpoint only_one_thread, extra_images) File "/Users/buildslave/jenkins/workspace/lldb-cmake-sanitized/llvm-project/lldb/packages/Python/lldbsuite/test/lldbutil.py", line 890, in run_to_breakpoint_do_run "Process launch failed: %s" % (error.GetCString())) AssertionError: True is not False : Process launch failed: process exited with status -1 (tried to attach to process already being debugged) Config=x86_64-/Users/buildslave/jenkins/workspace/lldb-cmake-sanitized/host-compiler/bin/clang ---------------------------------------------------------------------- Ran 12 tests in 62.233s

Hide Details

RESULT: FAILED (8 passes, 1 failures, 0 errors, 3 skipped, 0 expected failures, 0 unexpected successes)

Hide Details

--

Hide Details

******************** PASS: lldb-unit :: ObjectFile/ELF/./ObjectFileELFTests/ObjectFileELFTest.GetSymtab_NoSymEntryPointArmThumbAddressClass (2016 of 2355) PASS: lldb-api :: functionalities/data-formatter/builtin-formats/TestBuiltinFormats.py (2017 of 2355) PASS: lldb-api :: lang/cpp/type_lookup/TestCppTypeLookup.py (2018 of 2355) UNSUPPORTED: lldb-api :: lang/cpp/printf/TestPrintf.py (2019 of 2355) PASS: lldb-shell :: Settings/TestFrameFormatNoColor.test (2020 of 2355) PASS: lldb-api :: functionalities/thread/concurrent_events/TestConcurrentManyWatchpoints.py (2021 of 2355) UNSUPPORTED: lldb-shell :: ScriptInterpreter/Lua/breakpoint_function_callback.test (2022 of 2355) PASS: lldb-unit :: DataFormatter/./LLDBFormatterTests/FormatManagerTests.CompatibleLangs (2023 of 2355) PASS: lldb-unit :: Utility/./UtilityTests/BinaryStreamTest.PutULEB128SixBytes (2024 of 2355) PASS: lldb-shell :: SymbolFile/DWARF/dwo-relative-path.s (2025 of 2355) PASS: lldb-unit :: Symbol/./SymbolTests/TestTypeSystemClang.TestDisplayNameEmpty (2026 of 2355) PASS: lldb-shell :: SymbolFile/symbol-binding.test (2027 of 2355) PASS: lldb-unit :: Utility/./UtilityTests/ArgsTest.TestSingleQuotedArgWithSpace (2028 of 2355) PASS: lldb-unit :: ScriptInterpreter/Python/./ScriptInterpreterPythonTests/PythonDataObjectsTest.TestGlobalNameResolutionWithDot (2029 of 2355) PASS: lldb-api :: commands/log/basic/TestLogging.py (2030 of 2355) PASS: lldb-unit :: ScriptInterpreter/Python/./ScriptInterpreterPythonTests/PythonDataObjectsTest.TestScript (2031 of 2355) PASS: lldb-shell :: ObjectFile/ELF/PT_LOAD-empty.yaml (2032 of 2355) PASS: lldb-api :: lang/cpp/diamond/TestDiamond.py (2033 of 2355) PASS: lldb-unit :: Language/Highlighting/./HighlighterTests/HighlighterTest.ClangTrailingBackslashWithWhitespace (2034 of 2355) UNSUPPORTED: lldb-api :: commands/expression/multiline-completion/TestMultilineCompletion.py (2035 of 2355) PASS: lldb-unit :: Utility/./UtilityTests/RangeTest.ClearWithStarAddress (2036 of 2355) PASS: lldb-unit :: Utility/./UtilityTests/StringExtractorTest.GetU64LittleEndian (2037 of 2355) PASS: lldb-api :: functionalities/thread/concurrent_events/TestConcurrentSignalDelayBreak.py (2038 of 2355) PASS: lldb-shell :: Register/Core/x86-64-netbsd-fp.test (2039 of 2355) PASS: lldb-unit :: Utility/./UtilityTests/AnsiTerminal.KnownPrefix (2040 of 2355) UNSUPPORTED: lldb-api :: iohandler/autosuggestion/TestAutosuggestion.py (2041 of 2355) PASS: lldb-unit :: Process/minidump/./LLDBMinidumpTests/MinidumpParserTest.GetPid (2042 of 2355) PASS: lldb-api :: commands/frame/var-scope/TestFrameVariableScope.py (2043 of 2355) PASS: lldb-unit :: SymbolFile/DWARF/./SymbolFileDWARFTests/SymbolFileDWARFTests.TestAbilitiesForDWARF (2044 of 2355) PASS: lldb-unit :: Utility/./UtilityTests/SerializationRountripTest.SerializeDeserializeObjectReference (2045 of 2355) UNSUPPORTED: lldb-api :: commands/watchpoints/multi_watchpoint_slots/TestWatchpointMultipleSlots.py (2046 of 2355) PASS: lldb-unit :: Utility/./UtilityTests/StringListTest.GetMaxStringLengthMixed (2047 of 2355) UNSUPPORTED: lldb-shell :: SymbolFile/target-symbols-add-unwind.test (2048 of 2355) PASS: lldb-api :: python_api/watchpoint/watchlocation/TestSetWatchlocation.py (2049 of 2355) PASS: lldb-api :: python_api/value/empty_class/TestValueAPIEmptyClass.py (2050 of 2355) PASS: lldb-unit :: Symbol/./SymbolTests/TestTypeSystemClang.TestGetBasicTypeFromEnum (2051 of 2355) UNSUPPORTED: lldb-api :: tools/lldb-server/TestGdbRemoteModuleInfo.py (2052 of 2355) PASS: lldb-api :: functionalities/wrong_commands/TestWrongCommands.py (2053 of 2355) PASS: lldb-unit :: UnwindAssembly/x86/./UnwindAssemblyx86Tests/Testx86AssemblyInspectionEngine.TestPopRBX (2054 of 2355) PASS: lldb-shell :: Register/Core/x86-64-netbsd-addr.test (2055 of 2355) PASS: lldb-api :: functionalities/data-formatter/data-formatter-synthtype/TestDataFormatterSynthType.py (2056 of 2355) PASS: lldb-shell :: Watchpoint/SetErrorCases.test (2057 of 2355) PASS: lldb-unit :: Target/./TargetTests/PathMappingListTest.RemapRoot (2058 of 2355) UNSUPPORTED: lldb-api :: linux/mix-dwo-and-regular-objects/TestMixedDwarfBinary.py (2059 of 2355) PASS: lldb-api :: python_api/section/TestSectionAPI.py (2060 of 2355) PASS: lldb-unit :: Utility/./UtilityTests/SerializationRountripTest.SerializeDeserializeCString (2061 of 2355) PASS: lldb-shell :: Quit/TestQuitExitCodeNonInt.test (2062 of 2355) PASS: lldb-shell :: Driver/TestError.test (2063 of 2355) PASS: lldb-api :: python_api/sbvalue_const_addrof/TestSBValueConstAddrOf.py (2064 of 2355) PASS: lldb-api :: python_api/process/read-mem-cstring/TestReadMemCString.py (2065 of 2355) PASS: lldb-unit :: Utility/./UtilityTests/StringExtractorTest.GetHexBytes_Underflow (2066 of 2355) PASS: lldb-api :: commands/breakpoint/set/func-regex/TestBreakpointRegexError.py (2067 of 2355) PASS: lldb-unit :: Utility/./UtilityTests/DataExtractorTest.GetCStrEmpty (2068 of 2355) PASS: lldb-unit :: Utility/./UtilityTests/FileSpecTest.FileAndDirectoryComponents (2069 of 2355) PASS: lldb-unit :: UnwindAssembly/x86/./UnwindAssemblyx86Tests/Testx86AssemblyInspectionEngine.TestPushR14 (2070 of 2355) PASS: lldb-unit :: UnwindAssembly/x86/./UnwindAssemblyx86Tests/Testx86AssemblyInspectionEngine.TestPushImm (2071 of 2355) PASS: lldb-unit :: Utility/./UtilityTests/StreamTest.AddressSize (2072 of 2355) PASS: lldb-unit :: Process/minidump/./LLDBMinidumpTests/MinidumpParserTest.GetMemoryRegionInfo (2073 of 2355) PASS: lldb-unit :: Host/./HostTests/FileSystemTest.EmptyTest (2074 of 2355) UNSUPPORTED: lldb-shell :: Register/x86-zmm-write.test (2075 of 2355) PASS: lldb-api :: macosx/version_zero/TestGetVersionZeroVersion.py (2076 of 2355) PASS: lldb-shell :: SymbolFile/DWARF/x86/gnu-style-compression.cpp (2077 of 2355) PASS: lldb-unit :: Utility/./UtilityTests/StringListTest.InsertStringAtIndexMove (2078 of 2355) PASS: lldb-api :: functionalities/data-formatter/nssetsynth/TestNSSetSynthetic.py (2079 of 2355) PASS: lldb-unit :: Utility/./UtilityTests/StreamTeeTest.GetStreamAtIndexOutOfBounds (2080 of 2355) PASS: lldb-api :: macosx/order/TestOrderFile.py (2081 of 2355) PASS: lldb-unit :: Symbol/./SymbolTests/TestClangASTImporter.ImportInvalidType (2082 of 2355) PASS: lldb-api :: functionalities/data-formatter/data-formatter-python-synth/TestDataFormatterPythonSynth.py (2083 of 2355) PASS: lldb-shell :: SymbolFile/Breakpad/line-table-mixed-path-styles.test (2084 of 2355) PASS: lldb-unit :: Utility/./UtilityTests/CompletionRequest.TryCompleteCurrentArgMode (2085 of 2355) PASS: lldb-unit :: Utility/./UtilityTests/RegularExpression.CopyAssignment (2086 of 2355) PASS: lldb-api :: lang/cpp/class_static/TestStaticVariables.py (2087 of 2355) PASS: lldb-unit :: Host/./HostTests/FileSystemTest.Readable (2088 of 2355) PASS: lldb-unit :: Process/gdb-remote/./ProcessGdbRemoteTests/GDBRemoteClientBaseTest.SendPacketAndReceiveResponseWithOutputSupport (2089 of 2355) PASS: lldb-unit :: Language/Highlighting/./HighlighterTests/HighlighterTest.ClangEmptyInput (2090 of 2355) PASS: lldb-api :: lang/cpp/namespace_conflicts/TestNamespaceConflicts.py (2091 of 2355) PASS: lldb-unit :: UnwindAssembly/x86/./UnwindAssemblyx86Tests/Testx86AssemblyInspectionEngine.TestSimple64bitFrameFunction (2092 of 2355) PASS: lldb-unit :: Language/Highlighting/./HighlighterTests/HighlighterTest.ClangPPDirectives (2093 of 2355) PASS: lldb-shell :: SymbolFile/DWARF/anon_class_w_and_wo_export_symbols.ll (2094 of 2355) PASS: lldb-unit :: Utility/./UtilityTests/XcodeSDKTest.GetSDKTypeForTriple (2095 of 2355) PASS: lldb-api :: lang/cpp/modules-import/TestCXXModulesImport.py (2096 of 2355) PASS: lldb-unit :: Thread/./ThreadTests/ThreadTest.SetStopInfo (2097 of 2355) UNSUPPORTED: lldb-shell :: SymbolFile/DWARF/x86/DW_TAG_GNU_call_site-DW_AT_low_pc.s (2098 of 2355) PASS: lldb-unit :: Process/Utility/./ProcessUtilityTests/ProcMapTests/LinuxProcMapsTestFixture.ParseMapRegions/4 (2099 of 2355) PASS: lldb-api :: commands/watchpoints/watchpoint_count/TestWatchpointCount.py (2100 of 2355) PASS: lldb-api :: lang/cpp/global_operators/TestCppGlobalOperators.py (2101 of 2355) PASS: lldb-unit :: Symbol/./SymbolTests/PostfixExpression.ToDWARF (2102 of 2355) PASS: lldb-unit :: Utility/./UtilityTests/OptionsWithRawTest.WhitespaceInput (2103 of 2355) UNSUPPORTED: lldb-api :: benchmarks/expression/TestExpressionCmd.py (2104 of 2355) UNSUPPORTED: lldb-shell :: SymbolFile/NativePDB/local-variables.cpp (2105 of 2355) PASS: lldb-unit :: Host/./HostTests/NativeProcessProtocolTest.SetBreakpointFailWrite (2106 of 2355) PASS: lldb-unit :: Utility/./UtilityTests/StreamTest.PutCharWhitespace (2107 of 2355) PASS: lldb-api :: commands/expression/regression-access-function-template-in-record/TestRegressionAccessFunctionTemplateInRecord.py (2108 of 2355) PASS: lldb-api :: functionalities/data-formatter/data-formatter-stl/libcxx/map/TestDataFormatterLibccMap.py (2109 of 2355) PASS: lldb-shell :: ObjectFile/wasm/unified-debug-sections.yaml (2110 of 2355) PASS: lldb-shell :: Expr/TestMultilineExpr.test (2111 of 2355) UNSUPPORTED: lldb-shell :: SymbolFile/PDB/pointers.test (2112 of 2355) PASS: lldb-unit :: Utility/./UtilityTests/ArgsTest.ReplaceArgumentAtIndexLonger (2113 of 2355) PASS: lldb-unit :: Utility/./UtilityTests/SerializationRountripTest.SerializeDeserializePodPointers (2114 of 2355) PASS: lldb-api :: functionalities/breakpoint/address_breakpoints/TestBadAddressBreakpoints.py (2115 of 2355) PASS: lldb-unit :: Process/gdb-remote/./ProcessGdbRemoteTests/GDBRemoteClientBaseTest.SendContinueAndWait (2116 of 2355) PASS: lldb-shell :: Commands/command-image-lookup.yaml (2117 of 2355) PASS: lldb-unit :: Utility/./UtilityTests/StreamTest.PutMaxHex64ByteOrderBig (2118 of 2355) PASS: lldb-api :: commands/expression/persistent_variables/TestPersistentVariables.py (2119 of 2355) PASS: lldb-unit :: Language/Highlighting/./HighlighterTests/HighlighterTest.ClangCursorPosBeforeOtherToken (2120 of 2355) PASS: lldb-api :: lang/c/unions/TestUnionMembers.py (2121 of 2355) PASS: lldb-unit :: Target/./TargetTests/MCBasedABI.MapRegisterName (2122 of 2355) PASS: lldb-unit :: UnwindAssembly/x86/./UnwindAssemblyx86Tests/Testx86AssemblyInspectionEngine.TestSimplei386ugmented (2123 of 2355) PASS: lldb-unit :: Utility/./UtilityTests/StreamTest.AddressPrefixAndSuffix (2124 of 2355) PASS: lldb-unit :: Utility/./UtilityTests/ArgsTest.ReplaceArgumentAtIndexEqual (2125 of 2355) PASS: lldb-unit :: Utility/./UtilityTests/ArgsTest.Yaml (2126 of 2355) PASS: lldb-api :: commands/platform/file/close/TestPlatformFileClose.py (2127 of 2355) PASS: lldb-api :: functionalities/recursion/TestValueObjectRecursion.py (2128 of 2355) PASS: lldb-unit :: Symbol/./SymbolTests/LineEntryTest.GetSameLineContiguousAddressRangeNestedInline (2129 of 2355) PASS: lldb-unit :: Host/./HostTests/ConnectionFileDescriptorTest.TCPGetURIv6 (2130 of 2355) PASS: lldb-shell :: ObjectFile/PECOFF/basic-info-arm.yaml (2131 of 2355) PASS: lldb-api :: lang/cpp/alignas_base_class/TestAlignAsBaseClass.py (2132 of 2355) PASS: lldb-unit :: Utility/./UtilityTests/StringExtractorTest.InitEmpty (2133 of 2355) XFAIL: lldb-shell :: Expr/nodefaultlib.cpp (2134 of 2355) PASS: lldb-shell :: SymbolFile/DWARF/x86/find-function-regex.cpp (2135 of 2355) PASS: lldb-shell :: Recognizer/assert.test (2136 of 2355) PASS: lldb-shell :: Commands/command-thread-select.test (2137 of 2355) UNSUPPORTED: lldb-shell :: SymbolFile/NativePDB/stack_unwinding01.cpp (2138 of 2355) PASS: lldb-unit :: UnwindAssembly/x86/./UnwindAssemblyx86Tests/Testx86AssemblyInspectionEngine.Test32BitOnlyInstruction (2139 of 2355) PASS: lldb-shell :: SymbolFile/DWARF/DW_AT_range-DW_FORM_sec_offset.s (2140 of 2355) PASS: lldb-shell :: Process/UnsupportedLanguage.test (2141 of 2355) PASS: lldb-unit :: SymbolFile/NativePDB/./SymbolFileNativePDBTests/PDBFPOProgramToDWARFExpressionTests.MultipleDependentAssignments (2142 of 2355) UNSUPPORTED: lldb-api :: benchmarks/stepping/TestSteppingSpeed.py (2143 of 2355) PASS: lldb-unit :: Utility/./UtilityTests/StreamTeeTest.AppendStream (2144 of 2355) PASS: lldb-unit :: ScriptInterpreter/Python/./ScriptInterpreterPythonTests/PythonDataObjectsTest.TestCallable (2145 of 2355) PASS: lldb-unit :: Utility/./UtilityTests/ScalarTest.LongLongAssigmentOperator (2146 of 2355) PASS: lldb-unit :: Utility/./UtilityTests/RegularExpression.Valid (2147 of 2355) PASS: lldb-shell :: Unwind/thread-step-out-ret-addr-check.test (2148 of 2355) PASS: lldb-unit :: Symbol/./SymbolTests/TestTypeSystemClang.TestDeletingImplicitCopyCstrDueToMoveCStr (2149 of 2355) PASS: lldb-unit :: Utility/./UtilityTests/UserIDResolver.GetUserName (2150 of 2355) PASS: lldb-unit :: UnwindAssembly/x86/./UnwindAssemblyx86Tests/Testx86AssemblyInspectionEngine.TestPushEAX (2151 of 2355) PASS: lldb-unit :: Utility/./UtilityTests/ScalarTest.SetValueFromData (2152 of 2355) PASS: lldb-unit :: Host/./HostTests/NativeProcessProtocolTest.SetBreakpointFailRead (2153 of 2355) PASS: lldb-shell :: ObjectFile/ELF/eh_frame-symbols.yaml (2154 of 2355) PASS: lldb-unit :: Utility/./UtilityTests/StringExtractorTest.GetHexBytesAvail_Partial (2155 of 2355) PASS: lldb-unit :: Utility/./UtilityTests/CompletionRequest.TryCompleteCurrentArgBad (2156 of 2355) PASS: lldb-api :: functionalities/data-formatter/data-formatter-stl/libcxx/vbool/TestDataFormatterLibcxxVBool.py (2157 of 2355) PASS: lldb-api :: lang/cpp/breakpoint-commands/TestCPPBreakpointCommands.py (2158 of 2355) PASS: lldb-api :: tools/lldb-server/TestAppleSimulatorOSType.py (2159 of 2355) PASS: lldb-api :: commands/target/select/TestTargetSelect.py (2160 of 2355) PASS: lldb-shell :: Driver/TestCommands.test (2161 of 2355) PASS: lldb-api :: lang/cpp/incompatible-class-templates/TestCppIncompatibleClassTemplates.py (2162 of 2355) PASS: lldb-api :: tools/lldb-vscode/coreFile/TestVSCode_coreFile.py (2163 of 2355) PASS: lldb-unit :: Utility/./UtilityTests/NameMatchesTest.Ignore (2164 of 2355) PASS: lldb-unit :: Expression/./ExpressionTests/ClangHostTest.ComputeClangResourceDirectory (2165 of 2355) PASS: lldb-api :: functionalities/thread/concurrent_events/TestConcurrentBreakpointDelayBreakpointOneSignal.py (2166 of 2355) PASS: lldb-unit :: ScriptInterpreter/Python/./ScriptInterpreterPythonTests/PythonDataObjectsTest.TestObjectAttributes (2167 of 2355) PASS: lldb-api :: lang/cpp/constructors/TestCppConstructors.py (2168 of 2355) PASS: lldb-shell :: ScriptInterpreter/Python/Crashlog/parser_text.test (2169 of 2355) PASS: lldb-unit :: Utility/./UtilityTests/ArgsTest.TestMultipleArgs (2170 of 2355) PASS: lldb-unit :: Utility/./UtilityTests/StringListTest.RemoveBlankLines (2171 of 2355) PASS: lldb-unit :: UnwindAssembly/x86/./UnwindAssemblyx86Tests/Testx86AssemblyInspectionEngine.TestSpillRegToStackViaMOVx86_64 (2172 of 2355) PASS: lldb-shell :: SymbolFile/DWARF/x86/DW_AT_low_pc-addrx.s (2173 of 2355) PASS: lldb-api :: types/TestCharTypeExpr.py (2174 of 2355) PASS: lldb-shell :: SymbolFile/NativePDB/tag-types.cpp (2175 of 2355) PASS: lldb-unit :: Utility/./UtilityTests/VASprintfTest.NoBufferResize (2176 of 2355) PASS: lldb-api :: lang/objc/foundation/TestObjCMethods.py (2177 of 2355) PASS: lldb-shell :: SymbolFile/DWARF/x86/dwarf5-partial-index.cpp (2178 of 2355) UNSUPPORTED: lldb-shell :: ObjectFile/ELF/minidebuginfo-no-lzma.yaml (2179 of 2355) PASS: lldb-shell :: Register/Core/x86-64-freebsd-gp.test (2180 of 2355) PASS: lldb-unit :: Editline/./EditlineTests/EditlineTestFixture.EditlineReceivesSingleLineText (2181 of 2355) UNSUPPORTED: lldb-shell :: ScriptInterpreter/Lua/quit.test (2182 of 2355) PASS: lldb-api :: commands/process/signal/TestProcessSignal.py (2183 of 2355) PASS: lldb-shell :: SymbolFile/DWARF/x86/DW_TAG_variable-DW_AT_const_value.s (2184 of 2355) PASS: lldb-api :: commands/watchpoints/hello_watchpoint/TestMyFirstWatchpoint.py (2185 of 2355) PASS: lldb-api :: functionalities/conditional_break/TestConditionalBreak.py (2186 of 2355) PASS: lldb-api :: functionalities/backticks/TestBackticksWithoutATarget.py (2187 of 2355) PASS: lldb-api :: commands/expression/import-std-module/forward_list/TestForwardListFromStdModule.py (2188 of 2355) PASS: lldb-shell :: ObjectFile/ELF/netbsd-core-amd64.test (2189 of 2355) PASS: lldb-unit :: Utility/./UtilityTests/SerializationRountripTest.SerializeDeserializeCStringArray (2190 of 2355) PASS: lldb-shell :: ObjectFile/ELF/section-overlap.yaml (2191 of 2355) PASS: lldb-unit :: SymbolFile/DWARF/./SymbolFileDWARFTests/SymbolFileDWARFTests.TestAbbrevNullAttrValidForm (2192 of 2355) PASS: lldb-shell :: SymbolFile/DWARF/x86/find-basic-variable.cpp (2193 of 2355) UNSUPPORTED: lldb-api :: functionalities/asan/TestReportData.py (2194 of 2355) PASS: lldb-shell :: ScriptInterpreter/Python/fail_breakpoint_oneline.test (2195 of 2355) PASS: lldb-unit :: Core/./LLDBCoreTests/ModuleSpecTest.TestELFFile (2196 of 2355) PASS: lldb-shell :: ObjectFile/PECOFF/invalid-export-table.yaml (2197 of 2355) PASS: lldb-unit :: Utility/./UtilityTests/LogChannelEnabledTest.LogGetLogThread (2198 of 2355) PASS: lldb-api :: lang/objcxx/cxx-bridged-po/TestObjCXXBridgedPO.py (2199 of 2355) PASS: lldb-api :: commands/platform/process/list/TestProcessList.py (2200 of 2355) PASS: lldb-api :: commands/settings/quoting/TestQuoting.py (2201 of 2355) UNSUPPORTED: lldb-api :: commands/platform/connect/TestPlatformConnect.py (2202 of 2355) PASS: lldb-api :: lang/cpp/nsimport/TestCppNsImport.py (2203 of 2355) PASS: lldb-api :: functionalities/data-formatter/data-formatter-objc/TestDataFormatterObjCNSData.py (2204 of 2355) PASS: lldb-api :: lang/c/shared_lib_stripped_symbols/TestSharedLibStrippedSymbols.py (2205 of 2355) PASS: lldb-api :: commands/expression/cast_int_to_anonymous_enum/TestCastIntToAnonymousEnum.py (2206 of 2355) PASS: lldb-unit :: Utility/./UtilityTests/StringListTest.ForRangeEmpty (2207 of 2355) PASS: lldb-unit :: Utility/./UtilityTests/RangeTest.SizeTypes (2208 of 2355) UNSUPPORTED: lldb-api :: functionalities/data-formatter/data-formatter-stl/libstdcpp/iterator/TestDataFormatterStdIterator.py (2209 of 2355) PASS: lldb-unit :: Utility/./UtilityTests/OptionsWithRawTest.ArgsButNoLeadingDash (2210 of 2355) PASS: lldb-shell :: Quit/TestQuitExitCodeHex0.test (2211 of 2355) PASS: lldb-unit :: Utility/./UtilityTests/XcodeSDKTest.ParseTest (2212 of 2355) PASS: lldb-unit :: Utility/./UtilityTests/StreamTest.QuotedCString (2213 of 2355) PASS: lldb-api :: functionalities/param_entry_vals/basic_entry_values/TestBasicEntryValues.py (2214 of 2355) PASS: lldb-unit :: ScriptInterpreter/Python/./ScriptInterpreterPythonTests/PythonDataObjectsTest.TestPythonDictionaryValueEquality (2215 of 2355) PASS: lldb-api :: lang/cpp/class-template-non-type-parameter-pack/TestClassTemplateNonTypeParameterPack.py (2216 of 2355) PASS: lldb-unit :: Utility/./UtilityTests/FileSpecTest.GuessPathStyle (2217 of 2355) PASS: lldb-shell :: ObjectFile/MachO/lc_build_version_notools.yaml (2218 of 2355) PASS: lldb-unit :: Utility/./UtilityTests/BinaryStreamTest.PutULEB128FiveBytes (2219 of 2355) PASS: lldb-api :: functionalities/thread/concurrent_events/TestConcurrentWatchpointWithDelayWatchpointThreads.py (2220 of 2355) PASS: lldb-unit :: Utility/./UtilityTests/EventTest.DumpEventDataBytes (2221 of 2355) PASS: lldb-shell :: Settings/TestSettingsWrite.test (2222 of 2355) PASS: lldb-unit :: Utility/./UtilityTests/VMRange.IsValid (2223 of 2355) PASS: lldb-unit :: Process/Utility/./ProcessUtilityTests/ProcSMapTests/LinuxProcSMapsTestFixture.ParseSMapRegions/2 (2224 of 2355) PASS: lldb-api :: commands/platform/sdk/TestPlatformSDK.py (2225 of 2355) PASS: lldb-api :: sanity/TestSettingSkipping.py (2226 of 2355) PASS: lldb-unit :: Utility/./UtilityTests/ProcessInstanceInfo.DumpTable_invalidUID (2227 of 2355) PASS: lldb-api :: functionalities/data-formatter/data-formatter-objc/TestDataFormatterObjCNSBundle.py (2228 of 2355) PASS: lldb-unit :: Utility/./UtilityTests/StringLexerTest.Peek (2229 of 2355) PASS: lldb-api :: commands/watchpoints/multiple_threads/TestWatchpointMultipleThreads.py (2230 of 2355) PASS: lldb-api :: functionalities/stats_api/TestStatisticsAPI.py (2231 of 2355) PASS: lldb-shell :: SymbolFile/DWARF/x86/module-ownership.mm (2232 of 2355) PASS: lldb-api :: types/TestFloatTypesExpr.py (2233 of 2355) UNSUPPORTED: lldb-api :: linux/add-symbols/TestTargetSymbolsAddCommand.py (2234 of 2355) PASS: lldb-shell :: ScriptInterpreter/Python/Crashlog/text.test (2235 of 2355) PASS: lldb-api :: commands/expression/import-std-module/unique_ptr-dbg-info-content/TestUniquePtrDbgInfoContent.py (2236 of 2355) PASS: lldb-api :: functionalities/var_path/TestVarPath.py (2237 of 2355) PASS: lldb-api :: commands/expression/radar_8638051/Test8638051.py (2238 of 2355) PASS: lldb-shell :: Register/Core/x86-64-linux-addr.test (2239 of 2355) PASS: lldb-shell :: Register/x86-multithread-write.test (2240 of 2355) PASS: lldb-api :: commands/frame/diagnose/complicated-expression/TestComplicatedExpression.py (2241 of 2355) PASS: lldb-unit :: Utility/./UtilityTests/DataExtractorTest.GetULEB128_bit63 (2242 of 2355) PASS: lldb-unit :: ScriptInterpreter/Python/./ScriptInterpreterPythonTests/PythonDataObjectsTest.TestPythonInteger (2243 of 2355) UNSUPPORTED: lldb-api :: commands/expression/multiline-navigation/TestMultilineNavigation.py (2244 of 2355) UNSUPPORTED: lldb-api :: commands/register/register/aarch64_dynamic_regset/TestArm64DynamicRegsets.py (2245 of 2355) PASS: lldb-unit :: Host/./HostTests/ConnectionFileDescriptorTest.TCPGetURIv4 (2246 of 2355) PASS: lldb-api :: functionalities/data-formatter/data-formatter-stl/libcxx/forward_list/TestDataFormatterLibcxxForwardList.py (2247 of 2355) PASS: lldb-api :: functionalities/gdb_remote_client/TestJLink6Armv7RegisterDefinition.py (2248 of 2355) PASS: lldb-api :: functionalities/tail_call_frames/unambiguous_sequence/TestUnambiguousTailCalls.py (2249 of 2355) PASS: lldb-unit :: Target/./TargetTests/ExecutionContextTest.GetByteOrderTarget (2250 of 2355) PASS: lldb-unit :: Process/gdb-remote/./ProcessGdbRemoteTests/GDBRemoteCommunicationClientTest.ReadRegister (2251 of 2355) PASS: lldb-shell :: Quit/TestQuitExitCodeTooManyArgs.test (2252 of 2355) PASS: lldb-api :: functionalities/thread/concurrent_events/TestConcurrentDelayedCrashWithBreakpointSignal.py (2253 of 2355) PASS: lldb-unit :: Platform/Android/./AdbClientTests/AdbClientTest.CreateByDeviceId (2254 of 2355) PASS: lldb-api :: lang/objc/exceptions/TestObjCExceptions.py (2255 of 2355) PASS: lldb-api :: functionalities/breakpoint/scripted_bkpt/TestScriptedResolver.py (2256 of 2355) PASS: lldb-api :: functionalities/breakpoint/debugbreak/TestDebugBreak.py (2257 of 2355) PASS: lldb-unit :: Expression/./ExpressionTests/CppModuleConfigurationTest.LinuxLocalLibCpp (2258 of 2355) PASS: lldb-unit :: Utility/./UtilityTests/SerializationRountripTest.SerializeDeserializeCStringNull (2259 of 2355) UNSUPPORTED: lldb-shell :: Register/arm-fp-read.test (2260 of 2355) PASS: lldb-unit :: Utility/./UtilityTests/RangeTest.DoesIntersect (2261 of 2355) PASS: lldb-api :: api/log/TestAPILog.py (2262 of 2355) PASS: lldb-api :: lang/c/register_variables/TestRegisterVariables.py (2263 of 2355) PASS: lldb-api :: lang/c/local_variables/TestLocalVariables.py (2264 of 2355) PASS: lldb-unit :: SymbolFile/DWARF/./SymbolFileDWARFTests/SymbolFileDWARFTests.TestAbbrevOrder1Start5 (2265 of 2355) PASS: lldb-unit :: Process/minidump/./LLDBMinidumpTests/MinidumpParserTest.GetMiscInfo_no_stream (2266 of 2355) UNSUPPORTED: lldb-api :: functionalities/darwin_log/filter/exact_match/activity-chain/TestDarwinLogFilterMatchActivityChain.py (2267 of 2355) UNSUPPORTED: lldb-api :: commands/expression/import-std-module/pair/TestPairFromStdModule.py (2268 of 2355) PASS: lldb-api :: lang/cpp/function_refs/TestFunctionRefs.py (2269 of 2355) PASS: lldb-api :: functionalities/data-formatter/data-formatter-stl/libcxx/shared_ptr/TestDataFormatterLibcxxSharedPtr.py (2270 of 2355) PASS: lldb-unit :: Process/gdb-remote/./ProcessGdbRemoteTests/GDBRemoteClientBaseTest.SendContinueDelegateInterface (2271 of 2355) PASS: lldb-unit :: Core/./LLDBCoreTests/MangledTest.ResultForBlockInvocation (2272 of 2355) PASS: lldb-unit :: Utility/./UtilityTests/StringExtractorTest.DecodeHexU8_Underflow (2273 of 2355) PASS: lldb-unit :: Signals/./SignalsTests/UnixSignalsTest.VersionChange (2274 of 2355) PASS: lldb-unit :: ScriptInterpreter/Python/./ScriptInterpreterPythonTests/PythonDataObjectsTest.TestPythonDictionaryToStructuredDictionary (2275 of 2355) PASS: lldb-unit :: Utility/./UtilityTests/DataExtractorTest.GetCStr (2276 of 2355) PASS: lldb-unit :: Process/gdb-remote/./ProcessGdbRemoteTests/PortMapTest.AllowPort (2277 of 2355) PASS: lldb-api :: functionalities/breakpoint/address_breakpoints/TestAddressBreakpoints.py (2278 of 2355) PASS: lldb-api :: tools/lldb-server/TestGdbRemoteThreadsInStopReply.py (2279 of 2355) PASS: lldb-unit :: Expression/./ExpressionTests/DiagnosticManagerTest.PutStringSeverities (2280 of 2355) PASS: lldb-shell :: Breakpoint/jit-loader_jitlink_elf.test (2281 of 2355) PASS: lldb-unit :: UnwindAssembly/x86/./UnwindAssemblyx86Tests/Testx86AssemblyInspectionEngine.TestSubESP (2282 of 2355) PASS: lldb-shell :: ObjectFile/Breakpad/sections.test (2283 of 2355) PASS: lldb-unit :: Utility/./UtilityTests/ScalarTest.ComparisonFloat (2284 of 2355) PASS: lldb-shell :: Reproducer/TestFinalize.test (2285 of 2355) PASS: lldb-shell :: Driver/TestTarget.test (2286 of 2355) PASS: lldb-api :: functionalities/pointer_num_children/TestPointerNumChildren.py (2287 of 2355) PASS: lldb-unit :: Process/minidump/./LLDBMinidumpTests/RegisterContextMinidump.ConvertMinidumpContext_x86_32 (2288 of 2355) PASS: lldb-shell :: SymbolFile/NativePDB/source-list.cpp (2289 of 2355) PASS: lldb-api :: lang/objc/foundation/TestObjCMethodsNSError.py (2290 of 2355) PASS: lldb-api :: functionalities/data-formatter/data-formatter-enum-format/TestDataFormatterEnumFormat.py (2291 of 2355) PASS: lldb-api :: commands/expression/po_verbosity/TestPoVerbosity.py (2292 of 2355) PASS: lldb-unit :: ScriptInterpreter/Python/./ScriptInterpreterPythonTests/PythonDataObjectsTest.TestGlobalNameResolutionNoDot (2293 of 2355) PASS: lldb-unit :: Utility/./UtilityTests/BinaryStreamTest.PutULEB128ThreeBytes (2294 of 2355) PASS: lldb-unit :: Utility/./UtilityTests/UriParserTest.TypicalPortPathIPv4 (2295 of 2355) PASS: lldb-unit :: ScriptInterpreter/Python/./ScriptInterpreterPythonTests/PythonDataObjectsTest.TestPythonStringToStr (2296 of 2355) PASS: lldb-unit :: Symbol/./SymbolTests/Type.CompilerContextPattern (2297 of 2355) PASS: lldb-api :: lang/cpp/class-template-type-parameter-pack/TestClassTemplateTypeParameterPack.py (2298 of 2355) PASS: lldb-unit :: Utility/./UtilityTests/BinaryStreamTest.PutULEB128EightBytes (2299 of 2355) PASS: lldb-shell :: SymbolFile/DWARF/x86/find-qualified-variable.cpp (2300 of 2355) PASS: lldb-shell :: Reproducer/TestMultipleTargets.test (2301 of 2355) PASS: lldb-shell :: Commands/command-regex-unalias.test (2302 of 2355) UNSUPPORTED: lldb-shell :: ScriptInterpreter/Lua/breakpoint_oneline_callback.test (2303 of 2355) PASS: lldb-unit :: Process/Utility/./ProcessUtilityTests/ProcMapTests/LinuxProcMapsTestFixture.ParseMapRegions/2 (2304 of 2355) PASS: lldb-unit :: Expression/./ExpressionTests/DiagnosticManagerTest.GetStringSeverityLabels (2305 of 2355) PASS: lldb-unit :: UnwindAssembly/x86/./UnwindAssemblyx86Tests/Testx86AssemblyInspectionEngine.TestPushRBPWithREX (2306 of 2355) PASS: lldb-api :: python_api/watchpoint/TestWatchpointIgnoreCount.py (2307 of 2355) PASS: lldb-api :: functionalities/tail_call_frames/cross_dso/TestCrossDSOTailCalls.py (2308 of 2355) PASS: lldb-api :: lang/cpp/frame-var-anon-unions/TestFrameVariableAnonymousUnions.py (2309 of 2355) PASS: lldb-unit :: Host/./HostTests/FileSystemTest.Resolve (2310 of 2355) UNSUPPORTED: lldb-api :: commands/trace/TestTraceSchema.py (2311 of 2355) PASS: lldb-unit :: Interpreter/./InterpreterTests/CompletionTest.DirCompletionUsername (2312 of 2355) PASS: lldb-unit :: Process/Utility/./ProcessUtilityTests/ProcSMapTests/LinuxProcSMapsTestFixture.ParseSMapRegions/4 (2313 of 2355) PASS: lldb-unit :: Utility/./UtilityTests/StringExtractorTest.GetHexBytesAvail (2314 of 2355) PASS: lldb-unit :: Symbol/./SymbolTests/TestTypeSystemClang.TemplateArguments (2315 of 2355) UNSUPPORTED: lldb-api :: functionalities/darwin_log/source/info/TestDarwinLogSourceInfo.py (2316 of 2355) PASS: lldb-api :: functionalities/gdb_remote_client/TestGDBRemoteDiskFileCompletion.py (2317 of 2355) PASS: lldb-unit :: Utility/./UtilityTests/ConstStringTest.NullAndEmptyStates (2318 of 2355) PASS: lldb-unit :: Utility/./UtilityTests/StringListTest.LongestCommonPrefixEmpty (2319 of 2355) PASS: lldb-unit :: Utility/./UtilityTests/FileSpecTest.RemoveLastPathComponent (2320 of 2355) PASS: lldb-api :: lang/cpp/break-on-initializers/TestBreakOnCPP11Initializers.py (2321 of 2355) PASS: lldb-unit :: DataFormatter/./LLDBFormatterTests/TypeMatcherTests.CreatedBySameMatchString (2322 of 2355) PASS: lldb-api :: tools/lldb-server/TestGdbRemoteAttachOrWait.py (2323 of 2355) PASS: lldb-shell :: ObjectFile/PECOFF/section-types.yaml (2324 of 2355) PASS: lldb-unit :: ScriptInterpreter/Python/./ScriptInterpreterPythonTests/PythonDataObjectsTest.TestPythonIntegerToStr (2325 of 2355) PASS: lldb-api :: commands/target/stop-hook/delete/TestTargetStopHookDelete.py (2326 of 2355) PASS: lldb-api :: functionalities/data-formatter/ptr_ref_typedef/TestPtrRef2Typedef.py (2327 of 2355) PASS: lldb-unit :: Utility/./UtilityTests/VMRange.Clear (2328 of 2355) PASS: lldb-shell :: SymbolFile/DWARF/x86/debug_line-tombstone.s (2329 of 2355) PASS: lldb-unit :: Process/gdb-remote/./ProcessGdbRemoteTests/GDBRemoteCommunicationServerTest.SendErrorResponse_UnimplementedError (2330 of 2355) PASS: lldb-api :: functionalities/thread/exit_during_break/TestExitDuringBreak.py (2331 of 2355) PASS: lldb-unit :: Process/gdb-remote/./ProcessGdbRemoteTests/GDBRemoteCommunicationClientTest.ReadMemoryTags (2332 of 2355) PASS: lldb-unit :: Utility/./UtilityTests/StringListTest.LongestCommonPrefixNoPrefix (2333 of 2355) PASS: lldb-shell :: SymbolFile/DWARF/x86/childless-compile-unit.s (2334 of 2355) PASS: lldb-api :: functionalities/thread/concurrent_events/TestConcurrentSignalDelayWatch.py (2335 of 2355) PASS: lldb-unit :: Utility/./UtilityTests/StringLexerTest.NextIfList (2336 of 2355) PASS: lldb-api :: macosx/save_crashlog/TestSaveCrashlog.py (2337 of 2355) PASS: lldb-unit :: Utility/./UtilityTests/IndexToObjectTest.ObjectForIndex (2338 of 2355) PASS: lldb-api :: macosx/indirect_symbol/TestIndirectSymbols.py (2339 of 2355) PASS: lldb-unit :: Utility/./UtilityTests/SerializationRountripTest.SerializeDeserializePod (2340 of 2355) PASS: lldb-unit :: Utility/./UtilityTests/CompletionRequest.DuplicateFilteringWithComments (2341 of 2355) PASS: lldb-unit :: Utility/./UtilityTests/StringLexerTest.NextIf (2342 of 2355) PASS: lldb-unit :: Utility/./UtilityTests/StringExtractorTest.GetHexBytesAvail_FullString (2343 of 2355) PASS: lldb-unit :: Host/./HostTests/SocketTests/SocketTest.TCPListen0ConnectAccept/ipv4 (2344 of 2355) PASS: lldb-api :: commands/expression/import-std-module/no-std-module/TestMissingStdModule.py (2345 of 2355) PASS: lldb-unit :: Utility/./UtilityTests/ScalarTest.Division (2346 of 2355) PASS: lldb-shell :: Error/assert.test (2347 of 2355) PASS: lldb-unit :: Utility/./UtilityTests/StringListTest.Clear (2348 of 2355) PASS: lldb-api :: macosx/load-kext/TestLoadKext.py (2349 of 2355) PASS: lldb-unit :: Utility/./UtilityTests/ArgsTest.ReplaceArgumentAtIndexOutOfRange (2350 of 2355) PASS: lldb-shell :: ObjectFile/ELF/null-jmprel.yaml (2351 of 2355) PASS: lldb-api :: macosx/macCatalyst/TestMacCatalyst.py (2352 of 2355) UNSUPPORTED: lldb-api :: functionalities/data-formatter/data-formatter-stl/libstdcpp/vbool/TestDataFormatterStdVBool.py (2353 of 2355) PASS: lldb-api :: commands/target/auto-install-main-executable/TestAutoInstallMainExecutable.py (2354 of 2355) PASS: lldb-api :: lang/cpp/virtual-overload/TestVirtualOverload.py (2355 of 2355) Slowest Tests: -------------------------------------------------------------------------- 261.13s: lldb-api :: tools/lldb-server/TestLldbGdbServer.py 138.46s: lldb-api :: functionalities/memory-region/TestMemoryRegion.py 130.18s: lldb-api :: api/multithreaded/TestMultithreaded.py 113.57s: lldb-api :: macosx/skinny-corefile/TestSkinnyCorefile.py 91.26s: lldb-api :: functionalities/gdb_remote_client/TestWasm.py 83.98s: lldb-api :: types/TestLongTypesExpr.py 72.71s: lldb-api :: lang/objc/exceptions/TestObjCExceptions.py 70.04s: lldb-api :: commands/expression/import-std-module/queue/TestQueueFromStdModule.py 66.45s: lldb-api :: lang/cpp/namespace/TestNamespaceLookup.py 66.19s: lldb-api :: commands/expression/import-std-module/stack/TestStackFromStdModule.py 64.67s: lldb-api :: commands/expression/import-std-module/deque-dbg-info-content/TestDbgInfoContentDequeFromStdModule.py 64.09s: lldb-api :: lang/objc/hidden-ivars/TestHiddenIvars.py 63.70s: lldb-api :: commands/expression/static-initializers/TestStaticInitializers.py 63.20s: lldb-api :: lang/objc/objc-new-syntax/TestObjCNewSyntaxLiteral.py 61.62s: lldb-api :: python_api/frame/TestFrames.py 59.16s: lldb-api :: lang/objc/foundation/TestObjCMethods.py 57.05s: lldb-api :: commands/expression/import-std-module/vector/TestVectorFromStdModule.py 54.43s: lldb-api :: functionalities/thread/break_after_join/TestBreakAfterJoin.py 52.52s: lldb-api :: types/TestIntegerTypeExpr.py 50.36s: lldb-api :: commands/expression/import-std-module/deque-basic/TestDequeFromStdModule.py

Hide Details

Tests Times: -------------------------------------------------------------------------- [ Range ] :: [ Percentage ] :: [ Count ] -------------------------------------------------------------------------- [260s,280s) :: [ ] :: [ 1/2355] [240s,260s) :: [ ] :: [ 0/2355] [220s,240s) :: [ ] :: [ 0/2355] [200s,220s) :: [ ] :: [ 0/2355] [180s,200s) :: [ ] :: [ 0/2355] [160s,180s) :: [ ] :: [ 0/2355] [140s,160s) :: [ ] :: [ 1/2355] [120s,140s) :: [ ] :: [ 2/2355] [100s,120s) :: [ ] :: [ 0/2355] [ 80s,100s) :: [ ] :: [ 2/2355] [ 60s, 80s) :: [ ] :: [ 11/2355] [ 40s, 60s) :: [ ] :: [ 18/2355] [ 20s, 40s) :: [* ] :: [ 73/2355] [ 0s, 20s) :: [************************************** ] :: [2247/2355] -------------------------------------------------------------------------- ******************** Failed Tests (6): lldb-api :: commands/expression/static-initializers/TestStaticInitializers.py lldb-api :: functionalities/data-formatter/data-formatter-stl/libcxx/unordered/TestDataFormatterUnordered.py lldb-api :: python_api/frame/TestFrames.py lldb-api :: tools/lldb-vscode/breakpoint/TestVSCode_setBreakpoints.py lldb-api :: tools/lldb-vscode/breakpoint/TestVSCode_setFunctionBreakpoints.py lldb-api :: tools/lldb-vscode/evaluate/TestVSCode_evaluate.py

Hide Details

Hide Details

Testing Time: 2452.32s Unsupported : 212 Passed : 2127 Expectedly Failed: 10 Failed : 6 FAILED: tools/lldb/test/CMakeFiles/check-lldb cd /Users/buildslave/jenkins/workspace/lldb-cmake-sanitized/lldb-build/tools/lldb/test && /usr/local/Frameworks/Python.framework/Versions/3.7/bin/python3.7 /Users/buildslave/jenkins/workspace/lldb-cmake-sanitized/lldb-build/./bin/llvm-lit -v --time-tests --shuffle --xunit-xml-output=/Users/buildslave/jenkins/workspace/lldb-cmake-sanitized/test/results.xml -v -j 4 --timeout 1200 /Users/buildslave/jenkins/workspace/lldb-cmake-sanitized/lldb-build/tools/lldb/test ninja: build stopped: subcommand failed. Command failed: Command '['/usr/bin/env', 'TERM=vt100', '/usr/local/bin/ninja', '-v', 'check-lldb']' returned non-zero exit status 1. Command: ['/usr/bin/env', 'TERM=vt100', '/usr/local/bin/ninja', '-v', 'check-lldb'] [Pipeline] } [Pipeline] // timeout [Pipeline] } [Pipeline] // stage [Pipeline] stage [Pipeline] { (Declarative: Post Actions) [Pipeline] scanForIssues [Clang (LLVM based)] Sleeping for 5 seconds due to JENKINS-32191... [Clang (LLVM based)] Parsing console log (workspace: '/Users/buildslave/jenkins/workspace/lldb-cmake-sanitized') [Clang (LLVM based)] Successfully parsed console log [Clang (LLVM based)] -> found 4 issues (skipped 4 duplicates) [Clang (LLVM based)] [-ERROR-] Can't create fingerprints for some files: [Clang (LLVM based)] [-ERROR-] - '/Users/buildslave/jenkins/workspace/lldb-cmake-sanitized/lldb-build/{"body":{"category":"console","output":"/Users/buildslave/jenkins/workspace/lldb-cmake-sanitized/llvm-project/lldb/tools/lldb-vscode/ProgressEvent.cpp', IO exception has been thrown: java.nio.file.NoSuchFileException: /Users/buildslave/jenkins/workspace/lldb-cmake-sanitized/lldb-build/{"body":{"category":"console","output":"/Users/buildslave/jenkins/workspace/lldb-cmake-sanitized/llvm-project/lldb/tools/lldb-vscode/ProgressEvent.cpp [Clang (LLVM based)] Post processing issues on 'green-dragon-23' with source code encoding 'UTF-8' [Clang (LLVM based)] Creating SCM blamer to obtain author and commit information for affected files [Clang (LLVM based)] -> No blamer installed yet. You need to install the 'git-forensics' plugin to enable blaming for Git. [Clang (LLVM based)] Resolving file names for all issues in source directory '/Users/buildslave/jenkins/workspace/lldb-cmake-sanitized' [Clang (LLVM based)] -> resolved paths in source directory (3 found, 1 not found) [Clang (LLVM based)] Resolving module names from module definitions (build.xml, pom.xml, or Manifest.mf files) [Clang (LLVM based)] -> resolved module names for 4 issues [Clang (LLVM based)] Resolving package names (or namespaces) by parsing the affected files [Clang (LLVM based)] -> resolved package names of 4 affected files [Clang (LLVM based)] No filter has been set, publishing all 4 issues [Clang (LLVM based)] Creating fingerprints for all affected code blocks to track issues over different builds [Clang (LLVM based)] -> created fingerprints for 3 issues (skipped 1 issues) [Clang (LLVM based)] Copying affected files to Jenkins' build folder '/Users/Shared/Jenkins/Home/jobs/lldb-cmake-sanitized/builds/1902/files-with-issues' [Clang (LLVM based)] -> 3 copied, 0 not in workspace, 1 not-found, 0 with I/O error [Clang (LLVM based)] Repository miner is not configured, skipping repository mining [Pipeline] junit Recording test results [Checks API] No suitable checks publisher found. [Pipeline] } [Pipeline] // stage [Pipeline] } [Pipeline] // withEnv [Pipeline] } [Pipeline] // node [Pipeline] End of Pipeline ERROR: script returned exit code 1 Finished: FAILURE