Console Output

Skipping 9,558 KB.. Full Log
--> 
Content-Length: 109

Hide Details

{"command":"stackTrace","type":"request","arguments":{"threadId":1688671,"startFrame":0,"levels":1},"seq":70} <-- Content-Length: 342

Hide Details

{"body":{"stackFrames":[{"column":10,"id":524288,"line":11,"name":"a_function(int)","source":{"name":"main.cpp","path":"/Users/buildslave/jenkins/workspace/lldb-cmake-sanitized/llvm-project/lldb/test/API/tools/lldb-vscode/evaluate/main.cpp"}}],"totalFrames":3},"command":"stackTrace","request_seq":70,"seq":0,"success":true,"type":"response"} --> Content-Length: 127

Hide Details

{"command":"evaluate","type":"request","arguments":{"expression":"non_static_int","context":"hover","frameId":524288},"seq":71} <-- Content-Length: 139

Hide Details

{"body":{"result":"43","type":"int","variablesReference":0},"command":"evaluate","request_seq":71,"seq":0,"success":true,"type":"response"} --> Content-Length: 109

Hide Details

{"command":"stackTrace","type":"request","arguments":{"threadId":1688671,"startFrame":0,"levels":1},"seq":72} <-- Content-Length: 342

Hide Details

{"body":{"stackFrames":[{"column":10,"id":524288,"line":11,"name":"a_function(int)","source":{"name":"main.cpp","path":"/Users/buildslave/jenkins/workspace/lldb-cmake-sanitized/llvm-project/lldb/test/API/tools/lldb-vscode/evaluate/main.cpp"}}],"totalFrames":3},"command":"stackTrace","request_seq":72,"seq":0,"success":true,"type":"response"} --> Content-Length: 117

Hide Details

{"command":"evaluate","type":"request","arguments":{"expression":"var1","context":"hover","frameId":524288},"seq":73} <-- Content-Length: 119

Hide Details

{"body":{},"command":"evaluate","message":"error: No value","request_seq":73,"seq":0,"success":false,"type":"response"} --> Content-Length: 109

Hide Details

{"command":"stackTrace","type":"request","arguments":{"threadId":1688671,"startFrame":0,"levels":1},"seq":74} <-- Content-Length: 342

Hide Details

{"body":{"stackFrames":[{"column":10,"id":524288,"line":11,"name":"a_function(int)","source":{"name":"main.cpp","path":"/Users/buildslave/jenkins/workspace/lldb-cmake-sanitized/llvm-project/lldb/test/API/tools/lldb-vscode/evaluate/main.cpp"}}],"totalFrames":3},"command":"stackTrace","request_seq":74,"seq":0,"success":true,"type":"response"} --> Content-Length: 117

Hide Details

{"command":"evaluate","type":"request","arguments":{"expression":"var2","context":"hover","frameId":524288},"seq":75} <-- Content-Length: 119

Hide Details

{"body":{},"command":"evaluate","message":"error: No value","request_seq":75,"seq":0,"success":false,"type":"response"} --> Content-Length: 109

Hide Details

{"command":"stackTrace","type":"request","arguments":{"threadId":1688671,"startFrame":0,"levels":1},"seq":76} <-- Content-Length: 342

Hide Details

{"body":{"stackFrames":[{"column":10,"id":524288,"line":11,"name":"a_function(int)","source":{"name":"main.cpp","path":"/Users/buildslave/jenkins/workspace/lldb-cmake-sanitized/llvm-project/lldb/test/API/tools/lldb-vscode/evaluate/main.cpp"}}],"totalFrames":3},"command":"stackTrace","request_seq":76,"seq":0,"success":true,"type":"response"} --> Content-Length: 120

Hide Details

{"command":"evaluate","type":"request","arguments":{"expression":"struct1","context":"hover","frameId":524288},"seq":77} <-- Content-Length: 119

Hide Details

{"body":{},"command":"evaluate","message":"error: No value","request_seq":77,"seq":0,"success":false,"type":"response"} --> Content-Length: 109

Hide Details

{"command":"stackTrace","type":"request","arguments":{"threadId":1688671,"startFrame":0,"levels":1},"seq":78} <-- Content-Length: 342

Hide Details

{"body":{"stackFrames":[{"column":10,"id":524288,"line":11,"name":"a_function(int)","source":{"name":"main.cpp","path":"/Users/buildslave/jenkins/workspace/lldb-cmake-sanitized/llvm-project/lldb/test/API/tools/lldb-vscode/evaluate/main.cpp"}}],"totalFrames":3},"command":"stackTrace","request_seq":78,"seq":0,"success":true,"type":"response"} --> Content-Length: 124

Hide Details

{"command":"evaluate","type":"request","arguments":{"expression":"struct1.foo","context":"hover","frameId":524288},"seq":79} <-- Content-Length: 119

Hide Details

{"body":{},"command":"evaluate","message":"error: No value","request_seq":79,"seq":0,"success":false,"type":"response"} --> Content-Length: 109

Hide Details

{"command":"stackTrace","type":"request","arguments":{"threadId":1688671,"startFrame":0,"levels":1},"seq":80} <-- Content-Length: 342

Hide Details

{"body":{"stackFrames":[{"column":10,"id":524288,"line":11,"name":"a_function(int)","source":{"name":"main.cpp","path":"/Users/buildslave/jenkins/workspace/lldb-cmake-sanitized/llvm-project/lldb/test/API/tools/lldb-vscode/evaluate/main.cpp"}}],"totalFrames":3},"command":"stackTrace","request_seq":80,"seq":0,"success":true,"type":"response"} --> Content-Length: 125

Hide Details

{"command":"evaluate","type":"request","arguments":{"expression":"struct2->foo","context":"hover","frameId":524288},"seq":81} <-- Content-Length: 119

Hide Details

{"body":{},"command":"evaluate","message":"error: No value","request_seq":81,"seq":0,"success":false,"type":"response"} --> Content-Length: 109

Hide Details

{"command":"stackTrace","type":"request","arguments":{"threadId":1688671,"startFrame":0,"levels":1},"seq":82} <-- Content-Length: 342

Hide Details

{"body":{"stackFrames":[{"column":10,"id":524288,"line":11,"name":"a_function(int)","source":{"name":"main.cpp","path":"/Users/buildslave/jenkins/workspace/lldb-cmake-sanitized/llvm-project/lldb/test/API/tools/lldb-vscode/evaluate/main.cpp"}}],"totalFrames":3},"command":"stackTrace","request_seq":82,"seq":0,"success":true,"type":"response"} --> Content-Length: 131

Hide Details

{"command":"evaluate","type":"request","arguments":{"expression":"var2 + struct1.foo","context":"hover","frameId":524288},"seq":83} <-- Content-Length: 119

Hide Details

{"body":{},"command":"evaluate","message":"error: No value","request_seq":83,"seq":0,"success":false,"type":"response"} --> Content-Length: 109

Hide Details

{"command":"stackTrace","type":"request","arguments":{"threadId":1688671,"startFrame":0,"levels":1},"seq":84} <-- Content-Length: 342

Hide Details

{"body":{"stackFrames":[{"column":10,"id":524288,"line":11,"name":"a_function(int)","source":{"name":"main.cpp","path":"/Users/buildslave/jenkins/workspace/lldb-cmake-sanitized/llvm-project/lldb/test/API/tools/lldb-vscode/evaluate/main.cpp"}}],"totalFrames":3},"command":"stackTrace","request_seq":84,"seq":0,"success":true,"type":"response"} --> Content-Length: 123

Hide Details

{"command":"evaluate","type":"request","arguments":{"expression":"a_function","context":"hover","frameId":524288},"seq":85} <-- Content-Length: 119

Hide Details

{"body":{},"command":"evaluate","message":"error: No value","request_seq":85,"seq":0,"success":false,"type":"response"} --> Content-Length: 109

Hide Details

{"command":"stackTrace","type":"request","arguments":{"threadId":1688671,"startFrame":0,"levels":1},"seq":86} <-- Content-Length: 342

Hide Details

{"body":{"stackFrames":[{"column":10,"id":524288,"line":11,"name":"a_function(int)","source":{"name":"main.cpp","path":"/Users/buildslave/jenkins/workspace/lldb-cmake-sanitized/llvm-project/lldb/test/API/tools/lldb-vscode/evaluate/main.cpp"}}],"totalFrames":3},"command":"stackTrace","request_seq":86,"seq":0,"success":true,"type":"response"} --> Content-Length: 126

Hide Details

{"command":"evaluate","type":"request","arguments":{"expression":"a_function(1)","context":"hover","frameId":524288},"seq":87} <-- Content-Length: 119

Hide Details

{"body":{},"command":"evaluate","message":"error: No value","request_seq":87,"seq":0,"success":false,"type":"response"} --> Content-Length: 109

Hide Details

{"command":"stackTrace","type":"request","arguments":{"threadId":1688671,"startFrame":0,"levels":1},"seq":88} <-- Content-Length: 342

Hide Details

{"body":{"stackFrames":[{"column":10,"id":524288,"line":11,"name":"a_function(int)","source":{"name":"main.cpp","path":"/Users/buildslave/jenkins/workspace/lldb-cmake-sanitized/llvm-project/lldb/test/API/tools/lldb-vscode/evaluate/main.cpp"}}],"totalFrames":3},"command":"stackTrace","request_seq":88,"seq":0,"success":true,"type":"response"} --> Content-Length: 120

Hide Details

{"command":"evaluate","type":"request","arguments":{"expression":"var + 1","context":"hover","frameId":524288},"seq":89} <-- Content-Length: 119

Hide Details

{"body":{},"command":"evaluate","message":"error: No value","request_seq":89,"seq":0,"success":false,"type":"response"} --> Content-Length: 109

Hide Details

{"command":"stackTrace","type":"request","arguments":{"threadId":1688671,"startFrame":0,"levels":1},"seq":90} <-- Content-Length: 342

Hide Details

{"body":{"stackFrames":[{"column":10,"id":524288,"line":11,"name":"a_function(int)","source":{"name":"main.cpp","path":"/Users/buildslave/jenkins/workspace/lldb-cmake-sanitized/llvm-project/lldb/test/API/tools/lldb-vscode/evaluate/main.cpp"}}],"totalFrames":3},"command":"stackTrace","request_seq":90,"seq":0,"success":true,"type":"response"} --> Content-Length: 121

Hide Details

{"command":"evaluate","type":"request","arguments":{"expression":"foo_func","context":"hover","frameId":524288},"seq":91} <-- Content-Length: 119

Hide Details

{"body":{},"command":"evaluate","message":"error: No value","request_seq":91,"seq":0,"success":false,"type":"response"} --> Content-Length: 109

Hide Details

{"command":"stackTrace","type":"request","arguments":{"threadId":1688671,"startFrame":0,"levels":1},"seq":92} <-- Content-Length: 342

Hide Details

{"body":{"stackFrames":[{"column":10,"id":524288,"line":11,"name":"a_function(int)","source":{"name":"main.cpp","path":"/Users/buildslave/jenkins/workspace/lldb-cmake-sanitized/llvm-project/lldb/test/API/tools/lldb-vscode/evaluate/main.cpp"}}],"totalFrames":3},"command":"stackTrace","request_seq":92,"seq":0,"success":true,"type":"response"} --> Content-Length: 120

Hide Details

{"command":"evaluate","type":"request","arguments":{"expression":"foo_var","context":"hover","frameId":524288},"seq":93} <-- Content-Length: 119

Hide Details

{"body":{},"command":"evaluate","message":"error: No value","request_seq":93,"seq":0,"success":false,"type":"response"} --> Content-Length: 81

Hide Details

{"command":"continue","type":"request","arguments":{"threadId":1688671},"seq":94} <-- Content-Length: 116

Hide Details

{"body":{"allThreadsContinued":true},"command":"continue","request_seq":94,"seq":0,"success":true,"type":"response"} <-- Content-Length: 199

Hide Details

{"body":{"allThreadsStopped":true,"description":"breakpoint 4.1","preserveFocusHint":false,"reason":"breakpoint","threadCausedFocus":true,"threadId":1688671},"event":"stopped","seq":0,"type":"event"} --> Content-Length: 62

Hide Details

{"command":"threads","type":"request","arguments":{},"seq":95} <-- Content-Length: 134

Hide Details

{"body":{"threads":[{"id":1688671,"name":"Thread #1"}]},"command":"threads","request_seq":95,"seq":0,"success":true,"type":"response"} --> Content-Length: 109

Hide Details

{"command":"stackTrace","type":"request","arguments":{"threadId":1688671,"startFrame":0,"levels":1},"seq":96} <-- Content-Length: 331

Hide Details

{"body":{"stackFrames":[{"column":20,"id":524288,"line":35,"name":"main","source":{"name":"main.cpp","path":"/Users/buildslave/jenkins/workspace/lldb-cmake-sanitized/llvm-project/lldb/test/API/tools/lldb-vscode/evaluate/main.cpp"}}],"totalFrames":2},"command":"stackTrace","request_seq":96,"seq":0,"success":true,"type":"response"} --> Content-Length: 119

Hide Details

{"command":"evaluate","type":"request","arguments":{"expression":"my_vec","context":"hover","frameId":524288},"seq":97} <-- Content-Length: 179

Hide Details

{"body":{"result":" size=2","type":"std::vector<int, std::allocator<int> >","variablesReference":6},"command":"evaluate","request_seq":97,"seq":0,"success":true,"type":"response"} --> Content-Length: 81

Hide Details

{"command":"continue","type":"request","arguments":{"threadId":1688671},"seq":98} <-- Content-Length: 116

Hide Details

{"body":{"allThreadsContinued":true},"command":"continue","request_seq":98,"seq":0,"success":true,"type":"response"} <-- Content-Length: 199

Hide Details

{"body":{"allThreadsStopped":true,"description":"breakpoint 5.1","preserveFocusHint":false,"reason":"breakpoint","threadCausedFocus":true,"threadId":1688671},"event":"stopped","seq":0,"type":"event"} --> Content-Length: 62

Hide Details

{"command":"threads","type":"request","arguments":{},"seq":99} <-- Content-Length: 134

Hide Details

{"body":{"threads":[{"id":1688671,"name":"Thread #1"}]},"command":"threads","request_seq":99,"seq":0,"success":true,"type":"response"} --> Content-Length: 110

Hide Details

{"command":"stackTrace","type":"request","arguments":{"threadId":1688671,"startFrame":0,"levels":1},"seq":100} <-- Content-Length: 332

Hide Details

{"body":{"stackFrames":[{"column":10,"id":524288,"line":40,"name":"main","source":{"name":"main.cpp","path":"/Users/buildslave/jenkins/workspace/lldb-cmake-sanitized/llvm-project/lldb/test/API/tools/lldb-vscode/evaluate/main.cpp"}}],"totalFrames":2},"command":"stackTrace","request_seq":100,"seq":0,"success":true,"type":"response"} --> Content-Length: 120

Hide Details

{"command":"evaluate","type":"request","arguments":{"expression":"my_vec","context":"hover","frameId":524288},"seq":101} <-- Content-Length: 180

Hide Details

{"body":{"result":" size=3","type":"std::vector<int, std::allocator<int> >","variablesReference":7},"command":"evaluate","request_seq":101,"seq":0,"success":true,"type":"response"} --> Content-Length: 110

Hide Details

{"command":"stackTrace","type":"request","arguments":{"threadId":1688671,"startFrame":0,"levels":1},"seq":102} <-- Content-Length: 332

Hide Details

{"body":{"stackFrames":[{"column":10,"id":524288,"line":40,"name":"main","source":{"name":"main.cpp","path":"/Users/buildslave/jenkins/workspace/lldb-cmake-sanitized/llvm-project/lldb/test/API/tools/lldb-vscode/evaluate/main.cpp"}}],"totalFrames":2},"command":"stackTrace","request_seq":102,"seq":0,"success":true,"type":"response"} --> Content-Length: 120

Hide Details

{"command":"evaluate","type":"request","arguments":{"expression":"my_map","context":"hover","frameId":524288},"seq":103} <-- Content-Length: 221

Hide Details

{"body":{"result":" size=2","type":"std::map<int, int, std::less<int>, std::allocator<std::pair<const int, int> > >","variablesReference":8},"command":"evaluate","request_seq":103,"seq":0,"success":true,"type":"response"} --> Content-Length: 82

Hide Details

{"command":"continue","type":"request","arguments":{"threadId":1688671},"seq":104} <-- Content-Length: 117

Hide Details

{"body":{"allThreadsContinued":true},"command":"continue","request_seq":104,"seq":0,"success":true,"type":"response"} <-- Content-Length: 199

Hide Details

{"body":{"allThreadsStopped":true,"description":"breakpoint 6.1","preserveFocusHint":false,"reason":"breakpoint","threadCausedFocus":true,"threadId":1688671},"event":"stopped","seq":0,"type":"event"} --> Content-Length: 63

Hide Details

{"command":"threads","type":"request","arguments":{},"seq":105} <-- Content-Length: 135

Hide Details

{"body":{"threads":[{"id":1688671,"name":"Thread #1"}]},"command":"threads","request_seq":105,"seq":0,"success":true,"type":"response"} --> Content-Length: 110

Hide Details

{"command":"stackTrace","type":"request","arguments":{"threadId":1688671,"startFrame":0,"levels":1},"seq":106} <-- Content-Length: 332

Hide Details

{"body":{"stackFrames":[{"column":25,"id":524288,"line":44,"name":"main","source":{"name":"main.cpp","path":"/Users/buildslave/jenkins/workspace/lldb-cmake-sanitized/llvm-project/lldb/test/API/tools/lldb-vscode/evaluate/main.cpp"}}],"totalFrames":2},"command":"stackTrace","request_seq":106,"seq":0,"success":true,"type":"response"} --> Content-Length: 120

Hide Details

{"command":"evaluate","type":"request","arguments":{"expression":"my_map","context":"hover","frameId":524288},"seq":107} <-- Content-Length: 221

Hide Details

{"body":{"result":" size=3","type":"std::map<int, int, std::less<int>, std::allocator<std::pair<const int, int> > >","variablesReference":9},"command":"evaluate","request_seq":107,"seq":0,"success":true,"type":"response"} --> Content-Length: 110

Hide Details

{"command":"stackTrace","type":"request","arguments":{"threadId":1688671,"startFrame":0,"levels":1},"seq":108} <-- Content-Length: 332

Hide Details

{"body":{"stackFrames":[{"column":25,"id":524288,"line":44,"name":"main","source":{"name":"main.cpp","path":"/Users/buildslave/jenkins/workspace/lldb-cmake-sanitized/llvm-project/lldb/test/API/tools/lldb-vscode/evaluate/main.cpp"}}],"totalFrames":2},"command":"stackTrace","request_seq":108,"seq":0,"success":true,"type":"response"} --> Content-Length: 125

Hide Details

{"command":"evaluate","type":"request","arguments":{"expression":"my_bool_vec","context":"hover","frameId":524288},"seq":109} <-- Content-Length: 183

Hide Details

{"body":{"result":" size=1","type":"std::vector<bool, std::allocator<bool> >","variablesReference":10},"command":"evaluate","request_seq":109,"seq":0,"success":true,"type":"response"} --> Content-Length: 82

Hide Details

{"command":"continue","type":"request","arguments":{"threadId":1688671},"seq":110} <-- Content-Length: 117

Hide Details

{"body":{"allThreadsContinued":true},"command":"continue","request_seq":110,"seq":0,"success":true,"type":"response"} <-- Content-Length: 199

Hide Details

{"body":{"allThreadsStopped":true,"description":"breakpoint 7.1","preserveFocusHint":false,"reason":"breakpoint","threadCausedFocus":true,"threadId":1688671},"event":"stopped","seq":0,"type":"event"} --> Content-Length: 63

Hide Details

{"command":"threads","type":"request","arguments":{},"seq":111} <-- Content-Length: 135

Hide Details

{"body":{"threads":[{"id":1688671,"name":"Thread #1"}]},"command":"threads","request_seq":111,"seq":0,"success":true,"type":"response"} --> Content-Length: 110

Hide Details

{"command":"stackTrace","type":"request","arguments":{"threadId":1688671,"startFrame":0,"levels":1},"seq":112} <-- Content-Length: 332

Hide Details

{"body":{"stackFrames":[{"column":25,"id":524288,"line":45,"name":"main","source":{"name":"main.cpp","path":"/Users/buildslave/jenkins/workspace/lldb-cmake-sanitized/llvm-project/lldb/test/API/tools/lldb-vscode/evaluate/main.cpp"}}],"totalFrames":2},"command":"stackTrace","request_seq":112,"seq":0,"success":true,"type":"response"} --> Content-Length: 125

Hide Details

{"command":"evaluate","type":"request","arguments":{"expression":"my_bool_vec","context":"hover","frameId":524288},"seq":113} <-- Content-Length: 183

Hide Details

{"body":{"result":" size=2","type":"std::vector<bool, std::allocator<bool> >","variablesReference":11},"command":"evaluate","request_seq":113,"seq":0,"success":true,"type":"response"} --> Content-Length: 90

Hide Details

{"command":"disconnect","type":"request","arguments":{"terminateDebuggee":true},"seq":114} <-- Content-Length: 45

Hide Details

{"event":"terminated","seq":0,"type":"event"} <-- Content-Length: 63

Hide Details

{"body":{"exitCode":9},"event":"exited","seq":0,"type":"event"} <-- Content-Length: 83

Hide Details

{"command":"disconnect","request_seq":114,"seq":0,"success":true,"type":"response"}

Hide Details

========= END ========= ========= DEBUG ADAPTER PROTOCOL LOGS ========= --> Content-Length: 284

Hide Details

{"command":"initialize","type":"request","arguments":{"adapterID":"lldb-native","clientID":"vscode","columnsStartAt1":true,"linesStartAt1":true,"locale":"en-us","pathFormat":"path","supportsRunInTerminalRequest":true,"supportsVariablePaging":true,"supportsVariableType":true},"seq":1} <-- Content-Length: 1222

Hide Details

{"body":{"exceptionBreakpointFilters":[{"default":false,"filter":"cpp_catch","label":"C++ Catch"},{"default":false,"filter":"cpp_throw","label":"C++ Throw"},{"default":false,"filter":"objc_catch","label":"Objective C Catch"},{"default":false,"filter":"objc_throw","label":"Objective C Throw"},{"default":false,"filter":"swift_catch","label":"Swift Catch"},{"default":false,"filter":"swift_throw","label":"Swift Throw"}],"supportTerminateDebuggee":true,"supportsCompletionsRequest":false,"supportsConditionalBreakpoints":true,"supportsConfigurationDoneRequest":true,"supportsDelayedStackTraceLoading":true,"supportsEvaluateForHovers":true,"supportsExceptionInfoRequest":true,"supportsExceptionOptions":true,"supportsFunctionBreakpoints":true,"supportsGotoTargetsRequest":false,"supportsHitConditionalBreakpoints":true,"supportsLoadedSourcesRequest":false,"supportsModulesRequest":false,"supportsProgressReporting":true,"supportsRestartFrame":false,"supportsRestartRequest":false,"supportsRunInTerminalRequest":true,"supportsSetVariable":true,"supportsStepBack":false,"supportsStepInTargetsRequest":false,"supportsValueFormattingOptions":true},"command":"initialize","request_seq":1,"seq":0,"success":true,"type":"response"} --> Content-Length: 1040

Hide Details

{"command":"launch","type":"request","arguments":{"program":"/Users/buildslave/jenkins/workspace/lldb-cmake-sanitized/lldb-build/lldb-test-build.noindex/tools/lldb-vscode/evaluate/TestVSCode_evaluate.test_repl_evaluate_expressions/a.out","disableASLR":true,"initCommands":["settings clear -all","settings set symbols.enable-external-lookup false","settings set target.inherit-tcc true","settings set target.detach-on-error false","settings set target.auto-apply-fixits false","settings set plugin.process.gdb-remote.packet-timeout 60","settings set symbols.clang-modules-cache-path \"/Users/buildslave/jenkins/workspace/lldb-cmake-sanitized/lldb-build/lldb-test-build.noindex/module-cache-lldb/lldb-api\"","settings set use-color false","setting set target.prefer-dynamic-value no-dynamic-values","settings set target.env-vars ASAN_OPTIONS=detect_stack_use_after_return=1 DYLD_INSERT_LIBRARIES=/Users/buildslave/jenkins/workspace/lldb-cmake-sanitized/host-compiler/lib/clang/13.0.99/lib/darwin/libclang_rt.asan_osx_dynamic.dylib"]},"seq":2} <-- Content-Length: 923

Hide Details

{"body":{"category":"console","output":"Running initCommands:\n(lldb) settings clear -all\n(lldb) settings set symbols.enable-external-lookup false\n(lldb) settings set target.inherit-tcc true\n(lldb) settings set target.detach-on-error false\n(lldb) settings set target.auto-apply-fixits false\n(lldb) settings set plugin.process.gdb-remote.packet-timeout 60\n(lldb) settings set symbols.clang-modules-cache-path \"/Users/buildslave/jenkins/workspace/lldb-cmake-sanitized/lldb-build/lldb-test-build.noindex/module-cache-lldb/lldb-api\"\n(lldb) settings set use-color false\n(lldb) setting set target.prefer-dynamic-value no-dynamic-values\n(lldb) settings set target.env-vars ASAN_OPTIONS=detect_stack_use_after_return=1 DYLD_INSERT_LIBRARIES=/Users/buildslave/jenkins/workspace/lldb-cmake-sanitized/host-compiler/lib/clang/13.0.99/lib/darwin/libclang_rt.asan_osx_dynamic.dylib\n"},"event":"output","seq":0,"type":"event"} <-- Content-Length: 77

Hide Details

{"command":"launch","request_seq":2,"seq":0,"success":true,"type":"response"} <-- Content-Length: 304

Hide Details

{"body":{"isLocalProcess":true,"name":"/Users/buildslave/jenkins/workspace/lldb-cmake-sanitized/lldb-build/lldb-test-build.noindex/tools/lldb-vscode/evaluate/TestVSCode_evaluate.test_repl_evaluate_expressions/a.out","startMethod":"launch","systemProcessId":1283},"event":"process","seq":0,"type":"event"} <-- Content-Length: 46

Hide Details

{"event":"initialized","seq":0,"type":"event"} --> Content-Length: 276

Hide Details

{"command":"setBreakpoints","type":"request","arguments":{"source":{"name":"main.cpp","path":"main.cpp"},"sourceModified":false,"lines":"[23, 27, 11, 35, 40, 44, 45]","breakpoints":[{"line":23},{"line":27},{"line":11},{"line":35},{"line":40},{"line":44},{"line":45}]},"seq":3} <-- Content-Length: 684

Hide Details

{"body":{"breakpoints":[{"id":1,"line":23,"source":{"name":"main.cpp","path":"main.cpp"},"verified":true},{"id":2,"line":27,"source":{"name":"main.cpp","path":"main.cpp"},"verified":true},{"id":3,"line":11,"source":{"name":"main.cpp","path":"main.cpp"},"verified":true},{"id":4,"line":35,"source":{"name":"main.cpp","path":"main.cpp"},"verified":true},{"id":5,"line":40,"source":{"name":"main.cpp","path":"main.cpp"},"verified":true},{"id":6,"line":44,"source":{"name":"main.cpp","path":"main.cpp"},"verified":true},{"id":7,"line":45,"source":{"name":"main.cpp","path":"main.cpp"},"verified":true}]},"command":"setBreakpoints","request_seq":3,"seq":0,"success":true,"type":"response"} --> Content-Length: 71

Hide Details

{"command":"configurationDone","type":"request","arguments":{},"seq":4} <-- Content-Length: 88

Hide Details

{"command":"configurationDone","request_seq":4,"seq":0,"success":true,"type":"response"} <-- Content-Length: 199

Hide Details

{"body":{"allThreadsStopped":true,"description":"breakpoint 1.1","preserveFocusHint":false,"reason":"breakpoint","threadCausedFocus":true,"threadId":1689175},"event":"stopped","seq":0,"type":"event"} --> Content-Length: 61

Hide Details

{"command":"threads","type":"request","arguments":{},"seq":5} <-- Content-Length: 133

Hide Details

{"body":{"threads":[{"id":1689175,"name":"Thread #1"}]},"command":"threads","request_seq":5,"seq":0,"success":true,"type":"response"} --> Content-Length: 108

Hide Details

{"command":"stackTrace","type":"request","arguments":{"threadId":1689175,"startFrame":0,"levels":1},"seq":6} <-- Content-Length: 330

Hide Details

{"body":{"stackFrames":[{"column":14,"id":524288,"line":23,"name":"main","source":{"name":"main.cpp","path":"/Users/buildslave/jenkins/workspace/lldb-cmake-sanitized/llvm-project/lldb/test/API/tools/lldb-vscode/evaluate/main.cpp"}}],"totalFrames":3},"command":"stackTrace","request_seq":6,"seq":0,"success":true,"type":"response"} --> Content-Length: 115

Hide Details

{"command":"evaluate","type":"request","arguments":{"expression":"var1","context":"repl","frameId":524288},"seq":7} <-- Content-Length: 138

Hide Details

{"body":{"result":"20","type":"int","variablesReference":0},"command":"evaluate","request_seq":7,"seq":0,"success":true,"type":"response"} --> Content-Length: 108

Hide Details

{"command":"stackTrace","type":"request","arguments":{"threadId":1689175,"startFrame":0,"levels":1},"seq":8} <-- Content-Length: 330

Hide Details

{"body":{"stackFrames":[{"column":14,"id":524288,"line":23,"name":"main","source":{"name":"main.cpp","path":"/Users/buildslave/jenkins/workspace/lldb-cmake-sanitized/llvm-project/lldb/test/API/tools/lldb-vscode/evaluate/main.cpp"}}],"totalFrames":3},"command":"stackTrace","request_seq":8,"seq":0,"success":true,"type":"response"} --> Content-Length: 115

Hide Details

{"command":"evaluate","type":"request","arguments":{"expression":"var2","context":"repl","frameId":524288},"seq":9} <-- Content-Length: 138

Hide Details

{"body":{"result":"21","type":"int","variablesReference":0},"command":"evaluate","request_seq":9,"seq":0,"success":true,"type":"response"} --> Content-Length: 109

Hide Details

{"command":"stackTrace","type":"request","arguments":{"threadId":1689175,"startFrame":0,"levels":1},"seq":10} <-- Content-Length: 331

Hide Details

{"body":{"stackFrames":[{"column":14,"id":524288,"line":23,"name":"main","source":{"name":"main.cpp","path":"/Users/buildslave/jenkins/workspace/lldb-cmake-sanitized/llvm-project/lldb/test/API/tools/lldb-vscode/evaluate/main.cpp"}}],"totalFrames":3},"command":"stackTrace","request_seq":10,"seq":0,"success":true,"type":"response"} --> Content-Length: 122

Hide Details

{"command":"evaluate","type":"request","arguments":{"expression":"static_int","context":"repl","frameId":524288},"seq":11} <-- Content-Length: 139

Hide Details

{"body":{"result":"42","type":"int","variablesReference":0},"command":"evaluate","request_seq":11,"seq":0,"success":true,"type":"response"} --> Content-Length: 109

Hide Details

{"command":"stackTrace","type":"request","arguments":{"threadId":1689175,"startFrame":0,"levels":1},"seq":12} <-- Content-Length: 331

Hide Details

{"body":{"stackFrames":[{"column":14,"id":524288,"line":23,"name":"main","source":{"name":"main.cpp","path":"/Users/buildslave/jenkins/workspace/lldb-cmake-sanitized/llvm-project/lldb/test/API/tools/lldb-vscode/evaluate/main.cpp"}}],"totalFrames":3},"command":"stackTrace","request_seq":12,"seq":0,"success":true,"type":"response"} --> Content-Length: 126

Hide Details

{"command":"evaluate","type":"request","arguments":{"expression":"non_static_int","context":"repl","frameId":524288},"seq":13} <-- Content-Length: 139

Hide Details

{"body":{"result":"43","type":"int","variablesReference":0},"command":"evaluate","request_seq":13,"seq":0,"success":true,"type":"response"} --> Content-Length: 109

Hide Details

{"command":"stackTrace","type":"request","arguments":{"threadId":1689175,"startFrame":0,"levels":1},"seq":14} <-- Content-Length: 331

Hide Details

{"body":{"stackFrames":[{"column":14,"id":524288,"line":23,"name":"main","source":{"name":"main.cpp","path":"/Users/buildslave/jenkins/workspace/lldb-cmake-sanitized/llvm-project/lldb/test/API/tools/lldb-vscode/evaluate/main.cpp"}}],"totalFrames":3},"command":"stackTrace","request_seq":14,"seq":0,"success":true,"type":"response"} --> Content-Length: 119

Hide Details

{"command":"evaluate","type":"request","arguments":{"expression":"struct1","context":"repl","frameId":524288},"seq":15} <-- Content-Length: 169

Hide Details

{"body":{"result":"my_struct @ 0x7ffeefbff7c8","type":"my_struct","variablesReference":4},"command":"evaluate","request_seq":15,"seq":0,"success":true,"type":"response"} --> Content-Length: 109

Hide Details

{"command":"stackTrace","type":"request","arguments":{"threadId":1689175,"startFrame":0,"levels":1},"seq":16} <-- Content-Length: 331

Hide Details

{"body":{"stackFrames":[{"column":14,"id":524288,"line":23,"name":"main","source":{"name":"main.cpp","path":"/Users/buildslave/jenkins/workspace/lldb-cmake-sanitized/llvm-project/lldb/test/API/tools/lldb-vscode/evaluate/main.cpp"}}],"totalFrames":3},"command":"stackTrace","request_seq":16,"seq":0,"success":true,"type":"response"} --> Content-Length: 123

Hide Details

{"command":"evaluate","type":"request","arguments":{"expression":"struct1.foo","context":"repl","frameId":524288},"seq":17} <-- Content-Length: 139

Hide Details

{"body":{"result":"15","type":"int","variablesReference":0},"command":"evaluate","request_seq":17,"seq":0,"success":true,"type":"response"} --> Content-Length: 109

Hide Details

{"command":"stackTrace","type":"request","arguments":{"threadId":1689175,"startFrame":0,"levels":1},"seq":18} <-- Content-Length: 331

Hide Details

{"body":{"stackFrames":[{"column":14,"id":524288,"line":23,"name":"main","source":{"name":"main.cpp","path":"/Users/buildslave/jenkins/workspace/lldb-cmake-sanitized/llvm-project/lldb/test/API/tools/lldb-vscode/evaluate/main.cpp"}}],"totalFrames":3},"command":"stackTrace","request_seq":18,"seq":0,"success":true,"type":"response"} --> Content-Length: 124

Hide Details

{"command":"evaluate","type":"request","arguments":{"expression":"struct2->foo","context":"repl","frameId":524288},"seq":19} <-- Content-Length: 139

Hide Details

{"body":{"result":"16","type":"int","variablesReference":0},"command":"evaluate","request_seq":19,"seq":0,"success":true,"type":"response"} --> Content-Length: 109

Hide Details

{"command":"stackTrace","type":"request","arguments":{"threadId":1689175,"startFrame":0,"levels":1},"seq":20} <-- Content-Length: 331

Hide Details

{"body":{"stackFrames":[{"column":14,"id":524288,"line":23,"name":"main","source":{"name":"main.cpp","path":"/Users/buildslave/jenkins/workspace/lldb-cmake-sanitized/llvm-project/lldb/test/API/tools/lldb-vscode/evaluate/main.cpp"}}],"totalFrames":3},"command":"stackTrace","request_seq":20,"seq":0,"success":true,"type":"response"} --> Content-Length: 115

Hide Details

{"command":"evaluate","type":"request","arguments":{"expression":"var","context":"repl","frameId":524288},"seq":21} <-- Content-Length: 311

Hide Details

{"body":{"category":"console","output":"/Users/buildslave/jenkins/workspace/lldb-cmake-sanitized/llvm-project/lldb/tools/lldb-vscode/ProgressEvent.cpp:89:64: runtime error: load of value 829960214, which is not a valid value for type 'lldb_vscode::ProgressEventType'\n"},"event":"output","seq":0,"type":"event"} <-- Content-Length: 261

Hide Details

{"body":{"category":"console","output":"SUMMARY: UndefinedBehaviorSanitizer: undefined-behavior /Users/buildslave/jenkins/workspace/lldb-cmake-sanitized/llvm-project/lldb/tools/lldb-vscode/ProgressEvent.cpp:89:64 in \n"},"event":"output","seq":0,"type":"event"} <-- Content-Length: 170

Hide Details

{"body":{"category":"console","output":"PLEASE submit a bug report to https://bugs.llvm.org/ and include the crash backtrace.\n"},"event":"output","seq":0,"type":"event"}

Hide Details

========= END ========= ========= DEBUG ADAPTER PROTOCOL LOGS ========= --> Content-Length: 284

Hide Details

{"command":"initialize","type":"request","arguments":{"adapterID":"lldb-native","clientID":"vscode","columnsStartAt1":true,"linesStartAt1":true,"locale":"en-us","pathFormat":"path","supportsRunInTerminalRequest":true,"supportsVariablePaging":true,"supportsVariableType":true},"seq":1} <-- Content-Length: 1222

Hide Details

{"body":{"exceptionBreakpointFilters":[{"default":false,"filter":"cpp_catch","label":"C++ Catch"},{"default":false,"filter":"cpp_throw","label":"C++ Throw"},{"default":false,"filter":"objc_catch","label":"Objective C Catch"},{"default":false,"filter":"objc_throw","label":"Objective C Throw"},{"default":false,"filter":"swift_catch","label":"Swift Catch"},{"default":false,"filter":"swift_throw","label":"Swift Throw"}],"supportTerminateDebuggee":true,"supportsCompletionsRequest":false,"supportsConditionalBreakpoints":true,"supportsConfigurationDoneRequest":true,"supportsDelayedStackTraceLoading":true,"supportsEvaluateForHovers":true,"supportsExceptionInfoRequest":true,"supportsExceptionOptions":true,"supportsFunctionBreakpoints":true,"supportsGotoTargetsRequest":false,"supportsHitConditionalBreakpoints":true,"supportsLoadedSourcesRequest":false,"supportsModulesRequest":false,"supportsProgressReporting":true,"supportsRestartFrame":false,"supportsRestartRequest":false,"supportsRunInTerminalRequest":true,"supportsSetVariable":true,"supportsStepBack":false,"supportsStepInTargetsRequest":false,"supportsValueFormattingOptions":true},"command":"initialize","request_seq":1,"seq":0,"success":true,"type":"response"} --> Content-Length: 1041

Hide Details

{"command":"launch","type":"request","arguments":{"program":"/Users/buildslave/jenkins/workspace/lldb-cmake-sanitized/lldb-build/lldb-test-build.noindex/tools/lldb-vscode/evaluate/TestVSCode_evaluate.test_watch_evaluate_expressions/a.out","disableASLR":true,"initCommands":["settings clear -all","settings set symbols.enable-external-lookup false","settings set target.inherit-tcc true","settings set target.detach-on-error false","settings set target.auto-apply-fixits false","settings set plugin.process.gdb-remote.packet-timeout 60","settings set symbols.clang-modules-cache-path \"/Users/buildslave/jenkins/workspace/lldb-cmake-sanitized/lldb-build/lldb-test-build.noindex/module-cache-lldb/lldb-api\"","settings set use-color false","setting set target.prefer-dynamic-value no-dynamic-values","settings set target.env-vars ASAN_OPTIONS=detect_stack_use_after_return=1 DYLD_INSERT_LIBRARIES=/Users/buildslave/jenkins/workspace/lldb-cmake-sanitized/host-compiler/lib/clang/13.0.99/lib/darwin/libclang_rt.asan_osx_dynamic.dylib"]},"seq":2} <-- Content-Length: 923

Hide Details

{"body":{"category":"console","output":"Running initCommands:\n(lldb) settings clear -all\n(lldb) settings set symbols.enable-external-lookup false\n(lldb) settings set target.inherit-tcc true\n(lldb) settings set target.detach-on-error false\n(lldb) settings set target.auto-apply-fixits false\n(lldb) settings set plugin.process.gdb-remote.packet-timeout 60\n(lldb) settings set symbols.clang-modules-cache-path \"/Users/buildslave/jenkins/workspace/lldb-cmake-sanitized/lldb-build/lldb-test-build.noindex/module-cache-lldb/lldb-api\"\n(lldb) settings set use-color false\n(lldb) setting set target.prefer-dynamic-value no-dynamic-values\n(lldb) settings set target.env-vars ASAN_OPTIONS=detect_stack_use_after_return=1 DYLD_INSERT_LIBRARIES=/Users/buildslave/jenkins/workspace/lldb-cmake-sanitized/host-compiler/lib/clang/13.0.99/lib/darwin/libclang_rt.asan_osx_dynamic.dylib\n"},"event":"output","seq":0,"type":"event"} <-- Content-Length: 77

Hide Details

{"command":"launch","request_seq":2,"seq":0,"success":true,"type":"response"} <-- Content-Length: 305

Hide Details

{"body":{"isLocalProcess":true,"name":"/Users/buildslave/jenkins/workspace/lldb-cmake-sanitized/lldb-build/lldb-test-build.noindex/tools/lldb-vscode/evaluate/TestVSCode_evaluate.test_watch_evaluate_expressions/a.out","startMethod":"launch","systemProcessId":1390},"event":"process","seq":0,"type":"event"} <-- Content-Length: 46

Hide Details

{"event":"initialized","seq":0,"type":"event"} --> Content-Length: 276

Hide Details

{"command":"setBreakpoints","type":"request","arguments":{"source":{"name":"main.cpp","path":"main.cpp"},"sourceModified":false,"lines":"[23, 27, 11, 35, 40, 44, 45]","breakpoints":[{"line":23},{"line":27},{"line":11},{"line":35},{"line":40},{"line":44},{"line":45}]},"seq":3} <-- Content-Length: 684

Hide Details

{"body":{"breakpoints":[{"id":1,"line":23,"source":{"name":"main.cpp","path":"main.cpp"},"verified":true},{"id":2,"line":27,"source":{"name":"main.cpp","path":"main.cpp"},"verified":true},{"id":3,"line":11,"source":{"name":"main.cpp","path":"main.cpp"},"verified":true},{"id":4,"line":35,"source":{"name":"main.cpp","path":"main.cpp"},"verified":true},{"id":5,"line":40,"source":{"name":"main.cpp","path":"main.cpp"},"verified":true},{"id":6,"line":44,"source":{"name":"main.cpp","path":"main.cpp"},"verified":true},{"id":7,"line":45,"source":{"name":"main.cpp","path":"main.cpp"},"verified":true}]},"command":"setBreakpoints","request_seq":3,"seq":0,"success":true,"type":"response"} --> Content-Length: 71

Hide Details

{"command":"configurationDone","type":"request","arguments":{},"seq":4} <-- Content-Length: 88

Hide Details

{"command":"configurationDone","request_seq":4,"seq":0,"success":true,"type":"response"} <-- Content-Length: 199

Hide Details

{"body":{"allThreadsStopped":true,"description":"breakpoint 1.1","preserveFocusHint":false,"reason":"breakpoint","threadCausedFocus":true,"threadId":1689572},"event":"stopped","seq":0,"type":"event"} --> Content-Length: 61

Hide Details

{"command":"threads","type":"request","arguments":{},"seq":5} <-- Content-Length: 133

Hide Details

{"body":{"threads":[{"id":1689572,"name":"Thread #1"}]},"command":"threads","request_seq":5,"seq":0,"success":true,"type":"response"} --> Content-Length: 108

Hide Details

{"command":"stackTrace","type":"request","arguments":{"threadId":1689572,"startFrame":0,"levels":1},"seq":6} <-- Content-Length: 330

Hide Details

{"body":{"stackFrames":[{"column":14,"id":524288,"line":23,"name":"main","source":{"name":"main.cpp","path":"/Users/buildslave/jenkins/workspace/lldb-cmake-sanitized/llvm-project/lldb/test/API/tools/lldb-vscode/evaluate/main.cpp"}}],"totalFrames":2},"command":"stackTrace","request_seq":6,"seq":0,"success":true,"type":"response"} --> Content-Length: 116

Hide Details

{"command":"evaluate","type":"request","arguments":{"expression":"var1","context":"watch","frameId":524288},"seq":7} <-- Content-Length: 138

Hide Details

{"body":{"result":"20","type":"int","variablesReference":0},"command":"evaluate","request_seq":7,"seq":0,"success":true,"type":"response"} --> Content-Length: 108

Hide Details

{"command":"stackTrace","type":"request","arguments":{"threadId":1689572,"startFrame":0,"levels":1},"seq":8} <-- Content-Length: 330

Hide Details

{"body":{"stackFrames":[{"column":14,"id":524288,"line":23,"name":"main","source":{"name":"main.cpp","path":"/Users/buildslave/jenkins/workspace/lldb-cmake-sanitized/llvm-project/lldb/test/API/tools/lldb-vscode/evaluate/main.cpp"}}],"totalFrames":2},"command":"stackTrace","request_seq":8,"seq":0,"success":true,"type":"response"} --> Content-Length: 116

Hide Details

{"command":"evaluate","type":"request","arguments":{"expression":"var2","context":"watch","frameId":524288},"seq":9} <-- Content-Length: 138

Hide Details

{"body":{"result":"21","type":"int","variablesReference":0},"command":"evaluate","request_seq":9,"seq":0,"success":true,"type":"response"} --> Content-Length: 109

Hide Details

{"command":"stackTrace","type":"request","arguments":{"threadId":1689572,"startFrame":0,"levels":1},"seq":10} <-- Content-Length: 331

Hide Details

{"body":{"stackFrames":[{"column":14,"id":524288,"line":23,"name":"main","source":{"name":"main.cpp","path":"/Users/buildslave/jenkins/workspace/lldb-cmake-sanitized/llvm-project/lldb/test/API/tools/lldb-vscode/evaluate/main.cpp"}}],"totalFrames":2},"command":"stackTrace","request_seq":10,"seq":0,"success":true,"type":"response"} --> Content-Length: 123

Hide Details

{"command":"evaluate","type":"request","arguments":{"expression":"static_int","context":"watch","frameId":524288},"seq":11} <-- Content-Length: 139

Hide Details

{"body":{"result":"42","type":"int","variablesReference":0},"command":"evaluate","request_seq":11,"seq":0,"success":true,"type":"response"} --> Content-Length: 109

Hide Details

{"command":"stackTrace","type":"request","arguments":{"threadId":1689572,"startFrame":0,"levels":1},"seq":12} <-- Content-Length: 331

Hide Details

{"body":{"stackFrames":[{"column":14,"id":524288,"line":23,"name":"main","source":{"name":"main.cpp","path":"/Users/buildslave/jenkins/workspace/lldb-cmake-sanitized/llvm-project/lldb/test/API/tools/lldb-vscode/evaluate/main.cpp"}}],"totalFrames":2},"command":"stackTrace","request_seq":12,"seq":0,"success":true,"type":"response"} --> Content-Length: 127

Hide Details

{"command":"evaluate","type":"request","arguments":{"expression":"non_static_int","context":"watch","frameId":524288},"seq":13} <-- Content-Length: 139

Hide Details

{"body":{"result":"43","type":"int","variablesReference":0},"command":"evaluate","request_seq":13,"seq":0,"success":true,"type":"response"} --> Content-Length: 109

Hide Details

{"command":"stackTrace","type":"request","arguments":{"threadId":1689572,"startFrame":0,"levels":1},"seq":14} <-- Content-Length: 331

Hide Details

{"body":{"stackFrames":[{"column":14,"id":524288,"line":23,"name":"main","source":{"name":"main.cpp","path":"/Users/buildslave/jenkins/workspace/lldb-cmake-sanitized/llvm-project/lldb/test/API/tools/lldb-vscode/evaluate/main.cpp"}}],"totalFrames":2},"command":"stackTrace","request_seq":14,"seq":0,"success":true,"type":"response"} --> Content-Length: 120

Hide Details

{"command":"evaluate","type":"request","arguments":{"expression":"struct1","context":"watch","frameId":524288},"seq":15} <-- Content-Length: 169

Hide Details

{"body":{"result":"my_struct @ 0x7ffeefbff7c8","type":"my_struct","variablesReference":4},"command":"evaluate","request_seq":15,"seq":0,"success":true,"type":"response"} --> Content-Length: 109

Hide Details

{"command":"stackTrace","type":"request","arguments":{"threadId":1689572,"startFrame":0,"levels":1},"seq":16} <-- Content-Length: 331

Hide Details

{"body":{"stackFrames":[{"column":14,"id":524288,"line":23,"name":"main","source":{"name":"main.cpp","path":"/Users/buildslave/jenkins/workspace/lldb-cmake-sanitized/llvm-project/lldb/test/API/tools/lldb-vscode/evaluate/main.cpp"}}],"totalFrames":2},"command":"stackTrace","request_seq":16,"seq":0,"success":true,"type":"response"} --> Content-Length: 124

Hide Details

{"command":"evaluate","type":"request","arguments":{"expression":"struct1.foo","context":"watch","frameId":524288},"seq":17} <-- Content-Length: 139

Hide Details

{"body":{"result":"15","type":"int","variablesReference":0},"command":"evaluate","request_seq":17,"seq":0,"success":true,"type":"response"} --> Content-Length: 109

Hide Details

{"command":"stackTrace","type":"request","arguments":{"threadId":1689572,"startFrame":0,"levels":1},"seq":18} <-- Content-Length: 331

Hide Details

{"body":{"stackFrames":[{"column":14,"id":524288,"line":23,"name":"main","source":{"name":"main.cpp","path":"/Users/buildslave/jenkins/workspace/lldb-cmake-sanitized/llvm-project/lldb/test/API/tools/lldb-vscode/evaluate/main.cpp"}}],"totalFrames":2},"command":"stackTrace","request_seq":18,"seq":0,"success":true,"type":"response"} --> Content-Length: 125

Hide Details

{"command":"evaluate","type":"request","arguments":{"expression":"struct2->foo","context":"watch","frameId":524288},"seq":19} <-- Content-Length: 139

Hide Details

{"body":{"result":"16","type":"int","variablesReference":0},"command":"evaluate","request_seq":19,"seq":0,"success":true,"type":"response"} --> Content-Length: 109

Hide Details

{"command":"stackTrace","type":"request","arguments":{"threadId":1689572,"startFrame":0,"levels":1},"seq":20} <-- Content-Length: 331

Hide Details

{"body":{"stackFrames":[{"column":14,"id":524288,"line":23,"name":"main","source":{"name":"main.cpp","path":"/Users/buildslave/jenkins/workspace/lldb-cmake-sanitized/llvm-project/lldb/test/API/tools/lldb-vscode/evaluate/main.cpp"}}],"totalFrames":2},"command":"stackTrace","request_seq":20,"seq":0,"success":true,"type":"response"} --> Content-Length: 116

Hide Details

{"command":"evaluate","type":"request","arguments":{"expression":"var","context":"watch","frameId":524288},"seq":21} <-- Content-Length: 311

Hide Details

{"body":{"category":"console","output":"/Users/buildslave/jenkins/workspace/lldb-cmake-sanitized/llvm-project/lldb/tools/lldb-vscode/ProgressEvent.cpp:89:64: runtime error: load of value 829960214, which is not a valid value for type 'lldb_vscode::ProgressEventType'\n"},"event":"output","seq":0,"type":"event"} <-- Content-Length: 261

Hide Details

{"body":{"category":"console","output":"SUMMARY: UndefinedBehaviorSanitizer: undefined-behavior /Users/buildslave/jenkins/workspace/lldb-cmake-sanitized/llvm-project/lldb/tools/lldb-vscode/ProgressEvent.cpp:89:64 in \n"},"event":"output","seq":0,"type":"event"} <-- Content-Length: 170

Hide Details

{"body":{"category":"console","output":"PLEASE submit a bug report to https://bugs.llvm.org/ and include the crash backtrace.\n"},"event":"output","seq":0,"type":"event"}

Hide Details

========= END =========

Hide Details

-- Command Output (stderr): -- Change dir to: /Users/buildslave/jenkins/workspace/lldb-cmake-sanitized/llvm-project/lldb/test/API/tools/lldb-vscode/evaluate runCmd: settings clear -all output:

Hide Details

runCmd: settings set symbols.enable-external-lookup false output:

Hide Details

runCmd: settings set target.inherit-tcc true output:

Hide Details

runCmd: settings set target.detach-on-error false output:

Hide Details

runCmd: settings set target.auto-apply-fixits false output:

Hide Details

runCmd: settings set plugin.process.gdb-remote.packet-timeout 60 output:

Hide Details

runCmd: settings set symbols.clang-modules-cache-path "/Users/buildslave/jenkins/workspace/lldb-cmake-sanitized/lldb-build/lldb-test-build.noindex/module-cache-lldb/lldb-api" output:

Hide Details

runCmd: settings set use-color false output:

Hide Details

runCmd: setting set target.prefer-dynamic-value no-dynamic-values output:

Hide Details

runCmd: settings set target.env-vars ASAN_OPTIONS=detect_stack_use_after_return=1 DYLD_INSERT_LIBRARIES=/Users/buildslave/jenkins/workspace/lldb-cmake-sanitized/host-compiler/lib/clang/13.0.99/lib/darwin/libclang_rt.asan_osx_dynamic.dylib output:

Hide Details

Adding tearDown hook: def cleanup(): if disconnectAutomatically: self.vscode.request_disconnect(terminateDebuggee=True) self.vscode.terminate()

Hide Details

Hide Details

FAIL: LLDB (/Users/buildslave/jenkins/workspace/lldb-cmake-sanitized/host-compiler/bin/clang-x86_64) :: test_generic_evaluate_expressions (TestVSCode_evaluate.TestVSCode_variables) Executing tearDown hook: def cleanup(): if disconnectAutomatically: self.vscode.request_disconnect(terminateDebuggee=True) self.vscode.terminate()

Hide Details

Hide Details

CLEANUP ERROR: LLDB (/Users/buildslave/jenkins/workspace/lldb-cmake-sanitized/host-compiler/bin/clang-x86_64) :: test_generic_evaluate_expressions (TestVSCode_evaluate.TestVSCode_variables) Traceback (most recent call last): File "/Users/buildslave/jenkins/workspace/lldb-cmake-sanitized/llvm-project/lldb/third_party/Python/module/unittest2/unittest2/case.py", line 386, in run self.tearDown() File "/Users/buildslave/jenkins/workspace/lldb-cmake-sanitized/llvm-project/lldb/packages/Python/lldbsuite/test/lldbtest.py", line 2095, in tearDown Base.tearDown(self) File "/Users/buildslave/jenkins/workspace/lldb-cmake-sanitized/llvm-project/lldb/packages/Python/lldbsuite/test/lldbtest.py", line 1065, in tearDown hook() # try the plain call and hope it works File "/Users/buildslave/jenkins/workspace/lldb-cmake-sanitized/llvm-project/lldb/packages/Python/lldbsuite/test/tools/lldb-vscode/lldbvscode_testcase.py", line 294, in cleanup self.vscode.request_disconnect(terminateDebuggee=True) File "/Users/buildslave/jenkins/workspace/lldb-cmake-sanitized/llvm-project/lldb/packages/Python/lldbsuite/test/tools/lldb-vscode/vscode.py", line 590, in request_disconnect return self.send_recv(command_dict) File "/Users/buildslave/jenkins/workspace/lldb-cmake-sanitized/llvm-project/lldb/packages/Python/lldbsuite/test/tools/lldb-vscode/vscode.py", line 315, in send_recv self.send_packet(command) File "/Users/buildslave/jenkins/workspace/lldb-cmake-sanitized/llvm-project/lldb/packages/Python/lldbsuite/test/tools/lldb-vscode/vscode.py", line 271, in send_packet self.send.flush() BrokenPipeError: [Errno 32] Broken pipe

Hide Details

runCmd: settings clear -all output:

Hide Details

runCmd: settings set symbols.enable-external-lookup false output:

Hide Details

runCmd: settings set target.inherit-tcc true output:

Hide Details

runCmd: settings set target.detach-on-error false output:

Hide Details

runCmd: settings set target.auto-apply-fixits false output:

Hide Details

runCmd: settings set plugin.process.gdb-remote.packet-timeout 60 output:

Hide Details

runCmd: settings set symbols.clang-modules-cache-path "/Users/buildslave/jenkins/workspace/lldb-cmake-sanitized/lldb-build/lldb-test-build.noindex/module-cache-lldb/lldb-api" output:

Hide Details

runCmd: settings set use-color false output:

Hide Details

runCmd: setting set target.prefer-dynamic-value no-dynamic-values output:

Hide Details

runCmd: settings set target.env-vars ASAN_OPTIONS=detect_stack_use_after_return=1 DYLD_INSERT_LIBRARIES=/Users/buildslave/jenkins/workspace/lldb-cmake-sanitized/host-compiler/lib/clang/13.0.99/lib/darwin/libclang_rt.asan_osx_dynamic.dylib output:

Hide Details

Adding tearDown hook: def cleanup(): if disconnectAutomatically: self.vscode.request_disconnect(terminateDebuggee=True) self.vscode.terminate()

Hide Details

Hide Details

Executing tearDown hook: def cleanup(): if disconnectAutomatically: self.vscode.request_disconnect(terminateDebuggee=True) self.vscode.terminate()

Hide Details

Hide Details

PASS: LLDB (/Users/buildslave/jenkins/workspace/lldb-cmake-sanitized/host-compiler/bin/clang-x86_64) :: test_hover_evaluate_expressions (TestVSCode_evaluate.TestVSCode_variables) runCmd: settings clear -all output:

Hide Details

runCmd: settings set symbols.enable-external-lookup false output:

Hide Details

runCmd: settings set target.inherit-tcc true output:

Hide Details

runCmd: settings set target.detach-on-error false output:

Hide Details

runCmd: settings set target.auto-apply-fixits false output:

Hide Details

runCmd: settings set plugin.process.gdb-remote.packet-timeout 60 output:

Hide Details

runCmd: settings set symbols.clang-modules-cache-path "/Users/buildslave/jenkins/workspace/lldb-cmake-sanitized/lldb-build/lldb-test-build.noindex/module-cache-lldb/lldb-api" output:

Hide Details

runCmd: settings set use-color false output:

Hide Details

runCmd: setting set target.prefer-dynamic-value no-dynamic-values output:

Hide Details

runCmd: settings set target.env-vars ASAN_OPTIONS=detect_stack_use_after_return=1 DYLD_INSERT_LIBRARIES=/Users/buildslave/jenkins/workspace/lldb-cmake-sanitized/host-compiler/lib/clang/13.0.99/lib/darwin/libclang_rt.asan_osx_dynamic.dylib output:

Hide Details

Adding tearDown hook: def cleanup(): if disconnectAutomatically: self.vscode.request_disconnect(terminateDebuggee=True) self.vscode.terminate()

Hide Details

Hide Details

FAIL: LLDB (/Users/buildslave/jenkins/workspace/lldb-cmake-sanitized/host-compiler/bin/clang-x86_64) :: test_repl_evaluate_expressions (TestVSCode_evaluate.TestVSCode_variables) Executing tearDown hook: def cleanup(): if disconnectAutomatically: self.vscode.request_disconnect(terminateDebuggee=True) self.vscode.terminate()

Hide Details

Hide Details

CLEANUP ERROR: LLDB (/Users/buildslave/jenkins/workspace/lldb-cmake-sanitized/host-compiler/bin/clang-x86_64) :: test_repl_evaluate_expressions (TestVSCode_evaluate.TestVSCode_variables) Traceback (most recent call last): File "/Users/buildslave/jenkins/workspace/lldb-cmake-sanitized/llvm-project/lldb/third_party/Python/module/unittest2/unittest2/case.py", line 386, in run self.tearDown() File "/Users/buildslave/jenkins/workspace/lldb-cmake-sanitized/llvm-project/lldb/packages/Python/lldbsuite/test/lldbtest.py", line 2095, in tearDown Base.tearDown(self) File "/Users/buildslave/jenkins/workspace/lldb-cmake-sanitized/llvm-project/lldb/packages/Python/lldbsuite/test/lldbtest.py", line 1065, in tearDown hook() # try the plain call and hope it works File "/Users/buildslave/jenkins/workspace/lldb-cmake-sanitized/llvm-project/lldb/packages/Python/lldbsuite/test/tools/lldb-vscode/lldbvscode_testcase.py", line 294, in cleanup self.vscode.request_disconnect(terminateDebuggee=True) File "/Users/buildslave/jenkins/workspace/lldb-cmake-sanitized/llvm-project/lldb/packages/Python/lldbsuite/test/tools/lldb-vscode/vscode.py", line 590, in request_disconnect return self.send_recv(command_dict) File "/Users/buildslave/jenkins/workspace/lldb-cmake-sanitized/llvm-project/lldb/packages/Python/lldbsuite/test/tools/lldb-vscode/vscode.py", line 315, in send_recv self.send_packet(command) File "/Users/buildslave/jenkins/workspace/lldb-cmake-sanitized/llvm-project/lldb/packages/Python/lldbsuite/test/tools/lldb-vscode/vscode.py", line 271, in send_packet self.send.flush() BrokenPipeError: [Errno 32] Broken pipe

Hide Details

runCmd: settings clear -all output:

Hide Details

runCmd: settings set symbols.enable-external-lookup false output:

Hide Details

runCmd: settings set target.inherit-tcc true output:

Hide Details

runCmd: settings set target.detach-on-error false output:

Hide Details

runCmd: settings set target.auto-apply-fixits false output:

Hide Details

runCmd: settings set plugin.process.gdb-remote.packet-timeout 60 output:

Hide Details

runCmd: settings set symbols.clang-modules-cache-path "/Users/buildslave/jenkins/workspace/lldb-cmake-sanitized/lldb-build/lldb-test-build.noindex/module-cache-lldb/lldb-api" output:

Hide Details

runCmd: settings set use-color false output:

Hide Details

runCmd: setting set target.prefer-dynamic-value no-dynamic-values output:

Hide Details

runCmd: settings set target.env-vars ASAN_OPTIONS=detect_stack_use_after_return=1 DYLD_INSERT_LIBRARIES=/Users/buildslave/jenkins/workspace/lldb-cmake-sanitized/host-compiler/lib/clang/13.0.99/lib/darwin/libclang_rt.asan_osx_dynamic.dylib output:

Hide Details

Adding tearDown hook: def cleanup(): if disconnectAutomatically: self.vscode.request_disconnect(terminateDebuggee=True) self.vscode.terminate()

Hide Details

Hide Details

FAIL: LLDB (/Users/buildslave/jenkins/workspace/lldb-cmake-sanitized/host-compiler/bin/clang-x86_64) :: test_watch_evaluate_expressions (TestVSCode_evaluate.TestVSCode_variables) Executing tearDown hook: def cleanup(): if disconnectAutomatically: self.vscode.request_disconnect(terminateDebuggee=True) self.vscode.terminate()

Hide Details

Hide Details

CLEANUP ERROR: LLDB (/Users/buildslave/jenkins/workspace/lldb-cmake-sanitized/host-compiler/bin/clang-x86_64) :: test_watch_evaluate_expressions (TestVSCode_evaluate.TestVSCode_variables) Traceback (most recent call last): File "/Users/buildslave/jenkins/workspace/lldb-cmake-sanitized/llvm-project/lldb/third_party/Python/module/unittest2/unittest2/case.py", line 386, in run self.tearDown() File "/Users/buildslave/jenkins/workspace/lldb-cmake-sanitized/llvm-project/lldb/packages/Python/lldbsuite/test/lldbtest.py", line 2095, in tearDown Base.tearDown(self) File "/Users/buildslave/jenkins/workspace/lldb-cmake-sanitized/llvm-project/lldb/packages/Python/lldbsuite/test/lldbtest.py", line 1065, in tearDown hook() # try the plain call and hope it works File "/Users/buildslave/jenkins/workspace/lldb-cmake-sanitized/llvm-project/lldb/packages/Python/lldbsuite/test/tools/lldb-vscode/lldbvscode_testcase.py", line 294, in cleanup self.vscode.request_disconnect(terminateDebuggee=True) File "/Users/buildslave/jenkins/workspace/lldb-cmake-sanitized/llvm-project/lldb/packages/Python/lldbsuite/test/tools/lldb-vscode/vscode.py", line 590, in request_disconnect return self.send_recv(command_dict) File "/Users/buildslave/jenkins/workspace/lldb-cmake-sanitized/llvm-project/lldb/packages/Python/lldbsuite/test/tools/lldb-vscode/vscode.py", line 315, in send_recv self.send_packet(command) File "/Users/buildslave/jenkins/workspace/lldb-cmake-sanitized/llvm-project/lldb/packages/Python/lldbsuite/test/tools/lldb-vscode/vscode.py", line 271, in send_packet self.send.flush() BrokenPipeError: [Errno 32] Broken pipe

Hide Details

Restore dir to: /Users/buildslave/jenkins/workspace/lldb-cmake-sanitized/lldb-build/tools/lldb/test ====================================================================== ERROR: test_generic_evaluate_expressions (TestVSCode_evaluate.TestVSCode_variables) ---------------------------------------------------------------------- Traceback (most recent call last): File "/Users/buildslave/jenkins/workspace/lldb-cmake-sanitized/llvm-project/lldb/test/API/tools/lldb-vscode/evaluate/TestVSCode_evaluate.py", line 157, in test_generic_evaluate_expressions self.run_test_evaluate_expressions() File "/Users/buildslave/jenkins/workspace/lldb-cmake-sanitized/llvm-project/lldb/test/API/tools/lldb-vscode/evaluate/TestVSCode_evaluate.py", line 60, in run_test_evaluate_expressions self.assertEvaluateFailure("var") # local variable of a_function File "/Users/buildslave/jenkins/workspace/lldb-cmake-sanitized/llvm-project/lldb/test/API/tools/lldb-vscode/evaluate/TestVSCode_evaluate.py", line 24, in assertEvaluateFailure self.vscode.request_evaluate(expression, context=self.context)['body']) File "/Users/buildslave/jenkins/workspace/lldb-cmake-sanitized/llvm-project/lldb/packages/Python/lldbsuite/test/tools/lldb-vscode/vscode.py", line 607, in request_evaluate return self.send_recv(command_dict) File "/Users/buildslave/jenkins/workspace/lldb-cmake-sanitized/llvm-project/lldb/packages/Python/lldbsuite/test/tools/lldb-vscode/vscode.py", line 321, in send_recv raise ValueError(desc) ValueError: no response for "evaluate" Config=x86_64-/Users/buildslave/jenkins/workspace/lldb-cmake-sanitized/host-compiler/bin/clang ====================================================================== ERROR: test_repl_evaluate_expressions (TestVSCode_evaluate.TestVSCode_variables) ---------------------------------------------------------------------- Traceback (most recent call last): File "/Users/buildslave/jenkins/workspace/lldb-cmake-sanitized/llvm-project/lldb/test/API/tools/lldb-vscode/evaluate/TestVSCode_evaluate.py", line 163, in test_repl_evaluate_expressions self.run_test_evaluate_expressions("repl") File "/Users/buildslave/jenkins/workspace/lldb-cmake-sanitized/llvm-project/lldb/test/API/tools/lldb-vscode/evaluate/TestVSCode_evaluate.py", line 60, in run_test_evaluate_expressions self.assertEvaluateFailure("var") # local variable of a_function File "/Users/buildslave/jenkins/workspace/lldb-cmake-sanitized/llvm-project/lldb/test/API/tools/lldb-vscode/evaluate/TestVSCode_evaluate.py", line 24, in assertEvaluateFailure self.vscode.request_evaluate(expression, context=self.context)['body']) File "/Users/buildslave/jenkins/workspace/lldb-cmake-sanitized/llvm-project/lldb/packages/Python/lldbsuite/test/tools/lldb-vscode/vscode.py", line 607, in request_evaluate return self.send_recv(command_dict) File "/Users/buildslave/jenkins/workspace/lldb-cmake-sanitized/llvm-project/lldb/packages/Python/lldbsuite/test/tools/lldb-vscode/vscode.py", line 321, in send_recv raise ValueError(desc) ValueError: no response for "evaluate" Config=x86_64-/Users/buildslave/jenkins/workspace/lldb-cmake-sanitized/host-compiler/bin/clang ====================================================================== ERROR: test_watch_evaluate_expressions (TestVSCode_evaluate.TestVSCode_variables) ---------------------------------------------------------------------- Traceback (most recent call last): File "/Users/buildslave/jenkins/workspace/lldb-cmake-sanitized/llvm-project/lldb/test/API/tools/lldb-vscode/evaluate/TestVSCode_evaluate.py", line 169, in test_watch_evaluate_expressions self.run_test_evaluate_expressions("watch") File "/Users/buildslave/jenkins/workspace/lldb-cmake-sanitized/llvm-project/lldb/test/API/tools/lldb-vscode/evaluate/TestVSCode_evaluate.py", line 60, in run_test_evaluate_expressions self.assertEvaluateFailure("var") # local variable of a_function File "/Users/buildslave/jenkins/workspace/lldb-cmake-sanitized/llvm-project/lldb/test/API/tools/lldb-vscode/evaluate/TestVSCode_evaluate.py", line 24, in assertEvaluateFailure self.vscode.request_evaluate(expression, context=self.context)['body']) File "/Users/buildslave/jenkins/workspace/lldb-cmake-sanitized/llvm-project/lldb/packages/Python/lldbsuite/test/tools/lldb-vscode/vscode.py", line 607, in request_evaluate return self.send_recv(command_dict) File "/Users/buildslave/jenkins/workspace/lldb-cmake-sanitized/llvm-project/lldb/packages/Python/lldbsuite/test/tools/lldb-vscode/vscode.py", line 321, in send_recv raise ValueError(desc) ValueError: no response for "evaluate" Config=x86_64-/Users/buildslave/jenkins/workspace/lldb-cmake-sanitized/host-compiler/bin/clang ---------------------------------------------------------------------- Ran 4 tests in 14.445s

Hide Details

RESULT: FAILED (1 passes, 0 failures, 3 errors, 0 skipped, 0 expected failures, 0 unexpected successes)

Hide Details

--

Hide Details

******************** PASS: lldb-shell :: SymbolFile/NativePDB/tag-types.cpp (1470 of 2355) PASS: lldb-api :: functionalities/breakpoint/consecutive_breakpoints/TestConsecutiveBreakpoints.py (1471 of 2355) UNSUPPORTED: lldb-api :: functionalities/darwin_log/filter/regex/message/TestDarwinLogFilterRegexMessage.py (1472 of 2355) UNSUPPORTED: lldb-api :: commands/trace/multiple-threads/TestTraceStartStopMultipleThreads.py (1473 of 2355) PASS: lldb-unit :: Utility/./UtilityTests/StreamTest.PutRawBytesToBigEndian (1474 of 2355) PASS: lldb-api :: lang/cpp/typedef/TestCppTypedef.py (1475 of 2355) PASS: lldb-unit :: Utility/./UtilityTests/OptionsWithRawTest.UnterminatedQuote (1476 of 2355) PASS: lldb-unit :: Process/gdb-remote/./ProcessGdbRemoteTests/GDBRemoteCommunicationClientTest.SendSignalsToIgnore (1477 of 2355) PASS: lldb-unit :: Symbol/./SymbolTests/TestClangASTImporter.CanImportInvalidType (1478 of 2355) PASS: lldb-shell :: Register/Core/x86-64-freebsd-addr.test (1479 of 2355) PASS: lldb-unit :: Utility/./UtilityTests/AnsiTerminal.WhiteSpace (1480 of 2355) PASS: lldb-unit :: Utility/./UtilityTests/SerializationRountripTest.SerializeDeserializeCString (1481 of 2355) PASS: lldb-unit :: UnwindAssembly/x86/./UnwindAssemblyx86Tests/Testx86AssemblyInspectionEngine.TestPushR12 (1482 of 2355) PASS: lldb-unit :: Expression/./ExpressionTests/ClangExpressionDeclMapTest.TestPersistentDeclLookup (1483 of 2355) PASS: lldb-unit :: Utility/./UtilityTests/StringListTest.Join (1484 of 2355) PASS: lldb-api :: commands/add-dsym/uuid/TestAddDsymCommand.py (1485 of 2355) PASS: lldb-unit :: Host/./HostTests/FileSystemTest.MakeAbsolute (1486 of 2355) PASS: lldb-api :: functionalities/gdb_remote_client/TestGDBRemoteClient.py (1487 of 2355) PASS: lldb-api :: commands/process/launch-with-shellexpand/TestLaunchWithShellExpand.py (1488 of 2355) UNSUPPORTED: lldb-api :: benchmarks/libcxxmap/TestBenchmarkLibcxxMap.py (1489 of 2355) PASS: lldb-unit :: Host/./HostTests/MainLoopTest.TwoSignalCallbacks (1490 of 2355) PASS: lldb-unit :: Process/minidump/./LLDBMinidumpTests/MinidumpParserTest.InvalidMinidump (1491 of 2355) PASS: lldb-shell :: SymbolFile/DWARF/x86/DW_AT_declaration-with-children.s (1492 of 2355) PASS: lldb-shell :: ObjectFile/MachO/subsections.yaml (1493 of 2355) PASS: lldb-shell :: ObjectFile/ELF/section-overlap.yaml (1494 of 2355) PASS: lldb-shell :: SymbolFile/DWARF/x86/dwarf5-atomic.s (1495 of 2355) PASS: lldb-unit :: Host/./HostTests/SocketTests/SocketTest.UDPGetConnectURI/ipv6 (1496 of 2355) PASS: lldb-unit :: Utility/./UtilityTests/BinaryStreamTest.PutULEB128Zero (1497 of 2355) UNSUPPORTED: lldb-api :: tools/lldb-server/TestGdbRemoteModuleInfo.py (1498 of 2355) PASS: lldb-api :: python_api/name_lookup/TestNameLookup.py (1499 of 2355) PASS: lldb-unit :: debugserver/./debugserverTests/RNBSocket.LoopBackConnectIPv4 (1500 of 2355) UNSUPPORTED: lldb-shell :: ScriptInterpreter/Lua/print.test (1501 of 2355) UNSUPPORTED: lldb-shell :: SymbolFile/PDB/enums-layout.test (1502 of 2355) PASS: lldb-api :: lang/cpp/alignas_base_class/TestAlignAsBaseClass.py (1503 of 2355) PASS: lldb-unit :: Process/gdb-remote/./ProcessGdbRemoteTests/GDBRemoteCommunicationClientTest.GetModulesInfo (1504 of 2355) PASS: lldb-shell :: Commands/command-backtrace-parser-1.test (1505 of 2355) UNSUPPORTED: lldb-api :: commands/expression/multiline-navigation/TestMultilineNavigation.py (1506 of 2355) PASS: lldb-api :: commands/expression/import-std-module/vector-dbg-info-content/TestDbgInfoContentVectorFromStdModule.py (1507 of 2355) PASS: lldb-api :: commands/watchpoints/hello_watchpoint/TestMyFirstWatchpoint.py (1508 of 2355) PASS: lldb-shell :: ObjectFile/PECOFF/sections-names.yaml (1509 of 2355) PASS: lldb-api :: commands/expression/no-deadlock/TestExprDoesntBlock.py (1510 of 2355) PASS: lldb-unit :: SymbolFile/NativePDB/./SymbolFileNativePDBTests/PDBFPOProgramToDWARFExpressionTests.DependencyChain (1511 of 2355) PASS: lldb-unit :: Utility/./UtilityTests/LogTest.Register (1512 of 2355) PASS: lldb-unit :: Language/Highlighting/./HighlighterTests/HighlighterTest.ClangCursorPosEndOfLine (1513 of 2355) PASS: lldb-api :: commands/expression/completion-in-lambda-and-unnamed-class/TestCompletionInLambdaAndUnnamedClass.py (1514 of 2355) PASS: lldb-unit :: Process/minidump/./LLDBMinidumpTests/MinidumpParserTest.GetMemoryRegionInfo (1515 of 2355) UNSUPPORTED: lldb-api :: functionalities/darwin_log/format/TestDarwinLogMessageFormat.py (1516 of 2355) PASS: lldb-unit :: Utility/./UtilityTests/UUIDTest.SetFromStringRef (1517 of 2355) PASS: lldb-api :: commands/expression/import-std-module/deque-dbg-info-content/TestDbgInfoContentDequeFromStdModule.py (1518 of 2355) PASS: lldb-api :: functionalities/thread/concurrent_events/TestConcurrentTwoBreakpointsOneWatchpoint.py (1519 of 2355) UNSUPPORTED: lldb-shell :: SymbolFile/NativePDB/stack_unwinding01.cpp (1520 of 2355) PASS: lldb-unit :: UnwindAssembly/x86/./UnwindAssemblyx86Tests/Testx86AssemblyInspectionEngine.TestAddRSP (1521 of 2355) PASS: lldb-unit :: Symbol/./SymbolTests/TestTypeSystemClang.TestIsClangType (1522 of 2355) PASS: lldb-api :: lang/c/stepping/TestThreadStepping.py (1523 of 2355) PASS: lldb-api :: commands/expression/import-std-module/deque-basic/TestDequeFromStdModule.py (1524 of 2355) PASS: lldb-unit :: UnwindAssembly/x86/./UnwindAssemblyx86Tests/Testx86AssemblyInspectionEngine.TestPushImm (1525 of 2355) PASS: lldb-shell :: SymbolFile/DWARF/x86/debug_rnglists-dwo.s (1526 of 2355) PASS: lldb-api :: functionalities/gdb_remote_client/TestJLink6Armv7RegisterDefinition.py (1527 of 2355) PASS: lldb-shell :: Breakpoint/breakpoint-command.test (1528 of 2355) PASS: lldb-api :: commands/target/basic/TestTargetCommand.py (1529 of 2355) PASS: lldb-unit :: Utility/./UtilityTests/RangeTest.ContainsAddrInvalid (1530 of 2355) PASS: lldb-unit :: Utility/./UtilityTests/StreamTest.AddressRangeEmptyRange (1531 of 2355) PASS: lldb-unit :: Process/gdb-remote/./ProcessGdbRemoteTests/GDBRemoteCommunicationTest.ReadPacket_checksum (1532 of 2355) XFAIL: lldb-shell :: Expr/nodefaultlib.cpp (1533 of 2355) PASS: lldb-shell :: SymbolFile/DWARF/x86/debug_rnglists.s (1534 of 2355) UNSUPPORTED: lldb-api :: functionalities/tsan/thread_numbers/TestTsanThreadNumbers.py (1535 of 2355) PASS: lldb-unit :: UnwindAssembly/x86/./UnwindAssemblyx86Tests/Testx86AssemblyInspectionEngine.Test64bitFramelessSmallStackFrame (1536 of 2355) PASS: lldb-unit :: Utility/./UtilityTests/StreamTeeTest.Flush (1537 of 2355) PASS: lldb-api :: lang/cpp/pointer_to_member_type_depending_on_parent_size/TestPointerToMemberTypeDependingOnParentSize.py (1538 of 2355) PASS: lldb-api :: functionalities/unwind/sigtramp/TestSigtrampUnwind.py (1539 of 2355) PASS: lldb-api :: tools/lldb-server/TestGdbRemoteSingleStep.py (1540 of 2355) PASS: lldb-unit :: Target/./TargetTests/ModuleCacheTest.GetAndPutUuidExists (1541 of 2355) PASS: lldb-api :: commands/expression/deleting-implicit-copy-constructor/TestDeletingImplicitCopyConstructor.py (1542 of 2355) PASS: lldb-api :: functionalities/backticks/TestBackticksWithoutATarget.py (1543 of 2355) PASS: lldb-unit :: Process/minidump/./LLDBMinidumpTests/MinidumpParserTest.GetFilteredModuleList (1544 of 2355) PASS: lldb-api :: types/TestDoubleTypes.py (1545 of 2355) PASS: lldb-unit :: Utility/./UtilityTests/RangeTest.ContainsRange (1546 of 2355) PASS: lldb-api :: functionalities/step_scripted/TestStepScripted.py (1547 of 2355) PASS: lldb-unit :: Core/./LLDBCoreTests/RichManglingContextTest.IPDRealloc (1548 of 2355) PASS: lldb-unit :: Process/Utility/./ProcessUtilityTests/ProcSMapTests/LinuxProcSMapsTestFixture.ParseSMapRegions/6 (1549 of 2355) PASS: lldb-api :: functionalities/breakpoint/objc/TestObjCBreakpoints.py (1550 of 2355) PASS: lldb-unit :: Utility/./UtilityTests/FileSpecTest.EqualDotsWindows (1551 of 2355) PASS: lldb-shell :: Driver/TestPositionalArgs.test (1552 of 2355) PASS: lldb-api :: macosx/dyld-trie-symbols/TestDyldTrieSymbols.py (1553 of 2355) PASS: lldb-shell :: SymbolFile/NativePDB/nested-types.cpp (1554 of 2355) PASS: lldb-api :: types/TestShortTypeExpr.py (1555 of 2355) PASS: lldb-api :: functionalities/tail_call_frames/inlining_and_tail_calls/TestInliningAndTailCalls.py (1556 of 2355) PASS: lldb-shell :: Driver/LocalLLDBInit.test (1557 of 2355) PASS: lldb-unit :: Symbol/./SymbolTests/TestTypeSystemClang.TestGetEnumIntegerTypeInvalid (1558 of 2355) PASS: lldb-unit :: Utility/./UtilityTests/NameMatchesTest.Ignore (1559 of 2355) PASS: lldb-unit :: UnwindAssembly/x86/./UnwindAssemblyx86Tests/Testx86AssemblyInspectionEngine.Test32bitFramelessBigStackFrame (1560 of 2355) PASS: lldb-unit :: Symbol/./SymbolTests/DWARFCallFrameInfoTest.Basic_dwarf4 (1561 of 2355) PASS: lldb-api :: types/TestShortType.py (1562 of 2355) UNSUPPORTED: lldb-shell :: ObjectFile/PECOFF/disassemble-thumb.yaml (1563 of 2355) PASS: lldb-unit :: Host/./HostTests/ConnectionFileDescriptorTest.TCPGetURIv6 (1564 of 2355) UNSUPPORTED: lldb-shell :: SymbolFile/PDB/type-quals.test (1565 of 2355) PASS: lldb-unit :: Utility/./UtilityTests/StringListTest.ShiftStdString (1566 of 2355) PASS: lldb-api :: lang/objc/objc-baseclass-sbtype/TestObjCBaseClassSBType.py (1567 of 2355) PASS: lldb-unit :: ScriptInterpreter/Python/./ScriptInterpreterPythonTests/PythonDataObjectsTest.TestPythonTupleValues (1568 of 2355) PASS: lldb-api :: commands/process/signal/TestProcessSignal.py (1569 of 2355) PASS: lldb-api :: lang/c/vla/TestVLA.py (1570 of 2355) PASS: lldb-unit :: Core/./LLDBCoreTests/FormatEntityTest.DefinitionConstructionNameAndType (1571 of 2355) PASS: lldb-unit :: Utility/./UtilityTests/OptionsWithRawTest.MultiWordSuffix (1572 of 2355) PASS: lldb-unit :: Utility/./UtilityTests/RangeTest.DoesIntersect (1573 of 2355) PASS: lldb-unit :: Utility/./UtilityTests/StringListTest.JoinEmpty (1574 of 2355) PASS: lldb-api :: functionalities/postmortem/minidump-new/TestMiniDumpNew.py (1575 of 2355) PASS: lldb-unit :: Process/gdb-remote/./ProcessGdbRemoteTests/GDBRemoteCommunicationServerTest.SendErrorResponse_UnimplementedError (1576 of 2355) PASS: lldb-shell :: SymbolFile/DWARF/x86/dwp-separate-debug-file.cpp (1577 of 2355) UNSUPPORTED: lldb-api :: commands/expression/macros/TestMacros.py (1578 of 2355) PASS: lldb-unit :: Platform/./LLDBPlatformTests/PlatformAppleSimulatorTest.TestSimHasSimEnvionament (1579 of 2355) PASS: lldb-unit :: Utility/./UtilityTests/StreamTest.PutHex32ByteOrderLittle (1580 of 2355) UNSUPPORTED: lldb-api :: iohandler/autosuggestion/TestAutosuggestion.py (1581 of 2355) PASS: lldb-api :: functionalities/data-formatter/data-formatter-stl/libcxx/tuple/TestDataFormatterLibcxxTuple.py (1582 of 2355) PASS: lldb-api :: python_api/default-constructor/TestDefaultConstructorForAPIObjects.py (1583 of 2355) UNSUPPORTED: lldb-api :: lang/c/typedef/Testtypedef.py (1584 of 2355) PASS: lldb-api :: tools/lldb-server/register-reading/TestGdbRemoteGPacket.py (1585 of 2355) PASS: lldb-unit :: Target/./TargetTests/ModuleCacheTest.GetAndPut (1586 of 2355) PASS: lldb-api :: python_api/watchpoint/TestWatchpointIgnoreCount.py (1587 of 2355) PASS: lldb-shell :: Reproducer/TestDump.test (1588 of 2355) PASS: lldb-api :: commands/statistics/basic/TestStats.py (1589 of 2355) PASS: lldb-unit :: Process/Utility/./ProcessUtilityTests/RegisterContext_x86Test.FullToAbridgedTagWord (1590 of 2355) UNSUPPORTED: lldb-api :: functionalities/ubsan/basic/TestUbsanBasic.py (1591 of 2355) PASS: lldb-unit :: Utility/./UtilityTests/StreamTest.Indent (1592 of 2355) PASS: lldb-api :: functionalities/thread/crash_during_step/TestCrashDuringStep.py (1593 of 2355) PASS: lldb-api :: tools/lldb-server/TestGdbRemote_vCont.py (1594 of 2355) PASS: lldb-shell :: SymbolFile/DWARF/x86/dir-separator-no-comp-dir-relative-name.s (1595 of 2355) PASS: lldb-unit :: UnwindAssembly/x86/./UnwindAssemblyx86Tests/Testx86AssemblyInspectionEngine.TestPushRBPWithREX (1596 of 2355) PASS: lldb-shell :: SymbolFile/DWARF/x86/DW_TAG_variable-DW_AT_const_value.s (1597 of 2355) PASS: lldb-unit :: Utility/./UtilityTests/NameMatchesTest.RegularExpression (1598 of 2355) PASS: lldb-unit :: Interpreter/./InterpreterTests/OptionArgParserTest.toChar (1599 of 2355) PASS: lldb-unit :: Utility/./UtilityTests/ConstStringTest.MangledCounterpart (1600 of 2355) PASS: lldb-unit :: Utility/./UtilityTests/StreamTest.AddressSize (1601 of 2355) PASS: lldb-unit :: Utility/./UtilityTests/FileSpecTest.Equal (1602 of 2355) PASS: lldb-unit :: Process/Utility/./ProcessUtilityTests/ProcMapTests/LinuxProcMapsTestFixture.ParseMapRegions/1 (1603 of 2355) PASS: lldb-unit :: Process/minidump/./LLDBMinidumpTests/MinidumpParserTest.GetArchitecture (1604 of 2355) PASS: lldb-shell :: SymbolFile/DWARF/x86/dwarf5-split.s (1605 of 2355) PASS: lldb-unit :: Utility/./UtilityTests/ReproducerTest.SetReplay (1606 of 2355) PASS: lldb-unit :: Signals/./SignalsTests/UnixSignalsTest.VersionChange (1607 of 2355) PASS: lldb-api :: lang/objc/modules-non-objc-target/TestObjCModulesNonObjCTarget.py (1608 of 2355) PASS: lldb-shell :: ObjectFile/ELF/build-id-case.yaml (1609 of 2355) PASS: lldb-api :: commands/expression/char/TestExprsChar.py (1610 of 2355) PASS: lldb-api :: functionalities/data-formatter/data-formatter-objc/nsstring/TestDataFormatterNSString.py (1611 of 2355) PASS: lldb-api :: commands/expression/calculator_mode/TestCalculatorMode.py (1612 of 2355) PASS: lldb-unit :: Utility/./UtilityTests/RegisterValueTest.GetScalarValue (1613 of 2355) PASS: lldb-unit :: Process/minidump/./LLDBMinidumpTests/MinidumpParserTest.MinidumpModuleOrder (1614 of 2355) PASS: lldb-unit :: Utility/./UtilityTests/RegularExpression.Invalid (1615 of 2355) PASS: lldb-unit :: Utility/./UtilityTests/StringLexerTest.GetUnlexed (1616 of 2355) PASS: lldb-api :: lang/cpp/char8_t/TestCxxChar8_t.py (1617 of 2355) PASS: lldb-api :: functionalities/thread/concurrent_events/TestConcurrentDelaySignalWatch.py (1618 of 2355) PASS: lldb-api :: functionalities/scripted_process/TestScriptedProcess.py (1619 of 2355) PASS: lldb-api :: functionalities/data-formatter/hexcaps/TestDataFormatterHexCaps.py (1620 of 2355) PASS: lldb-unit :: Utility/./UtilityTests/VMRange.SetEndAddress (1621 of 2355) PASS: lldb-unit :: Symbol/./SymbolTests/TestTypeSystemClang.OnlyPackName (1622 of 2355) PASS: lldb-shell :: Breakpoint/jit-loader_jitlink_elf.test (1623 of 2355) UNSUPPORTED: lldb-api :: lang/objc/objc-dynamic-value/TestObjCDynamicValue.py (1624 of 2355) PASS: lldb-unit :: Utility/./UtilityTests/OptionsWithRawTest.ArgsButNoDelimiter (1625 of 2355) PASS: lldb-unit :: Utility/./UtilityTests/BinaryStreamTest.PutULEB128OneByte (1626 of 2355) PASS: lldb-unit :: Utility/./UtilityTests/RangeDataVector.FindEntryThatContains (1627 of 2355) PASS: lldb-unit :: Utility/./UtilityTests/GeneratorTest.YamlMultiProvider (1628 of 2355) PASS: lldb-api :: sample_test/TestSampleInlineTest.py (1629 of 2355) PASS: lldb-api :: python_api/disassemble-raw-data/TestDisassembleRawData.py (1630 of 2355) PASS: lldb-shell :: Reproducer/Functionalities/TestImageList.test (1631 of 2355) PASS: lldb-shell :: Settings/TestSettingsSet.test (1632 of 2355) PASS: lldb-shell :: SymbolFile/DWARF/x86/debug_aranges-empty-section.s (1633 of 2355) PASS: lldb-api :: functionalities/data-formatter/data-formatter-stl/libcxx/forward_list/TestDataFormatterLibcxxForwardList.py (1634 of 2355) PASS: lldb-unit :: Utility/./UtilityTests/EnvironmentTest.EnvpConstruction (1635 of 2355) PASS: lldb-unit :: Utility/./UtilityTests/VASprintfTest.NoBufferResize (1636 of 2355) PASS: lldb-api :: lang/c/shared_lib/TestSharedLib.py (1637 of 2355) PASS: lldb-unit :: Utility/./UtilityTests/AnsiTerminal.Empty (1638 of 2355) PASS: lldb-api :: commands/platform/file/close/TestPlatformFileClose.py (1639 of 2355) PASS: lldb-unit :: Utility/./UtilityTests/ScalarTest.GetBytes (1640 of 2355) PASS: lldb-shell :: Error/assert.test (1641 of 2355) PASS: lldb-api :: commands/watchpoints/watchpoint_commands/command/TestWatchpointCommandLLDB.py (1642 of 2355) PASS: lldb-unit :: Utility/./UtilityTests/StringExtractorTest.GetNameColonValueSuccess (1643 of 2355) PASS: lldb-api :: functionalities/postmortem/mach-core/TestMachCore.py (1644 of 2355) PASS: lldb-api :: commands/expression/import-std-module/stack/TestStackFromStdModule.py (1645 of 2355) UNSUPPORTED: lldb-api :: functionalities/unwind/standard/TestStandardUnwind.py (1646 of 2355) PASS: lldb-unit :: Utility/./UtilityTests/ProcessInstanceInfo.Yaml (1647 of 2355) PASS: lldb-unit :: Utility/./UtilityTests/BinaryStreamTest.PutSLEB128One (1648 of 2355) PASS: lldb-unit :: ScriptInterpreter/Python/./ScriptInterpreterPythonTests/PythonDataObjectsTest.TestPythonStringToStructuredString (1649 of 2355) PASS: lldb-unit :: Platform/./LLDBPlatformTests/PlatformAppleSimulatorTest.TestHostPlatformToSim (1650 of 2355) PASS: lldb-api :: tools/lldb-vscode/console/TestVSCode_console.py (1651 of 2355) PASS: lldb-shell :: ObjectFile/ELF/PT_LOAD-empty.yaml (1652 of 2355) PASS: lldb-api :: macosx/find-dsym/bundle-with-dot-in-filename/TestBundleWithDotInFilename.py (1653 of 2355) PASS: lldb-unit :: Utility/./UtilityTests/StringListTest.GetMaxStringLengthIncreasingSize (1654 of 2355) PASS: lldb-unit :: Language/CPlusPlus/./LanguageCPlusPlusTests/CPlusPlusLanguage.ExtractContextAndIdentifier (1655 of 2355) PASS: lldb-api :: tools/lldb-server/signal-filtering/TestGdbRemote_QPassSignals.py (1656 of 2355) PASS: lldb-unit :: Utility/./UtilityTests/StreamTest.PutCString (1657 of 2355) PASS: lldb-api :: commands/expression/expr-in-syscall/TestExpressionInSyscall.py (1658 of 2355) PASS: lldb-unit :: Expression/./ExpressionTests/CppModuleConfigurationTest.LibCppV2 (1659 of 2355) PASS: lldb-unit :: Utility/./UtilityTests/VMRange.ContainsAddr (1660 of 2355) PASS: lldb-api :: types/TestRecursiveTypes.py (1661 of 2355) UNSUPPORTED: lldb-shell :: Register/x86-ymm-read.test (1662 of 2355) PASS: lldb-api :: commands/frame/diagnose/local-variable/TestLocalVariable.py (1663 of 2355) UNSUPPORTED: lldb-shell :: Minidump/Windows/arm-fp-unwind.test (1664 of 2355) PASS: lldb-unit :: UnwindAssembly/x86/./UnwindAssemblyx86Tests/Testx86AssemblyInspectionEngine.TestPushECX (1665 of 2355) PASS: lldb-unit :: Host/./HostTests/HostInfoTestInitialization.InitTwice (1666 of 2355) PASS: lldb-unit :: Utility/./UtilityTests/StringExtractorTest.GetHexBytesAvail (1667 of 2355) PASS: lldb-unit :: Utility/./UtilityTests/ScalarTest.LongLongAssigmentOperator (1668 of 2355) PASS: lldb-api :: lang/objcxx/class-name-clash/TestNameClash.py (1669 of 2355) UNSUPPORTED: lldb-shell :: ScriptInterpreter/Lua/command_script_import.test (1670 of 2355) PASS: lldb-api :: commands/expression/import-std-module/queue/TestQueueFromStdModule.py (1671 of 2355) PASS: lldb-shell :: SymbolFile/DWARF/x86/debug-types-basic.test (1672 of 2355) PASS: lldb-unit :: Process/minidump/./LLDBMinidumpTests/MinidumpParserTest.GetMemoryRegionInfoLinuxMaps (1673 of 2355) PASS: lldb-unit :: Utility/./UtilityTests/StringExtractorTest.DecodeHexU8_InvalidHex2 (1674 of 2355) PASS: lldb-unit :: Utility/./UtilityTests/ProcessInstanceInfoMatch.Name (1675 of 2355) PASS: lldb-api :: lang/cpp/global_variables/TestCPPGlobalVariables.py (1676 of 2355) PASS: lldb-api :: commands/command/script/import/TestImport.py (1677 of 2355) UNSUPPORTED: lldb-api :: commands/trace/TestTraceSchema.py (1678 of 2355) PASS: lldb-unit :: ScriptInterpreter/Python/./ScriptInterpreterPythonTests/PythonDataObjectsTest.TestInstanceNameResolutionNoDot (1679 of 2355) PASS: lldb-unit :: Process/minidump/./LLDBMinidumpTests/RegisterContextMinidump.ConvertMinidumpContext_x86_32 (1680 of 2355) PASS: lldb-unit :: Utility/./UtilityTests/RangeTest.ContainsEndInclusive (1681 of 2355) PASS: lldb-api :: macosx/builtin-debugtrap/TestBuiltinDebugTrap.py (1682 of 2355) PASS: lldb-unit :: Utility/./UtilityTests/GeneratorTest.Create (1683 of 2355) UNSUPPORTED: lldb-shell :: SymbolFile/DWARF/x86/dwarf5-line-strp.s (1684 of 2355) PASS: lldb-unit :: Utility/./UtilityTests/Flags.AnySet (1685 of 2355) PASS: lldb-unit :: Interpreter/./InterpreterTests/OptionArgParserTest.toBoolean (1686 of 2355) UNSUPPORTED: lldb-api :: functionalities/process_save_core/TestProcessSaveCore.py (1687 of 2355) PASS: lldb-api :: lang/cpp/bitfields/TestCppBitfields.py (1688 of 2355) PASS: lldb-api :: python_api/process/io/TestProcessIO.py (1689 of 2355) PASS: lldb-shell :: Reproducer/Functionalities/TestDataFormatter.test (1690 of 2355) PASS: lldb-unit :: Host/./HostTests/SocketTests/SocketTest.TCPListen0GetPort/ipv6 (1691 of 2355) PASS: lldb-api :: macosx/queues/TestQueues.py (1692 of 2355) PASS: lldb-unit :: ObjectFile/PECOFF/./ObjectFilePECOFFTests/PECallFrameInfoTest.Chained_eh (1693 of 2355) PASS: lldb-unit :: Utility/./UtilityTests/ListenerTest.GetEventImmediate (1694 of 2355) PASS: lldb-unit :: Utility/./UtilityTests/StateTest.Formatv (1695 of 2355) PASS: lldb-api :: lang/cpp/offsetof/TestOffsetofCpp.py (1696 of 2355) PASS: lldb-unit :: Utility/./UtilityTests/ArgsTest.ReplaceArgumentAtIndexEqual (1697 of 2355) PASS: lldb-unit :: Host/./HostTests/File.GetStreamFromDescriptor (1698 of 2355) PASS: lldb-api :: macosx/profile_vrs_detach/TestDetachVrsProfile.py (1699 of 2355) PASS: lldb-unit :: Utility/./UtilityTests/StreamTeeTest.DefaultConstructor (1700 of 2355) PASS: lldb-shell :: SymbolFile/DWARF/x86/childless-compile-unit.s (1701 of 2355) PASS: lldb-api :: commands/expression/result_numbering/TestResultNumbering.py (1702 of 2355) PASS: lldb-shell :: Breakpoint/debug_rnglistx_rlex.test (1703 of 2355) PASS: lldb-api :: commands/expression/import-std-module/basic/TestImportStdModule.py (1704 of 2355) PASS: lldb-shell :: SymbolFile/DWARF/x86/dir-separator-windows.s (1705 of 2355) PASS: lldb-api :: commands/settings/quoting/TestQuoting.py (1706 of 2355) PASS: lldb-api :: lang/cpp/template/TestTemplateArgs.py (1707 of 2355) PASS: lldb-unit :: Utility/./UtilityTests/StringListTest.AppendStringCString (1708 of 2355) UNSUPPORTED: lldb-shell :: SymbolFile/PDB/variables.test (1709 of 2355) PASS: lldb-unit :: Core/./LLDBCoreTests/DumpDataExtractorTest.ItemByteSizeErrors (1710 of 2355) PASS: lldb-api :: tools/lldb-server/inferior-crash/TestGdbRemoteAbort.py (1711 of 2355) PASS: lldb-unit :: Utility/./UtilityTests/StringListTest.LongestCommonPrefixDuplicateElement (1712 of 2355) PASS: lldb-api :: lang/c/const_variables/TestConstVariables.py (1713 of 2355) PASS: lldb-api :: commands/target/select/TestTargetSelect.py (1714 of 2355) PASS: lldb-api :: functionalities/data-formatter/ostypeformatting/TestFormattersOsType.py (1715 of 2355) UNSUPPORTED: lldb-api :: lang/cpp/function-template-parameter-pack/TestFunctionTemplateParameterPack.py (1716 of 2355) UNSUPPORTED: lldb-shell :: Register/x86-64-gp-write.test (1717 of 2355) PASS: lldb-unit :: Utility/./UtilityTests/StringListTest.GetSize (1718 of 2355) PASS: lldb-shell :: SymbolFile/NativePDB/ast-types.cpp (1719 of 2355) PASS: lldb-unit :: Utility/./UtilityTests/StringExtractorTest.GetHexBytes_FullString (1720 of 2355) PASS: lldb-unit :: Utility/./UtilityTests/AnsiTerminal.AtStart (1721 of 2355) PASS: lldb-unit :: Utility/./UtilityTests/SubsystemRAIITest.NormalSubsystem (1722 of 2355) PASS: lldb-unit :: Symbol/./SymbolTests/PostfixExpression.ParseFPOProgram (1723 of 2355) PASS: lldb-unit :: Utility/./UtilityTests/OptionsWithRawTest.EmptyArgsOnlySuffix (1724 of 2355) PASS: lldb-unit :: Utility/./UtilityTests/DataExtractorTest.GetCStrAtNullOffset (1725 of 2355) UNSUPPORTED: lldb-api :: functionalities/data-formatter/data-formatter-stl/libstdcpp/smart_ptr/TestDataFormatterStdSmartPtr.py (1726 of 2355) PASS: lldb-api :: functionalities/data-formatter/type_summary_list_arg/TestTypeSummaryListArg.py (1727 of 2355) PASS: lldb-shell :: Settings/TestSettingsWrite.test (1728 of 2355) PASS: lldb-shell :: Quit/TestQuitExitCodeTooManyArgs.test (1729 of 2355) PASS: lldb-api :: iohandler/resize/TestIOHandlerResizeNoEditline.py (1730 of 2355) PASS: lldb-unit :: Utility/./UtilityTests/ConstStringTest.UpdateMangledCounterpart (1731 of 2355) PASS: lldb-shell :: ObjectFile/PECOFF/basic-info-arm64.yaml (1732 of 2355) PASS: lldb-unit :: Core/./LLDBCoreTests/SourceLocationSpecTest.Equal (1733 of 2355) PASS: lldb-unit :: Language/Highlighting/./HighlighterTests/HighlighterTest.ClangPPDirectives (1734 of 2355) PASS: lldb-api :: functionalities/signal/TestSendSignal.py (1735 of 2355) PASS: lldb-api :: lang/objc/objc-static-method-stripped/TestObjCStaticMethodStripped.py (1736 of 2355) UNSUPPORTED: lldb-shell :: Register/aarch64-gp-read.test (1737 of 2355) PASS: lldb-unit :: Utility/./UtilityTests/LogTest.LLDB_LOG_nullptr (1738 of 2355) PASS: lldb-unit :: Language/Highlighting/./HighlighterTests/HighlighterTest.ClangTrailingBackslashMissingNewLine (1739 of 2355) UNSUPPORTED: lldb-shell :: ScriptInterpreter/Lua/persistent_state.test (1740 of 2355) PASS: lldb-unit :: Symbol/./SymbolTests/TestTypeSystemClang.TestDisplayName (1741 of 2355) PASS: lldb-api :: tools/lldb-vscode/step/TestVSCode_step.py (1742 of 2355) PASS: lldb-unit :: Utility/./UtilityTests/UriParserTest.BracketedHostnameWithColon (1743 of 2355) PASS: lldb-unit :: ScriptInterpreter/Python/./ScriptInterpreterPythonTests/PythonDataObjectsTest.TestPythonString (1744 of 2355) PASS: lldb-api :: lang/objcxx/cxx-bridged-po/TestObjCXXBridgedPO.py (1745 of 2355) PASS: lldb-api :: lang/cpp/type_lookup/TestCppTypeLookup.py (1746 of 2355) PASS: lldb-api :: commands/expression/pr35310/TestExprsBug35310.py (1747 of 2355) PASS: lldb-unit :: Process/minidump/./LLDBMinidumpTests/MinidumpParserTest.GetMemoryRegionInfoFromMemory64List (1748 of 2355) UNSUPPORTED: lldb-api :: functionalities/tsan/cpp_global_location/TestTsanCPPGlobalLocation.py (1749 of 2355) PASS: lldb-unit :: Symbol/./SymbolTests/TestTypeSystemClang.TestRemoveFastQualifiers (1750 of 2355) PASS: lldb-unit :: Core/./LLDBCoreTests/ModuleSpecTest.InvalidInMemoryBuffer (1751 of 2355) PASS: lldb-api :: functionalities/data-formatter/nsarraysynth/TestNSArraySynthetic.py (1752 of 2355) PASS: lldb-api :: python_api/sbvalue_persist/TestSBValuePersist.py (1753 of 2355) PASS: lldb-api :: functionalities/gdb_remote_client/TestIOSSimulator.py (1754 of 2355) UNSUPPORTED: lldb-api :: lang/objc/rdar-12408181/TestRdar12408181.py (1755 of 2355) PASS: lldb-api :: lang/objc/objc-struct-argument/TestObjCStructArgument.py (1756 of 2355) PASS: lldb-unit :: ScriptInterpreter/Python/./ScriptInterpreterPythonTests/PythonDataObjectsTest.TestPythonBoolean (1757 of 2355) PASS: lldb-unit :: Expression/./ExpressionTests/CppModuleConfigurationTest.MissingLibCpp (1758 of 2355) UNSUPPORTED: lldb-shell :: ScriptInterpreter/Lua/bindings.test (1759 of 2355) PASS: lldb-shell :: Host/TestCustomShell.test (1760 of 2355) PASS: lldb-api :: functionalities/thread/concurrent_events/TestConcurrentSignalNWatchNBreak.py (1761 of 2355) PASS: lldb-unit :: Symbol/./SymbolTests/TestClangASTImporter.MetadataPropagationIndirectImport (1762 of 2355) PASS: lldb-unit :: Utility/./UtilityTests/LogChannelTest.List (1763 of 2355) PASS: lldb-unit :: Host/./HostTests/SocketTests/SocketTest.TCPGetAddress/ipv4 (1764 of 2355) PASS: lldb-unit :: Process/Utility/./ProcessUtilityTests/ProcSMapTests/LinuxProcSMapsTestFixture.ParseSMapRegions/7 (1765 of 2355) PASS: lldb-unit :: ObjectFile/ELF/./ObjectFileELFTests/ObjectFileELFTest.SectionsResolveConsistently (1766 of 2355) PASS: lldb-api :: functionalities/data-formatter/data-formatter-stl/libcxx/list/TestDataFormatterLibcxxList.py (1767 of 2355) PASS: lldb-api :: lang/objc/cpp_keyword_identifiers/TestCppKeywordsAsObjCIdentifiers.py (1768 of 2355) PASS: lldb-api :: functionalities/plugins/python_os_plugin/TestPythonOSPlugin.py (1769 of 2355) UNSUPPORTED: lldb-api :: commands/register/register/intel_xtended_registers/mpx_bound_violation/TestBoundViolation.py (1770 of 2355) PASS: lldb-shell :: ObjectFile/wasm/basic.yaml (1771 of 2355) XFAIL: lldb-shell :: Register/x86-64-fp-read.test (1772 of 2355) PASS: lldb-api :: lang/c/local_types/TestUseClosestType.py (1773 of 2355) PASS: lldb-unit :: Core/./LLDBCoreTests/DumpDataExtractorTest.StartOffset (1774 of 2355) PASS: lldb-unit :: Process/minidump/./LLDBMinidumpTests/MinidumpParserTest.GetLinuxProcStatus (1775 of 2355) PASS: lldb-shell :: SymbolFile/DWARF/x86/debug_loclists-dwo.s (1776 of 2355) PASS: lldb-api :: functionalities/breakpoint/move_nearest/TestMoveNearest.py (1777 of 2355) UNSUPPORTED: lldb-api :: commands/expression/completion-crash-invalid-iterator/TestInvalidIteratorCompletionCrash.py (1778 of 2355) UNSUPPORTED: lldb-api :: iohandler/unicode/TestUnicode.py (1779 of 2355) PASS: lldb-unit :: Utility/./UtilityTests/StreamTest.PutPtr (1780 of 2355) PASS: lldb-api :: lang/objc/exceptions/TestObjCExceptions.py (1781 of 2355) PASS: lldb-unit :: Utility/./UtilityTests/StringListTest.LongestCommonPrefixSingleElement (1782 of 2355) PASS: lldb-api :: functionalities/gdb_remote_client/TestProcessConnect.py (1783 of 2355) PASS: lldb-unit :: Utility/./UtilityTests/ScalarTest.Equality (1784 of 2355) PASS: lldb-unit :: Utility/./UtilityTests/RangeTest.Constructor (1785 of 2355) PASS: lldb-unit :: Utility/./UtilityTests/StatusTest.Formatv (1786 of 2355) PASS: lldb-unit :: Utility/./UtilityTests/BinaryStreamTest.PutSLEB128FourBytes (1787 of 2355) PASS: lldb-api :: commands/expression/call-throws/TestCallThatThrows.py (1788 of 2355) PASS: lldb-unit :: UnwindAssembly/x86/./UnwindAssemblyx86Tests/Testx86AssemblyInspectionEngine.TestPopR13 (1789 of 2355) PASS: lldb-unit :: Utility/./UtilityTests/OptionsWithRawTest.WhitespaceInput (1790 of 2355) PASS: lldb-unit :: Utility/./UtilityTests/StreamTest.PutMaxHex64ByteOrderBig (1791 of 2355) PASS: lldb-unit :: Process/minidump/./LLDBMinidumpTests/MinidumpParserTest.GetMemoryRegionInfoLinuxMapsError (1792 of 2355) PASS: lldb-api :: functionalities/param_entry_vals/basic_entry_values/TestBasicEntryValues.py (1793 of 2355) PASS: lldb-shell :: Quit/TestQuitExitCode-30.test (1794 of 2355) UNSUPPORTED: lldb-api :: functionalities/breakpoint/breakpoint_callback_command_source/TestBreakpointCallbackCommandSource.py (1795 of 2355) PASS: lldb-api :: functionalities/data-formatter/synthcapping/TestSyntheticCapping.py (1796 of 2355) PASS: lldb-api :: commands/platform/sdk/TestPlatformSDK.py (1797 of 2355) PASS: lldb-unit :: Utility/./UtilityTests/StreamTeeTest.CopyConstructor (1798 of 2355) UNSUPPORTED: lldb-shell :: ObjectFile/ELF/minidebuginfo-no-lzma.yaml (1799 of 2355) PASS: lldb-shell :: ObjectFile/ELF/avr-basic-info.yaml (1800 of 2355) PASS: lldb-api :: commands/expression/entry-bp/TestExprEntryBP.py (1801 of 2355) PASS: lldb-api :: lang/objc/bitfield_ivars/TestBitfieldIvars.py (1802 of 2355) PASS: lldb-api :: functionalities/conditional_break/TestConditionalBreak.py (1803 of 2355) UNSUPPORTED: lldb-shell :: SymbolFile/DWARF/x86/DW_TAG_GNU_call_site-DW_AT_low_pc.s (1804 of 2355) PASS: lldb-unit :: Language/Highlighting/./HighlighterTests/HighlighterTest.ClangBraces (1805 of 2355) PASS: lldb-api :: commands/settings/TestSettings.py (1806 of 2355) PASS: lldb-api :: source-manager/TestSourceManager.py (1807 of 2355) PASS: lldb-unit :: Utility/./UtilityTests/StringListTest.Assignment (1808 of 2355) UNSUPPORTED: lldb-api :: benchmarks/turnaround/TestCompileRunToBreakpointTurnaround.py (1809 of 2355) PASS: lldb-unit :: Utility/./UtilityTests/Flags.Clear (1810 of 2355) PASS: lldb-api :: functionalities/data-formatter/data-formatter-advanced/TestDataFormatterAdv.py (1811 of 2355) PASS: lldb-unit :: Utility/./UtilityTests/StreamTeeTest.SetStreamAtIndexOutOfBounds (1812 of 2355) PASS: lldb-api :: functionalities/data-formatter/vector-types/TestVectorTypesFormatting.py (1813 of 2355) PASS: lldb-unit :: Target/./TargetTests/PathMappingListTest.RemapRoot (1814 of 2355) PASS: lldb-unit :: Process/minidump/./LLDBMinidumpTests/MinidumpParserTest.MinidumpDuplicateModuleMappedSecondHigh (1815 of 2355) PASS: lldb-api :: tools/lldb-server/TestGdbRemoteAttachOrWait.py (1816 of 2355) PASS: lldb-unit :: Symbol/./SymbolTests/TestTypeSystemClang.TestUnifyAccessSpecifiers (1817 of 2355) PASS: lldb-unit :: Utility/./UtilityTests/XcodeSDKTest.ParseTest (1818 of 2355) UNSUPPORTED: lldb-shell :: ScriptInterpreter/Lua/watchpoint_callback.test (1819 of 2355) PASS: lldb-unit :: Language/Highlighting/./HighlighterTests/HighlighterTest.ClangOperators (1820 of 2355) PASS: lldb-unit :: Host/./HostTests/MainLoopTest.DetectsEOF (1821 of 2355) PASS: lldb-api :: functionalities/dynamic_value_child_count/TestDynamicValueChildCount.py (1822 of 2355) UNSUPPORTED: lldb-api :: linux/sepdebugsymlink/TestTargetSymbolsSepDebugSymlink.py (1823 of 2355) UNSUPPORTED: lldb-api :: linux/aarch64/mte_memory_region/TestAArch64LinuxMTEMemoryRegion.py (1824 of 2355) PASS: lldb-api :: tools/lldb-vscode/module/TestVSCode_module.py (1825 of 2355) UNSUPPORTED: lldb-api :: tools/lldb-server/libraries-svr4/TestGdbRemoteLibrariesSvr4Support.py (1826 of 2355) PASS: lldb-shell :: SymbolFile/DWARF/x86/split-dwarf-multiple-cu.ll (1827 of 2355) PASS: lldb-unit :: Utility/./UtilityTests/StatusTest.ErrorCodeConstructor (1828 of 2355) PASS: lldb-unit :: Utility/./UtilityTests/StreamTeeTest.Write (1829 of 2355) PASS: lldb-api :: commands/watchpoints/watchpoint_events/TestWatchpointEvents.py (1830 of 2355) PASS: lldb-api :: lang/objc/rdar-10967107/TestRdar10967107.py (1831 of 2355) PASS: lldb-unit :: Utility/./UtilityTests/XcodeSDKTest.MergeTest (1832 of 2355) PASS: lldb-shell :: SymbolFile/Breakpad/unwind-via-stack-win.test (1833 of 2355) PASS: lldb-unit :: Symbol/./SymbolTests/TestTypeSystemClang.TestGetBasicTypeFromName (1834 of 2355) PASS: lldb-unit :: Host/./HostTests/Host.WaitStatusFormat (1835 of 2355) PASS: lldb-unit :: ScriptInterpreter/Python/./ScriptInterpreterPythonTests/PythonDataObjectsTest.TestPythonInteger (1836 of 2355) PASS: lldb-api :: lang/c/blocks/TestBlocks.py (1837 of 2355) PASS: lldb-shell :: SymbolFile/DWARF/x86/DW_AT_decl_file-DW_AT_specification-crosscu.s (1838 of 2355) PASS: lldb-api :: functionalities/thread/concurrent_events/TestConcurrentSignalBreak.py (1839 of 2355) PASS: lldb-unit :: Utility/./UtilityTests/RangeTest.ContainsRangeStartingFromZero (1840 of 2355) PASS: lldb-unit :: Utility/./UtilityTests/StringListTest.LongestCommonPrefix (1841 of 2355) PASS: lldb-shell :: Register/Core/x86-32-linux-addr.test (1842 of 2355) PASS: lldb-unit :: Utility/./UtilityTests/StringListTest.CopyList (1843 of 2355) PASS: lldb-api :: functionalities/data-formatter/user-format-vs-summary/TestUserFormatVsSummary.py (1844 of 2355) PASS: lldb-unit :: Core/./LLDBCoreTests/RichManglingContextTest.FromCxxMethodName (1845 of 2355) PASS: lldb-shell :: Quit/TestQuitExitCodeHex0.test (1846 of 2355) PASS: lldb-unit :: UnwindAssembly/x86/./UnwindAssemblyx86Tests/Testx86AssemblyInspectionEngine.TestSubESP (1847 of 2355) PASS: lldb-api :: functionalities/data-formatter/stringprinter/TestStringPrinter.py (1848 of 2355) PASS: lldb-api :: lang/cpp/unique-types/TestUniqueTypes.py (1849 of 2355) PASS: lldb-unit :: Utility/./UtilityTests/StringExtractorTest.DecodeHexU8_Extra (1850 of 2355) PASS: lldb-unit :: Utility/./UtilityTests/DataExtractorTest.GetCStrUnterminated (1851 of 2355) PASS: lldb-unit :: SymbolFile/DWARF/./SymbolFileDWARFTests/SymbolFileDWARFTests.TestAbbrevNullAttrValidForm (1852 of 2355) PASS: lldb-shell :: SymbolFile/DWARF/x86/DW_TAG_variable-invalid_location.s (1853 of 2355) PASS: lldb-api :: functionalities/completion/TestCompletion.py (1854 of 2355) PASS: lldb-api :: commands/frame/diagnose/complicated-expression/TestComplicatedExpression.py (1855 of 2355) UNSUPPORTED: lldb-api :: tools/lldb-server/TestGdbRemoteCompletion.py (1856 of 2355) PASS: lldb-unit :: Utility/./UtilityTests/FileSpecTest.GuessPathStyle (1857 of 2355) PASS: lldb-unit :: Utility/./UtilityTests/StringExtractorTest.GetNameColonValueContainsColon (1858 of 2355) PASS: lldb-shell :: Unwind/trap_frame_sym_ctx.test (1859 of 2355) PASS: lldb-shell :: Breakpoint/debug_rnglist_basic.test (1860 of 2355) PASS: lldb-unit :: Utility/./UtilityTests/UriParserTest.SchemeHostSeparator3 (1861 of 2355) PASS: lldb-api :: functionalities/memory/read/TestMemoryRead.py (1862 of 2355) PASS: lldb-api :: functionalities/thread/concurrent_events/TestConcurrentBreakpointDelayBreakpointOneSignal.py (1863 of 2355) UNSUPPORTED: lldb-api :: tools/lldb-server/memory-tagging/TestGdbRemoteMemoryTagging.py (1864 of 2355) PASS: lldb-unit :: Utility/./UtilityTests/StringExtractorTest.GetHexBytesAvail_OddPair (1865 of 2355) PASS: lldb-unit :: Utility/./UtilityTests/ArgsTest.TestQuotedTrailingBackslash (1866 of 2355) PASS: lldb-shell :: ObjectFile/ELF/basic-info.yaml (1867 of 2355) PASS: lldb-api :: functionalities/postmortem/elf-core/TestLinuxCore.py (1868 of 2355) PASS: lldb-api :: functionalities/data-formatter/data-formatter-objc/TestDataFormatterObjCNSError.py (1869 of 2355) PASS: lldb-unit :: UnwindAssembly/x86/./UnwindAssemblyx86Tests/Testx86AssemblyInspectionEngine.TestSimple32bitFrameFunction (1870 of 2355) UNSUPPORTED: lldb-api :: functionalities/tsan/basic/TestTsanBasic.py (1871 of 2355) PASS: lldb-shell :: ObjectFile/ELF/null-jmprel.yaml (1872 of 2355) UNSUPPORTED: lldb-api :: functionalities/data-formatter/data-formatter-stl/libstdcpp/tuple/TestDataFormatterStdTuple.py (1873 of 2355) PASS: lldb-api :: functionalities/thread/backtrace_all/TestBacktraceAll.py (1874 of 2355) PASS: lldb-api :: lang/cpp/bool/TestCPPBool.py (1875 of 2355) UNSUPPORTED: lldb-api :: functionalities/data-formatter/data-formatter-stl/libstdcpp/iterator/TestDataFormatterStdIterator.py (1876 of 2355) PASS: lldb-api :: lang/objc/foundation/TestObjCMethodsNSArray.py (1877 of 2355) PASS: lldb-shell :: SymbolFile/Breakpad/line-table-edgecases.test (1878 of 2355) PASS: lldb-unit :: Utility/./UtilityTests/ArgsTest.Yaml (1879 of 2355) PASS: lldb-api :: lang/objc/variadic_methods/TestVariadicMethods.py (1880 of 2355) PASS: lldb-api :: functionalities/breakpoint/breakpoint_locations/TestBreakpointLocations.py (1881 of 2355) PASS: lldb-api :: commands/expression/dollar-in-variable/TestDollarInVariable.py (1882 of 2355) PASS: lldb-unit :: UnwindAssembly/x86/./UnwindAssemblyx86Tests/Testx86AssemblyInspectionEngine.TestStackRealign8BitDisp_i386 (1883 of 2355) PASS: lldb-api :: functionalities/breakpoint/cpp_exception/TestCPPExceptionBreakpoint.py (1884 of 2355) PASS: lldb-api :: lang/cpp/function_refs/TestFunctionRefs.py (1885 of 2355) PASS: lldb-unit :: DataFormatter/./LLDBFormatterTests/TypeMatcherTests.RegexMatchPart (1886 of 2355) PASS: lldb-unit :: Utility/./UtilityTests/StringExtractorTest.GetHexU8_Exact (1887 of 2355) PASS: lldb-unit :: UnwindAssembly/x86/./UnwindAssemblyx86Tests/Testx86AssemblyInspectionEngine.TestDisassemblyMidFunctionEpilogues (1888 of 2355) PASS: lldb-unit :: UnwindAssembly/x86/./UnwindAssemblyx86Tests/Testx86AssemblyInspectionEngine.TestPopR12 (1889 of 2355) PASS: lldb-api :: lang/objc/orderedset/TestOrderedSet.py (1890 of 2355) PASS: lldb-unit :: Process/gdb-remote/./ProcessGdbRemoteTests/GDBRemoteClientBaseTest.SendContinueAndLateInterrupt (1891 of 2355) PASS: lldb-api :: functionalities/data-formatter/data-formatter-objc/TestDataFormatterObjCNSURL.py (1892 of 2355) PASS: lldb-api :: lang/objc/objc-optimized/TestObjcOptimized.py (1893 of 2355) PASS: lldb-unit :: Process/Utility/./ProcessUtilityTests/ProcSMapTests/LinuxProcSMapsTestFixture.ParseSMapRegions/9 (1894 of 2355) PASS: lldb-shell :: Settings/TestEchoCommands.test (1895 of 2355) PASS: lldb-api :: functionalities/data-formatter/data-formatter-stl/libstdcpp/unique_ptr/invalid/TestDataFormatterInvalidStdUniquePtr.py (1896 of 2355) PASS: lldb-api :: lang/objc/radar-9691614/TestObjCMethodReturningBOOL.py (1897 of 2355) PASS: lldb-shell :: ObjectFile/PECOFF/basic-info-arm.yaml (1898 of 2355) PASS: lldb-unit :: Utility/./UtilityTests/SubsystemRAIITest.SubsystemWithErrorFailure (1899 of 2355) PASS: lldb-unit :: Language/Highlighting/./HighlighterTests/HighlighterTest.DefaultHighlighter (1900 of 2355) PASS: lldb-shell :: ObjectFile/ELF/PT_TLS-overlap-PT_LOAD.yaml (1901 of 2355) PASS: lldb-shell :: Register/Core/x86-64-netbsd-addr.test (1902 of 2355) PASS: lldb-api :: lang/cpp/symbols/TestSymbols.py (1903 of 2355) PASS: lldb-api :: functionalities/data-formatter/refpointer-recursion/TestDataFormatterRefPtrRecursion.py (1904 of 2355) PASS: lldb-unit :: Utility/./UtilityTests/StringExtractorTest.DecodeHexU8_Underflow2 (1905 of 2355) PASS: lldb-unit :: Expression/./ExpressionTests/CppModuleConfigurationTest.AmbiguousLibCpp (1906 of 2355) PASS: lldb-unit :: Utility/./UtilityTests/SharedCluster.ClusterManager (1907 of 2355) UNSUPPORTED: lldb-api :: functionalities/thread/multi_break/TestMultipleBreakpoints.py (1908 of 2355) PASS: lldb-unit :: debugserver/./debugserverTests/RNBSocket.LoopBackListenIPv4 (1909 of 2355) PASS: lldb-api :: functionalities/data-formatter/typedef_array/TestTypedefArray.py (1910 of 2355) PASS: lldb-unit :: Utility/./UtilityTests/LogChannelTest.Enable (1911 of 2355) PASS: lldb-api :: commands/expression/error-limit/TestExprErrorLimit.py (1912 of 2355) PASS: lldb-api :: commands/process/attach/attach_denied/TestAttachDenied.py (1913 of 2355) PASS: lldb-unit :: Utility/./UtilityTests/OptionsWithRawTest.TerminatedQuote (1914 of 2355) UNSUPPORTED: lldb-shell :: SymbolFile/PDB/variables-locations.test (1915 of 2355) PASS: lldb-api :: lang/cpp/rvalue-references/TestRvalueReferences.py (1916 of 2355) PASS: lldb-api :: python_api/thread/TestThreadAPI.py (1917 of 2355) PASS: lldb-api :: commands/expression/diagnostics/TestExprDiagnostics.py (1918 of 2355) PASS: lldb-unit :: UnwindAssembly/x86/./UnwindAssemblyx86Tests/Testx86AssemblyInspectionEngine.Test64bitFramelessBigStackFrame (1919 of 2355) PASS: lldb-unit :: Symbol/./SymbolTests/TestClangASTImporter.DeportDeclTagDecl (1920 of 2355) UNSUPPORTED: lldb-shell :: SymbolFile/DWARF/x86/DW_TAG_variable-DW_AT_decl_file-DW_AT_abstract_origin-crosscu1.s (1921 of 2355) PASS: lldb-unit :: Symbol/./SymbolTests/TestTypeSystemClang.AddMethodToObjCObjectType (1922 of 2355) PASS: lldb-unit :: ScriptInterpreter/Python/./ScriptInterpreterPythonTests/PythonDataObjectsTest.TestPythonIntegerToStr (1923 of 2355) PASS: lldb-shell :: SymbolFile/Breakpad/unwind-via-raSearch.test (1924 of 2355) PASS: lldb-unit :: Utility/./UtilityTests/StreamTest.AddressPrefixAndSuffix (1925 of 2355) PASS: lldb-shell :: ObjectFile/MachO/symtab.yaml (1926 of 2355) PASS: lldb-unit :: Utility/./UtilityTests/UUIDTest.StringConverion (1927 of 2355) PASS: lldb-api :: commands/expression/persistent_ptr_update/TestPersistentPtrUpdate.py (1928 of 2355) PASS: lldb-unit :: Language/Highlighting/./HighlighterTests/HighlighterTest.DefaultHighlighterWithCursor (1929 of 2355) PASS: lldb-api :: tools/lldb-server/TestGdbRemoteAttach.py (1930 of 2355) PASS: lldb-api :: commands/expression/import-std-module/missing-module-sources/TestStdModuleSourcesMissing.py (1931 of 2355) PASS: lldb-unit :: Utility/./UtilityTests/LogChannelEnabledTest.LLDB_LOG_ERROR (1932 of 2355) PASS: lldb-api :: functionalities/return-value/TestReturnValue.py (1933 of 2355) PASS: lldb-unit :: Core/./LLDBCoreTests/ModuleSpecTest.InvalidInMemoryBufferValidFile (1934 of 2355) PASS: lldb-unit :: Utility/./UtilityTests/ScalarTest.CastOperations (1935 of 2355) PASS: lldb-api :: commands/expression/call-function/TestCallStopAndContinue.py (1936 of 2355) PASS: lldb-unit :: Utility/./UtilityTests/StringListTest.RemoveBlankLines (1937 of 2355) PASS: lldb-api :: lang/cpp/overloaded-functions/TestOverloadedFunctions.py (1938 of 2355) PASS: lldb-api :: functionalities/jitloader_gdb/TestJITLoaderGDB.py (1939 of 2355) PASS: lldb-shell :: Commands/command-backtrace-parser-2.test (1940 of 2355) PASS: lldb-unit :: Host/./HostTests/HostInfoTest.GetXcodeSDK (1941 of 2355) PASS: lldb-api :: commands/command/delete/TestCommandDelete.py (1942 of 2355) PASS: lldb-unit :: Utility/./UtilityTests/StringListTest.AppendListCStringArray (1943 of 2355) PASS: lldb-unit :: Process/gdb-remote/./ProcessGdbRemoteTests/PortMapTest.FreePort (1944 of 2355) PASS: lldb-api :: lang/objc/forward-decl/TestForwardDecl.py (1945 of 2355) UNSUPPORTED: lldb-shell :: SymbolFile/PDB/udt-layout.test (1946 of 2355) PASS: lldb-unit :: Process/minidump/./LLDBMinidumpTests/MinidumpParserTest.FindMemoryRangeWithFullMemoryMinidump (1947 of 2355) PASS: lldb-shell :: Settings/TestStopCommandSourceOnError.test (1948 of 2355) PASS: lldb-api :: functionalities/data-formatter/data-formatter-proper-plurals/TestFormattersOneIsSingular.py (1949 of 2355) PASS: lldb-unit :: Process/Utility/./ProcessUtilityTests/ProcMapTests/LinuxProcMapsTestFixture.ParseMapRegions/3 (1950 of 2355) PASS: lldb-unit :: Signals/./SignalsTests/UnixSignalsTest.GetInfo (1951 of 2355) PASS: lldb-shell :: SymbolFile/DWARF/x86/static_scope.s (1952 of 2355) PASS: lldb-unit :: Host/./HostTests/SocketTests/SocketTest.UDPConnect/ipv6 (1953 of 2355) PASS: lldb-unit :: Utility/./UtilityTests/ArgsTest.DoubleQuotedItem (1954 of 2355) UNSUPPORTED: lldb-shell :: Register/aarch64-fp-read.test (1955 of 2355) PASS: lldb-unit :: Utility/./UtilityTests/RangeTest.LessThanInvalid (1956 of 2355) PASS: lldb-unit :: Utility/./UtilityTests/RangeDataVector.FindEntryIndexesThatContain_Overlap (1957 of 2355) PASS: lldb-shell :: SymbolFile/DWARF/x86/dwp-debug-types.s (1958 of 2355) PASS: lldb-api :: functionalities/data-formatter/data-formatter-stl/libcxx/atomic/TestLibCxxAtomic.py (1959 of 2355) PASS: lldb-unit :: Process/Utility/./ProcessUtilityTests/ProcMapTests/LinuxProcMapsTestFixture.ParseMapRegions/5 (1960 of 2355) PASS: lldb-shell :: SymbolFile/DWARF/x86/dwarf5-implicit-const.s (1961 of 2355) PASS: lldb-api :: lang/objc/objc-runtime-ivars/TestRuntimeIvars.py (1962 of 2355) PASS: lldb-api :: lang/c/complex/TestComplexC99.py (1963 of 2355) PASS: lldb-api :: lang/cpp/class_types/TestClassTypes.py (1964 of 2355) PASS: lldb-api :: commands/expression/import-std-module/array/TestArrayFromStdModule.py (1965 of 2355) PASS: lldb-unit :: Core/./LLDBCoreTests/FormatEntityTest.DefinitionConstructionNameTypeChildren (1966 of 2355) PASS: lldb-api :: lang/cpp/breakpoint-commands/TestCPPBreakpointCommands.py (1967 of 2355) PASS: lldb-unit :: Utility/./UtilityTests/BinaryStreamTest.PutULEB128SixBytes (1968 of 2355) PASS: lldb-unit :: ScriptInterpreter/Python/./ScriptInterpreterPythonTests/PythonDataObjectsTest.TestPythonListValueEquality (1969 of 2355) PASS: lldb-unit :: Process/minidump/./LLDBMinidumpTests/MinidumpParserTest.GetPid (1970 of 2355) PASS: lldb-unit :: Process/minidump/./LLDBMinidumpTests/MinidumpParserTest.GetLinuxProcStatus_no_stream (1971 of 2355) PASS: lldb-unit :: Utility/./UtilityTests/UUIDTest.RelationalOperators (1972 of 2355) PASS: lldb-unit :: Host/./HostTests/SocketTests/SocketTest.DomainGetConnectURI/ipv4 (1973 of 2355) PASS: lldb-api :: lang/cpp/dynamic-value/TestCppValueCast.py (1974 of 2355) PASS: lldb-api :: lang/c/inlines/TestRedefinitionsInInlines.py (1975 of 2355) PASS: lldb-api :: lang/cpp/const_this/TestConstThis.py (1976 of 2355) PASS: lldb-unit :: ScriptInterpreter/Python/./ScriptInterpreterPythonTests/PythonDataObjectsTest.TestExceptions (1977 of 2355) PASS: lldb-unit :: Utility/./UtilityTests/UriParserTest.TypicalPortPathIPv4 (1978 of 2355) UNSUPPORTED: lldb-shell :: Register/x86-gp-write.test (1979 of 2355) PASS: lldb-unit :: Utility/./UtilityTests/StringExtractorTest.GetHexBytes_OddPair (1980 of 2355) UNSUPPORTED: lldb-shell :: ScriptInterpreter/Lua/fail_breakpoint_oneline.test (1981 of 2355) PASS: lldb-unit :: Utility/./UtilityTests/PassiveReplayTest.InstrumentedBarPtr (1982 of 2355) PASS: lldb-unit :: Symbol/./SymbolTests/TestCreateClassTemplateDecl.FindExistingTemplates (1983 of 2355) PASS: lldb-shell :: SymbolFile/DWARF/x86/dir-separator-no-comp-dir.s (1984 of 2355) PASS: lldb-shell :: ObjectFile/ELF/aarch64-relocations.yaml (1985 of 2355) PASS: lldb-api :: functionalities/tail_call_frames/disambiguate_paths_to_common_sink/TestDisambiguatePathsToCommonSink.py (1986 of 2355) PASS: lldb-shell :: ObjectFile/wasm/embedded-debug-sections.yaml (1987 of 2355) PASS: lldb-unit :: Utility/./UtilityTests/UserIDResolver.GetGroupName (1988 of 2355) PASS: lldb-unit :: Utility/./UtilityTests/StatusTest.ErrorConstructor (1989 of 2355) PASS: lldb-unit :: Utility/./UtilityTests/Flags.AllClear (1990 of 2355) PASS: lldb-api :: lang/cpp/this/TestCPPThis.py (1991 of 2355) PASS: lldb-unit :: API/./APITests/SBCommandInterpreterTest.MultiWordCommand (1992 of 2355) PASS: lldb-unit :: UnwindAssembly/x86/./UnwindAssemblyx86Tests/Testx86AssemblyInspectionEngine.TestPushESI (1993 of 2355) PASS: lldb-api :: test_utils/TestPExpectTest.py (1994 of 2355) PASS: lldb-unit :: Host/./HostTests/SocketTests/SocketTest.TCPListen0ConnectAccept/ipv6 (1995 of 2355) PASS: lldb-shell :: SymbolFile/DWARF/x86/DW_AT_loclists_base.s (1996 of 2355) UNSUPPORTED: lldb-api :: tools/lldb-server/registers-target-xml-reading/TestGdbRemoteTargetXmlPacket.py (1997 of 2355) PASS: lldb-shell :: SymbolFile/Breakpad/line-table-missing-file.test (1998 of 2355) PASS: lldb-shell :: SymbolFile/DWARF/x86/debug-names-compressed.cpp (1999 of 2355) PASS: lldb-api :: functionalities/gdb_remote_client/TestRestartBug.py (2000 of 2355) PASS: lldb-unit :: Utility/./UtilityTests/NameMatchesTest.Contains (2001 of 2355) PASS: lldb-api :: lang/c/cpp_keyword_identifiers/TestCppKeywordsAsCIdentifiers.py (2002 of 2355) PASS: lldb-shell :: Breakpoint/debug_addrx.test (2003 of 2355) PASS: lldb-unit :: Language/Highlighting/./HighlighterTests/HighlighterTest.HighlighterSelectionPath (2004 of 2355) PASS: lldb-api :: functionalities/data-formatter/data-formatter-stl/libcxx/list/loop/TestDataFormatterLibcxxListLoop.py (2005 of 2355) PASS: lldb-api :: lang/cpp/global_operators/TestCppGlobalOperators.py (2006 of 2355) PASS: lldb-unit :: Process/gdb-remote/./ProcessGdbRemoteTests/GDBRemoteCommunicationClientTest.GetModulesInfo_UUID20 (2007 of 2355) PASS: lldb-unit :: Interpreter/./InterpreterTests/OptionArgParserTest.toScriptLanguage (2008 of 2355) PASS: lldb-unit :: Utility/./UtilityTests/AnsiTerminal.AtEnd (2009 of 2355) UNSUPPORTED: lldb-api :: iohandler/resize/TestIOHandlerResize.py (2010 of 2355) PASS: lldb-unit :: Symbol/./SymbolTests/TestTypeSystemClang.TestGetEnumIntegerTypeBasicTypes (2011 of 2355) PASS: lldb-api :: functionalities/set-data/TestSetData.py (2012 of 2355) UNSUPPORTED: lldb-api :: functionalities/asan/TestMemoryHistory.py (2013 of 2355) PASS: lldb-api :: functionalities/pre_run_dylibs/TestPreRunDylibs.py (2014 of 2355) PASS: lldb-unit :: Utility/./UtilityTests/StreamTest.PutBytesAsRawHex8ToBigEndian (2015 of 2355) PASS: lldb-shell :: SymbolFile/Breakpad/stack-cfi-parsing.test (2016 of 2355) PASS: lldb-api :: functionalities/breakpoint/address_breakpoints/TestBadAddressBreakpoints.py (2017 of 2355) PASS: lldb-unit :: Language/Highlighting/./HighlighterTests/HighlighterTest.HighlighterSelectionType (2018 of 2355) PASS: lldb-api :: functionalities/value_md5_crash/TestValueMD5Crash.py (2019 of 2355) PASS: lldb-api :: python_api/formatters/TestFormattersSBAPI.py (2020 of 2355) PASS: lldb-api :: lang/objcxx/hide-runtime-values/TestObjCXXHideRuntimeValues.py (2021 of 2355) PASS: lldb-api :: functionalities/thread/concurrent_events/TestConcurrentBreakpointsDelayedBreakpointOneWatchpoint.py (2022 of 2355) UNSUPPORTED: lldb-shell :: SymbolFile/DWARF/debug-types-expressions.test (2023 of 2355) PASS: lldb-unit :: Utility/./UtilityTests/StreamTest.PutHex64ByteOrderLittle (2024 of 2355) PASS: lldb-shell :: ScriptInterpreter/Python/scripted_breakpoint.test (2025 of 2355) PASS: lldb-shell :: ObjectFile/Breakpad/sections.test (2026 of 2355) PASS: lldb-api :: functionalities/data-formatter/frameformat_smallstruct/TestFrameFormatSmallStruct.py (2027 of 2355) PASS: lldb-api :: lang/cpp/stl/TestSTL.py (2028 of 2355) PASS: lldb-api :: functionalities/data-formatter/compactvectors/TestCompactVectors.py (2029 of 2355) PASS: lldb-api :: macosx/debugserver-exit-code/TestDebugServerExitCode.py (2030 of 2355) PASS: lldb-api :: functionalities/thread/concurrent_events/TestConcurrentCrashWithSignal.py (2031 of 2355) PASS: lldb-api :: lang/mixed/TestMixedLanguages.py (2032 of 2355) PASS: lldb-unit :: Utility/./UtilityTests/RangeDataVector.CustomSort (2033 of 2355) PASS: lldb-api :: tools/lldb-vscode/coreFile/TestVSCode_coreFile.py (2034 of 2355) PASS: lldb-api :: functionalities/data-formatter/data-formatter-named-summaries/TestDataFormatterNamedSummaries.py (2035 of 2355) PASS: lldb-shell :: Minidump/disassemble-no-module.yaml (2036 of 2355) UNSUPPORTED: lldb-api :: commands/watchpoints/multi_watchpoint_slots/TestWatchpointMultipleSlots.py (2037 of 2355) PASS: lldb-unit :: Utility/./UtilityTests/StringExtractorTest.GetHexU8_Underflow2 (2038 of 2355) PASS: lldb-api :: macosx/thread_suspend/TestInternalThreadSuspension.py (2039 of 2355) UNSUPPORTED: lldb-shell :: Unwind/basic-block-sections.test (2040 of 2355) PASS: lldb-api :: functionalities/thread/ignore_suspended/TestIgnoreSuspendedThread.py (2041 of 2355) PASS: lldb-unit :: Process/gdb-remote/./ProcessGdbRemoteTests/GDBRemoteClientBaseTest.SendContinueAndAsyncPacket (2042 of 2355) PASS: lldb-unit :: Utility/./UtilityTests/StringExtractorTest.GetHexU8_Extra_NoEof (2043 of 2355) PASS: lldb-unit :: Utility/./UtilityTests/RangeTest.Copy (2044 of 2355) PASS: lldb-unit :: Utility/./UtilityTests/FileSpecTest.RemoveLastPathComponent (2045 of 2355) UNSUPPORTED: lldb-api :: linux/thread/create_during_instruction_step/TestCreateDuringInstructionStep.py (2046 of 2355) PASS: lldb-unit :: Utility/./UtilityTests/ArgsTest.TestMultipleArgs (2047 of 2355) PASS: lldb-unit :: Utility/./UtilityTests/StreamTest.AddressRange (2048 of 2355) PASS: lldb-unit :: UnwindAssembly/x86/./UnwindAssemblyx86Tests/Testx86AssemblyInspectionEngine.TestPopRBX (2049 of 2355) UNSUPPORTED: lldb-api :: functionalities/tsan/thread_leak/TestTsanThreadLeak.py (2050 of 2355) PASS: lldb-unit :: Utility/./UtilityTests/LogTest.Unregister (2051 of 2355) PASS: lldb-api :: functionalities/breakpoint/dummy_target_breakpoints/TestBreakpointsWithNoTargets.py (2052 of 2355) PASS: lldb-unit :: Core/./LLDBCoreTests/ModuleSpecTest.TestCOFFFile (2053 of 2355) PASS: lldb-api :: commands/expression/completion-crash-incomplete-record/TestCompletionCrashIncompleteRecord.py (2054 of 2355) PASS: lldb-shell :: Driver/TestNoUseColor.test (2055 of 2355) UNSUPPORTED: lldb-shell :: Register/arm-gp-read.test (2056 of 2355) PASS: lldb-unit :: Symbol/./SymbolTests/TestTypeSystemClang.TestDeletingImplicitCopyCstrDueToMoveCStr (2057 of 2355) PASS: lldb-api :: tools/lldb-vscode/console/TestVSCode_redirection_to_console.py (2058 of 2355) PASS: lldb-api :: lang/objc/modules-hash-mismatch/TestClangModulesHashMismatch.py (2059 of 2355) PASS: lldb-unit :: Utility/./UtilityTests/StringExtractorTest.DecodeHexU8_InvalidHex (2060 of 2355) PASS: lldb-unit :: Process/Utility/./ProcessUtilityTests/MemoryTagManagerAArch64MTETest.AddressDiff (2061 of 2355) PASS: lldb-api :: commands/frame/diagnose/array/TestArray.py (2062 of 2355) PASS: lldb-shell :: ScriptInterpreter/Python/fail_breakpoint_oneline.test (2063 of 2355) PASS: lldb-api :: commands/disassemble/basic/TestDisassembleBreakpoint.py (2064 of 2355) PASS: lldb-api :: lang/cpp/typeof/TestTypeOfDeclTypeExpr.py (2065 of 2355) PASS: lldb-api :: lang/objc/objc-stepping/TestObjCStepping.py (2066 of 2355) PASS: lldb-unit :: Utility/./UtilityTests/RangeTest.ContainsEndInclusiveInvalid (2067 of 2355) PASS: lldb-api :: functionalities/postmortem/wow64_minidump/TestWow64MiniDump.py (2068 of 2355) PASS: lldb-api :: lang/cpp/multiple-inheritance/TestCppMultipleInheritance.py (2069 of 2355) PASS: lldb-unit :: Utility/./UtilityTests/StringListTest.Clear (2070 of 2355) PASS: lldb-api :: functionalities/data-formatter/data-formatter-stl/libcxx/map/TestDataFormatterLibccMap.py (2071 of 2355) PASS: lldb-api :: lang/objc/foundation/TestRuntimeTypes.py (2072 of 2355) PASS: lldb-api :: lang/c/step_over_no_deadlock/TestStepOverDoesntBlock.py (2073 of 2355) UNSUPPORTED: lldb-api :: commands/gui/basic/TestGuiBasic.py (2074 of 2355) PASS: lldb-unit :: UnwindAssembly/x86/./UnwindAssemblyx86Tests/Testx86AssemblyInspectionEngine.TestStackRealign32BitDisp_x86_64 (2075 of 2355) PASS: lldb-api :: commands/expression/import-std-module/shared_ptr/TestSharedPtrFromStdModule.py (2076 of 2355) PASS: lldb-unit :: Utility/./UtilityTests/StringExtractorTest.GetU64LittleEndian (2077 of 2355) PASS: lldb-api :: lang/objc/modules-auto-import/TestModulesAutoImport.py (2078 of 2355) PASS: lldb-api :: commands/expression/call-function/TestCallStdStringFunction.py (2079 of 2355) UNSUPPORTED: lldb-api :: commands/gui/viewlarge/TestGuiViewLarge.py (2080 of 2355) PASS: lldb-unit :: SymbolFile/DWARF/./SymbolFileDWARFTests/DWARFASTParserClangTests.EnsureAllDIEsInDeclContextHaveBeenParsedParsesOnlyMatchingEntries (2081 of 2355) PASS: lldb-unit :: Utility/./UtilityTests/ArgsTest.TestSingleQuotedArgWithSpace (2082 of 2355) PASS: lldb-api :: functionalities/data-formatter/data-formatter-objc/TestDataFormatterObjCNSBundle.py (2083 of 2355) PASS: lldb-api :: functionalities/memory/cache/TestMemoryCache.py (2084 of 2355) PASS: lldb-api :: lang/c/shared_lib_stripped_symbols/TestSharedLibStrippedSymbols.py (2085 of 2355) PASS: lldb-api :: functionalities/breakpoint/hardware_breakpoints/require_hw_breakpoints/TestRequireHWBreakpoints.py (2086 of 2355) PASS: lldb-unit :: Utility/./UtilityTests/CompletionRequest.DuplicateFiltering (2087 of 2355) UNSUPPORTED: lldb-api :: functionalities/thread/create_during_step/TestCreateDuringStep.py (2088 of 2355) PASS: lldb-unit :: Process/gdb-remote/./ProcessGdbRemoteTests/GDBRemoteCommunicationClientTest.ReadRegister (2089 of 2355) PASS: lldb-shell :: ObjectFile/ELF/riscv-arch.yaml (2090 of 2355) PASS: lldb-unit :: Utility/./UtilityTests/ArchSpecTest.TestSetTriple (2091 of 2355) PASS: lldb-api :: functionalities/thread/exit_during_break/TestExitDuringBreak.py (2092 of 2355) PASS: lldb-api :: commands/expression/import-std-module/empty-module/TestEmptyStdModule.py (2093 of 2355) UNSUPPORTED: lldb-api :: functionalities/breakpoint/breakpoint_in_delayslot/TestAvoidBreakpointInDelaySlot.py (2094 of 2355) PASS: lldb-api :: functionalities/data-formatter/cstring-utf8-summary/TestCstringUnicode.py (2095 of 2355) PASS: lldb-api :: functionalities/inferior-crashing/recursive-inferior/TestRecursiveInferior.py (2096 of 2355) XFAIL: lldb-shell :: SymbolFile/DWARF/find-type-in-function.cpp (2097 of 2355) PASS: lldb-unit :: Expression/./ExpressionTests/DWARFExpression.DW_OP_implicit_value (2098 of 2355) PASS: lldb-api :: functionalities/unwind/zeroth_frame/TestZerothFrame.py (2099 of 2355) PASS: lldb-api :: python_api/frame/inlines/TestInlinedFrame.py (2100 of 2355) PASS: lldb-shell :: Minidump/memory-region.yaml (2101 of 2355) PASS: lldb-unit :: DataFormatter/./LLDBFormatterTests/TypeMatcherTests.CreatedBySameMatchString (2102 of 2355) PASS: lldb-unit :: Utility/./UtilityTests/ProcessInstanceInfoList.Yaml (2103 of 2355) PASS: lldb-api :: functionalities/breakpoint/cpp/TestCPPBreakpointLocations.py (2104 of 2355) PASS: lldb-api :: tools/lldb-vscode/breakpoint/TestVSCode_setExceptionBreakpoints.py (2105 of 2355) PASS: lldb-api :: functionalities/thread/concurrent_events/TestConcurrentTwoBreakpointThreads.py (2106 of 2355) PASS: lldb-shell :: Register/Core/x86-32-freebsd-addr.test (2107 of 2355) PASS: lldb-api :: python_api/value/change_values/TestChangeValueAPI.py (2108 of 2355) UNSUPPORTED: lldb-shell :: Register/x86-64-zmm-read.test (2109 of 2355) UNSUPPORTED: lldb-api :: functionalities/data-formatter/data-formatter-stl/libstdcpp/vbool/TestDataFormatterStdVBool.py (2110 of 2355) PASS: lldb-shell :: SymbolFile/NativePDB/globals-fundamental.cpp (2111 of 2355) PASS: lldb-unit :: Process/Utility/./ProcessUtilityTests/ProcSMapTests/LinuxProcSMapsTestFixture.ParseSMapRegions/5 (2112 of 2355) PASS: lldb-unit :: Process/gdb-remote/./ProcessGdbRemoteTests/GDBRemoteCommunicationClientTest.SendTraceSupportedPacket (2113 of 2355) PASS: lldb-shell :: ObjectFile/ELF/PT_LOAD-overlap-PT_INTERP.yaml (2114 of 2355) PASS: lldb-api :: lang/c/set_values/TestSetValues.py (2115 of 2355) UNSUPPORTED: lldb-api :: lang/objc/ptr_refs/TestPtrRefsObjC.py (2116 of 2355) PASS: lldb-api :: functionalities/thread/concurrent_events/TestConcurrentManyWatchpoints.py (2117 of 2355) PASS: lldb-api :: lang/cpp/non-type-template-param/TestCppNonTypeTemplateParam.py (2118 of 2355) PASS: lldb-api :: lang/cpp/incomplete-types/TestCppIncompleteTypes.py (2119 of 2355) PASS: lldb-unit :: Host/./HostTests/FileSystemTest.EnumerateDirectory (2120 of 2355) PASS: lldb-unit :: Utility/./UtilityTests/StringExtractorGDBRemoteTest.GetPidTidMultipleValues (2121 of 2355) PASS: lldb-unit :: Expression/./ExpressionTests/DWARFExpression.DW_OP_piece (2122 of 2355) PASS: lldb-shell :: Process/UnsupportedLanguage.test (2123 of 2355) PASS: lldb-unit :: Utility/./UtilityTests/ReproducerTest.SetCapture (2124 of 2355) PASS: lldb-shell :: SymbolFile/NativePDB/break-by-function.cpp (2125 of 2355) PASS: lldb-api :: tools/lldb-server/TestGdbRemoteAttachWait.py (2126 of 2355) PASS: lldb-unit :: Utility/./UtilityTests/DataExtractorTest.GetULEB128_bit63 (2127 of 2355) PASS: lldb-unit :: Utility/./UtilityTests/SubsystemRAIITest.SubsystemWithErrorSuccess (2128 of 2355) PASS: lldb-api :: macosx/safe-to-func-call/TestSafeFuncCalls.py (2129 of 2355) PASS: lldb-unit :: Target/./TargetTests/StackFrameRecognizerTest.NullModuleRegex (2130 of 2355) UNSUPPORTED: lldb-shell :: SymbolFile/NativePDB/ast-functions-msvc.cpp (2131 of 2355) PASS: lldb-api :: types/TestIntegerTypeExpr.py (2132 of 2355) PASS: lldb-unit :: Utility/./UtilityTests/ScalarTest.SetValueFromData (2133 of 2355) PASS: lldb-api :: lang/cpp/nested-class-other-compilation-unit/TestNestedClassWithParentInAnotherCU.py (2134 of 2355) PASS: lldb-unit :: ObjectFile/PECOFF/./ObjectFilePECOFFTests/PECallFrameInfoTest.Basic_eh (2135 of 2355) PASS: lldb-api :: lang/objc/real-definition/TestRealDefinition.py (2136 of 2355) PASS: lldb-unit :: Process/minidump/./LLDBMinidumpTests/MinidumpParserTest.GetMemory (2137 of 2355) PASS: lldb-unit :: API/./APITests/SBCommandInterpreterTest.SingleWordCommand (2138 of 2355) PASS: lldb-api :: types/TestFloatTypes.py (2139 of 2355) PASS: lldb-shell :: ObjectFile/ELF/section-types.yaml (2140 of 2355) PASS: lldb-api :: api/multithreaded/TestMultithreaded.py (2141 of 2355) PASS: lldb-unit :: Utility/./UtilityTests/ArgsTest.ReplaceArgumentAtIndexLonger (2142 of 2355) PASS: lldb-unit :: Expression/./ExpressionTests/ClangHostTest.MacOSX (2143 of 2355) PASS: lldb-shell :: ObjectFile/PECOFF/uuid.yaml (2144 of 2355) PASS: lldb-unit :: Utility/./UtilityTests/OptionsWithRawTest.SingleWordSuffix (2145 of 2355) PASS: lldb-shell :: Reproducer/Functionalities/TestStepping.test (2146 of 2355) UNSUPPORTED: lldb-api :: python_api/event/TestEvents.py (2147 of 2355) UNSUPPORTED: lldb-shell :: SymbolFile/DWARF/split-dwarf-expression-eval-bug.cpp (2148 of 2355) PASS: lldb-shell :: SymbolFile/DWARF/x86/find-basic-variable.cpp (2149 of 2355) PASS: lldb-unit :: Utility/./UtilityTests/ArgsTest.EscapeLLDBCommandArgument (2150 of 2355) PASS: lldb-api :: lang/objc/foundation/TestConstStrings.py (2151 of 2355) PASS: lldb-shell :: ScriptInterpreter/Python/Crashlog/parser_text.test (2152 of 2355) PASS: lldb-unit :: Utility/./UtilityTests/RangeTest.DefaultConstructor (2153 of 2355) UNSUPPORTED: lldb-shell :: Breakpoint/case-insensitive.test (2154 of 2355) PASS: lldb-unit :: UnwindAssembly/x86/./UnwindAssemblyx86Tests/Testx86AssemblyInspectionEngine.TestPopEDI (2155 of 2355) PASS: lldb-unit :: Host/./HostTests/FileSystemTest.OpenErrno (2156 of 2355) PASS: lldb-api :: functionalities/multiword-commands/TestMultiWordCommands.py (2157 of 2355) PASS: lldb-api :: commands/expression/import-std-module/weak_ptr-dbg-info-content/TestDbgInfoContentWeakPtrFromStdModule.py (2158 of 2355) PASS: lldb-unit :: Platform/./LLDBPlatformTests/PlatformDarwinTest.FindComponentInPath (2159 of 2355) PASS: lldb-shell :: SymbolFile/DWARF/clang-ast-from-dwarf-unamed-and-anon-structs.cpp (2160 of 2355) PASS: lldb-unit :: Utility/./UtilityTests/Flags.Test (2161 of 2355) PASS: lldb-api :: functionalities/thread/concurrent_events/TestConcurrentTwoBreakpointsOneSignal.py (2162 of 2355) PASS: lldb-unit :: Host/./HostTests/FileSystemTest.FileAndDirectoryComponents (2163 of 2355) PASS: lldb-unit :: SymbolFile/DWARF/./SymbolFileDWARFTests/SymbolFileDWARFTests.TestAbbrevValidAttrNullForm (2164 of 2355) PASS: lldb-unit :: Process/minidump/./LLDBMinidumpTests/RegisterContextMinidump.CheckRegisterContextMinidump_ARM (2165 of 2355) PASS: lldb-shell :: Reproducer/TestVerify.test (2166 of 2355) PASS: lldb-shell :: SymbolFile/DWARF/x86/debug_loc_and_loclists.s (2167 of 2355) PASS: lldb-unit :: Host/./HostTests/FileActionTest.Open (2168 of 2355) PASS: lldb-unit :: Process/Utility/./ProcessUtilityTests/ProcSMapTests/LinuxProcSMapsTestFixture.ParseSMapRegions/1 (2169 of 2355) PASS: lldb-api :: functionalities/data-formatter/data-formatter-smart-array/TestDataFormatterSmartArray.py (2170 of 2355) PASS: lldb-shell :: Commands/command-image-lookup.yaml (2171 of 2355) PASS: lldb-unit :: Core/./LLDBCoreTests/MangledTest.NameIndexes_FindFunctionSymbols (2172 of 2355) PASS: lldb-unit :: Utility/./UtilityTests/StringLexerTest.Next (2173 of 2355) PASS: lldb-unit :: Utility/./UtilityTests/StreamTest.ChangingByteOrder (2174 of 2355) PASS: lldb-unit :: Platform/Android/./AdbClientTests/AdbClientTest.CreateByDeviceId (2175 of 2355) PASS: lldb-shell :: ObjectFile/Breakpad/sections-trailing-func.test (2176 of 2355) PASS: lldb-api :: functionalities/thread/concurrent_events/TestConcurrentWatchpointDelayWatchpointOneBreakpoint.py (2177 of 2355) PASS: lldb-api :: lang/objc/direct-dispatch-step/TestObjCDirectDispatchStepping.py (2178 of 2355) PASS: lldb-unit :: Utility/./UtilityTests/StringListTest.JoinMultiCharSeparator (2179 of 2355) PASS: lldb-unit :: Signals/./SignalsTests/UnixSignalsTest.Iteration (2180 of 2355) PASS: lldb-api :: driver/batch_mode/TestBatchMode.py (2181 of 2355) PASS: lldb-api :: commands/expression/import_base_class_when_class_has_derived_member/TestImportBaseClassWhenClassHasDerivedMember.py (2182 of 2355) PASS: lldb-api :: lang/objc/objc-ivar-offsets/TestObjCIvarOffsets.py (2183 of 2355) PASS: lldb-api :: python_api/debugger/TestDebuggerAPI.py (2184 of 2355) PASS: lldb-unit :: Utility/./UtilityTests/UriParserTest.Empty (2185 of 2355) PASS: lldb-unit :: Utility/./UtilityTests/StringListTest.GetMaxStringLengthEqualSize (2186 of 2355) PASS: lldb-unit :: Process/minidump/./LLDBMinidumpTests/MinidumpParserTest.GetThreadsAndGetThreadContext (2187 of 2355) UNSUPPORTED: lldb-api :: functionalities/gdb_remote_client/TestWasm.py (2188 of 2355) PASS: lldb-shell :: Register/Core/x86-64-freebsd-fp.test (2189 of 2355) UNSUPPORTED: lldb-api :: functionalities/tty/TestTerminal.py (2190 of 2355) PASS: lldb-unit :: Utility/./UtilityTests/FileSpecTest.EqualSeparator (2191 of 2355) PASS: lldb-unit :: Utility/./UtilityTests/FileSpecTest.PrependPathComponent (2192 of 2355) PASS: lldb-shell :: Driver/TestFile.test (2193 of 2355) PASS: lldb-api :: functionalities/thread/concurrent_events/TestConcurrentTwoBreakpointsOneDelaySignal.py (2194 of 2355) PASS: lldb-unit :: Utility/./UtilityTests/StructuredDataTest.StringDump (2195 of 2355) PASS: lldb-shell :: SymbolFile/Breakpad/line-table-mixed-path-styles.test (2196 of 2355) PASS: lldb-api :: lang/objcxx/cpp_keywords_enabled/TestObjCppKeywordsEnabled.py (2197 of 2355) PASS: lldb-unit :: Language/Highlighting/./HighlighterTests/HighlighterTest.ClangEmptyInput (2198 of 2355) PASS: lldb-unit :: Utility/./UtilityTests/StringExtractorTest.DecodeHexU8_Underflow (2199 of 2355) PASS: lldb-unit :: UnwindAssembly/x86/./UnwindAssemblyx86Tests/Testx86AssemblyInspectionEngine.TestPushR14 (2200 of 2355) PASS: lldb-api :: functionalities/memory/tag/TestMemoryTag.py (2201 of 2355) PASS: lldb-api :: python_api/process/TestProcessAPI.py (2202 of 2355) PASS: lldb-shell :: SymbolFile/DWARF/x86/find-basic-namespace.cpp (2203 of 2355) PASS: lldb-api :: commands/register/register/register_command/TestRegisters.py (2204 of 2355) PASS: lldb-api :: functionalities/wrong_commands/TestWrongCommands.py (2205 of 2355) PASS: lldb-unit :: Symbol/./SymbolTests/TestClangASTImporter.CopyTypeTagDecl (2206 of 2355) PASS: lldb-unit :: ScriptInterpreter/Python/./ScriptInterpreterPythonTests/PythonDataObjectsTest.TestPythonTupleSize (2207 of 2355) PASS: lldb-api :: lang/objc/foundation/TestObjCMethods.py (2208 of 2355) UNSUPPORTED: lldb-shell :: SymbolFile/Breakpad/stack-cfi-arm.yaml (2209 of 2355) UNSUPPORTED: lldb-api :: functionalities/darwin_log/filter/exact_match/activity/TestDarwinLogFilterMatchActivity.py (2210 of 2355) PASS: lldb-api :: commands/expression/persistent_types/TestNestedPersistentTypes.py (2211 of 2355) PASS: lldb-unit :: Process/gdb-remote/./ProcessGdbRemoteTests/GDBRemoteClientBaseTest.SendContinueAndWait (2212 of 2355) PASS: lldb-api :: functionalities/tail_call_frames/sbapi_support/TestTailCallFrameSBAPI.py (2213 of 2355) PASS: lldb-unit :: Expression/./ExpressionTests/DiagnosticManagerTest.GetStringBasic (2214 of 2355) PASS: lldb-unit :: Utility/./UtilityTests/TimeoutTest.Format (2215 of 2355) PASS: lldb-unit :: Expression/./ExpressionTests/CppModuleConfigurationTest.Xcode (2216 of 2355) PASS: lldb-api :: commands/process/launch/TestProcessLaunch.py (2217 of 2355) PASS: lldb-unit :: ScriptInterpreter/Python/./ScriptInterpreterPythonTests/PythonDataObjectsTest.TestPythonTupleToStructuredList (2218 of 2355) PASS: lldb-api :: functionalities/data-formatter/data-formatter-enum-format/TestDataFormatterEnumFormat.py (2219 of 2355) PASS: lldb-shell :: Reproducer/TestDiscard.test (2220 of 2355) PASS: lldb-api :: lang/objc/objc-checker/TestObjCCheckers.py (2221 of 2355) PASS: lldb-unit :: Expression/./ExpressionTests/DWARFExpression.DW_OP_unknown (2222 of 2355) PASS: lldb-api :: python_api/module_section/TestModuleAndSection.py (2223 of 2355) UNSUPPORTED: lldb-api :: functionalities/data-formatter/data-formatter-stl/libstdcpp/string/TestDataFormatterStdString.py (2224 of 2355) PASS: lldb-shell :: SymbolFile/DWARF/x86/DW_AT_data_bit_offset-DW_OP_stack_value.s (2225 of 2355) PASS: lldb-api :: commands/watchpoints/watchpoint_commands/command/TestWatchpointCommandPython.py (2226 of 2355) PASS: lldb-unit :: Utility/./UtilityTests/StreamTeeTest.SetStreamAtIndexOverwrite (2227 of 2355) PASS: lldb-shell :: ScriptInterpreter/None/import_module.test (2228 of 2355) PASS: lldb-unit :: Host/./HostTests/MainLoopTest.ReadObject (2229 of 2355) PASS: lldb-unit :: Utility/./UtilityTests/NameMatchesTest.Equals (2230 of 2355) PASS: lldb-unit :: Host/./HostTests/MainLoopTest.Signal (2231 of 2355) PASS: lldb-unit :: Utility/./UtilityTests/StringListTest.InsertStringAtIndexMove (2232 of 2355) PASS: lldb-unit :: UnwindAssembly/x86/./UnwindAssemblyx86Tests/Testx86AssemblyInspectionEngine.TestPushR15 (2233 of 2355) PASS: lldb-unit :: Expression/./ExpressionTests/CppModuleConfigurationTest.Linux (2234 of 2355) PASS: lldb-api :: functionalities/thread/concurrent_events/TestConcurrentTwoWatchpointsOneDelayBreakpoint.py (2235 of 2355) PASS: lldb-unit :: Process/minidump/./LLDBMinidumpTests/MinidumpParserTest.GetArchitectureWindows (2236 of 2355) PASS: lldb-shell :: ObjectFile/ELF/section-types-edgecases.yaml (2237 of 2355) PASS: lldb-unit :: Utility/./UtilityTests/PassiveReplayTest.InstrumentedFoo (2238 of 2355) PASS: lldb-unit :: Utility/./UtilityTests/PassiveReplayTest.InstrumentedBarRef (2239 of 2355) UNSUPPORTED: lldb-shell :: SymbolFile/PDB/pointers.test (2240 of 2355) PASS: lldb-shell :: Commands/command-script-import.test (2241 of 2355) PASS: lldb-unit :: Process/gdb-remote/./ProcessGdbRemoteTests/GDBRemoteCommunicationServerTest.SendErrorResponse_Status (2242 of 2355) PASS: lldb-api :: commands/expression/class_template_specialization_empty_pack/TestClassTemplateSpecializationParametersHandling.py (2243 of 2355) PASS: lldb-unit :: Utility/./UtilityTests/ArgsTest.TestAppendArg (2244 of 2355) PASS: lldb-unit :: Utility/./UtilityTests/StringListTest.SetSize (2245 of 2355) PASS: lldb-api :: commands/expression/issue_11588/Test11588.py (2246 of 2355) UNSUPPORTED: lldb-api :: functionalities/darwin_log/filter/regex/subsystem/TestDarwinLogFilterRegexSubsystem.py (2247 of 2355) PASS: lldb-shell :: SymbolFile/DWARF/x86/debug_ranges-missing-section.s (2248 of 2355) PASS: lldb-api :: commands/command/script/import/rdar-12586188/TestRdar12586188.py (2249 of 2355) PASS: lldb-unit :: Utility/./UtilityTests/StringListTest.ForRangeEmpty (2250 of 2355) PASS: lldb-unit :: Utility/./UtilityTests/StreamTest.PutHex16ByteOrderBig (2251 of 2355) PASS: lldb-unit :: Utility/./UtilityTests/ArgsTest.TestOverwriteArgs (2252 of 2355) PASS: lldb-unit :: Utility/./UtilityTests/StringListTest.ShiftMove (2253 of 2355) PASS: lldb-unit :: Utility/./UtilityTests/ScalarTest.Comparison (2254 of 2355) PASS: lldb-api :: lang/cpp/operator-overload/TestOperatorOverload.py (2255 of 2355) UNSUPPORTED: lldb-shell :: Unwind/eh-frame-small-fde.test (2256 of 2355) PASS: lldb-unit :: Utility/./UtilityTests/StreamTest.PutNHex8 (2257 of 2355) PASS: lldb-shell :: SymbolFile/DWARF/x86/DW_OP_piece-struct.s (2258 of 2355) PASS: lldb-shell :: Reproducer/TestFileRepro.test (2259 of 2355) PASS: lldb-api :: functionalities/reproducers/fs-case-sensitivity/TestReproducerFSCaseSensitivity.py (2260 of 2355) PASS: lldb-api :: lang/cpp/namespace_definitions/TestNamespaceDefinitions.py (2261 of 2355) UNSUPPORTED: lldb-shell :: SymbolFile/PDB/func-symbols.test (2262 of 2355) PASS: lldb-shell :: ObjectFile/ELF/PT_LOAD.yaml (2263 of 2355) UNSUPPORTED: lldb-api :: tools/lldb-vscode/disconnect/TestVSCode_disconnect.py (2264 of 2355) PASS: lldb-shell :: Settings/TestDisassemblyFormat.test (2265 of 2355) PASS: lldb-unit :: UnwindAssembly/x86/./UnwindAssemblyx86Tests/Testx86AssemblyInspectionEngine.Testi386IgnoredRegisters (2266 of 2355) PASS: lldb-api :: functionalities/data-formatter/data-formatter-caching/TestDataFormatterCaching.py (2267 of 2355) PASS: lldb-shell :: SymbolFile/DWARF/x86/DW_AT_location-DW_AT_const_value.s (2268 of 2355) PASS: lldb-api :: functionalities/gdb_remote_client/TestNestedRegDefinitions.py (2269 of 2355) PASS: lldb-unit :: Language/CPlusPlus/./LanguageCPlusPlusTests/CPlusPlusLanguage.FindAlternateFunctionManglings (2270 of 2355) PASS: lldb-api :: python_api/value/empty_class/TestValueAPIEmptyClass.py (2271 of 2355) PASS: lldb-unit :: Utility/./UtilityTests/StringListTest.DefaultConstructor (2272 of 2355) PASS: lldb-unit :: Utility/./UtilityTests/StreamTest.PutStringAsRawHex8 (2273 of 2355) PASS: lldb-unit :: Utility/./UtilityTests/StreamTest.PutCharWhitespace (2274 of 2355) UNSUPPORTED: lldb-api :: functionalities/data-formatter/data-formatter-stl/libstdcpp/list/TestDataFormatterStdList.py (2275 of 2355) PASS: lldb-unit :: Utility/./UtilityTests/StreamTest.PutCharNull (2276 of 2355) PASS: lldb-api :: python_api/interpreter/TestRunCommandInterpreterAPI.py (2277 of 2355) PASS: lldb-shell :: Driver/TestProcessAttach.test (2278 of 2355) PASS: lldb-shell :: Heap/heap-cstr.test (2279 of 2355) PASS: lldb-api :: lang/objc/unicode-string/TestUnicodeString.py (2280 of 2355) PASS: lldb-api :: functionalities/breakpoint/breakpoint_command/TestBreakpointCommand.py (2281 of 2355) PASS: lldb-unit :: Language/Highlighting/./HighlighterTests/HighlighterTest.DefaultHighlighterWithCursorOutOfBounds (2282 of 2355) UNSUPPORTED: lldb-shell :: Reproducer/TestLuaImport.test (2283 of 2355) PASS: lldb-unit :: Utility/./UtilityTests/StringExtractorTest.DecodeHexU8_Exact (2284 of 2355) PASS: lldb-api :: commands/target/auto-install-main-executable/TestAutoInstallMainExecutable.py (2285 of 2355) PASS: lldb-unit :: Utility/./UtilityTests/StringListTest.PopBack (2286 of 2355) PASS: lldb-unit :: Utility/./UtilityTests/ProcessInstanceInfo.DumpTable_invalidUID (2287 of 2355) PASS: lldb-unit :: Language/CLanguages/./LanguageCLanguagesTests/CLanguages.LookupCLanguagesByLanguageType (2288 of 2355) PASS: lldb-unit :: Host/./HostTests/MainLoopTest.UnmonitoredSignal (2289 of 2355) PASS: lldb-api :: lang/objc/objc-super/TestObjCSuper.py (2290 of 2355) UNSUPPORTED: lldb-api :: iohandler/completion/TestIOHandlerCompletion.py (2291 of 2355) PASS: lldb-api :: commands/frame/diagnose/dereference-this/TestDiagnoseDereferenceThis.py (2292 of 2355) PASS: lldb-unit :: Utility/./UtilityTests/VMRange.Comparison (2293 of 2355) PASS: lldb-unit :: Utility/./UtilityTests/OptionsWithRawTest.LeadingSpaceArgs (2294 of 2355) PASS: lldb-unit :: Utility/./UtilityTests/StreamTest.PutHex64ByteOrderBig (2295 of 2355) PASS: lldb-api :: functionalities/data-formatter/boolreference/TestFormattersBoolRefPtr.py (2296 of 2355) PASS: lldb-api :: functionalities/thread_plan/TestThreadPlanCommands.py (2297 of 2355) PASS: lldb-unit :: Expression/./ExpressionTests/DWARFExpression.DW_OP_const (2298 of 2355) UNSUPPORTED: lldb-api :: functionalities/thread/break_after_join/TestBreakAfterJoin.py (2299 of 2355) PASS: lldb-api :: commands/expression/import-std-module/forward_decl_from_module/TestForwardDeclFromStdModule.py (2300 of 2355) PASS: lldb-shell :: Register/x86-64-ymm-read.test (2301 of 2355) PASS: lldb-shell :: Register/Core/x86-32-netbsd-gp.test (2302 of 2355) PASS: lldb-api :: functionalities/stats_api/TestStatisticsAPI.py (2303 of 2355) UNSUPPORTED: lldb-api :: functionalities/ptr_refs/TestPtrRefs.py (2304 of 2355) PASS: lldb-api :: macosx/version_zero/TestGetVersionZeroVersion.py (2305 of 2355) PASS: lldb-api :: python_api/lldbutil/TestSwigVersion.py (2306 of 2355) PASS: lldb-unit :: Utility/./UtilityTests/LogChannelEnabledTest.LogThread (2307 of 2355) PASS: lldb-unit :: Expression/./ExpressionTests/ClangExpressionDeclMapTest.TestUnknownIdentifierLookup (2308 of 2355) PASS: lldb-api :: functionalities/thread/concurrent_events/TestConcurrentSignalWatch.py (2309 of 2355) PASS: lldb-shell :: Quit/TestQuitExitCode30.test (2310 of 2355) PASS: lldb-unit :: Target/./TargetTests/ExecutionContextTest.GetByteOrderTarget (2311 of 2355) PASS: lldb-unit :: ScriptInterpreter/Python/./ScriptInterpreterPythonTests/PythonDataObjectsTest.TestObjectAttributes (2312 of 2355) PASS: lldb-api :: python_api/objc_type/TestObjCType.py (2313 of 2355) PASS: lldb-unit :: Symbol/./SymbolTests/TestClangASTImporter.MetadataPropagationAfterCopying (2314 of 2355) PASS: lldb-api :: commands/platform/basic/TestPlatformCommand.py (2315 of 2355) UNSUPPORTED: lldb-api :: benchmarks/expression/TestExpressionCmd.py (2316 of 2355) PASS: lldb-api :: functionalities/process_group/TestChangeProcessGroup.py (2317 of 2355) PASS: lldb-unit :: UnwindAssembly/x86/./UnwindAssemblyx86Tests/Testx86AssemblyInspectionEngine.TestSimple64bitFrameFunction (2318 of 2355) PASS: lldb-unit :: Symbol/./SymbolTests/TestTypeSystemClang.TestGetEnumIntegerTypeUnexpectedType (2319 of 2355) PASS: lldb-unit :: Utility/./UtilityTests/ArgsTest.ReplaceArgumentAtIndexFarOutOfRange (2320 of 2355) PASS: lldb-shell :: SymbolFile/DWARF/x86/find-variable-dwo.cpp (2321 of 2355) PASS: lldb-unit :: Utility/./UtilityTests/TimerTest.CategoryTimes (2322 of 2355) PASS: lldb-shell :: Settings/TestDefaultModuleCachePath.test (2323 of 2355) PASS: lldb-api :: functionalities/limit-debug-info/TestLimitDebugInfo.py (2324 of 2355) PASS: lldb-unit :: Language/Highlighting/./HighlighterTests/HighlighterTest.ClangSquareBrackets (2325 of 2355) PASS: lldb-shell :: ScriptInterpreter/Python/Crashlog/json.test (2326 of 2355) PASS: lldb-unit :: Utility/./UtilityTests/CompletionRequest.FakeLastArg (2327 of 2355) PASS: lldb-shell :: Minidump/Windows/Sigsegv/sigsegv.test (2328 of 2355) PASS: lldb-api :: functionalities/gdb_remote_client/TestMemoryRegionDirtyPages.py (2329 of 2355) PASS: lldb-unit :: Utility/./UtilityTests/StringListTest.AppendStringStdString (2330 of 2355) PASS: lldb-unit :: Utility/./UtilityTests/StreamTeeTest.Constructor1Stream (2331 of 2355) UNSUPPORTED: lldb-api :: macosx/posix_spawn/TestLaunchProcessPosixSpawn.py (2332 of 2355) PASS: lldb-shell :: SymbolFile/DWARF/x86/find-basic-function.cpp (2333 of 2355) PASS: lldb-shell :: ObjectFile/ELF/PT_LOAD-overlap-PT_TLS.yaml (2334 of 2355) PASS: lldb-unit :: ObjectFile/Breakpad/./ObjectFileBreakpadTests/FuncRecord.parse (2335 of 2355) PASS: lldb-api :: lang/objc/modules-app-update/TestClangModulesAppUpdate.py (2336 of 2355) PASS: lldb-api :: functionalities/data-formatter/setvaluefromcstring/TestSetValueFromCString.py (2337 of 2355) PASS: lldb-api :: lang/c/strings/TestCStrings.py (2338 of 2355) PASS: lldb-api :: commands/apropos/basic/TestApropos.py (2339 of 2355) PASS: lldb-api :: commands/expression/persistent_types/TestPersistentTypes.py (2340 of 2355) PASS: lldb-unit :: Utility/./UtilityTests/ConstStringTest.NullAndEmptyStates (2341 of 2355) PASS: lldb-unit :: ScriptInterpreter/Python/./ScriptInterpreterPythonTests/PythonDataObjectsTest.TestCallable (2342 of 2355) PASS: lldb-unit :: Utility/./UtilityTests/StringExtractorTest.GetHexU8_InvalidHex_NoEof (2343 of 2355) PASS: lldb-unit :: Core/./LLDBCoreTests/DumpDataExtractorTest.Formats (2344 of 2355) PASS: lldb-unit :: Process/gdb-remote/./ProcessGdbRemoteTests/GDBRemoteClientBaseTest.SendContinueAndInterrupt (2345 of 2355) PASS: lldb-unit :: Expression/./ExpressionTests/DiagnosticManagerTest.PutStringSeverities (2346 of 2355) PASS: lldb-unit :: UnwindAssembly/x86/./UnwindAssemblyx86Tests/Testx86AssemblyInspectionEngine.TestPopRBPWithREX (2347 of 2355) UNSUPPORTED: lldb-api :: commands/watchpoints/hello_watchlocation/TestWatchLocation.py (2348 of 2355) PASS: lldb-unit :: Utility/./UtilityTests/StreamTest.PutBytesAsRawHex8ToMixedEndian (2349 of 2355) PASS: lldb-unit :: Utility/./UtilityTests/SerializationRountripTest.SerializeDeserializeCStringArray (2350 of 2355) PASS: lldb-unit :: Core/./LLDBCoreTests/MangledTest.ResultForValidName (2351 of 2355) PASS: lldb-unit :: Utility/./UtilityTests/StringExtractorTest.GetNameColonValueNoSemicolon (2352 of 2355) UNSUPPORTED: lldb-api :: commands/trace/TestTraceDumpInstructions.py (2353 of 2355) PASS: lldb-shell :: SymbolFile/Breakpad/unwind-via-stack-win-no-memory-info.yaml (2354 of 2355) PASS: lldb-api :: functionalities/data-formatter/data-formatter-objc/TestDataFormatterObjCPlain.py (2355 of 2355) Slowest Tests: -------------------------------------------------------------------------- 263.44s: lldb-api :: tools/lldb-server/TestLldbGdbServer.py 140.04s: lldb-api :: functionalities/memory-region/TestMemoryRegion.py 125.83s: lldb-api :: api/multithreaded/TestMultithreaded.py 114.91s: lldb-api :: macosx/skinny-corefile/TestSkinnyCorefile.py 91.28s: lldb-api :: functionalities/gdb_remote_client/TestWasm.py 85.71s: lldb-api :: types/TestLongTypesExpr.py 72.78s: lldb-api :: lang/objc/exceptions/TestObjCExceptions.py 69.40s: lldb-api :: commands/expression/import-std-module/queue/TestQueueFromStdModule.py 68.94s: lldb-api :: commands/expression/import-std-module/stack/TestStackFromStdModule.py 64.73s: lldb-api :: lang/cpp/namespace/TestNamespaceLookup.py 63.44s: lldb-api :: lang/objc/hidden-ivars/TestHiddenIvars.py 62.43s: lldb-api :: lang/objc/objc-new-syntax/TestObjCNewSyntaxLiteral.py 60.19s: lldb-api :: commands/expression/import-std-module/vector/TestVectorFromStdModule.py 56.00s: lldb-api :: lang/objc/foundation/TestObjCMethods.py 50.97s: lldb-api :: types/TestIntegerTypeExpr.py 50.58s: lldb-api :: commands/expression/import-std-module/deque-basic/TestDequeFromStdModule.py 49.96s: lldb-api :: tools/lldb-server/TestGdbRemoteThreadsInStopReply.py 48.84s: lldb-api :: python_api/target/TestTargetAPI.py 48.34s: lldb-api :: lang/objc/objc-new-syntax/TestObjCNewSyntaxArray.py 47.41s: lldb-api :: lang/objc/objc-new-syntax/TestObjCNewSyntaxDictionary.py

Hide Details

Tests Times: -------------------------------------------------------------------------- [ Range ] :: [ Percentage ] :: [ Count ] -------------------------------------------------------------------------- [260s,280s) :: [ ] :: [ 1/2355] [240s,260s) :: [ ] :: [ 0/2355] [220s,240s) :: [ ] :: [ 0/2355] [200s,220s) :: [ ] :: [ 0/2355] [180s,200s) :: [ ] :: [ 0/2355] [160s,180s) :: [ ] :: [ 0/2355] [140s,160s) :: [ ] :: [ 1/2355] [120s,140s) :: [ ] :: [ 2/2355] [100s,120s) :: [ ] :: [ 0/2355] [ 80s,100s) :: [ ] :: [ 2/2355] [ 60s, 80s) :: [ ] :: [ 7/2355] [ 40s, 60s) :: [ ] :: [ 18/2355] [ 20s, 40s) :: [* ] :: [ 65/2355] [ 0s, 20s) :: [************************************** ] :: [2259/2355] -------------------------------------------------------------------------- ******************** Failed Tests (3): lldb-api :: tools/lldb-vscode/breakpoint/TestVSCode_setBreakpoints.py lldb-api :: tools/lldb-vscode/breakpoint/TestVSCode_setFunctionBreakpoints.py lldb-api :: tools/lldb-vscode/evaluate/TestVSCode_evaluate.py

Hide Details

Hide Details

Testing Time: 2399.24s Unsupported : 212 Passed : 2130 Expectedly Failed: 10 Failed : 3 FAILED: tools/lldb/test/CMakeFiles/check-lldb cd /Users/buildslave/jenkins/workspace/lldb-cmake-sanitized/lldb-build/tools/lldb/test && /usr/local/Frameworks/Python.framework/Versions/3.7/bin/python3.7 /Users/buildslave/jenkins/workspace/lldb-cmake-sanitized/lldb-build/./bin/llvm-lit -v --time-tests --shuffle --xunit-xml-output=/Users/buildslave/jenkins/workspace/lldb-cmake-sanitized/test/results.xml -v -j 4 --timeout 1200 /Users/buildslave/jenkins/workspace/lldb-cmake-sanitized/lldb-build/tools/lldb/test ninja: build stopped: subcommand failed. Command failed: Command '['/usr/bin/env', 'TERM=vt100', '/usr/local/bin/ninja', '-v', 'check-lldb']' returned non-zero exit status 1. Command: ['/usr/bin/env', 'TERM=vt100', '/usr/local/bin/ninja', '-v', 'check-lldb'] [Pipeline] } [Pipeline] // timeout [Pipeline] } [Pipeline] // stage [Pipeline] stage [Pipeline] { (Declarative: Post Actions) [Pipeline] scanForIssues [Clang (LLVM based)] Sleeping for 5 seconds due to JENKINS-32191... [Clang (LLVM based)] Parsing console log (workspace: '/Users/buildslave/jenkins/workspace/lldb-cmake-sanitized') [Clang (LLVM based)] Successfully parsed console log [Clang (LLVM based)] -> found 4 issues (skipped 4 duplicates) [Clang (LLVM based)] [-ERROR-] Can't create fingerprints for some files: [Clang (LLVM based)] [-ERROR-] - '/Users/buildslave/jenkins/workspace/lldb-cmake-sanitized/lldb-build/{"body":{"category":"console","output":"/Users/buildslave/jenkins/workspace/lldb-cmake-sanitized/llvm-project/lldb/tools/lldb-vscode/ProgressEvent.cpp', IO exception has been thrown: java.nio.file.NoSuchFileException: /Users/buildslave/jenkins/workspace/lldb-cmake-sanitized/lldb-build/{"body":{"category":"console","output":"/Users/buildslave/jenkins/workspace/lldb-cmake-sanitized/llvm-project/lldb/tools/lldb-vscode/ProgressEvent.cpp [Clang (LLVM based)] Post processing issues on 'green-dragon-23' with source code encoding 'UTF-8' [Clang (LLVM based)] Creating SCM blamer to obtain author and commit information for affected files [Clang (LLVM based)] -> No blamer installed yet. You need to install the 'git-forensics' plugin to enable blaming for Git. [Clang (LLVM based)] Resolving file names for all issues in source directory '/Users/buildslave/jenkins/workspace/lldb-cmake-sanitized' [Clang (LLVM based)] -> resolved paths in source directory (3 found, 1 not found) [Clang (LLVM based)] Resolving module names from module definitions (build.xml, pom.xml, or Manifest.mf files) [Clang (LLVM based)] -> resolved module names for 4 issues [Clang (LLVM based)] Resolving package names (or namespaces) by parsing the affected files [Clang (LLVM based)] -> resolved package names of 4 affected files [Clang (LLVM based)] No filter has been set, publishing all 4 issues [Clang (LLVM based)] Creating fingerprints for all affected code blocks to track issues over different builds [Clang (LLVM based)] -> created fingerprints for 3 issues (skipped 1 issues) [Clang (LLVM based)] Copying affected files to Jenkins' build folder '/Users/Shared/Jenkins/Home/jobs/lldb-cmake-sanitized/builds/1904/files-with-issues' [Clang (LLVM based)] -> 3 copied, 0 not in workspace, 1 not-found, 0 with I/O error [Clang (LLVM based)] Repository miner is not configured, skipping repository mining [Pipeline] junit Recording test results [Checks API] No suitable checks publisher found. [Pipeline] } [Pipeline] // stage [Pipeline] } [Pipeline] // withEnv [Pipeline] } [Pipeline] // node [Pipeline] End of Pipeline ERROR: script returned exit code 1 Finished: FAILURE