Console Output

Skipping 9,562 KB.. Full Log
--> 
Content-Length: 120

Hide Details

{"command":"evaluate","type":"request","arguments":{"expression":"struct1","context":"hover","frameId":524288},"seq":15} <-- Content-Length: 169

Hide Details

{"body":{"result":"my_struct @ 0x7ffeefbff7c8","type":"my_struct","variablesReference":4},"command":"evaluate","request_seq":15,"seq":0,"success":true,"type":"response"} --> Content-Length: 110

Hide Details

{"command":"stackTrace","type":"request","arguments":{"threadId":12665778,"startFrame":0,"levels":1},"seq":16} <-- Content-Length: 331

Hide Details

{"body":{"stackFrames":[{"column":14,"id":524288,"line":23,"name":"main","source":{"name":"main.cpp","path":"/Users/buildslave/jenkins/workspace/lldb-cmake-sanitized/llvm-project/lldb/test/API/tools/lldb-vscode/evaluate/main.cpp"}}],"totalFrames":2},"command":"stackTrace","request_seq":16,"seq":0,"success":true,"type":"response"} --> Content-Length: 124

Hide Details

{"command":"evaluate","type":"request","arguments":{"expression":"struct1.foo","context":"hover","frameId":524288},"seq":17} <-- Content-Length: 139

Hide Details

{"body":{"result":"15","type":"int","variablesReference":0},"command":"evaluate","request_seq":17,"seq":0,"success":true,"type":"response"} --> Content-Length: 110

Hide Details

{"command":"stackTrace","type":"request","arguments":{"threadId":12665778,"startFrame":0,"levels":1},"seq":18} <-- Content-Length: 331

Hide Details

{"body":{"stackFrames":[{"column":14,"id":524288,"line":23,"name":"main","source":{"name":"main.cpp","path":"/Users/buildslave/jenkins/workspace/lldb-cmake-sanitized/llvm-project/lldb/test/API/tools/lldb-vscode/evaluate/main.cpp"}}],"totalFrames":2},"command":"stackTrace","request_seq":18,"seq":0,"success":true,"type":"response"} --> Content-Length: 125

Hide Details

{"command":"evaluate","type":"request","arguments":{"expression":"struct2->foo","context":"hover","frameId":524288},"seq":19} <-- Content-Length: 139

Hide Details

{"body":{"result":"16","type":"int","variablesReference":0},"command":"evaluate","request_seq":19,"seq":0,"success":true,"type":"response"} --> Content-Length: 110

Hide Details

{"command":"stackTrace","type":"request","arguments":{"threadId":12665778,"startFrame":0,"levels":1},"seq":20} <-- Content-Length: 331

Hide Details

{"body":{"stackFrames":[{"column":14,"id":524288,"line":23,"name":"main","source":{"name":"main.cpp","path":"/Users/buildslave/jenkins/workspace/lldb-cmake-sanitized/llvm-project/lldb/test/API/tools/lldb-vscode/evaluate/main.cpp"}}],"totalFrames":2},"command":"stackTrace","request_seq":20,"seq":0,"success":true,"type":"response"} --> Content-Length: 116

Hide Details

{"command":"evaluate","type":"request","arguments":{"expression":"var","context":"hover","frameId":524288},"seq":21} <-- Content-Length: 119

Hide Details

{"body":{},"command":"evaluate","message":"error: No value","request_seq":21,"seq":0,"success":false,"type":"response"} --> Content-Length: 110

Hide Details

{"command":"stackTrace","type":"request","arguments":{"threadId":12665778,"startFrame":0,"levels":1},"seq":22} <-- Content-Length: 331

Hide Details

{"body":{"stackFrames":[{"column":14,"id":524288,"line":23,"name":"main","source":{"name":"main.cpp","path":"/Users/buildslave/jenkins/workspace/lldb-cmake-sanitized/llvm-project/lldb/test/API/tools/lldb-vscode/evaluate/main.cpp"}}],"totalFrames":2},"command":"stackTrace","request_seq":22,"seq":0,"success":true,"type":"response"} --> Content-Length: 122

Hide Details

{"command":"evaluate","type":"request","arguments":{"expression":"my_struct","context":"hover","frameId":524288},"seq":23} <-- Content-Length: 119

Hide Details

{"body":{},"command":"evaluate","message":"error: No value","request_seq":23,"seq":0,"success":false,"type":"response"} --> Content-Length: 110

Hide Details

{"command":"stackTrace","type":"request","arguments":{"threadId":12665778,"startFrame":0,"levels":1},"seq":24} <-- Content-Length: 331

Hide Details

{"body":{"stackFrames":[{"column":14,"id":524288,"line":23,"name":"main","source":{"name":"main.cpp","path":"/Users/buildslave/jenkins/workspace/lldb-cmake-sanitized/llvm-project/lldb/test/API/tools/lldb-vscode/evaluate/main.cpp"}}],"totalFrames":2},"command":"stackTrace","request_seq":24,"seq":0,"success":true,"type":"response"} --> Content-Length: 116

Hide Details

{"command":"evaluate","type":"request","arguments":{"expression":"int","context":"hover","frameId":524288},"seq":25} <-- Content-Length: 119

Hide Details

{"body":{},"command":"evaluate","message":"error: No value","request_seq":25,"seq":0,"success":false,"type":"response"} --> Content-Length: 110

Hide Details

{"command":"stackTrace","type":"request","arguments":{"threadId":12665778,"startFrame":0,"levels":1},"seq":26} <-- Content-Length: 331

Hide Details

{"body":{"stackFrames":[{"column":14,"id":524288,"line":23,"name":"main","source":{"name":"main.cpp","path":"/Users/buildslave/jenkins/workspace/lldb-cmake-sanitized/llvm-project/lldb/test/API/tools/lldb-vscode/evaluate/main.cpp"}}],"totalFrames":2},"command":"stackTrace","request_seq":26,"seq":0,"success":true,"type":"response"} --> Content-Length: 116

Hide Details

{"command":"evaluate","type":"request","arguments":{"expression":"foo","context":"hover","frameId":524288},"seq":27} <-- Content-Length: 119

Hide Details

{"body":{},"command":"evaluate","message":"error: No value","request_seq":27,"seq":0,"success":false,"type":"response"} --> Content-Length: 110

Hide Details

{"command":"stackTrace","type":"request","arguments":{"threadId":12665778,"startFrame":0,"levels":1},"seq":28} <-- Content-Length: 331

Hide Details

{"body":{"stackFrames":[{"column":14,"id":524288,"line":23,"name":"main","source":{"name":"main.cpp","path":"/Users/buildslave/jenkins/workspace/lldb-cmake-sanitized/llvm-project/lldb/test/API/tools/lldb-vscode/evaluate/main.cpp"}}],"totalFrames":2},"command":"stackTrace","request_seq":28,"seq":0,"success":true,"type":"response"} --> Content-Length: 123

Hide Details

{"command":"evaluate","type":"request","arguments":{"expression":"a_function","context":"hover","frameId":524288},"seq":29} <-- Content-Length: 119

Hide Details

{"body":{},"command":"evaluate","message":"error: No value","request_seq":29,"seq":0,"success":false,"type":"response"} --> Content-Length: 110

Hide Details

{"command":"stackTrace","type":"request","arguments":{"threadId":12665778,"startFrame":0,"levels":1},"seq":30} <-- Content-Length: 331

Hide Details

{"body":{"stackFrames":[{"column":14,"id":524288,"line":23,"name":"main","source":{"name":"main.cpp","path":"/Users/buildslave/jenkins/workspace/lldb-cmake-sanitized/llvm-project/lldb/test/API/tools/lldb-vscode/evaluate/main.cpp"}}],"totalFrames":2},"command":"stackTrace","request_seq":30,"seq":0,"success":true,"type":"response"} --> Content-Length: 126

Hide Details

{"command":"evaluate","type":"request","arguments":{"expression":"a_function(1)","context":"hover","frameId":524288},"seq":31} <-- Content-Length: 119

Hide Details

{"body":{},"command":"evaluate","message":"error: No value","request_seq":31,"seq":0,"success":false,"type":"response"} --> Content-Length: 110

Hide Details

{"command":"stackTrace","type":"request","arguments":{"threadId":12665778,"startFrame":0,"levels":1},"seq":32} <-- Content-Length: 331

Hide Details

{"body":{"stackFrames":[{"column":14,"id":524288,"line":23,"name":"main","source":{"name":"main.cpp","path":"/Users/buildslave/jenkins/workspace/lldb-cmake-sanitized/llvm-project/lldb/test/API/tools/lldb-vscode/evaluate/main.cpp"}}],"totalFrames":2},"command":"stackTrace","request_seq":32,"seq":0,"success":true,"type":"response"} --> Content-Length: 131

Hide Details

{"command":"evaluate","type":"request","arguments":{"expression":"var2 + struct1.foo","context":"hover","frameId":524288},"seq":33} <-- Content-Length: 119

Hide Details

{"body":{},"command":"evaluate","message":"error: No value","request_seq":33,"seq":0,"success":false,"type":"response"} --> Content-Length: 110

Hide Details

{"command":"stackTrace","type":"request","arguments":{"threadId":12665778,"startFrame":0,"levels":1},"seq":34} <-- Content-Length: 331

Hide Details

{"body":{"stackFrames":[{"column":14,"id":524288,"line":23,"name":"main","source":{"name":"main.cpp","path":"/Users/buildslave/jenkins/workspace/lldb-cmake-sanitized/llvm-project/lldb/test/API/tools/lldb-vscode/evaluate/main.cpp"}}],"totalFrames":2},"command":"stackTrace","request_seq":34,"seq":0,"success":true,"type":"response"} --> Content-Length: 121

Hide Details

{"command":"evaluate","type":"request","arguments":{"expression":"foo_func","context":"hover","frameId":524288},"seq":35} <-- Content-Length: 119

Hide Details

{"body":{},"command":"evaluate","message":"error: No value","request_seq":35,"seq":0,"success":false,"type":"response"} --> Content-Length: 110

Hide Details

{"command":"stackTrace","type":"request","arguments":{"threadId":12665778,"startFrame":0,"levels":1},"seq":36} <-- Content-Length: 331

Hide Details

{"body":{"stackFrames":[{"column":14,"id":524288,"line":23,"name":"main","source":{"name":"main.cpp","path":"/Users/buildslave/jenkins/workspace/lldb-cmake-sanitized/llvm-project/lldb/test/API/tools/lldb-vscode/evaluate/main.cpp"}}],"totalFrames":2},"command":"stackTrace","request_seq":36,"seq":0,"success":true,"type":"response"} --> Content-Length: 120

Hide Details

{"command":"evaluate","type":"request","arguments":{"expression":"foo_var","context":"hover","frameId":524288},"seq":37} <-- Content-Length: 119

Hide Details

{"body":{},"command":"evaluate","message":"error: No value","request_seq":37,"seq":0,"success":false,"type":"response"} --> Content-Length: 82

Hide Details

{"command":"continue","type":"request","arguments":{"threadId":12665778},"seq":38} <-- Content-Length: 116

Hide Details

{"body":{"allThreadsContinued":true},"command":"continue","request_seq":38,"seq":0,"success":true,"type":"response"} <-- Content-Length: 200

Hide Details

{"body":{"allThreadsStopped":true,"description":"breakpoint 2.1","preserveFocusHint":false,"reason":"breakpoint","threadCausedFocus":true,"threadId":12665778},"event":"stopped","seq":0,"type":"event"} --> Content-Length: 62

Hide Details

{"command":"threads","type":"request","arguments":{},"seq":39} <-- Content-Length: 135

Hide Details

{"body":{"threads":[{"id":12665778,"name":"Thread #1"}]},"command":"threads","request_seq":39,"seq":0,"success":true,"type":"response"} --> Content-Length: 110

Hide Details

{"command":"stackTrace","type":"request","arguments":{"threadId":12665778,"startFrame":0,"levels":1},"seq":40} <-- Content-Length: 331

Hide Details

{"body":{"stackFrames":[{"column":16,"id":524288,"line":27,"name":"main","source":{"name":"main.cpp","path":"/Users/buildslave/jenkins/workspace/lldb-cmake-sanitized/llvm-project/lldb/test/API/tools/lldb-vscode/evaluate/main.cpp"}}],"totalFrames":2},"command":"stackTrace","request_seq":40,"seq":0,"success":true,"type":"response"} --> Content-Length: 117

Hide Details

{"command":"evaluate","type":"request","arguments":{"expression":"var1","context":"hover","frameId":524288},"seq":41} <-- Content-Length: 139

Hide Details

{"body":{"result":"20","type":"int","variablesReference":0},"command":"evaluate","request_seq":41,"seq":0,"success":true,"type":"response"} --> Content-Length: 110

Hide Details

{"command":"stackTrace","type":"request","arguments":{"threadId":12665778,"startFrame":0,"levels":1},"seq":42} <-- Content-Length: 331

Hide Details

{"body":{"stackFrames":[{"column":16,"id":524288,"line":27,"name":"main","source":{"name":"main.cpp","path":"/Users/buildslave/jenkins/workspace/lldb-cmake-sanitized/llvm-project/lldb/test/API/tools/lldb-vscode/evaluate/main.cpp"}}],"totalFrames":2},"command":"stackTrace","request_seq":42,"seq":0,"success":true,"type":"response"} --> Content-Length: 117

Hide Details

{"command":"evaluate","type":"request","arguments":{"expression":"var2","context":"hover","frameId":524288},"seq":43} <-- Content-Length: 138

Hide Details

{"body":{"result":"2","type":"int","variablesReference":0},"command":"evaluate","request_seq":43,"seq":0,"success":true,"type":"response"} --> Content-Length: 110

Hide Details

{"command":"stackTrace","type":"request","arguments":{"threadId":12665778,"startFrame":0,"levels":1},"seq":44} <-- Content-Length: 331

Hide Details

{"body":{"stackFrames":[{"column":16,"id":524288,"line":27,"name":"main","source":{"name":"main.cpp","path":"/Users/buildslave/jenkins/workspace/lldb-cmake-sanitized/llvm-project/lldb/test/API/tools/lldb-vscode/evaluate/main.cpp"}}],"totalFrames":2},"command":"stackTrace","request_seq":44,"seq":0,"success":true,"type":"response"} --> Content-Length: 123

Hide Details

{"command":"evaluate","type":"request","arguments":{"expression":"static_int","context":"hover","frameId":524288},"seq":45} <-- Content-Length: 139

Hide Details

{"body":{"result":"42","type":"int","variablesReference":0},"command":"evaluate","request_seq":45,"seq":0,"success":true,"type":"response"} --> Content-Length: 110

Hide Details

{"command":"stackTrace","type":"request","arguments":{"threadId":12665778,"startFrame":0,"levels":1},"seq":46} <-- Content-Length: 331

Hide Details

{"body":{"stackFrames":[{"column":16,"id":524288,"line":27,"name":"main","source":{"name":"main.cpp","path":"/Users/buildslave/jenkins/workspace/lldb-cmake-sanitized/llvm-project/lldb/test/API/tools/lldb-vscode/evaluate/main.cpp"}}],"totalFrames":2},"command":"stackTrace","request_seq":46,"seq":0,"success":true,"type":"response"} --> Content-Length: 127

Hide Details

{"command":"evaluate","type":"request","arguments":{"expression":"non_static_int","context":"hover","frameId":524288},"seq":47} <-- Content-Length: 139

Hide Details

{"body":{"result":"10","type":"int","variablesReference":0},"command":"evaluate","request_seq":47,"seq":0,"success":true,"type":"response"} --> Content-Length: 110

Hide Details

{"command":"stackTrace","type":"request","arguments":{"threadId":12665778,"startFrame":0,"levels":1},"seq":48} <-- Content-Length: 331

Hide Details

{"body":{"stackFrames":[{"column":16,"id":524288,"line":27,"name":"main","source":{"name":"main.cpp","path":"/Users/buildslave/jenkins/workspace/lldb-cmake-sanitized/llvm-project/lldb/test/API/tools/lldb-vscode/evaluate/main.cpp"}}],"totalFrames":2},"command":"stackTrace","request_seq":48,"seq":0,"success":true,"type":"response"} --> Content-Length: 120

Hide Details

{"command":"evaluate","type":"request","arguments":{"expression":"struct1","context":"hover","frameId":524288},"seq":49} <-- Content-Length: 169

Hide Details

{"body":{"result":"my_struct @ 0x7ffeefbff7c8","type":"my_struct","variablesReference":5},"command":"evaluate","request_seq":49,"seq":0,"success":true,"type":"response"} --> Content-Length: 110

Hide Details

{"command":"stackTrace","type":"request","arguments":{"threadId":12665778,"startFrame":0,"levels":1},"seq":50} <-- Content-Length: 331

Hide Details

{"body":{"stackFrames":[{"column":16,"id":524288,"line":27,"name":"main","source":{"name":"main.cpp","path":"/Users/buildslave/jenkins/workspace/lldb-cmake-sanitized/llvm-project/lldb/test/API/tools/lldb-vscode/evaluate/main.cpp"}}],"totalFrames":2},"command":"stackTrace","request_seq":50,"seq":0,"success":true,"type":"response"} --> Content-Length: 124

Hide Details

{"command":"evaluate","type":"request","arguments":{"expression":"struct1.foo","context":"hover","frameId":524288},"seq":51} <-- Content-Length: 139

Hide Details

{"body":{"result":"15","type":"int","variablesReference":0},"command":"evaluate","request_seq":51,"seq":0,"success":true,"type":"response"} --> Content-Length: 110

Hide Details

{"command":"stackTrace","type":"request","arguments":{"threadId":12665778,"startFrame":0,"levels":1},"seq":52} <-- Content-Length: 331

Hide Details

{"body":{"stackFrames":[{"column":16,"id":524288,"line":27,"name":"main","source":{"name":"main.cpp","path":"/Users/buildslave/jenkins/workspace/lldb-cmake-sanitized/llvm-project/lldb/test/API/tools/lldb-vscode/evaluate/main.cpp"}}],"totalFrames":2},"command":"stackTrace","request_seq":52,"seq":0,"success":true,"type":"response"} --> Content-Length: 125

Hide Details

{"command":"evaluate","type":"request","arguments":{"expression":"struct2->foo","context":"hover","frameId":524288},"seq":53} <-- Content-Length: 139

Hide Details

{"body":{"result":"16","type":"int","variablesReference":0},"command":"evaluate","request_seq":53,"seq":0,"success":true,"type":"response"} --> Content-Length: 110

Hide Details

{"command":"stackTrace","type":"request","arguments":{"threadId":12665778,"startFrame":0,"levels":1},"seq":54} <-- Content-Length: 331

Hide Details

{"body":{"stackFrames":[{"column":16,"id":524288,"line":27,"name":"main","source":{"name":"main.cpp","path":"/Users/buildslave/jenkins/workspace/lldb-cmake-sanitized/llvm-project/lldb/test/API/tools/lldb-vscode/evaluate/main.cpp"}}],"totalFrames":2},"command":"stackTrace","request_seq":54,"seq":0,"success":true,"type":"response"} --> Content-Length: 123

Hide Details

{"command":"evaluate","type":"request","arguments":{"expression":"a_function","context":"hover","frameId":524288},"seq":55} <-- Content-Length: 119

Hide Details

{"body":{},"command":"evaluate","message":"error: No value","request_seq":55,"seq":0,"success":false,"type":"response"} --> Content-Length: 110

Hide Details

{"command":"stackTrace","type":"request","arguments":{"threadId":12665778,"startFrame":0,"levels":1},"seq":56} <-- Content-Length: 331

Hide Details

{"body":{"stackFrames":[{"column":16,"id":524288,"line":27,"name":"main","source":{"name":"main.cpp","path":"/Users/buildslave/jenkins/workspace/lldb-cmake-sanitized/llvm-project/lldb/test/API/tools/lldb-vscode/evaluate/main.cpp"}}],"totalFrames":2},"command":"stackTrace","request_seq":56,"seq":0,"success":true,"type":"response"} --> Content-Length: 126

Hide Details

{"command":"evaluate","type":"request","arguments":{"expression":"a_function(1)","context":"hover","frameId":524288},"seq":57} <-- Content-Length: 119

Hide Details

{"body":{},"command":"evaluate","message":"error: No value","request_seq":57,"seq":0,"success":false,"type":"response"} --> Content-Length: 110

Hide Details

{"command":"stackTrace","type":"request","arguments":{"threadId":12665778,"startFrame":0,"levels":1},"seq":58} <-- Content-Length: 331

Hide Details

{"body":{"stackFrames":[{"column":16,"id":524288,"line":27,"name":"main","source":{"name":"main.cpp","path":"/Users/buildslave/jenkins/workspace/lldb-cmake-sanitized/llvm-project/lldb/test/API/tools/lldb-vscode/evaluate/main.cpp"}}],"totalFrames":2},"command":"stackTrace","request_seq":58,"seq":0,"success":true,"type":"response"} --> Content-Length: 131

Hide Details

{"command":"evaluate","type":"request","arguments":{"expression":"var2 + struct1.foo","context":"hover","frameId":524288},"seq":59} <-- Content-Length: 119

Hide Details

{"body":{},"command":"evaluate","message":"error: No value","request_seq":59,"seq":0,"success":false,"type":"response"} --> Content-Length: 110

Hide Details

{"command":"stackTrace","type":"request","arguments":{"threadId":12665778,"startFrame":0,"levels":1},"seq":60} <-- Content-Length: 331

Hide Details

{"body":{"stackFrames":[{"column":16,"id":524288,"line":27,"name":"main","source":{"name":"main.cpp","path":"/Users/buildslave/jenkins/workspace/lldb-cmake-sanitized/llvm-project/lldb/test/API/tools/lldb-vscode/evaluate/main.cpp"}}],"totalFrames":2},"command":"stackTrace","request_seq":60,"seq":0,"success":true,"type":"response"} --> Content-Length: 121

Hide Details

{"command":"evaluate","type":"request","arguments":{"expression":"foo_func","context":"hover","frameId":524288},"seq":61} <-- Content-Length: 119

Hide Details

{"body":{},"command":"evaluate","message":"error: No value","request_seq":61,"seq":0,"success":false,"type":"response"} --> Content-Length: 110

Hide Details

{"command":"stackTrace","type":"request","arguments":{"threadId":12665778,"startFrame":0,"levels":1},"seq":62} <-- Content-Length: 331

Hide Details

{"body":{"stackFrames":[{"column":16,"id":524288,"line":27,"name":"main","source":{"name":"main.cpp","path":"/Users/buildslave/jenkins/workspace/lldb-cmake-sanitized/llvm-project/lldb/test/API/tools/lldb-vscode/evaluate/main.cpp"}}],"totalFrames":2},"command":"stackTrace","request_seq":62,"seq":0,"success":true,"type":"response"} --> Content-Length: 120

Hide Details

{"command":"evaluate","type":"request","arguments":{"expression":"foo_var","context":"hover","frameId":524288},"seq":63} <-- Content-Length: 119

Hide Details

{"body":{},"command":"evaluate","message":"error: No value","request_seq":63,"seq":0,"success":false,"type":"response"} --> Content-Length: 82

Hide Details

{"command":"continue","type":"request","arguments":{"threadId":12665778},"seq":64} <-- Content-Length: 116

Hide Details

{"body":{"allThreadsContinued":true},"command":"continue","request_seq":64,"seq":0,"success":true,"type":"response"} <-- Content-Length: 200

Hide Details

{"body":{"allThreadsStopped":true,"description":"breakpoint 3.1","preserveFocusHint":false,"reason":"breakpoint","threadCausedFocus":true,"threadId":12665778},"event":"stopped","seq":0,"type":"event"} --> Content-Length: 62

Hide Details

{"command":"threads","type":"request","arguments":{},"seq":65} <-- Content-Length: 135

Hide Details

{"body":{"threads":[{"id":12665778,"name":"Thread #1"}]},"command":"threads","request_seq":65,"seq":0,"success":true,"type":"response"} --> Content-Length: 110

Hide Details

{"command":"stackTrace","type":"request","arguments":{"threadId":12665778,"startFrame":0,"levels":1},"seq":66} <-- Content-Length: 342

Hide Details

{"body":{"stackFrames":[{"column":10,"id":524288,"line":11,"name":"a_function(int)","source":{"name":"main.cpp","path":"/Users/buildslave/jenkins/workspace/lldb-cmake-sanitized/llvm-project/lldb/test/API/tools/lldb-vscode/evaluate/main.cpp"}}],"totalFrames":3},"command":"stackTrace","request_seq":66,"seq":0,"success":true,"type":"response"} --> Content-Length: 116

Hide Details

{"command":"evaluate","type":"request","arguments":{"expression":"var","context":"hover","frameId":524288},"seq":67} <-- Content-Length: 139

Hide Details

{"body":{"result":"42","type":"int","variablesReference":0},"command":"evaluate","request_seq":67,"seq":0,"success":true,"type":"response"} --> Content-Length: 110

Hide Details

{"command":"stackTrace","type":"request","arguments":{"threadId":12665778,"startFrame":0,"levels":1},"seq":68} <-- Content-Length: 342

Hide Details

{"body":{"stackFrames":[{"column":10,"id":524288,"line":11,"name":"a_function(int)","source":{"name":"main.cpp","path":"/Users/buildslave/jenkins/workspace/lldb-cmake-sanitized/llvm-project/lldb/test/API/tools/lldb-vscode/evaluate/main.cpp"}}],"totalFrames":3},"command":"stackTrace","request_seq":68,"seq":0,"success":true,"type":"response"} --> Content-Length: 123

Hide Details

{"command":"evaluate","type":"request","arguments":{"expression":"static_int","context":"hover","frameId":524288},"seq":69} <-- Content-Length: 139

Hide Details

{"body":{"result":"42","type":"int","variablesReference":0},"command":"evaluate","request_seq":69,"seq":0,"success":true,"type":"response"} --> Content-Length: 110

Hide Details

{"command":"stackTrace","type":"request","arguments":{"threadId":12665778,"startFrame":0,"levels":1},"seq":70} <-- Content-Length: 342

Hide Details

{"body":{"stackFrames":[{"column":10,"id":524288,"line":11,"name":"a_function(int)","source":{"name":"main.cpp","path":"/Users/buildslave/jenkins/workspace/lldb-cmake-sanitized/llvm-project/lldb/test/API/tools/lldb-vscode/evaluate/main.cpp"}}],"totalFrames":3},"command":"stackTrace","request_seq":70,"seq":0,"success":true,"type":"response"} --> Content-Length: 127

Hide Details

{"command":"evaluate","type":"request","arguments":{"expression":"non_static_int","context":"hover","frameId":524288},"seq":71} <-- Content-Length: 139

Hide Details

{"body":{"result":"43","type":"int","variablesReference":0},"command":"evaluate","request_seq":71,"seq":0,"success":true,"type":"response"} --> Content-Length: 110

Hide Details

{"command":"stackTrace","type":"request","arguments":{"threadId":12665778,"startFrame":0,"levels":1},"seq":72} <-- Content-Length: 342

Hide Details

{"body":{"stackFrames":[{"column":10,"id":524288,"line":11,"name":"a_function(int)","source":{"name":"main.cpp","path":"/Users/buildslave/jenkins/workspace/lldb-cmake-sanitized/llvm-project/lldb/test/API/tools/lldb-vscode/evaluate/main.cpp"}}],"totalFrames":3},"command":"stackTrace","request_seq":72,"seq":0,"success":true,"type":"response"} --> Content-Length: 117

Hide Details

{"command":"evaluate","type":"request","arguments":{"expression":"var1","context":"hover","frameId":524288},"seq":73} <-- Content-Length: 119

Hide Details

{"body":{},"command":"evaluate","message":"error: No value","request_seq":73,"seq":0,"success":false,"type":"response"} --> Content-Length: 110

Hide Details

{"command":"stackTrace","type":"request","arguments":{"threadId":12665778,"startFrame":0,"levels":1},"seq":74} <-- Content-Length: 342

Hide Details

{"body":{"stackFrames":[{"column":10,"id":524288,"line":11,"name":"a_function(int)","source":{"name":"main.cpp","path":"/Users/buildslave/jenkins/workspace/lldb-cmake-sanitized/llvm-project/lldb/test/API/tools/lldb-vscode/evaluate/main.cpp"}}],"totalFrames":3},"command":"stackTrace","request_seq":74,"seq":0,"success":true,"type":"response"} --> Content-Length: 117

Hide Details

{"command":"evaluate","type":"request","arguments":{"expression":"var2","context":"hover","frameId":524288},"seq":75} <-- Content-Length: 119

Hide Details

{"body":{},"command":"evaluate","message":"error: No value","request_seq":75,"seq":0,"success":false,"type":"response"} --> Content-Length: 110

Hide Details

{"command":"stackTrace","type":"request","arguments":{"threadId":12665778,"startFrame":0,"levels":1},"seq":76} <-- Content-Length: 342

Hide Details

{"body":{"stackFrames":[{"column":10,"id":524288,"line":11,"name":"a_function(int)","source":{"name":"main.cpp","path":"/Users/buildslave/jenkins/workspace/lldb-cmake-sanitized/llvm-project/lldb/test/API/tools/lldb-vscode/evaluate/main.cpp"}}],"totalFrames":3},"command":"stackTrace","request_seq":76,"seq":0,"success":true,"type":"response"} --> Content-Length: 120

Hide Details

{"command":"evaluate","type":"request","arguments":{"expression":"struct1","context":"hover","frameId":524288},"seq":77} <-- Content-Length: 119

Hide Details

{"body":{},"command":"evaluate","message":"error: No value","request_seq":77,"seq":0,"success":false,"type":"response"} --> Content-Length: 110

Hide Details

{"command":"stackTrace","type":"request","arguments":{"threadId":12665778,"startFrame":0,"levels":1},"seq":78} <-- Content-Length: 342

Hide Details

{"body":{"stackFrames":[{"column":10,"id":524288,"line":11,"name":"a_function(int)","source":{"name":"main.cpp","path":"/Users/buildslave/jenkins/workspace/lldb-cmake-sanitized/llvm-project/lldb/test/API/tools/lldb-vscode/evaluate/main.cpp"}}],"totalFrames":3},"command":"stackTrace","request_seq":78,"seq":0,"success":true,"type":"response"} --> Content-Length: 124

Hide Details

{"command":"evaluate","type":"request","arguments":{"expression":"struct1.foo","context":"hover","frameId":524288},"seq":79} <-- Content-Length: 119

Hide Details

{"body":{},"command":"evaluate","message":"error: No value","request_seq":79,"seq":0,"success":false,"type":"response"} --> Content-Length: 110

Hide Details

{"command":"stackTrace","type":"request","arguments":{"threadId":12665778,"startFrame":0,"levels":1},"seq":80} <-- Content-Length: 342

Hide Details

{"body":{"stackFrames":[{"column":10,"id":524288,"line":11,"name":"a_function(int)","source":{"name":"main.cpp","path":"/Users/buildslave/jenkins/workspace/lldb-cmake-sanitized/llvm-project/lldb/test/API/tools/lldb-vscode/evaluate/main.cpp"}}],"totalFrames":3},"command":"stackTrace","request_seq":80,"seq":0,"success":true,"type":"response"} --> Content-Length: 125

Hide Details

{"command":"evaluate","type":"request","arguments":{"expression":"struct2->foo","context":"hover","frameId":524288},"seq":81} <-- Content-Length: 119

Hide Details

{"body":{},"command":"evaluate","message":"error: No value","request_seq":81,"seq":0,"success":false,"type":"response"} --> Content-Length: 110

Hide Details

{"command":"stackTrace","type":"request","arguments":{"threadId":12665778,"startFrame":0,"levels":1},"seq":82} <-- Content-Length: 342

Hide Details

{"body":{"stackFrames":[{"column":10,"id":524288,"line":11,"name":"a_function(int)","source":{"name":"main.cpp","path":"/Users/buildslave/jenkins/workspace/lldb-cmake-sanitized/llvm-project/lldb/test/API/tools/lldb-vscode/evaluate/main.cpp"}}],"totalFrames":3},"command":"stackTrace","request_seq":82,"seq":0,"success":true,"type":"response"} --> Content-Length: 131

Hide Details

{"command":"evaluate","type":"request","arguments":{"expression":"var2 + struct1.foo","context":"hover","frameId":524288},"seq":83} <-- Content-Length: 119

Hide Details

{"body":{},"command":"evaluate","message":"error: No value","request_seq":83,"seq":0,"success":false,"type":"response"} --> Content-Length: 110

Hide Details

{"command":"stackTrace","type":"request","arguments":{"threadId":12665778,"startFrame":0,"levels":1},"seq":84} <-- Content-Length: 342

Hide Details

{"body":{"stackFrames":[{"column":10,"id":524288,"line":11,"name":"a_function(int)","source":{"name":"main.cpp","path":"/Users/buildslave/jenkins/workspace/lldb-cmake-sanitized/llvm-project/lldb/test/API/tools/lldb-vscode/evaluate/main.cpp"}}],"totalFrames":3},"command":"stackTrace","request_seq":84,"seq":0,"success":true,"type":"response"} --> Content-Length: 123

Hide Details

{"command":"evaluate","type":"request","arguments":{"expression":"a_function","context":"hover","frameId":524288},"seq":85} <-- Content-Length: 119

Hide Details

{"body":{},"command":"evaluate","message":"error: No value","request_seq":85,"seq":0,"success":false,"type":"response"} --> Content-Length: 110

Hide Details

{"command":"stackTrace","type":"request","arguments":{"threadId":12665778,"startFrame":0,"levels":1},"seq":86} <-- Content-Length: 342

Hide Details

{"body":{"stackFrames":[{"column":10,"id":524288,"line":11,"name":"a_function(int)","source":{"name":"main.cpp","path":"/Users/buildslave/jenkins/workspace/lldb-cmake-sanitized/llvm-project/lldb/test/API/tools/lldb-vscode/evaluate/main.cpp"}}],"totalFrames":3},"command":"stackTrace","request_seq":86,"seq":0,"success":true,"type":"response"} --> Content-Length: 126

Hide Details

{"command":"evaluate","type":"request","arguments":{"expression":"a_function(1)","context":"hover","frameId":524288},"seq":87} <-- Content-Length: 119

Hide Details

{"body":{},"command":"evaluate","message":"error: No value","request_seq":87,"seq":0,"success":false,"type":"response"} --> Content-Length: 110

Hide Details

{"command":"stackTrace","type":"request","arguments":{"threadId":12665778,"startFrame":0,"levels":1},"seq":88} <-- Content-Length: 342

Hide Details

{"body":{"stackFrames":[{"column":10,"id":524288,"line":11,"name":"a_function(int)","source":{"name":"main.cpp","path":"/Users/buildslave/jenkins/workspace/lldb-cmake-sanitized/llvm-project/lldb/test/API/tools/lldb-vscode/evaluate/main.cpp"}}],"totalFrames":3},"command":"stackTrace","request_seq":88,"seq":0,"success":true,"type":"response"} --> Content-Length: 120

Hide Details

{"command":"evaluate","type":"request","arguments":{"expression":"var + 1","context":"hover","frameId":524288},"seq":89} <-- Content-Length: 119

Hide Details

{"body":{},"command":"evaluate","message":"error: No value","request_seq":89,"seq":0,"success":false,"type":"response"} --> Content-Length: 110

Hide Details

{"command":"stackTrace","type":"request","arguments":{"threadId":12665778,"startFrame":0,"levels":1},"seq":90} <-- Content-Length: 342

Hide Details

{"body":{"stackFrames":[{"column":10,"id":524288,"line":11,"name":"a_function(int)","source":{"name":"main.cpp","path":"/Users/buildslave/jenkins/workspace/lldb-cmake-sanitized/llvm-project/lldb/test/API/tools/lldb-vscode/evaluate/main.cpp"}}],"totalFrames":3},"command":"stackTrace","request_seq":90,"seq":0,"success":true,"type":"response"} --> Content-Length: 121

Hide Details

{"command":"evaluate","type":"request","arguments":{"expression":"foo_func","context":"hover","frameId":524288},"seq":91} <-- Content-Length: 119

Hide Details

{"body":{},"command":"evaluate","message":"error: No value","request_seq":91,"seq":0,"success":false,"type":"response"} --> Content-Length: 110

Hide Details

{"command":"stackTrace","type":"request","arguments":{"threadId":12665778,"startFrame":0,"levels":1},"seq":92} <-- Content-Length: 342

Hide Details

{"body":{"stackFrames":[{"column":10,"id":524288,"line":11,"name":"a_function(int)","source":{"name":"main.cpp","path":"/Users/buildslave/jenkins/workspace/lldb-cmake-sanitized/llvm-project/lldb/test/API/tools/lldb-vscode/evaluate/main.cpp"}}],"totalFrames":3},"command":"stackTrace","request_seq":92,"seq":0,"success":true,"type":"response"} --> Content-Length: 120

Hide Details

{"command":"evaluate","type":"request","arguments":{"expression":"foo_var","context":"hover","frameId":524288},"seq":93} <-- Content-Length: 119

Hide Details

{"body":{},"command":"evaluate","message":"error: No value","request_seq":93,"seq":0,"success":false,"type":"response"} --> Content-Length: 82

Hide Details

{"command":"continue","type":"request","arguments":{"threadId":12665778},"seq":94} <-- Content-Length: 116

Hide Details

{"body":{"allThreadsContinued":true},"command":"continue","request_seq":94,"seq":0,"success":true,"type":"response"} <-- Content-Length: 200

Hide Details

{"body":{"allThreadsStopped":true,"description":"breakpoint 4.1","preserveFocusHint":false,"reason":"breakpoint","threadCausedFocus":true,"threadId":12665778},"event":"stopped","seq":0,"type":"event"} --> Content-Length: 62

Hide Details

{"command":"threads","type":"request","arguments":{},"seq":95} <-- Content-Length: 135

Hide Details

{"body":{"threads":[{"id":12665778,"name":"Thread #1"}]},"command":"threads","request_seq":95,"seq":0,"success":true,"type":"response"} --> Content-Length: 110

Hide Details

{"command":"stackTrace","type":"request","arguments":{"threadId":12665778,"startFrame":0,"levels":1},"seq":96} <-- Content-Length: 331

Hide Details

{"body":{"stackFrames":[{"column":20,"id":524288,"line":35,"name":"main","source":{"name":"main.cpp","path":"/Users/buildslave/jenkins/workspace/lldb-cmake-sanitized/llvm-project/lldb/test/API/tools/lldb-vscode/evaluate/main.cpp"}}],"totalFrames":2},"command":"stackTrace","request_seq":96,"seq":0,"success":true,"type":"response"} --> Content-Length: 119

Hide Details

{"command":"evaluate","type":"request","arguments":{"expression":"my_vec","context":"hover","frameId":524288},"seq":97} <-- Content-Length: 179

Hide Details

{"body":{"result":" size=2","type":"std::vector<int, std::allocator<int> >","variablesReference":6},"command":"evaluate","request_seq":97,"seq":0,"success":true,"type":"response"} --> Content-Length: 82

Hide Details

{"command":"continue","type":"request","arguments":{"threadId":12665778},"seq":98} <-- Content-Length: 116

Hide Details

{"body":{"allThreadsContinued":true},"command":"continue","request_seq":98,"seq":0,"success":true,"type":"response"} <-- Content-Length: 200

Hide Details

{"body":{"allThreadsStopped":true,"description":"breakpoint 5.1","preserveFocusHint":false,"reason":"breakpoint","threadCausedFocus":true,"threadId":12665778},"event":"stopped","seq":0,"type":"event"} --> Content-Length: 62

Hide Details

{"command":"threads","type":"request","arguments":{},"seq":99} <-- Content-Length: 135

Hide Details

{"body":{"threads":[{"id":12665778,"name":"Thread #1"}]},"command":"threads","request_seq":99,"seq":0,"success":true,"type":"response"} --> Content-Length: 111

Hide Details

{"command":"stackTrace","type":"request","arguments":{"threadId":12665778,"startFrame":0,"levels":1},"seq":100} <-- Content-Length: 332

Hide Details

{"body":{"stackFrames":[{"column":10,"id":524288,"line":40,"name":"main","source":{"name":"main.cpp","path":"/Users/buildslave/jenkins/workspace/lldb-cmake-sanitized/llvm-project/lldb/test/API/tools/lldb-vscode/evaluate/main.cpp"}}],"totalFrames":2},"command":"stackTrace","request_seq":100,"seq":0,"success":true,"type":"response"} --> Content-Length: 120

Hide Details

{"command":"evaluate","type":"request","arguments":{"expression":"my_vec","context":"hover","frameId":524288},"seq":101} <-- Content-Length: 180

Hide Details

{"body":{"result":" size=3","type":"std::vector<int, std::allocator<int> >","variablesReference":7},"command":"evaluate","request_seq":101,"seq":0,"success":true,"type":"response"} --> Content-Length: 111

Hide Details

{"command":"stackTrace","type":"request","arguments":{"threadId":12665778,"startFrame":0,"levels":1},"seq":102} <-- Content-Length: 332

Hide Details

{"body":{"stackFrames":[{"column":10,"id":524288,"line":40,"name":"main","source":{"name":"main.cpp","path":"/Users/buildslave/jenkins/workspace/lldb-cmake-sanitized/llvm-project/lldb/test/API/tools/lldb-vscode/evaluate/main.cpp"}}],"totalFrames":2},"command":"stackTrace","request_seq":102,"seq":0,"success":true,"type":"response"} --> Content-Length: 120

Hide Details

{"command":"evaluate","type":"request","arguments":{"expression":"my_map","context":"hover","frameId":524288},"seq":103} <-- Content-Length: 221

Hide Details

{"body":{"result":" size=2","type":"std::map<int, int, std::less<int>, std::allocator<std::pair<const int, int> > >","variablesReference":8},"command":"evaluate","request_seq":103,"seq":0,"success":true,"type":"response"} --> Content-Length: 83

Hide Details

{"command":"continue","type":"request","arguments":{"threadId":12665778},"seq":104} <-- Content-Length: 117

Hide Details

{"body":{"allThreadsContinued":true},"command":"continue","request_seq":104,"seq":0,"success":true,"type":"response"} <-- Content-Length: 200

Hide Details

{"body":{"allThreadsStopped":true,"description":"breakpoint 6.1","preserveFocusHint":false,"reason":"breakpoint","threadCausedFocus":true,"threadId":12665778},"event":"stopped","seq":0,"type":"event"} --> Content-Length: 63

Hide Details

{"command":"threads","type":"request","arguments":{},"seq":105} <-- Content-Length: 136

Hide Details

{"body":{"threads":[{"id":12665778,"name":"Thread #1"}]},"command":"threads","request_seq":105,"seq":0,"success":true,"type":"response"} --> Content-Length: 111

Hide Details

{"command":"stackTrace","type":"request","arguments":{"threadId":12665778,"startFrame":0,"levels":1},"seq":106} <-- Content-Length: 332

Hide Details

{"body":{"stackFrames":[{"column":25,"id":524288,"line":44,"name":"main","source":{"name":"main.cpp","path":"/Users/buildslave/jenkins/workspace/lldb-cmake-sanitized/llvm-project/lldb/test/API/tools/lldb-vscode/evaluate/main.cpp"}}],"totalFrames":2},"command":"stackTrace","request_seq":106,"seq":0,"success":true,"type":"response"} --> Content-Length: 120

Hide Details

{"command":"evaluate","type":"request","arguments":{"expression":"my_map","context":"hover","frameId":524288},"seq":107} <-- Content-Length: 221

Hide Details

{"body":{"result":" size=3","type":"std::map<int, int, std::less<int>, std::allocator<std::pair<const int, int> > >","variablesReference":9},"command":"evaluate","request_seq":107,"seq":0,"success":true,"type":"response"} --> Content-Length: 111

Hide Details

{"command":"stackTrace","type":"request","arguments":{"threadId":12665778,"startFrame":0,"levels":1},"seq":108} <-- Content-Length: 332

Hide Details

{"body":{"stackFrames":[{"column":25,"id":524288,"line":44,"name":"main","source":{"name":"main.cpp","path":"/Users/buildslave/jenkins/workspace/lldb-cmake-sanitized/llvm-project/lldb/test/API/tools/lldb-vscode/evaluate/main.cpp"}}],"totalFrames":2},"command":"stackTrace","request_seq":108,"seq":0,"success":true,"type":"response"} --> Content-Length: 125

Hide Details

{"command":"evaluate","type":"request","arguments":{"expression":"my_bool_vec","context":"hover","frameId":524288},"seq":109} <-- Content-Length: 183

Hide Details

{"body":{"result":" size=1","type":"std::vector<bool, std::allocator<bool> >","variablesReference":10},"command":"evaluate","request_seq":109,"seq":0,"success":true,"type":"response"} --> Content-Length: 83

Hide Details

{"command":"continue","type":"request","arguments":{"threadId":12665778},"seq":110} <-- Content-Length: 117

Hide Details

{"body":{"allThreadsContinued":true},"command":"continue","request_seq":110,"seq":0,"success":true,"type":"response"} <-- Content-Length: 200

Hide Details

{"body":{"allThreadsStopped":true,"description":"breakpoint 7.1","preserveFocusHint":false,"reason":"breakpoint","threadCausedFocus":true,"threadId":12665778},"event":"stopped","seq":0,"type":"event"} --> Content-Length: 63

Hide Details

{"command":"threads","type":"request","arguments":{},"seq":111} <-- Content-Length: 136

Hide Details

{"body":{"threads":[{"id":12665778,"name":"Thread #1"}]},"command":"threads","request_seq":111,"seq":0,"success":true,"type":"response"} --> Content-Length: 111

Hide Details

{"command":"stackTrace","type":"request","arguments":{"threadId":12665778,"startFrame":0,"levels":1},"seq":112} <-- Content-Length: 332

Hide Details

{"body":{"stackFrames":[{"column":25,"id":524288,"line":45,"name":"main","source":{"name":"main.cpp","path":"/Users/buildslave/jenkins/workspace/lldb-cmake-sanitized/llvm-project/lldb/test/API/tools/lldb-vscode/evaluate/main.cpp"}}],"totalFrames":2},"command":"stackTrace","request_seq":112,"seq":0,"success":true,"type":"response"} --> Content-Length: 125

Hide Details

{"command":"evaluate","type":"request","arguments":{"expression":"my_bool_vec","context":"hover","frameId":524288},"seq":113} <-- Content-Length: 183

Hide Details

{"body":{"result":" size=2","type":"std::vector<bool, std::allocator<bool> >","variablesReference":11},"command":"evaluate","request_seq":113,"seq":0,"success":true,"type":"response"} --> Content-Length: 90

Hide Details

{"command":"disconnect","type":"request","arguments":{"terminateDebuggee":true},"seq":114} <-- Content-Length: 45

Hide Details

{"event":"terminated","seq":0,"type":"event"} <-- Content-Length: 63

Hide Details

{"body":{"exitCode":9},"event":"exited","seq":0,"type":"event"} <-- Content-Length: 83

Hide Details

{"command":"disconnect","request_seq":114,"seq":0,"success":true,"type":"response"}

Hide Details

========= END ========= ========= DEBUG ADAPTER PROTOCOL LOGS ========= --> Content-Length: 284

Hide Details

{"command":"initialize","type":"request","arguments":{"adapterID":"lldb-native","clientID":"vscode","columnsStartAt1":true,"linesStartAt1":true,"locale":"en-us","pathFormat":"path","supportsRunInTerminalRequest":true,"supportsVariablePaging":true,"supportsVariableType":true},"seq":1} <-- Content-Length: 1222

Hide Details

{"body":{"exceptionBreakpointFilters":[{"default":false,"filter":"cpp_catch","label":"C++ Catch"},{"default":false,"filter":"cpp_throw","label":"C++ Throw"},{"default":false,"filter":"objc_catch","label":"Objective C Catch"},{"default":false,"filter":"objc_throw","label":"Objective C Throw"},{"default":false,"filter":"swift_catch","label":"Swift Catch"},{"default":false,"filter":"swift_throw","label":"Swift Throw"}],"supportTerminateDebuggee":true,"supportsCompletionsRequest":false,"supportsConditionalBreakpoints":true,"supportsConfigurationDoneRequest":true,"supportsDelayedStackTraceLoading":true,"supportsEvaluateForHovers":true,"supportsExceptionInfoRequest":true,"supportsExceptionOptions":true,"supportsFunctionBreakpoints":true,"supportsGotoTargetsRequest":false,"supportsHitConditionalBreakpoints":true,"supportsLoadedSourcesRequest":false,"supportsModulesRequest":false,"supportsProgressReporting":true,"supportsRestartFrame":false,"supportsRestartRequest":false,"supportsRunInTerminalRequest":true,"supportsSetVariable":true,"supportsStepBack":false,"supportsStepInTargetsRequest":false,"supportsValueFormattingOptions":true},"command":"initialize","request_seq":1,"seq":0,"success":true,"type":"response"} --> Content-Length: 1040

Hide Details

{"command":"launch","type":"request","arguments":{"program":"/Users/buildslave/jenkins/workspace/lldb-cmake-sanitized/lldb-build/lldb-test-build.noindex/tools/lldb-vscode/evaluate/TestVSCode_evaluate.test_repl_evaluate_expressions/a.out","disableASLR":true,"initCommands":["settings clear -all","settings set symbols.enable-external-lookup false","settings set target.inherit-tcc true","settings set target.detach-on-error false","settings set target.auto-apply-fixits false","settings set plugin.process.gdb-remote.packet-timeout 60","settings set symbols.clang-modules-cache-path \"/Users/buildslave/jenkins/workspace/lldb-cmake-sanitized/lldb-build/lldb-test-build.noindex/module-cache-lldb/lldb-api\"","settings set use-color false","setting set target.prefer-dynamic-value no-dynamic-values","settings set target.env-vars ASAN_OPTIONS=detect_stack_use_after_return=1 DYLD_INSERT_LIBRARIES=/Users/buildslave/jenkins/workspace/lldb-cmake-sanitized/host-compiler/lib/clang/13.0.99/lib/darwin/libclang_rt.asan_osx_dynamic.dylib"]},"seq":2} <-- Content-Length: 923

Hide Details

{"body":{"category":"console","output":"Running initCommands:\n(lldb) settings clear -all\n(lldb) settings set symbols.enable-external-lookup false\n(lldb) settings set target.inherit-tcc true\n(lldb) settings set target.detach-on-error false\n(lldb) settings set target.auto-apply-fixits false\n(lldb) settings set plugin.process.gdb-remote.packet-timeout 60\n(lldb) settings set symbols.clang-modules-cache-path \"/Users/buildslave/jenkins/workspace/lldb-cmake-sanitized/lldb-build/lldb-test-build.noindex/module-cache-lldb/lldb-api\"\n(lldb) settings set use-color false\n(lldb) setting set target.prefer-dynamic-value no-dynamic-values\n(lldb) settings set target.env-vars ASAN_OPTIONS=detect_stack_use_after_return=1 DYLD_INSERT_LIBRARIES=/Users/buildslave/jenkins/workspace/lldb-cmake-sanitized/host-compiler/lib/clang/13.0.99/lib/darwin/libclang_rt.asan_osx_dynamic.dylib\n"},"event":"output","seq":0,"type":"event"} <-- Content-Length: 77

Hide Details

{"command":"launch","request_seq":2,"seq":0,"success":true,"type":"response"} <-- Content-Length: 305

Hide Details

{"body":{"isLocalProcess":true,"name":"/Users/buildslave/jenkins/workspace/lldb-cmake-sanitized/lldb-build/lldb-test-build.noindex/tools/lldb-vscode/evaluate/TestVSCode_evaluate.test_repl_evaluate_expressions/a.out","startMethod":"launch","systemProcessId":60397},"event":"process","seq":0,"type":"event"} <-- Content-Length: 46

Hide Details

{"event":"initialized","seq":0,"type":"event"} --> Content-Length: 276

Hide Details

{"command":"setBreakpoints","type":"request","arguments":{"source":{"name":"main.cpp","path":"main.cpp"},"sourceModified":false,"lines":"[23, 27, 11, 35, 40, 44, 45]","breakpoints":[{"line":23},{"line":27},{"line":11},{"line":35},{"line":40},{"line":44},{"line":45}]},"seq":3} <-- Content-Length: 684

Hide Details

{"body":{"breakpoints":[{"id":1,"line":23,"source":{"name":"main.cpp","path":"main.cpp"},"verified":true},{"id":2,"line":27,"source":{"name":"main.cpp","path":"main.cpp"},"verified":true},{"id":3,"line":11,"source":{"name":"main.cpp","path":"main.cpp"},"verified":true},{"id":4,"line":35,"source":{"name":"main.cpp","path":"main.cpp"},"verified":true},{"id":5,"line":40,"source":{"name":"main.cpp","path":"main.cpp"},"verified":true},{"id":6,"line":44,"source":{"name":"main.cpp","path":"main.cpp"},"verified":true},{"id":7,"line":45,"source":{"name":"main.cpp","path":"main.cpp"},"verified":true}]},"command":"setBreakpoints","request_seq":3,"seq":0,"success":true,"type":"response"} --> Content-Length: 71

Hide Details

{"command":"configurationDone","type":"request","arguments":{},"seq":4} <-- Content-Length: 88

Hide Details

{"command":"configurationDone","request_seq":4,"seq":0,"success":true,"type":"response"} <-- Content-Length: 200

Hide Details

{"body":{"allThreadsStopped":true,"description":"breakpoint 1.1","preserveFocusHint":false,"reason":"breakpoint","threadCausedFocus":true,"threadId":12666588},"event":"stopped","seq":0,"type":"event"} --> Content-Length: 61

Hide Details

{"command":"threads","type":"request","arguments":{},"seq":5} <-- Content-Length: 134

Hide Details

{"body":{"threads":[{"id":12666588,"name":"Thread #1"}]},"command":"threads","request_seq":5,"seq":0,"success":true,"type":"response"} --> Content-Length: 109

Hide Details

{"command":"stackTrace","type":"request","arguments":{"threadId":12666588,"startFrame":0,"levels":1},"seq":6} <-- Content-Length: 330

Hide Details

{"body":{"stackFrames":[{"column":14,"id":524288,"line":23,"name":"main","source":{"name":"main.cpp","path":"/Users/buildslave/jenkins/workspace/lldb-cmake-sanitized/llvm-project/lldb/test/API/tools/lldb-vscode/evaluate/main.cpp"}}],"totalFrames":3},"command":"stackTrace","request_seq":6,"seq":0,"success":true,"type":"response"} --> Content-Length: 115

Hide Details

{"command":"evaluate","type":"request","arguments":{"expression":"var1","context":"repl","frameId":524288},"seq":7} <-- Content-Length: 138

Hide Details

{"body":{"result":"20","type":"int","variablesReference":0},"command":"evaluate","request_seq":7,"seq":0,"success":true,"type":"response"} --> Content-Length: 109

Hide Details

{"command":"stackTrace","type":"request","arguments":{"threadId":12666588,"startFrame":0,"levels":1},"seq":8} <-- Content-Length: 330

Hide Details

{"body":{"stackFrames":[{"column":14,"id":524288,"line":23,"name":"main","source":{"name":"main.cpp","path":"/Users/buildslave/jenkins/workspace/lldb-cmake-sanitized/llvm-project/lldb/test/API/tools/lldb-vscode/evaluate/main.cpp"}}],"totalFrames":3},"command":"stackTrace","request_seq":8,"seq":0,"success":true,"type":"response"} --> Content-Length: 115

Hide Details

{"command":"evaluate","type":"request","arguments":{"expression":"var2","context":"repl","frameId":524288},"seq":9} <-- Content-Length: 138

Hide Details

{"body":{"result":"21","type":"int","variablesReference":0},"command":"evaluate","request_seq":9,"seq":0,"success":true,"type":"response"} --> Content-Length: 110

Hide Details

{"command":"stackTrace","type":"request","arguments":{"threadId":12666588,"startFrame":0,"levels":1},"seq":10} <-- Content-Length: 331

Hide Details

{"body":{"stackFrames":[{"column":14,"id":524288,"line":23,"name":"main","source":{"name":"main.cpp","path":"/Users/buildslave/jenkins/workspace/lldb-cmake-sanitized/llvm-project/lldb/test/API/tools/lldb-vscode/evaluate/main.cpp"}}],"totalFrames":3},"command":"stackTrace","request_seq":10,"seq":0,"success":true,"type":"response"} --> Content-Length: 122

Hide Details

{"command":"evaluate","type":"request","arguments":{"expression":"static_int","context":"repl","frameId":524288},"seq":11} <-- Content-Length: 139

Hide Details

{"body":{"result":"42","type":"int","variablesReference":0},"command":"evaluate","request_seq":11,"seq":0,"success":true,"type":"response"} --> Content-Length: 110

Hide Details

{"command":"stackTrace","type":"request","arguments":{"threadId":12666588,"startFrame":0,"levels":1},"seq":12} <-- Content-Length: 331

Hide Details

{"body":{"stackFrames":[{"column":14,"id":524288,"line":23,"name":"main","source":{"name":"main.cpp","path":"/Users/buildslave/jenkins/workspace/lldb-cmake-sanitized/llvm-project/lldb/test/API/tools/lldb-vscode/evaluate/main.cpp"}}],"totalFrames":3},"command":"stackTrace","request_seq":12,"seq":0,"success":true,"type":"response"} --> Content-Length: 126

Hide Details

{"command":"evaluate","type":"request","arguments":{"expression":"non_static_int","context":"repl","frameId":524288},"seq":13} <-- Content-Length: 139

Hide Details

{"body":{"result":"43","type":"int","variablesReference":0},"command":"evaluate","request_seq":13,"seq":0,"success":true,"type":"response"} --> Content-Length: 110

Hide Details

{"command":"stackTrace","type":"request","arguments":{"threadId":12666588,"startFrame":0,"levels":1},"seq":14} <-- Content-Length: 331

Hide Details

{"body":{"stackFrames":[{"column":14,"id":524288,"line":23,"name":"main","source":{"name":"main.cpp","path":"/Users/buildslave/jenkins/workspace/lldb-cmake-sanitized/llvm-project/lldb/test/API/tools/lldb-vscode/evaluate/main.cpp"}}],"totalFrames":3},"command":"stackTrace","request_seq":14,"seq":0,"success":true,"type":"response"} --> Content-Length: 119

Hide Details

{"command":"evaluate","type":"request","arguments":{"expression":"struct1","context":"repl","frameId":524288},"seq":15} <-- Content-Length: 169

Hide Details

{"body":{"result":"my_struct @ 0x7ffeefbff7c8","type":"my_struct","variablesReference":4},"command":"evaluate","request_seq":15,"seq":0,"success":true,"type":"response"} --> Content-Length: 110

Hide Details

{"command":"stackTrace","type":"request","arguments":{"threadId":12666588,"startFrame":0,"levels":1},"seq":16} <-- Content-Length: 331

Hide Details

{"body":{"stackFrames":[{"column":14,"id":524288,"line":23,"name":"main","source":{"name":"main.cpp","path":"/Users/buildslave/jenkins/workspace/lldb-cmake-sanitized/llvm-project/lldb/test/API/tools/lldb-vscode/evaluate/main.cpp"}}],"totalFrames":3},"command":"stackTrace","request_seq":16,"seq":0,"success":true,"type":"response"} --> Content-Length: 123

Hide Details

{"command":"evaluate","type":"request","arguments":{"expression":"struct1.foo","context":"repl","frameId":524288},"seq":17} <-- Content-Length: 139

Hide Details

{"body":{"result":"15","type":"int","variablesReference":0},"command":"evaluate","request_seq":17,"seq":0,"success":true,"type":"response"} --> Content-Length: 110

Hide Details

{"command":"stackTrace","type":"request","arguments":{"threadId":12666588,"startFrame":0,"levels":1},"seq":18} <-- Content-Length: 331

Hide Details

{"body":{"stackFrames":[{"column":14,"id":524288,"line":23,"name":"main","source":{"name":"main.cpp","path":"/Users/buildslave/jenkins/workspace/lldb-cmake-sanitized/llvm-project/lldb/test/API/tools/lldb-vscode/evaluate/main.cpp"}}],"totalFrames":3},"command":"stackTrace","request_seq":18,"seq":0,"success":true,"type":"response"} --> Content-Length: 124

Hide Details

{"command":"evaluate","type":"request","arguments":{"expression":"struct2->foo","context":"repl","frameId":524288},"seq":19} <-- Content-Length: 139

Hide Details

{"body":{"result":"16","type":"int","variablesReference":0},"command":"evaluate","request_seq":19,"seq":0,"success":true,"type":"response"} --> Content-Length: 110

Hide Details

{"command":"stackTrace","type":"request","arguments":{"threadId":12666588,"startFrame":0,"levels":1},"seq":20} <-- Content-Length: 331

Hide Details

{"body":{"stackFrames":[{"column":14,"id":524288,"line":23,"name":"main","source":{"name":"main.cpp","path":"/Users/buildslave/jenkins/workspace/lldb-cmake-sanitized/llvm-project/lldb/test/API/tools/lldb-vscode/evaluate/main.cpp"}}],"totalFrames":3},"command":"stackTrace","request_seq":20,"seq":0,"success":true,"type":"response"} --> Content-Length: 115

Hide Details

{"command":"evaluate","type":"request","arguments":{"expression":"var","context":"repl","frameId":524288},"seq":21} <-- Content-Length: 311

Hide Details

{"body":{"category":"console","output":"/Users/buildslave/jenkins/workspace/lldb-cmake-sanitized/llvm-project/lldb/tools/lldb-vscode/ProgressEvent.cpp:89:64: runtime error: load of value 829960214, which is not a valid value for type 'lldb_vscode::ProgressEventType'\n"},"event":"output","seq":0,"type":"event"} <-- Content-Length: 261

Hide Details

{"body":{"category":"console","output":"SUMMARY: UndefinedBehaviorSanitizer: undefined-behavior /Users/buildslave/jenkins/workspace/lldb-cmake-sanitized/llvm-project/lldb/tools/lldb-vscode/ProgressEvent.cpp:89:64 in \n"},"event":"output","seq":0,"type":"event"} <-- Content-Length: 170

Hide Details

{"body":{"category":"console","output":"PLEASE submit a bug report to https://bugs.llvm.org/ and include the crash backtrace.\n"},"event":"output","seq":0,"type":"event"}

Hide Details

========= END ========= ========= DEBUG ADAPTER PROTOCOL LOGS ========= --> Content-Length: 284

Hide Details

{"command":"initialize","type":"request","arguments":{"adapterID":"lldb-native","clientID":"vscode","columnsStartAt1":true,"linesStartAt1":true,"locale":"en-us","pathFormat":"path","supportsRunInTerminalRequest":true,"supportsVariablePaging":true,"supportsVariableType":true},"seq":1} <-- Content-Length: 1222

Hide Details

{"body":{"exceptionBreakpointFilters":[{"default":false,"filter":"cpp_catch","label":"C++ Catch"},{"default":false,"filter":"cpp_throw","label":"C++ Throw"},{"default":false,"filter":"objc_catch","label":"Objective C Catch"},{"default":false,"filter":"objc_throw","label":"Objective C Throw"},{"default":false,"filter":"swift_catch","label":"Swift Catch"},{"default":false,"filter":"swift_throw","label":"Swift Throw"}],"supportTerminateDebuggee":true,"supportsCompletionsRequest":false,"supportsConditionalBreakpoints":true,"supportsConfigurationDoneRequest":true,"supportsDelayedStackTraceLoading":true,"supportsEvaluateForHovers":true,"supportsExceptionInfoRequest":true,"supportsExceptionOptions":true,"supportsFunctionBreakpoints":true,"supportsGotoTargetsRequest":false,"supportsHitConditionalBreakpoints":true,"supportsLoadedSourcesRequest":false,"supportsModulesRequest":false,"supportsProgressReporting":true,"supportsRestartFrame":false,"supportsRestartRequest":false,"supportsRunInTerminalRequest":true,"supportsSetVariable":true,"supportsStepBack":false,"supportsStepInTargetsRequest":false,"supportsValueFormattingOptions":true},"command":"initialize","request_seq":1,"seq":0,"success":true,"type":"response"} --> Content-Length: 1041

Hide Details

{"command":"launch","type":"request","arguments":{"program":"/Users/buildslave/jenkins/workspace/lldb-cmake-sanitized/lldb-build/lldb-test-build.noindex/tools/lldb-vscode/evaluate/TestVSCode_evaluate.test_watch_evaluate_expressions/a.out","disableASLR":true,"initCommands":["settings clear -all","settings set symbols.enable-external-lookup false","settings set target.inherit-tcc true","settings set target.detach-on-error false","settings set target.auto-apply-fixits false","settings set plugin.process.gdb-remote.packet-timeout 60","settings set symbols.clang-modules-cache-path \"/Users/buildslave/jenkins/workspace/lldb-cmake-sanitized/lldb-build/lldb-test-build.noindex/module-cache-lldb/lldb-api\"","settings set use-color false","setting set target.prefer-dynamic-value no-dynamic-values","settings set target.env-vars ASAN_OPTIONS=detect_stack_use_after_return=1 DYLD_INSERT_LIBRARIES=/Users/buildslave/jenkins/workspace/lldb-cmake-sanitized/host-compiler/lib/clang/13.0.99/lib/darwin/libclang_rt.asan_osx_dynamic.dylib"]},"seq":2} <-- Content-Length: 923

Hide Details

{"body":{"category":"console","output":"Running initCommands:\n(lldb) settings clear -all\n(lldb) settings set symbols.enable-external-lookup false\n(lldb) settings set target.inherit-tcc true\n(lldb) settings set target.detach-on-error false\n(lldb) settings set target.auto-apply-fixits false\n(lldb) settings set plugin.process.gdb-remote.packet-timeout 60\n(lldb) settings set symbols.clang-modules-cache-path \"/Users/buildslave/jenkins/workspace/lldb-cmake-sanitized/lldb-build/lldb-test-build.noindex/module-cache-lldb/lldb-api\"\n(lldb) settings set use-color false\n(lldb) setting set target.prefer-dynamic-value no-dynamic-values\n(lldb) settings set target.env-vars ASAN_OPTIONS=detect_stack_use_after_return=1 DYLD_INSERT_LIBRARIES=/Users/buildslave/jenkins/workspace/lldb-cmake-sanitized/host-compiler/lib/clang/13.0.99/lib/darwin/libclang_rt.asan_osx_dynamic.dylib\n"},"event":"output","seq":0,"type":"event"} <-- Content-Length: 77

Hide Details

{"command":"launch","request_seq":2,"seq":0,"success":true,"type":"response"} <-- Content-Length: 306

Hide Details

{"body":{"isLocalProcess":true,"name":"/Users/buildslave/jenkins/workspace/lldb-cmake-sanitized/lldb-build/lldb-test-build.noindex/tools/lldb-vscode/evaluate/TestVSCode_evaluate.test_watch_evaluate_expressions/a.out","startMethod":"launch","systemProcessId":60452},"event":"process","seq":0,"type":"event"} <-- Content-Length: 46

Hide Details

{"event":"initialized","seq":0,"type":"event"} --> Content-Length: 276

Hide Details

{"command":"setBreakpoints","type":"request","arguments":{"source":{"name":"main.cpp","path":"main.cpp"},"sourceModified":false,"lines":"[23, 27, 11, 35, 40, 44, 45]","breakpoints":[{"line":23},{"line":27},{"line":11},{"line":35},{"line":40},{"line":44},{"line":45}]},"seq":3} <-- Content-Length: 684

Hide Details

{"body":{"breakpoints":[{"id":1,"line":23,"source":{"name":"main.cpp","path":"main.cpp"},"verified":true},{"id":2,"line":27,"source":{"name":"main.cpp","path":"main.cpp"},"verified":true},{"id":3,"line":11,"source":{"name":"main.cpp","path":"main.cpp"},"verified":true},{"id":4,"line":35,"source":{"name":"main.cpp","path":"main.cpp"},"verified":true},{"id":5,"line":40,"source":{"name":"main.cpp","path":"main.cpp"},"verified":true},{"id":6,"line":44,"source":{"name":"main.cpp","path":"main.cpp"},"verified":true},{"id":7,"line":45,"source":{"name":"main.cpp","path":"main.cpp"},"verified":true}]},"command":"setBreakpoints","request_seq":3,"seq":0,"success":true,"type":"response"} --> Content-Length: 71

Hide Details

{"command":"configurationDone","type":"request","arguments":{},"seq":4} <-- Content-Length: 88

Hide Details

{"command":"configurationDone","request_seq":4,"seq":0,"success":true,"type":"response"} <-- Content-Length: 200

Hide Details

{"body":{"allThreadsStopped":true,"description":"breakpoint 1.1","preserveFocusHint":false,"reason":"breakpoint","threadCausedFocus":true,"threadId":12667124},"event":"stopped","seq":0,"type":"event"} --> Content-Length: 61

Hide Details

{"command":"threads","type":"request","arguments":{},"seq":5} <-- Content-Length: 134

Hide Details

{"body":{"threads":[{"id":12667124,"name":"Thread #1"}]},"command":"threads","request_seq":5,"seq":0,"success":true,"type":"response"} --> Content-Length: 109

Hide Details

{"command":"stackTrace","type":"request","arguments":{"threadId":12667124,"startFrame":0,"levels":1},"seq":6} <-- Content-Length: 330

Hide Details

{"body":{"stackFrames":[{"column":14,"id":524288,"line":23,"name":"main","source":{"name":"main.cpp","path":"/Users/buildslave/jenkins/workspace/lldb-cmake-sanitized/llvm-project/lldb/test/API/tools/lldb-vscode/evaluate/main.cpp"}}],"totalFrames":2},"command":"stackTrace","request_seq":6,"seq":0,"success":true,"type":"response"} --> Content-Length: 116

Hide Details

{"command":"evaluate","type":"request","arguments":{"expression":"var1","context":"watch","frameId":524288},"seq":7} <-- Content-Length: 138

Hide Details

{"body":{"result":"20","type":"int","variablesReference":0},"command":"evaluate","request_seq":7,"seq":0,"success":true,"type":"response"} --> Content-Length: 109

Hide Details

{"command":"stackTrace","type":"request","arguments":{"threadId":12667124,"startFrame":0,"levels":1},"seq":8} <-- Content-Length: 330

Hide Details

{"body":{"stackFrames":[{"column":14,"id":524288,"line":23,"name":"main","source":{"name":"main.cpp","path":"/Users/buildslave/jenkins/workspace/lldb-cmake-sanitized/llvm-project/lldb/test/API/tools/lldb-vscode/evaluate/main.cpp"}}],"totalFrames":2},"command":"stackTrace","request_seq":8,"seq":0,"success":true,"type":"response"} --> Content-Length: 116

Hide Details

{"command":"evaluate","type":"request","arguments":{"expression":"var2","context":"watch","frameId":524288},"seq":9} <-- Content-Length: 138

Hide Details

{"body":{"result":"21","type":"int","variablesReference":0},"command":"evaluate","request_seq":9,"seq":0,"success":true,"type":"response"} --> Content-Length: 110

Hide Details

{"command":"stackTrace","type":"request","arguments":{"threadId":12667124,"startFrame":0,"levels":1},"seq":10} <-- Content-Length: 331

Hide Details

{"body":{"stackFrames":[{"column":14,"id":524288,"line":23,"name":"main","source":{"name":"main.cpp","path":"/Users/buildslave/jenkins/workspace/lldb-cmake-sanitized/llvm-project/lldb/test/API/tools/lldb-vscode/evaluate/main.cpp"}}],"totalFrames":2},"command":"stackTrace","request_seq":10,"seq":0,"success":true,"type":"response"} --> Content-Length: 123

Hide Details

{"command":"evaluate","type":"request","arguments":{"expression":"static_int","context":"watch","frameId":524288},"seq":11} <-- Content-Length: 139

Hide Details

{"body":{"result":"42","type":"int","variablesReference":0},"command":"evaluate","request_seq":11,"seq":0,"success":true,"type":"response"} --> Content-Length: 110

Hide Details

{"command":"stackTrace","type":"request","arguments":{"threadId":12667124,"startFrame":0,"levels":1},"seq":12} <-- Content-Length: 331

Hide Details

{"body":{"stackFrames":[{"column":14,"id":524288,"line":23,"name":"main","source":{"name":"main.cpp","path":"/Users/buildslave/jenkins/workspace/lldb-cmake-sanitized/llvm-project/lldb/test/API/tools/lldb-vscode/evaluate/main.cpp"}}],"totalFrames":2},"command":"stackTrace","request_seq":12,"seq":0,"success":true,"type":"response"} --> Content-Length: 127

Hide Details

{"command":"evaluate","type":"request","arguments":{"expression":"non_static_int","context":"watch","frameId":524288},"seq":13} <-- Content-Length: 139

Hide Details

{"body":{"result":"43","type":"int","variablesReference":0},"command":"evaluate","request_seq":13,"seq":0,"success":true,"type":"response"} --> Content-Length: 110

Hide Details

{"command":"stackTrace","type":"request","arguments":{"threadId":12667124,"startFrame":0,"levels":1},"seq":14} <-- Content-Length: 331

Hide Details

{"body":{"stackFrames":[{"column":14,"id":524288,"line":23,"name":"main","source":{"name":"main.cpp","path":"/Users/buildslave/jenkins/workspace/lldb-cmake-sanitized/llvm-project/lldb/test/API/tools/lldb-vscode/evaluate/main.cpp"}}],"totalFrames":2},"command":"stackTrace","request_seq":14,"seq":0,"success":true,"type":"response"} --> Content-Length: 120

Hide Details

{"command":"evaluate","type":"request","arguments":{"expression":"struct1","context":"watch","frameId":524288},"seq":15} <-- Content-Length: 169

Hide Details

{"body":{"result":"my_struct @ 0x7ffeefbff7c8","type":"my_struct","variablesReference":4},"command":"evaluate","request_seq":15,"seq":0,"success":true,"type":"response"} --> Content-Length: 110

Hide Details

{"command":"stackTrace","type":"request","arguments":{"threadId":12667124,"startFrame":0,"levels":1},"seq":16} <-- Content-Length: 331

Hide Details

{"body":{"stackFrames":[{"column":14,"id":524288,"line":23,"name":"main","source":{"name":"main.cpp","path":"/Users/buildslave/jenkins/workspace/lldb-cmake-sanitized/llvm-project/lldb/test/API/tools/lldb-vscode/evaluate/main.cpp"}}],"totalFrames":2},"command":"stackTrace","request_seq":16,"seq":0,"success":true,"type":"response"} --> Content-Length: 124

Hide Details

{"command":"evaluate","type":"request","arguments":{"expression":"struct1.foo","context":"watch","frameId":524288},"seq":17} <-- Content-Length: 139

Hide Details

{"body":{"result":"15","type":"int","variablesReference":0},"command":"evaluate","request_seq":17,"seq":0,"success":true,"type":"response"} --> Content-Length: 110

Hide Details

{"command":"stackTrace","type":"request","arguments":{"threadId":12667124,"startFrame":0,"levels":1},"seq":18} <-- Content-Length: 331

Hide Details

{"body":{"stackFrames":[{"column":14,"id":524288,"line":23,"name":"main","source":{"name":"main.cpp","path":"/Users/buildslave/jenkins/workspace/lldb-cmake-sanitized/llvm-project/lldb/test/API/tools/lldb-vscode/evaluate/main.cpp"}}],"totalFrames":2},"command":"stackTrace","request_seq":18,"seq":0,"success":true,"type":"response"} --> Content-Length: 125

Hide Details

{"command":"evaluate","type":"request","arguments":{"expression":"struct2->foo","context":"watch","frameId":524288},"seq":19} <-- Content-Length: 139

Hide Details

{"body":{"result":"16","type":"int","variablesReference":0},"command":"evaluate","request_seq":19,"seq":0,"success":true,"type":"response"} --> Content-Length: 110

Hide Details

{"command":"stackTrace","type":"request","arguments":{"threadId":12667124,"startFrame":0,"levels":1},"seq":20} <-- Content-Length: 331

Hide Details

{"body":{"stackFrames":[{"column":14,"id":524288,"line":23,"name":"main","source":{"name":"main.cpp","path":"/Users/buildslave/jenkins/workspace/lldb-cmake-sanitized/llvm-project/lldb/test/API/tools/lldb-vscode/evaluate/main.cpp"}}],"totalFrames":2},"command":"stackTrace","request_seq":20,"seq":0,"success":true,"type":"response"} --> Content-Length: 116

Hide Details

{"command":"evaluate","type":"request","arguments":{"expression":"var","context":"watch","frameId":524288},"seq":21} <-- Content-Length: 311

Hide Details

{"body":{"category":"console","output":"/Users/buildslave/jenkins/workspace/lldb-cmake-sanitized/llvm-project/lldb/tools/lldb-vscode/ProgressEvent.cpp:89:64: runtime error: load of value 829960214, which is not a valid value for type 'lldb_vscode::ProgressEventType'\n"},"event":"output","seq":0,"type":"event"} <-- Content-Length: 261

Hide Details

{"body":{"category":"console","output":"SUMMARY: UndefinedBehaviorSanitizer: undefined-behavior /Users/buildslave/jenkins/workspace/lldb-cmake-sanitized/llvm-project/lldb/tools/lldb-vscode/ProgressEvent.cpp:89:64 in \n"},"event":"output","seq":0,"type":"event"} <-- Content-Length: 170

Hide Details

{"body":{"category":"console","output":"PLEASE submit a bug report to https://bugs.llvm.org/ and include the crash backtrace.\n"},"event":"output","seq":0,"type":"event"}

Hide Details

========= END =========

Hide Details

-- Command Output (stderr): -- Change dir to: /Users/buildslave/jenkins/workspace/lldb-cmake-sanitized/llvm-project/lldb/test/API/tools/lldb-vscode/evaluate runCmd: settings clear -all output:

Hide Details

runCmd: settings set symbols.enable-external-lookup false output:

Hide Details

runCmd: settings set target.inherit-tcc true output:

Hide Details

runCmd: settings set target.detach-on-error false output:

Hide Details

runCmd: settings set target.auto-apply-fixits false output:

Hide Details

runCmd: settings set plugin.process.gdb-remote.packet-timeout 60 output:

Hide Details

runCmd: settings set symbols.clang-modules-cache-path "/Users/buildslave/jenkins/workspace/lldb-cmake-sanitized/lldb-build/lldb-test-build.noindex/module-cache-lldb/lldb-api" output:

Hide Details

runCmd: settings set use-color false output:

Hide Details

runCmd: setting set target.prefer-dynamic-value no-dynamic-values output:

Hide Details

runCmd: settings set target.env-vars ASAN_OPTIONS=detect_stack_use_after_return=1 DYLD_INSERT_LIBRARIES=/Users/buildslave/jenkins/workspace/lldb-cmake-sanitized/host-compiler/lib/clang/13.0.99/lib/darwin/libclang_rt.asan_osx_dynamic.dylib output:

Hide Details

Adding tearDown hook: def cleanup(): if disconnectAutomatically: self.vscode.request_disconnect(terminateDebuggee=True) self.vscode.terminate()

Hide Details

Hide Details

FAIL: LLDB (/Users/buildslave/jenkins/workspace/lldb-cmake-sanitized/host-compiler/bin/clang-x86_64) :: test_generic_evaluate_expressions (TestVSCode_evaluate.TestVSCode_variables) Executing tearDown hook: def cleanup(): if disconnectAutomatically: self.vscode.request_disconnect(terminateDebuggee=True) self.vscode.terminate()

Hide Details

Hide Details

CLEANUP ERROR: LLDB (/Users/buildslave/jenkins/workspace/lldb-cmake-sanitized/host-compiler/bin/clang-x86_64) :: test_generic_evaluate_expressions (TestVSCode_evaluate.TestVSCode_variables) Traceback (most recent call last): File "/Users/buildslave/jenkins/workspace/lldb-cmake-sanitized/llvm-project/lldb/third_party/Python/module/unittest2/unittest2/case.py", line 386, in run self.tearDown() File "/Users/buildslave/jenkins/workspace/lldb-cmake-sanitized/llvm-project/lldb/packages/Python/lldbsuite/test/lldbtest.py", line 2095, in tearDown Base.tearDown(self) File "/Users/buildslave/jenkins/workspace/lldb-cmake-sanitized/llvm-project/lldb/packages/Python/lldbsuite/test/lldbtest.py", line 1065, in tearDown hook() # try the plain call and hope it works File "/Users/buildslave/jenkins/workspace/lldb-cmake-sanitized/llvm-project/lldb/packages/Python/lldbsuite/test/tools/lldb-vscode/lldbvscode_testcase.py", line 294, in cleanup self.vscode.request_disconnect(terminateDebuggee=True) File "/Users/buildslave/jenkins/workspace/lldb-cmake-sanitized/llvm-project/lldb/packages/Python/lldbsuite/test/tools/lldb-vscode/vscode.py", line 590, in request_disconnect return self.send_recv(command_dict) File "/Users/buildslave/jenkins/workspace/lldb-cmake-sanitized/llvm-project/lldb/packages/Python/lldbsuite/test/tools/lldb-vscode/vscode.py", line 315, in send_recv self.send_packet(command) File "/Users/buildslave/jenkins/workspace/lldb-cmake-sanitized/llvm-project/lldb/packages/Python/lldbsuite/test/tools/lldb-vscode/vscode.py", line 271, in send_packet self.send.flush() BrokenPipeError: [Errno 32] Broken pipe

Hide Details

runCmd: settings clear -all output:

Hide Details

runCmd: settings set symbols.enable-external-lookup false output:

Hide Details

runCmd: settings set target.inherit-tcc true output:

Hide Details

runCmd: settings set target.detach-on-error false output:

Hide Details

runCmd: settings set target.auto-apply-fixits false output:

Hide Details

runCmd: settings set plugin.process.gdb-remote.packet-timeout 60 output:

Hide Details

runCmd: settings set symbols.clang-modules-cache-path "/Users/buildslave/jenkins/workspace/lldb-cmake-sanitized/lldb-build/lldb-test-build.noindex/module-cache-lldb/lldb-api" output:

Hide Details

runCmd: settings set use-color false output:

Hide Details

runCmd: setting set target.prefer-dynamic-value no-dynamic-values output:

Hide Details

runCmd: settings set target.env-vars ASAN_OPTIONS=detect_stack_use_after_return=1 DYLD_INSERT_LIBRARIES=/Users/buildslave/jenkins/workspace/lldb-cmake-sanitized/host-compiler/lib/clang/13.0.99/lib/darwin/libclang_rt.asan_osx_dynamic.dylib output:

Hide Details

Adding tearDown hook: def cleanup(): if disconnectAutomatically: self.vscode.request_disconnect(terminateDebuggee=True) self.vscode.terminate()

Hide Details

Hide Details

Executing tearDown hook: def cleanup(): if disconnectAutomatically: self.vscode.request_disconnect(terminateDebuggee=True) self.vscode.terminate()

Hide Details

Hide Details

PASS: LLDB (/Users/buildslave/jenkins/workspace/lldb-cmake-sanitized/host-compiler/bin/clang-x86_64) :: test_hover_evaluate_expressions (TestVSCode_evaluate.TestVSCode_variables) runCmd: settings clear -all output:

Hide Details

runCmd: settings set symbols.enable-external-lookup false output:

Hide Details

runCmd: settings set target.inherit-tcc true output:

Hide Details

runCmd: settings set target.detach-on-error false output:

Hide Details

runCmd: settings set target.auto-apply-fixits false output:

Hide Details

runCmd: settings set plugin.process.gdb-remote.packet-timeout 60 output:

Hide Details

runCmd: settings set symbols.clang-modules-cache-path "/Users/buildslave/jenkins/workspace/lldb-cmake-sanitized/lldb-build/lldb-test-build.noindex/module-cache-lldb/lldb-api" output:

Hide Details

runCmd: settings set use-color false output:

Hide Details

runCmd: setting set target.prefer-dynamic-value no-dynamic-values output:

Hide Details

runCmd: settings set target.env-vars ASAN_OPTIONS=detect_stack_use_after_return=1 DYLD_INSERT_LIBRARIES=/Users/buildslave/jenkins/workspace/lldb-cmake-sanitized/host-compiler/lib/clang/13.0.99/lib/darwin/libclang_rt.asan_osx_dynamic.dylib output:

Hide Details

Adding tearDown hook: def cleanup(): if disconnectAutomatically: self.vscode.request_disconnect(terminateDebuggee=True) self.vscode.terminate()

Hide Details

Hide Details

FAIL: LLDB (/Users/buildslave/jenkins/workspace/lldb-cmake-sanitized/host-compiler/bin/clang-x86_64) :: test_repl_evaluate_expressions (TestVSCode_evaluate.TestVSCode_variables) Executing tearDown hook: def cleanup(): if disconnectAutomatically: self.vscode.request_disconnect(terminateDebuggee=True) self.vscode.terminate()

Hide Details

Hide Details

CLEANUP ERROR: LLDB (/Users/buildslave/jenkins/workspace/lldb-cmake-sanitized/host-compiler/bin/clang-x86_64) :: test_repl_evaluate_expressions (TestVSCode_evaluate.TestVSCode_variables) Traceback (most recent call last): File "/Users/buildslave/jenkins/workspace/lldb-cmake-sanitized/llvm-project/lldb/third_party/Python/module/unittest2/unittest2/case.py", line 386, in run self.tearDown() File "/Users/buildslave/jenkins/workspace/lldb-cmake-sanitized/llvm-project/lldb/packages/Python/lldbsuite/test/lldbtest.py", line 2095, in tearDown Base.tearDown(self) File "/Users/buildslave/jenkins/workspace/lldb-cmake-sanitized/llvm-project/lldb/packages/Python/lldbsuite/test/lldbtest.py", line 1065, in tearDown hook() # try the plain call and hope it works File "/Users/buildslave/jenkins/workspace/lldb-cmake-sanitized/llvm-project/lldb/packages/Python/lldbsuite/test/tools/lldb-vscode/lldbvscode_testcase.py", line 294, in cleanup self.vscode.request_disconnect(terminateDebuggee=True) File "/Users/buildslave/jenkins/workspace/lldb-cmake-sanitized/llvm-project/lldb/packages/Python/lldbsuite/test/tools/lldb-vscode/vscode.py", line 590, in request_disconnect return self.send_recv(command_dict) File "/Users/buildslave/jenkins/workspace/lldb-cmake-sanitized/llvm-project/lldb/packages/Python/lldbsuite/test/tools/lldb-vscode/vscode.py", line 315, in send_recv self.send_packet(command) File "/Users/buildslave/jenkins/workspace/lldb-cmake-sanitized/llvm-project/lldb/packages/Python/lldbsuite/test/tools/lldb-vscode/vscode.py", line 271, in send_packet self.send.flush() BrokenPipeError: [Errno 32] Broken pipe

Hide Details

runCmd: settings clear -all output:

Hide Details

runCmd: settings set symbols.enable-external-lookup false output:

Hide Details

runCmd: settings set target.inherit-tcc true output:

Hide Details

runCmd: settings set target.detach-on-error false output:

Hide Details

runCmd: settings set target.auto-apply-fixits false output:

Hide Details

runCmd: settings set plugin.process.gdb-remote.packet-timeout 60 output:

Hide Details

runCmd: settings set symbols.clang-modules-cache-path "/Users/buildslave/jenkins/workspace/lldb-cmake-sanitized/lldb-build/lldb-test-build.noindex/module-cache-lldb/lldb-api" output:

Hide Details

runCmd: settings set use-color false output:

Hide Details

runCmd: setting set target.prefer-dynamic-value no-dynamic-values output:

Hide Details

runCmd: settings set target.env-vars ASAN_OPTIONS=detect_stack_use_after_return=1 DYLD_INSERT_LIBRARIES=/Users/buildslave/jenkins/workspace/lldb-cmake-sanitized/host-compiler/lib/clang/13.0.99/lib/darwin/libclang_rt.asan_osx_dynamic.dylib output:

Hide Details

Adding tearDown hook: def cleanup(): if disconnectAutomatically: self.vscode.request_disconnect(terminateDebuggee=True) self.vscode.terminate()

Hide Details

Hide Details

FAIL: LLDB (/Users/buildslave/jenkins/workspace/lldb-cmake-sanitized/host-compiler/bin/clang-x86_64) :: test_watch_evaluate_expressions (TestVSCode_evaluate.TestVSCode_variables) Executing tearDown hook: def cleanup(): if disconnectAutomatically: self.vscode.request_disconnect(terminateDebuggee=True) self.vscode.terminate()

Hide Details

Hide Details

CLEANUP ERROR: LLDB (/Users/buildslave/jenkins/workspace/lldb-cmake-sanitized/host-compiler/bin/clang-x86_64) :: test_watch_evaluate_expressions (TestVSCode_evaluate.TestVSCode_variables) Traceback (most recent call last): File "/Users/buildslave/jenkins/workspace/lldb-cmake-sanitized/llvm-project/lldb/third_party/Python/module/unittest2/unittest2/case.py", line 386, in run self.tearDown() File "/Users/buildslave/jenkins/workspace/lldb-cmake-sanitized/llvm-project/lldb/packages/Python/lldbsuite/test/lldbtest.py", line 2095, in tearDown Base.tearDown(self) File "/Users/buildslave/jenkins/workspace/lldb-cmake-sanitized/llvm-project/lldb/packages/Python/lldbsuite/test/lldbtest.py", line 1065, in tearDown hook() # try the plain call and hope it works File "/Users/buildslave/jenkins/workspace/lldb-cmake-sanitized/llvm-project/lldb/packages/Python/lldbsuite/test/tools/lldb-vscode/lldbvscode_testcase.py", line 294, in cleanup self.vscode.request_disconnect(terminateDebuggee=True) File "/Users/buildslave/jenkins/workspace/lldb-cmake-sanitized/llvm-project/lldb/packages/Python/lldbsuite/test/tools/lldb-vscode/vscode.py", line 590, in request_disconnect return self.send_recv(command_dict) File "/Users/buildslave/jenkins/workspace/lldb-cmake-sanitized/llvm-project/lldb/packages/Python/lldbsuite/test/tools/lldb-vscode/vscode.py", line 315, in send_recv self.send_packet(command) File "/Users/buildslave/jenkins/workspace/lldb-cmake-sanitized/llvm-project/lldb/packages/Python/lldbsuite/test/tools/lldb-vscode/vscode.py", line 271, in send_packet self.send.flush() BrokenPipeError: [Errno 32] Broken pipe

Hide Details

Restore dir to: /Users/buildslave/jenkins/workspace/lldb-cmake-sanitized/lldb-build/tools/lldb/test ====================================================================== ERROR: test_generic_evaluate_expressions (TestVSCode_evaluate.TestVSCode_variables) ---------------------------------------------------------------------- Traceback (most recent call last): File "/Users/buildslave/jenkins/workspace/lldb-cmake-sanitized/llvm-project/lldb/test/API/tools/lldb-vscode/evaluate/TestVSCode_evaluate.py", line 157, in test_generic_evaluate_expressions self.run_test_evaluate_expressions() File "/Users/buildslave/jenkins/workspace/lldb-cmake-sanitized/llvm-project/lldb/test/API/tools/lldb-vscode/evaluate/TestVSCode_evaluate.py", line 60, in run_test_evaluate_expressions self.assertEvaluateFailure("var") # local variable of a_function File "/Users/buildslave/jenkins/workspace/lldb-cmake-sanitized/llvm-project/lldb/test/API/tools/lldb-vscode/evaluate/TestVSCode_evaluate.py", line 24, in assertEvaluateFailure self.vscode.request_evaluate(expression, context=self.context)['body']) File "/Users/buildslave/jenkins/workspace/lldb-cmake-sanitized/llvm-project/lldb/packages/Python/lldbsuite/test/tools/lldb-vscode/vscode.py", line 607, in request_evaluate return self.send_recv(command_dict) File "/Users/buildslave/jenkins/workspace/lldb-cmake-sanitized/llvm-project/lldb/packages/Python/lldbsuite/test/tools/lldb-vscode/vscode.py", line 321, in send_recv raise ValueError(desc) ValueError: no response for "evaluate" Config=x86_64-/Users/buildslave/jenkins/workspace/lldb-cmake-sanitized/host-compiler/bin/clang ====================================================================== ERROR: test_repl_evaluate_expressions (TestVSCode_evaluate.TestVSCode_variables) ---------------------------------------------------------------------- Traceback (most recent call last): File "/Users/buildslave/jenkins/workspace/lldb-cmake-sanitized/llvm-project/lldb/test/API/tools/lldb-vscode/evaluate/TestVSCode_evaluate.py", line 163, in test_repl_evaluate_expressions self.run_test_evaluate_expressions("repl") File "/Users/buildslave/jenkins/workspace/lldb-cmake-sanitized/llvm-project/lldb/test/API/tools/lldb-vscode/evaluate/TestVSCode_evaluate.py", line 60, in run_test_evaluate_expressions self.assertEvaluateFailure("var") # local variable of a_function File "/Users/buildslave/jenkins/workspace/lldb-cmake-sanitized/llvm-project/lldb/test/API/tools/lldb-vscode/evaluate/TestVSCode_evaluate.py", line 24, in assertEvaluateFailure self.vscode.request_evaluate(expression, context=self.context)['body']) File "/Users/buildslave/jenkins/workspace/lldb-cmake-sanitized/llvm-project/lldb/packages/Python/lldbsuite/test/tools/lldb-vscode/vscode.py", line 607, in request_evaluate return self.send_recv(command_dict) File "/Users/buildslave/jenkins/workspace/lldb-cmake-sanitized/llvm-project/lldb/packages/Python/lldbsuite/test/tools/lldb-vscode/vscode.py", line 321, in send_recv raise ValueError(desc) ValueError: no response for "evaluate" Config=x86_64-/Users/buildslave/jenkins/workspace/lldb-cmake-sanitized/host-compiler/bin/clang ====================================================================== ERROR: test_watch_evaluate_expressions (TestVSCode_evaluate.TestVSCode_variables) ---------------------------------------------------------------------- Traceback (most recent call last): File "/Users/buildslave/jenkins/workspace/lldb-cmake-sanitized/llvm-project/lldb/test/API/tools/lldb-vscode/evaluate/TestVSCode_evaluate.py", line 169, in test_watch_evaluate_expressions self.run_test_evaluate_expressions("watch") File "/Users/buildslave/jenkins/workspace/lldb-cmake-sanitized/llvm-project/lldb/test/API/tools/lldb-vscode/evaluate/TestVSCode_evaluate.py", line 60, in run_test_evaluate_expressions self.assertEvaluateFailure("var") # local variable of a_function File "/Users/buildslave/jenkins/workspace/lldb-cmake-sanitized/llvm-project/lldb/test/API/tools/lldb-vscode/evaluate/TestVSCode_evaluate.py", line 24, in assertEvaluateFailure self.vscode.request_evaluate(expression, context=self.context)['body']) File "/Users/buildslave/jenkins/workspace/lldb-cmake-sanitized/llvm-project/lldb/packages/Python/lldbsuite/test/tools/lldb-vscode/vscode.py", line 607, in request_evaluate return self.send_recv(command_dict) File "/Users/buildslave/jenkins/workspace/lldb-cmake-sanitized/llvm-project/lldb/packages/Python/lldbsuite/test/tools/lldb-vscode/vscode.py", line 321, in send_recv raise ValueError(desc) ValueError: no response for "evaluate" Config=x86_64-/Users/buildslave/jenkins/workspace/lldb-cmake-sanitized/host-compiler/bin/clang ---------------------------------------------------------------------- Ran 4 tests in 15.524s

Hide Details

RESULT: FAILED (1 passes, 0 failures, 3 errors, 0 skipped, 0 expected failures, 0 unexpected successes)

Hide Details

--

Hide Details

******************** PASS: lldb-api :: commands/disassemble/basic/TestFrameDisassemble.py (1723 of 2355) PASS: lldb-unit :: Core/./LLDBCoreTests/FormatEntityTest.DefinitionConstructionNameAndType (1724 of 2355) PASS: lldb-shell :: SymbolFile/DWARF/x86/array-sizes.s (1725 of 2355) PASS: lldb-shell :: ScriptInterpreter/Python/sb_address_exception.test (1726 of 2355) PASS: lldb-api :: functionalities/data-formatter/boolreference/TestFormattersBoolRefPtr.py (1727 of 2355) PASS: lldb-api :: functionalities/thread/concurrent_events/TestConcurrentDelayedCrashWithBreakpointWatchpoint.py (1728 of 2355) PASS: lldb-unit :: Symbol/./SymbolTests/LineEntryTest.GetSameLineContiguousAddressRangeNestedInline (1729 of 2355) PASS: lldb-api :: python_api/lldbutil/process/TestPrintStackTraces.py (1730 of 2355) PASS: lldb-unit :: Utility/./UtilityTests/BinaryStreamTest.PutULEB128TwoBytes (1731 of 2355) PASS: lldb-unit :: Process/gdb-remote/./ProcessGdbRemoteTests/PortMapTest.AllowPort (1732 of 2355) PASS: lldb-unit :: Core/./LLDBCoreTests/StreamCallbackTest.Callback (1733 of 2355) PASS: lldb-api :: commands/expression/argument_passing_restrictions/TestArgumentPassingRestrictions.py (1734 of 2355) PASS: lldb-api :: functionalities/data-formatter/data-formatter-objc/TestDataFormatterObjCCF.py (1735 of 2355) PASS: lldb-unit :: Utility/./UtilityTests/StreamTest.PutChar (1736 of 2355) PASS: lldb-unit :: Utility/./UtilityTests/SerializationRountripTest.SerializeDeserializeCStringArrayNullptrElem (1737 of 2355) PASS: lldb-api :: commands/expression/context-object-objc/TestContextObjectObjc.py (1738 of 2355) PASS: lldb-api :: lang/cpp/elaborated-types/TestElaboratedTypes.py (1739 of 2355) PASS: lldb-unit :: Utility/./UtilityTests/StringListTest.AppendList (1740 of 2355) UNSUPPORTED: lldb-api :: functionalities/data-formatter/data-formatter-stl/libstdcpp/map/TestDataFormatterStdMap.py (1741 of 2355) PASS: lldb-unit :: Utility/./UtilityTests/DataExtractorTest.GetFloat (1742 of 2355) PASS: lldb-api :: commands/expression/ignore-artificial-constructors/TestIgnoreArtificialConstructors.py (1743 of 2355) PASS: lldb-unit :: SymbolFile/DWARF/./SymbolFileDWARFTests/SymbolFileDWARFTests.TestAbbrevValidAttrNullForm (1744 of 2355) PASS: lldb-unit :: Process/gdb-remote/./ProcessGdbRemoteTests/GDBRemoteCommunicationServerTest.SendErrorResponse_UnimplementedError (1745 of 2355) PASS: lldb-api :: functionalities/fat_archives/TestFatArchives.py (1746 of 2355) PASS: lldb-shell :: Breakpoint/debug_rnglist_rlestartend.test (1747 of 2355) PASS: lldb-unit :: Utility/./UtilityTests/XcodeSDKTest.ParseTest (1748 of 2355) PASS: lldb-api :: functionalities/breakpoint/breakpoint_command/TestBreakpointCommandsFromPython.py (1749 of 2355) PASS: lldb-unit :: Utility/./UtilityTests/UUIDTest.StringConverion (1750 of 2355) PASS: lldb-unit :: Utility/./UtilityTests/XcodeSDKTest.MergeTest (1751 of 2355) PASS: lldb-unit :: Process/minidump/./LLDBMinidumpTests/MinidumpParserTest.MinidumpModuleOrder (1752 of 2355) PASS: lldb-api :: lang/cpp/unsigned_types/TestUnsignedTypes.py (1753 of 2355) PASS: lldb-unit :: Utility/./UtilityTests/DataExtractorTest.GetMaxU64 (1754 of 2355) PASS: lldb-api :: lang/objcxx/hide-runtime-values/TestObjCXXHideRuntimeValues.py (1755 of 2355) PASS: lldb-unit :: Utility/./UtilityTests/StringListTest.AppendStringStdString (1756 of 2355) UNSUPPORTED: lldb-api :: lang/objc/objc-dynamic-value/TestObjCDynamicValue.py (1757 of 2355) PASS: lldb-unit :: Core/./LLDBCoreTests/DumpDataExtractorTest.FormatCharArray (1758 of 2355) PASS: lldb-api :: commands/expression/radar_8638051/Test8638051.py (1759 of 2355) PASS: lldb-unit :: Utility/./UtilityTests/StructuredDataTest.ParseJSONFromFile (1760 of 2355) PASS: lldb-api :: types/TestShortTypeExpr.py (1761 of 2355) PASS: lldb-unit :: Utility/./UtilityTests/Flags.Test (1762 of 2355) PASS: lldb-api :: functionalities/data-formatter/data-formatter-stl/libcxx/unique_ptr/TestDataFormatterLibcxxUniquePtr.py (1763 of 2355) XFAIL: lldb-shell :: Register/x86-64-write.test (1764 of 2355) PASS: lldb-unit :: Utility/./UtilityTests/ProcessInfoTest.Constructor (1765 of 2355) PASS: lldb-shell :: Reproducer/Functionalities/TestExpressionEvaluation.test (1766 of 2355) PASS: lldb-shell :: ObjectFile/PECOFF/basic-info-arm.yaml (1767 of 2355) PASS: lldb-unit :: Target/./TargetTests/ModuleCacheTest.GetAndPut (1768 of 2355) PASS: lldb-api :: commands/watchpoints/watchpoint_on_vectors/TestValueOfVectorVariable.py (1769 of 2355) PASS: lldb-unit :: ScriptInterpreter/Python/./ScriptInterpreterPythonTests/PythonDataObjectsTest.TestResetting (1770 of 2355) PASS: lldb-api :: tools/lldb-server/TestGdbRemoteSingleStep.py (1771 of 2355) PASS: lldb-api :: functionalities/step_scripted/TestStepScripted.py (1772 of 2355) PASS: lldb-shell :: Register/Core/x86-64-netbsd-gp.test (1773 of 2355) PASS: lldb-unit :: Host/./HostTests/HostInfoTest.GetAugmentedArchSpec (1774 of 2355) PASS: lldb-api :: functionalities/memory/tag/TestMemoryTag.py (1775 of 2355) PASS: lldb-unit :: Utility/./UtilityTests/OptionsWithRawTest.LeadingSpaceArgs (1776 of 2355) PASS: lldb-api :: functionalities/data-formatter/ostypeformatting/TestFormattersOsType.py (1777 of 2355) PASS: lldb-unit :: Utility/./UtilityTests/UriParserTest.PortOverflow (1778 of 2355) PASS: lldb-api :: commands/settings/quoting/TestQuoting.py (1779 of 2355) PASS: lldb-api :: functionalities/scripted_process/TestScriptedProcess.py (1780 of 2355) PASS: lldb-unit :: Utility/./UtilityTests/StringExtractorTest.GetHexBytes (1781 of 2355) PASS: lldb-unit :: ObjectFile/MachO/./ObjectFileMachOTests/ObjectFileMachOTest.ModuleFromSharedCacheInfo (1782 of 2355) UNSUPPORTED: lldb-shell :: Unwind/basic-block-sections.test (1783 of 2355) PASS: lldb-unit :: Utility/./UtilityTests/StreamTest.PutHex64ByteOrderLittle (1784 of 2355) PASS: lldb-unit :: Language/CPlusPlus/./LanguageCPlusPlusTests/CPlusPlusLanguage.CPlusPlusNameParser (1785 of 2355) PASS: lldb-unit :: Utility/./UtilityTests/StringListTest.SplitIntoLines (1786 of 2355) PASS: lldb-api :: commands/expression/import-std-module/deque-basic/TestDequeFromStdModule.py (1787 of 2355) PASS: lldb-api :: lang/objc/objc_direct-methods/TestObjCDirectMethods.py (1788 of 2355) PASS: lldb-unit :: Utility/./UtilityTests/StringListTest.ForRange (1789 of 2355) PASS: lldb-unit :: SymbolFile/DWARF/./SymbolFileDWARFTests/DWARFUnitTest.NullUnitDie (1790 of 2355) PASS: lldb-api :: functionalities/gdb_remote_client/TestGDBRemoteDiskFileCompletion.py (1791 of 2355) PASS: lldb-unit :: Utility/./UtilityTests/StringListTest.InsertStringAtIndexStart (1792 of 2355) PASS: lldb-unit :: UnwindAssembly/x86/./UnwindAssemblyx86Tests/Testx86AssemblyInspectionEngine.TestSubESP (1793 of 2355) PASS: lldb-shell :: Reproducer/Functionalities/TestStepping.test (1794 of 2355) PASS: lldb-api :: lang/c/strings/TestCStrings.py (1795 of 2355) PASS: lldb-api :: lang/objc/foundation/TestObjCMethodsNSError.py (1796 of 2355) PASS: lldb-unit :: Utility/./UtilityTests/AnsiTerminal.Basic (1797 of 2355) PASS: lldb-shell :: SymbolFile/DWARF/x86/DW_AT_data_bit_offset-DW_OP_stack_value.s (1798 of 2355) PASS: lldb-api :: lang/objc/foundation/TestObjCMethods.py (1799 of 2355) PASS: lldb-unit :: Process/minidump/./LLDBMinidumpTests/RegisterContextMinidump.ConvertMinidumpContext_x86_32 (1800 of 2355) PASS: lldb-shell :: Reproducer/TestFileRepro.test (1801 of 2355) PASS: lldb-unit :: Process/gdb-remote/./ProcessGdbRemoteTests/PortMapTest.FreePort (1802 of 2355) UNSUPPORTED: lldb-api :: functionalities/darwin_log/filter/regex/activity/TestDarwinLogFilterRegexActivity.py (1803 of 2355) PASS: lldb-api :: macosx/lc-note/firmware-corefile/TestFirmwareCorefiles.py (1804 of 2355) PASS: lldb-unit :: Utility/./UtilityTests/ArchSpecTest.TestSetTriple (1805 of 2355) PASS: lldb-unit :: Core/./LLDBCoreTests/MangledTest.EmptyForInvalidName (1806 of 2355) PASS: lldb-unit :: Process/gdb-remote/./ProcessGdbRemoteTests/GDBRemoteCommunicationClientTest.WriteRegisterNoSuffix (1807 of 2355) PASS: lldb-unit :: Process/minidump/./LLDBMinidumpTests/MinidumpParserTest.GetLinuxProcStatus_no_stream (1808 of 2355) UNSUPPORTED: lldb-shell :: ScriptInterpreter/Lua/independent_state.test (1809 of 2355) PASS: lldb-api :: lang/cpp/unicode-literals/TestUnicodeLiterals.py (1810 of 2355) PASS: lldb-shell :: Reproducer/TestCrash.test (1811 of 2355) PASS: lldb-api :: functionalities/thread/concurrent_events/TestConcurrentTwoWatchpointsOneBreakpoint.py (1812 of 2355) PASS: lldb-api :: commands/expression/import-std-module/forward_list-dbg-info-content/TestDbgInfoContentForwardListFromStdModule.py (1813 of 2355) PASS: lldb-api :: tools/lldb-vscode/console/TestVSCode_redirection_to_console.py (1814 of 2355) UNSUPPORTED: lldb-api :: arm/breakpoint-it/TestBreakpointIt.py (1815 of 2355) PASS: lldb-unit :: DataFormatter/./LLDBFormatterTests/TypeMatcherTests.RegexName (1816 of 2355) PASS: lldb-unit :: Utility/./UtilityTests/StreamTest.PutHex64ByteOrderBig (1817 of 2355) PASS: lldb-api :: commands/register/register/register_command/TestRegisters.py (1818 of 2355) PASS: lldb-unit :: Process/gdb-remote/./ProcessGdbRemoteTests/PortMapTest.Constructors (1819 of 2355) PASS: lldb-api :: lang/c/offsetof/TestOffsetof.py (1820 of 2355) PASS: lldb-unit :: ObjectFile/ELF/./ObjectFileELFTests/ObjectFileELFTest.GetSymtab_NoSymEntryPointArmThumbAddressClass (1821 of 2355) PASS: lldb-api :: lang/mixed/TestMixedLanguages.py (1822 of 2355) PASS: lldb-unit :: tools/lldb-server/tests/./LLDBServerTests/TestBase.DebugserverEnv (1823 of 2355) PASS: lldb-shell :: ObjectFile/ELF/compressed-sections.yaml (1824 of 2355) PASS: lldb-api :: functionalities/stop-on-sharedlibrary-load/TestStopOnSharedlibraryEvents.py (1825 of 2355) PASS: lldb-shell :: SymbolFile/Breakpad/unwind-via-raSearch.test (1826 of 2355) PASS: lldb-unit :: Utility/./UtilityTests/ScalarTest.LongLongAssigmentOperator (1827 of 2355) PASS: lldb-api :: functionalities/unwind/noreturn/module-end/TestNoReturnModuleEnd.py (1828 of 2355) PASS: lldb-api :: commands/version/TestVersion.py (1829 of 2355) PASS: lldb-api :: functionalities/dynamic_value_child_count/TestDynamicValueChildCount.py (1830 of 2355) PASS: lldb-unit :: Expression/./ExpressionTests/CppModuleConfigurationTest.IgnoreLibStdCpp (1831 of 2355) PASS: lldb-unit :: Core/./LLDBCoreTests/MangledTest.ResultForValidName (1832 of 2355) PASS: lldb-unit :: Utility/./UtilityTests/PassiveReplayTest.InstrumentedFoo (1833 of 2355) PASS: lldb-unit :: Symbol/./SymbolTests/TestClangASTImporter.ImportInvalidType (1834 of 2355) PASS: lldb-api :: lang/cpp/member-and-local-vars-with-same-name/TestMembersAndLocalsWithSameName.py (1835 of 2355) PASS: lldb-unit :: Utility/./UtilityTests/RegisterValueTest.GetSet8 (1836 of 2355) PASS: lldb-api :: tools/lldb-server/TestGdbRemoteKill.py (1837 of 2355) PASS: lldb-unit :: Expression/./ExpressionTests/CppModuleConfigurationTest.Xcode (1838 of 2355) PASS: lldb-shell :: Register/Core/x86-32-freebsd-addr.test (1839 of 2355) PASS: lldb-unit :: Utility/./UtilityTests/LogChannelTest.EnableOptions (1840 of 2355) PASS: lldb-api :: functionalities/thread/concurrent_events/TestConcurrentCrashWithWatchpoint.py (1841 of 2355) PASS: lldb-api :: functionalities/archives/TestBSDArchives.py (1842 of 2355) PASS: lldb-api :: python_api/formatters/TestFormattersSBAPI.py (1843 of 2355) XFAIL: lldb-shell :: Register/x86-64-fp-write.test (1844 of 2355) PASS: lldb-api :: lang/cpp/typedef/TestCppTypedef.py (1845 of 2355) PASS: lldb-unit :: Interpreter/./InterpreterTests/CompletionTest.FileCompletionAbsolute (1846 of 2355) PASS: lldb-unit :: Utility/./UtilityTests/Flags.Clear (1847 of 2355) PASS: lldb-api :: commands/expression/formatters/TestFormatters.py (1848 of 2355) UNSUPPORTED: lldb-api :: python_api/disassemble-raw-data/TestDisassemble_VST1_64.py (1849 of 2355) PASS: lldb-api :: functionalities/target_var/no_vars/TestTargetVarNoVars.py (1850 of 2355) PASS: lldb-api :: functionalities/lazy-loading/TestLazyLoading.py (1851 of 2355) PASS: lldb-api :: functionalities/thread/concurrent_events/TestConcurrentWatchBreak.py (1852 of 2355) PASS: lldb-unit :: Utility/./UtilityTests/StringExtractorTest.InitEmpty (1853 of 2355) UNSUPPORTED: lldb-api :: functionalities/thread/multi_break/TestMultipleBreakpoints.py (1854 of 2355) PASS: lldb-api :: arm/emulation/TestEmulations.py (1855 of 2355) PASS: lldb-shell :: ObjectFile/PECOFF/section-types.yaml (1856 of 2355) PASS: lldb-shell :: ObjectFile/ELF/section-overlap.yaml (1857 of 2355) PASS: lldb-unit :: API/./APITests/SBCommandInterpreterTest.SingleWordCommand (1858 of 2355) PASS: lldb-unit :: Host/./HostTests/NativeProcessProtocolTest.SetBreakpointFailVerify (1859 of 2355) PASS: lldb-api :: functionalities/tail_call_frames/thread_step_out_message/TestArtificialFrameStepOutMessage.py (1860 of 2355) PASS: lldb-shell :: SymbolFile/DWARF/x86/dwp-debug-types.s (1861 of 2355) PASS: lldb-shell :: BuildScript/script-args.test (1862 of 2355) PASS: lldb-unit :: Core/./LLDBCoreTests/FormatEntityTest.DefinitionConstructionNameAndString (1863 of 2355) PASS: lldb-api :: commands/expression/inline-namespace/TestInlineNamespace.py (1864 of 2355) PASS: lldb-api :: lang/cpp/dynamic-value/TestDynamicValue.py (1865 of 2355) PASS: lldb-api :: lang/c/vla/TestVLA.py (1866 of 2355) PASS: lldb-api :: lang/cpp/keywords_enabled/TestCppKeywordsEnabled.py (1867 of 2355) PASS: lldb-api :: commands/target/stop-hook/enable/TestTargetStopHookEnable.py (1868 of 2355) PASS: lldb-unit :: Utility/./UtilityTests/DataExtractorTest.GetULEB128_bit63 (1869 of 2355) PASS: lldb-shell :: ObjectFile/ELF/PT_LOAD-empty.yaml (1870 of 2355) PASS: lldb-unit :: Symbol/./SymbolTests/TestClangASTImporter.MetadataPropagation (1871 of 2355) PASS: lldb-api :: lang/objc/objc-new-syntax/TestObjCNewSyntaxArray.py (1872 of 2355) PASS: lldb-api :: functionalities/unwind/sigtramp/TestSigtrampUnwind.py (1873 of 2355) PASS: lldb-shell :: ObjectFile/ELF/minidebuginfo-find-symbols.yaml (1874 of 2355) PASS: lldb-unit :: Host/./HostTests/SocketTests/SocketTest.TCPListen0GetPort/ipv4 (1875 of 2355) PASS: lldb-unit :: UnwindAssembly/x86/./UnwindAssemblyx86Tests/Testx86AssemblyInspectionEngine.TestPushR12 (1876 of 2355) PASS: lldb-api :: commands/command/script_alias/TestCommandScriptAlias.py (1877 of 2355) PASS: lldb-api :: functionalities/gdb_remote_client/TestNestedRegDefinitions.py (1878 of 2355) UNSUPPORTED: lldb-api :: functionalities/data-formatter/data-formatter-stl/libstdcpp/vbool/TestDataFormatterStdVBool.py (1879 of 2355) PASS: lldb-unit :: SymbolFile/NativePDB/./SymbolFileNativePDBTests/PDBFPOProgramToDWARFExpressionTests.InvalidOpBinary (1880 of 2355) PASS: lldb-api :: macosx/find-app-in-bundle/TestFindAppInBundle.py (1881 of 2355) PASS: lldb-api :: commands/watchpoints/step_over_watchpoint/TestStepOverWatchpoint.py (1882 of 2355) UNSUPPORTED: lldb-api :: benchmarks/libcxxlist/TestBenchmarkLibcxxList.py (1883 of 2355) PASS: lldb-unit :: Utility/./UtilityTests/StringListTest.GetMaxStringLengthEqualSize (1884 of 2355) PASS: lldb-api :: commands/log/basic/TestLogging.py (1885 of 2355) PASS: lldb-unit :: Utility/./UtilityTests/ArchSpecTest.Compatibility (1886 of 2355) PASS: lldb-unit :: Utility/./UtilityTests/LogChannelEnabledTest.LLDB_LOG_ERROR (1887 of 2355) UNSUPPORTED: lldb-api :: functionalities/asan/TestReportData.py (1888 of 2355) PASS: lldb-api :: functionalities/breakpoint/move_nearest/TestMoveNearest.py (1889 of 2355) PASS: lldb-shell :: ObjectFile/ELF/gnu-debuglink.yaml (1890 of 2355) PASS: lldb-unit :: Utility/./UtilityTests/RangeTest.SlideZero (1891 of 2355) PASS: lldb-api :: commands/frame/diagnose/bad-reference/TestBadReference.py (1892 of 2355) PASS: lldb-api :: functionalities/postmortem/wow64_minidump/TestWow64MiniDump.py (1893 of 2355) PASS: lldb-unit :: Expression/./ExpressionTests/DWARFExpression.DW_OP_convert (1894 of 2355) PASS: lldb-api :: lang/cpp/static_members/TestCPPStaticMembers.py (1895 of 2355) PASS: lldb-unit :: Utility/./UtilityTests/ScalarTest.APIntConstructor (1896 of 2355) PASS: lldb-unit :: Symbol/./SymbolTests/TestTypeSystemClang.TestGetTypeClassDeclType (1897 of 2355) PASS: lldb-shell :: Breakpoint/split-dwarf5-debug-stroffsets.test (1898 of 2355) PASS: lldb-unit :: UnwindAssembly/x86/./UnwindAssemblyx86Tests/Testx86AssemblyInspectionEngine.Test32bitFramelessBigStackFrame (1899 of 2355) PASS: lldb-unit :: Utility/./UtilityTests/AnsiTerminal.KnownPrefix (1900 of 2355) UNSUPPORTED: lldb-api :: functionalities/data-formatter/data-formatter-stl/libstdcpp/list/TestDataFormatterStdList.py (1901 of 2355) PASS: lldb-api :: lang/objc/conflicting-definition/TestConflictingDefinition.py (1902 of 2355) PASS: lldb-unit :: Host/./HostTests/SocketTests/SocketTest.UDPGetConnectURI/ipv4 (1903 of 2355) PASS: lldb-unit :: Utility/./UtilityTests/StreamTest.PutHex16ByteOrderBig (1904 of 2355) PASS: lldb-unit :: Interpreter/./InterpreterTests/OptionValueFileColonLine.setFromString (1905 of 2355) PASS: lldb-shell :: SymbolFile/Breakpad/symtab-macho.test (1906 of 2355) PASS: lldb-unit :: Process/gdb-remote/./ProcessGdbRemoteTests/GDBRemoteCommunicationTest.ReadPacket_checksum (1907 of 2355) PASS: lldb-unit :: Host/./HostTests/SocketAddressTest.Set (1908 of 2355) UNSUPPORTED: lldb-api :: tools/lldb-server/TestGdbRemoteAuxvSupport.py (1909 of 2355) PASS: lldb-api :: lang/cpp/this/TestCPPThis.py (1910 of 2355) PASS: lldb-unit :: DataFormatter/./LLDBFormatterTests/TypeMatcherTests.RegexMatchPart (1911 of 2355) PASS: lldb-unit :: Utility/./UtilityTests/ArgsTest.DoubleQuotedItem (1912 of 2355) PASS: lldb-shell :: SymbolFile/NativePDB/locate-pdb.cpp (1913 of 2355) PASS: lldb-unit :: Symbol/./SymbolTests/TestTypeSystemClang.TestGetTypeClassTypeOfExpr (1914 of 2355) PASS: lldb-unit :: ScriptInterpreter/Python/./ScriptInterpreterPythonTests/PythonDataObjectsTest.TestPythonDictionaryValueEquality (1915 of 2355) PASS: lldb-unit :: Utility/./UtilityTests/CompletionRequest.TryCompleteCurrentArgMode (1916 of 2355) PASS: lldb-unit :: ScriptInterpreter/Python/./ScriptInterpreterPythonTests/PythonDataObjectsTest.TestPythonListValueEquality (1917 of 2355) PASS: lldb-unit :: Utility/./UtilityTests/UriParserTest.SchemeHostSeparator3 (1918 of 2355) PASS: lldb-api :: functionalities/data-formatter/synthcapping/TestSyntheticCapping.py (1919 of 2355) PASS: lldb-api :: commands/expression/import-std-module/weak_ptr/TestWeakPtrFromStdModule.py (1920 of 2355) PASS: lldb-unit :: ScriptInterpreter/Python/./ScriptInterpreterPythonTests/PythonDataObjectsTest.TestExceptions (1921 of 2355) PASS: lldb-api :: commands/frame/diagnose/virtual-method-call/TestDiagnoseDereferenceVirtualMethodCall.py (1922 of 2355) PASS: lldb-api :: lang/c/function_types/TestFunctionTypes.py (1923 of 2355) PASS: lldb-shell :: Driver/TestConvenienceVariables.test (1924 of 2355) UNSUPPORTED: lldb-shell :: Register/x86-ymm-write.test (1925 of 2355) PASS: lldb-shell :: SymbolFile/DWARF/x86/inline-function-address-shared.test (1926 of 2355) PASS: lldb-api :: functionalities/data-formatter/poarray/TestPrintObjectArray.py (1927 of 2355) PASS: lldb-unit :: Utility/./UtilityTests/BinaryStreamTest.PutSLEB128NineBytes (1928 of 2355) PASS: lldb-api :: types/TestRecursiveTypes.py (1929 of 2355) PASS: lldb-unit :: ScriptInterpreter/Python/./ScriptInterpreterPythonTests/PythonDataObjectsTest.TestTypeNameResolutionNoDot (1930 of 2355) PASS: lldb-unit :: Symbol/./SymbolTests/TestTypeSystemClang.TestIsClangType (1931 of 2355) PASS: lldb-unit :: Process/./ProcessEventDataTests/ProcessEventDataTest.ShouldStop (1932 of 2355) PASS: lldb-api :: commands/expression/import-std-module/unique_ptr-dbg-info-content/TestUniquePtrDbgInfoContent.py (1933 of 2355) PASS: lldb-unit :: Utility/./UtilityTests/ScalarTest.CastOperations (1934 of 2355) UNSUPPORTED: lldb-api :: functionalities/asan/TestMemoryHistory.py (1935 of 2355) PASS: lldb-unit :: Expression/./ExpressionTests/DWARFExpression.DW_OP_implicit_value (1936 of 2355) UNSUPPORTED: lldb-api :: functionalities/darwin_log/filter/regex/category/TestDarwinLogFilterRegexCategory.py (1937 of 2355) PASS: lldb-unit :: SymbolFile/DWARF/./SymbolFileDWARFTests/DWARFASTParserClangTests.EnsureAllDIEsInDeclContextHaveBeenParsedParsesOnlyMatchingEntries (1938 of 2355) PASS: lldb-api :: functionalities/breakpoint/cpp_exception/TestCPPExceptionBreakpoint.py (1939 of 2355) PASS: lldb-unit :: Utility/./UtilityTests/SerializationRountripTest.SerializeDeserializeCString (1940 of 2355) PASS: lldb-api :: commands/expression/result_numbering/TestResultNumbering.py (1941 of 2355) UNSUPPORTED: lldb-api :: lang/cpp/printf/TestPrintf.py (1942 of 2355) PASS: lldb-unit :: Utility/./UtilityTests/VMRange.Reset (1943 of 2355) PASS: lldb-unit :: Process/minidump/./LLDBMinidumpTests/MinidumpParserTest.GetMemoryRegionInfoFromMemoryList (1944 of 2355) PASS: lldb-unit :: SymbolFile/NativePDB/./SymbolFileNativePDBTests/PDBFPOProgramToDWARFExpressionTests.MultipleIndependentAssignments (1945 of 2355) PASS: lldb-unit :: Utility/./UtilityTests/BinaryStreamTest.PutULEB128ThreeBytes (1946 of 2355) PASS: lldb-unit :: Host/./HostTests/MainLoopTest.Signal (1947 of 2355) XFAIL: lldb-shell :: Expr/nodefaultlib.cpp (1948 of 2355) PASS: lldb-shell :: ObjectFile/ELF/netbsd-exec-8.99.30-amd64.yaml (1949 of 2355) PASS: lldb-shell :: Commands/command-image-lookup.yaml (1950 of 2355) UNSUPPORTED: lldb-shell :: Subprocess/vfork-follow-parent-wp.test (1951 of 2355) PASS: lldb-unit :: Utility/./UtilityTests/StringExtractorTest.DecodeHexU8_Underflow2 (1952 of 2355) PASS: lldb-unit :: Utility/./UtilityTests/StreamTeeTest.GetStreamAtIndexOutOfBoundsEmpty (1953 of 2355) PASS: lldb-api :: python_api/watchpoint/condition/TestWatchpointConditionAPI.py (1954 of 2355) PASS: lldb-unit :: Symbol/./SymbolTests/TestTypeSystemClang.TestFunctionTemplateConstruction (1955 of 2355) PASS: lldb-api :: functionalities/data-formatter/data-formatter-stl/libcxx/multimap/TestDataFormatterLibccMultiMap.py (1956 of 2355) PASS: lldb-unit :: Utility/./UtilityTests/ScalarTest.ExtractBitfield (1957 of 2355) PASS: lldb-shell :: SymbolFile/DWARF/x86/parallel-indexing-stress.s (1958 of 2355) PASS: lldb-unit :: UnwindAssembly/x86/./UnwindAssemblyx86Tests/Testx86AssemblyInspectionEngine.TestPopR15 (1959 of 2355) PASS: lldb-api :: commands/frame/var/TestFrameVar.py (1960 of 2355) PASS: lldb-unit :: Process/gdb-remote/./ProcessGdbRemoteTests/GDBRemoteClientBaseTest.SendContinueAndLateInterrupt (1961 of 2355) PASS: lldb-unit :: Utility/./UtilityTests/BinaryStreamTest.PutULEB128NineBytes (1962 of 2355) PASS: lldb-unit :: ObjectFile/Breakpad/./ObjectFileBreakpadTests/InfoRecord.parse (1963 of 2355) PASS: lldb-api :: commands/expression/codegen-crash-typedefdecl-not-in_declcontext/TestCodegenCrashTypedefDeclNotInDeclContext.py (1964 of 2355) PASS: lldb-unit :: ScriptInterpreter/Python/./ScriptInterpreterPythonTests/PythonDataObjectsTest.TestRun (1965 of 2355) PASS: lldb-unit :: UnwindAssembly/x86/./UnwindAssemblyx86Tests/Testx86AssemblyInspectionEngine.Test32BitOnlyInstruction (1966 of 2355) UNSUPPORTED: lldb-api :: functionalities/breakpoint/hardware_breakpoints/write_memory_with_hw_breakpoint/TestWriteMemoryWithHWBreakpoint.py (1967 of 2355) PASS: lldb-api :: python_api/frame/TestFrames.py (1968 of 2355) PASS: lldb-unit :: Process/minidump/./LLDBMinidumpTests/MinidumpParserTest.GetThreadContext_x86_64 (1969 of 2355) PASS: lldb-api :: commands/watchpoints/multiple_threads/TestWatchpointMultipleThreads.py (1970 of 2355) PASS: lldb-api :: functionalities/gdb_remote_client/TestPlatformClient.py (1971 of 2355) PASS: lldb-unit :: Utility/./UtilityTests/Flags.AnyClear (1972 of 2355) PASS: lldb-api :: commands/expression/unicode-in-variable/TestUnicodeInVariable.py (1973 of 2355) UNSUPPORTED: lldb-api :: commands/expression/macros/TestMacros.py (1974 of 2355) PASS: lldb-unit :: ObjectFile/PECOFF/./ObjectFilePECOFFTests/PECallFrameInfoTest.Chained_eh (1975 of 2355) PASS: lldb-api :: functionalities/breakpoint/breakpoint_set_restart/TestBreakpointSetRestart.py (1976 of 2355) PASS: lldb-shell :: ObjectFile/ELF/avr-basic-info.yaml (1977 of 2355) PASS: lldb-unit :: Expression/./ExpressionTests/CppModuleConfigurationTest.UnknownLibCppFile (1978 of 2355) UNSUPPORTED: lldb-api :: functionalities/darwin_log/filter/exact_match/message/TestDarwinLogFilterMatchMessage.py (1979 of 2355) PASS: lldb-shell :: Commands/command-regex-delete.test (1980 of 2355) PASS: lldb-api :: lang/objc/warnings-in-expr-parser/TestObjCWarningsInExprParser.py (1981 of 2355) UNSUPPORTED: lldb-shell :: ScriptInterpreter/Lua/breakpoint_function_callback.test (1982 of 2355) PASS: lldb-unit :: Host/./HostTests/NativeProcessProtocolTest.ReadMemoryWithoutTrap (1983 of 2355) PASS: lldb-api :: tools/lldb-server/memory-allocation/TestGdbRemoteMemoryAllocation.py (1984 of 2355) PASS: lldb-api :: functionalities/thread/concurrent_events/TestConcurrentBreakpointDelayBreakpointOneSignal.py (1985 of 2355) PASS: lldb-unit :: Utility/./UtilityTests/LogTest.LLDB_LOG_nullptr (1986 of 2355) PASS: lldb-unit :: Host/./HostTests/FileSystemTest.Exists (1987 of 2355) PASS: lldb-shell :: SymbolFile/DWARF/x86/dwarf5-implicit-const.s (1988 of 2355) PASS: lldb-unit :: Utility/./UtilityTests/BinaryStreamTest.PutSLEB128FiveBytes (1989 of 2355) PASS: lldb-shell :: SymbolFile/DWARF/clang-ast-from-dwarf-unamed-and-anon-structs.cpp (1990 of 2355) PASS: lldb-api :: macosx/debugserver-exit-code/TestDebugServerExitCode.py (1991 of 2355) PASS: lldb-api :: functionalities/memory/read/TestMemoryRead.py (1992 of 2355) PASS: lldb-api :: python_api/thread/TestThreadAPI.py (1993 of 2355) PASS: lldb-unit :: Host/./HostTests/NativeProcessProtocolTest.ReadCStringFromMemory (1994 of 2355) PASS: lldb-unit :: Language/Highlighting/./HighlighterTests/HighlighterTest.ClangTrailingBackslashBeforeNewline (1995 of 2355) PASS: lldb-unit :: UnwindAssembly/x86/./UnwindAssemblyx86Tests/Testx86AssemblyInspectionEngine.TestStackRealign32BitDisp_x86_64 (1996 of 2355) PASS: lldb-shell :: ScriptInterpreter/Python/Crashlog/text.test (1997 of 2355) PASS: lldb-api :: functionalities/data-formatter/stringprinter/TestStringPrinter.py (1998 of 2355) PASS: lldb-unit :: Expression/./ExpressionTests/CppModuleConfigurationTest.AmbiguousCLib (1999 of 2355) PASS: lldb-unit :: ScriptInterpreter/Python/./ScriptInterpreterPythonTests/PythonDataObjectsTest.TestObjectAttributes (2000 of 2355) PASS: lldb-api :: lang/cpp/nsimport/TestCppNsImport.py (2001 of 2355) PASS: lldb-api :: commands/expression/import-std-module/list-dbg-info-content/TestDbgInfoContentListFromStdModule.py (2002 of 2355) PASS: lldb-unit :: ObjectFile/Breakpad/./ObjectFileBreakpadTests/FileRecord.parse (2003 of 2355) PASS: lldb-shell :: Reproducer/TestVersionCheck.test (2004 of 2355) PASS: lldb-unit :: Utility/./UtilityTests/ConstStringTest.MangledCounterpart (2005 of 2355) PASS: lldb-api :: macosx/indirect_symbol/TestIndirectSymbols.py (2006 of 2355) PASS: lldb-shell :: Driver/TestCore.test (2007 of 2355) PASS: lldb-unit :: Utility/./UtilityTests/FileSpecTest.FormatFileSpec (2008 of 2355) PASS: lldb-unit :: ScriptInterpreter/Python/./ScriptInterpreterPythonTests/PythonDataObjectsTest.TestPythonBoolean (2009 of 2355) PASS: lldb-api :: commands/expression/issue_11588/Test11588.py (2010 of 2355) UNSUPPORTED: lldb-api :: functionalities/tsan/multiple/TestTsanMultiple.py (2011 of 2355) PASS: lldb-unit :: Utility/./UtilityTests/ScalarTest.Promotion (2012 of 2355) PASS: lldb-api :: python_api/function_symbol/TestDisasmAPI.py (2013 of 2355) PASS: lldb-shell :: SymbolFile/DWARF/x86/debug_ranges-missing-section.s (2014 of 2355) PASS: lldb-unit :: Process/gdb-remote/./ProcessGdbRemoteTests/GDBRemoteCommunicationClientTest.TestPacketSpeedJSON (2015 of 2355) PASS: lldb-unit :: Process/gdb-remote/./ProcessGdbRemoteTests/GDBRemoteCommunicationClientTest.ReadMemoryTags (2016 of 2355) PASS: lldb-unit :: Utility/./UtilityTests/BinaryStreamTest.PutSLEB128SevenBytes (2017 of 2355) PASS: lldb-api :: python_api/sbplatform/TestSBPlatform.py (2018 of 2355) PASS: lldb-unit :: Interpreter/./InterpreterTests/OptionValueArgs.DeepCopy (2019 of 2355) PASS: lldb-api :: functionalities/gdb_remote_client/TestStopPCs.py (2020 of 2355) PASS: lldb-unit :: Utility/./UtilityTests/StringListTest.LongestCommonPrefixDuplicateElement (2021 of 2355) PASS: lldb-shell :: SymbolFile/DWARF/x86/DW_TAG_variable-invalid_location.s (2022 of 2355) PASS: lldb-unit :: Process/minidump/./LLDBMinidumpTests/MinidumpParserTest.GetPid (2023 of 2355) PASS: lldb-api :: commands/settings/TestSettings.py (2024 of 2355) PASS: lldb-api :: functionalities/breakpoint/auto_continue/TestBreakpointAutoContinue.py (2025 of 2355) PASS: lldb-api :: functionalities/thread/concurrent_events/TestConcurrentBreakpointOneDelayBreakpointThreads.py (2026 of 2355) PASS: lldb-api :: tools/lldb-server/TestGdbRemoteRegisterState.py (2027 of 2355) PASS: lldb-api :: lang/cpp/class_types/TestClassTypes.py (2028 of 2355) PASS: lldb-unit :: Symbol/./SymbolTests/DWARFCallFrameInfoTest.Basic_eh (2029 of 2355) PASS: lldb-shell :: SymbolFile/DWARF/x86/dir-separator-no-comp-dir.s (2030 of 2355) PASS: lldb-unit :: UnwindAssembly/x86/./UnwindAssemblyx86Tests/Testx86AssemblyInspectionEngine.TestSpArithx86_64Augmented (2031 of 2355) PASS: lldb-unit :: Target/./TargetTests/ExecutionContextTest.GetByteOrder (2032 of 2355) PASS: lldb-api :: functionalities/gdb_remote_client/TestqOffsets.py (2033 of 2355) PASS: lldb-unit :: Symbol/./SymbolTests/Type.CompilerContextPattern (2034 of 2355) UNSUPPORTED: lldb-api :: functionalities/darwin_log/filter/regex/message/TestDarwinLogFilterRegexMessage.py (2035 of 2355) PASS: lldb-api :: lang/c/register_variables/TestRegisterVariables.py (2036 of 2355) PASS: lldb-unit :: Process/gdb-remote/./ProcessGdbRemoteTests/GDBRemoteCommunicationServerTest.SendErrorResponse_ErrorList (2037 of 2355) PASS: lldb-unit :: Process/Utility/./ProcessUtilityTests/ProcSMapTests/LinuxProcSMapsTestFixture.ParseSMapRegions/4 (2038 of 2355) PASS: lldb-api :: lang/objc/objc-checker/TestObjCCheckers.py (2039 of 2355) PASS: lldb-api :: commands/target/basic/TestTargetCommand.py (2040 of 2355) UNSUPPORTED: lldb-shell :: Register/x86-zmm-read.test (2041 of 2355) UNSUPPORTED: lldb-api :: functionalities/darwin_log/filter/regex/activity-chain/TestDarwinLogFilterRegexActivityChain.py (2042 of 2355) PASS: lldb-unit :: Utility/./UtilityTests/StreamTest.PutCharNull (2043 of 2355) PASS: lldb-unit :: Utility/./UtilityTests/ArgsTest.GetQuotedCommandString (2044 of 2355) PASS: lldb-unit :: Utility/./UtilityTests/FileSpecTest.RemoveLastPathComponent (2045 of 2355) PASS: lldb-unit :: Process/minidump/./LLDBMinidumpTests/MinidumpParserTest.MinidumpDuplicateModuleMinAddress (2046 of 2355) PASS: lldb-unit :: Symbol/./SymbolTests/TestClangASTImporter.MetadataPropagationAfterCopying (2047 of 2355) PASS: lldb-unit :: Utility/./UtilityTests/StringListTest.LongestCommonPrefix (2048 of 2355) PASS: lldb-api :: lang/cpp/dynamic-value-same-basename/TestDynamicValueSameBase.py (2049 of 2355) PASS: lldb-api :: commands/help/TestHelp.py (2050 of 2355) PASS: lldb-unit :: UnwindAssembly/x86/./UnwindAssemblyx86Tests/Testx86AssemblyInspectionEngine.TestPush0 (2051 of 2355) PASS: lldb-unit :: Utility/./UtilityTests/VMRange.ContainsRange (2052 of 2355) PASS: lldb-api :: functionalities/inferior-crashing/recursive-inferior/TestRecursiveInferiorStep.py (2053 of 2355) PASS: lldb-unit :: Platform/Android/./AdbClientTests/AdbClientTest.CreateByDeviceId (2054 of 2355) PASS: lldb-api :: functionalities/thread/ignore_suspended/TestIgnoreSuspendedThread.py (2055 of 2355) PASS: lldb-unit :: Utility/./UtilityTests/StringListTest.Clear (2056 of 2355) PASS: lldb-unit :: Utility/./UtilityTests/RangeTest.ClearWithStarAddress (2057 of 2355) PASS: lldb-api :: functionalities/data-formatter/data-formatter-enum-format/TestDataFormatterEnumFormat.py (2058 of 2355) PASS: lldb-unit :: SymbolFile/NativePDB/./SymbolFileNativePDBTests/PDBFPOProgramToDWARFExpressionTests.UnresolvedRegisterReference (2059 of 2355) PASS: lldb-api :: python_api/sbdata/TestSBData.py (2060 of 2355) PASS: lldb-api :: commands/expression/static-initializers/TestStaticInitializers.py (2061 of 2355) PASS: lldb-unit :: Utility/./UtilityTests/StringListTest.AppendListCStringArray (2062 of 2355) PASS: lldb-unit :: Language/CPlusPlus/./LanguageCPlusPlusTests/CPlusPlusLanguage.FindAlternateFunctionManglings (2063 of 2355) PASS: lldb-api :: functionalities/thread/state_after_expression/TestStateAfterExpression.py (2064 of 2355) PASS: lldb-api :: commands/expression/completion/TestExprCompletion.py (2065 of 2355) PASS: lldb-unit :: SymbolFile/DWARF/./SymbolFileDWARFTests/SymbolFileDWARFTests.TestAbbrevNullAttrValidForm (2066 of 2355) PASS: lldb-shell :: Recognizer/assert.test (2067 of 2355) PASS: lldb-shell :: Reproducer/TestFinalize.test (2068 of 2355) PASS: lldb-unit :: UnwindAssembly/x86/./UnwindAssemblyx86Tests/Testx86AssemblyInspectionEngine.TestPushEDI (2069 of 2355) PASS: lldb-unit :: Utility/./UtilityTests/StringListTest.DefaultConstructor (2070 of 2355) PASS: lldb-unit :: UnwindAssembly/x86/./UnwindAssemblyx86Tests/Testx86AssemblyInspectionEngine.TestSpillRegToStackViaMOVx86_64 (2071 of 2355) PASS: lldb-unit :: Utility/./UtilityTests/StringExtractorTest.GetHexBytes_FullString (2072 of 2355) PASS: lldb-api :: lang/c/complex_int/TestComplexInt.py (2073 of 2355) PASS: lldb-unit :: Expression/./ExpressionTests/DiagnosticManagerTest.PutStringMultiple (2074 of 2355) PASS: lldb-unit :: ScriptInterpreter/Python/./ScriptInterpreterPythonTests/PythonDataObjectsTest.TestInstanceNameResolutionNoDot (2075 of 2355) PASS: lldb-unit :: ScriptInterpreter/Python/./ScriptInterpreterPythonTests/PythonDataObjectsTest.TestPythonTupleInitializerList2 (2076 of 2355) PASS: lldb-shell :: SymbolFile/DWARF/x86/apple-index-is-used.cpp (2077 of 2355) PASS: lldb-api :: api/multiple-debuggers/TestMultipleDebuggers.py (2078 of 2355) PASS: lldb-api :: lang/cpp/offsetof/TestOffsetofCpp.py (2079 of 2355) PASS: lldb-unit :: Utility/./UtilityTests/FileSpecTest.PrependPathComponent (2080 of 2355) PASS: lldb-api :: tools/lldb-server/TestGdbRemoteExpeditedRegisters.py (2081 of 2355) UNSUPPORTED: lldb-api :: arm/breakpoint-thumb-codesection/TestBreakpointThumbCodesection.py (2082 of 2355) PASS: lldb-shell :: SymbolFile/DWARF/x86/DW_TAG_variable-DW_AT_const_value.s (2083 of 2355) PASS: lldb-unit :: Utility/./UtilityTests/BinaryStreamTest.PutSLEB128One (2084 of 2355) PASS: lldb-api :: lang/objc/blocks/TestObjCIvarsInBlocks.py (2085 of 2355) PASS: lldb-unit :: Utility/./UtilityTests/BinaryStreamTest.PutSLEB128TwoBytes (2086 of 2355) PASS: lldb-api :: functionalities/gdb_remote_client/TestGDBRemoteLoad.py (2087 of 2355) PASS: lldb-api :: lang/cpp/unique-types/TestUniqueTypes.py (2088 of 2355) PASS: lldb-api :: commands/expression/scoped_enums/TestScopedEnumType.py (2089 of 2355) PASS: lldb-unit :: Utility/./UtilityTests/StreamTest.PutCStringWithStringRef (2090 of 2355) PASS: lldb-api :: functionalities/data-formatter/data-formatter-stl/libcxx/deque/TestDataFormatterLibcxxDeque.py (2091 of 2355) PASS: lldb-unit :: Utility/./UtilityTests/StreamTeeTest.GetStreamAtIndexOutOfBounds (2092 of 2355) PASS: lldb-unit :: UnwindAssembly/x86/./UnwindAssemblyx86Tests/Testx86AssemblyInspectionEngine.TestMovRSPtoRBP (2093 of 2355) PASS: lldb-api :: commands/process/attach/TestProcessAttach.py (2094 of 2355) PASS: lldb-unit :: Utility/./UtilityTests/FileSpecTest.GetPath (2095 of 2355) PASS: lldb-unit :: Utility/./UtilityTests/DeserializerTest.HasData (2096 of 2355) PASS: lldb-api :: lang/objc/objc-stepping/TestObjCStepping.py (2097 of 2355) PASS: lldb-api :: lang/cpp/bitfields/TestCppBitfields.py (2098 of 2355) PASS: lldb-unit :: Process/minidump/./LLDBMinidumpTests/MinidumpParserTest.GetMemoryRegionInfoLinuxMaps (2099 of 2355) PASS: lldb-shell :: SymbolFile/DWARF/x86/debug_loc-aslr.s (2100 of 2355) UNSUPPORTED: lldb-api :: benchmarks/stepping/TestSteppingSpeed.py (2101 of 2355) PASS: lldb-api :: python_api/lldbutil/iter/TestLLDBIterator.py (2102 of 2355) PASS: lldb-api :: lang/objc/real-definition/TestRealDefinition.py (2103 of 2355) PASS: lldb-api :: commands/expression/import-std-module/list/TestListFromStdModule.py (2104 of 2355) PASS: lldb-shell :: Quit/TestQuitExitCodeNonInt.test (2105 of 2355) UNSUPPORTED: lldb-api :: commands/expression/import-std-module/pair/TestPairFromStdModule.py (2106 of 2355) PASS: lldb-unit :: Process/gdb-remote/./ProcessGdbRemoteTests/GDBRemoteClientBaseTest.SendContinueAndWait (2107 of 2355) PASS: lldb-unit :: Utility/./UtilityTests/RegularExpression.CopyAssignment (2108 of 2355) PASS: lldb-api :: functionalities/thread/concurrent_events/TestConcurrentWatchpointDelayWatchpointOneBreakpoint.py (2109 of 2355) PASS: lldb-unit :: UnwindAssembly/x86/./UnwindAssemblyx86Tests/Testx86AssemblyInspectionEngine.TestPushEAX (2110 of 2355) PASS: lldb-unit :: DataFormatter/./LLDBFormatterTests/FormatManagerTests.CompatibleLangs (2111 of 2355) UNSUPPORTED: lldb-api :: functionalities/data-formatter/data-formatter-stl/libstdcpp/vector/TestDataFormatterStdVector.py (2112 of 2355) PASS: lldb-shell :: Unwind/trap_frame_sym_ctx.test (2113 of 2355) PASS: lldb-unit :: ScriptInterpreter/Python/./ScriptInterpreterPythonTests/PythonDataObjectsTest.TestPythonDictionaryManipulation (2114 of 2355) PASS: lldb-shell :: Breakpoint/jit-loader_rtdyld_elf.test (2115 of 2355) PASS: lldb-unit :: Utility/./UtilityTests/RangeTest.DefaultConstructor (2116 of 2355) PASS: lldb-shell :: Unwind/eh-frame-dwarf-unwind.test (2117 of 2355) PASS: lldb-unit :: Process/minidump/./LLDBMinidumpTests/MinidumpParserTest.GetMemoryRegionInfoFromMemory64List (2118 of 2355) PASS: lldb-unit :: Utility/./UtilityTests/RegularExpression.Invalid (2119 of 2355) PASS: lldb-unit :: Utility/./UtilityTests/LogChannelEnabledTest.LogVerboseThread (2120 of 2355) PASS: lldb-unit :: Utility/./UtilityTests/RangeTest.DoesIntersect (2121 of 2355) PASS: lldb-api :: lang/c/tls_globals/TestTlsGlobals.py (2122 of 2355) PASS: lldb-api :: commands/frame/select/TestFrameSelect.py (2123 of 2355) PASS: lldb-api :: python_api/watchpoint/TestWatchpointIgnoreCount.py (2124 of 2355) UNSUPPORTED: lldb-api :: iohandler/completion/TestIOHandlerCompletion.py (2125 of 2355) PASS: lldb-unit :: Symbol/./SymbolTests/TestTypeSystemClang.TestDisplayNameEmpty (2126 of 2355) PASS: lldb-unit :: Language/Highlighting/./HighlighterTests/HighlighterTest.ClangCommas (2127 of 2355) PASS: lldb-unit :: Process/gdb-remote/./ProcessGdbRemoteTests/GDBRemoteClientBaseTest.SendContinueDelegateInterface (2128 of 2355) PASS: lldb-api :: lang/cpp/stl/TestStdCXXDisassembly.py (2129 of 2355) PASS: lldb-api :: functionalities/breakpoint/consecutive_breakpoints/TestConsecutiveBreakpoints.py (2130 of 2355) PASS: lldb-api :: commands/expression/import-std-module/shared_ptr-dbg-info-content/TestSharedPtrDbgInfoContentFromStdModule.py (2131 of 2355) PASS: lldb-api :: commands/expression/call-throws/TestCallThatThrows.py (2132 of 2355) PASS: lldb-api :: functionalities/tail_call_frames/ambiguous_tail_call_seq1/TestAmbiguousTailCallSeq1.py (2133 of 2355) PASS: lldb-api :: functionalities/breakpoint/breakpoint_command/TestRegexpBreakCommand.py (2134 of 2355) PASS: lldb-shell :: Minidump/memory-region.yaml (2135 of 2355) PASS: lldb-unit :: Utility/./UtilityTests/UriParserTest.SchemeHostSeparator2 (2136 of 2355) PASS: lldb-api :: functionalities/data-formatter/data-formatter-objc/TestDataFormatterObjNSException.py (2137 of 2355) PASS: lldb-api :: commands/expression/import-std-module/empty-module/TestEmptyStdModule.py (2138 of 2355) PASS: lldb-api :: functionalities/process_group/TestChangeProcessGroup.py (2139 of 2355) PASS: lldb-api :: functionalities/data-formatter/nsarraysynth/TestNSArraySynthetic.py (2140 of 2355) PASS: lldb-shell :: ObjectFile/ELF/section-types.yaml (2141 of 2355) PASS: lldb-api :: lang/objc/objc-static-method-stripped/TestObjCStaticMethodStripped.py (2142 of 2355) PASS: lldb-unit :: Utility/./UtilityTests/TimerTest.CategoryTimesStats (2143 of 2355) PASS: lldb-unit :: Utility/./UtilityTests/ArgsTest.AppendArguments (2144 of 2355) PASS: lldb-shell :: Commands/command-disassemble-process.yaml (2145 of 2355) PASS: lldb-shell :: SymbolFile/DWARF/clang-ast-from-dwarf-objc-property.m (2146 of 2355) UNSUPPORTED: lldb-api :: functionalities/thread/state/TestThreadStates.py (2147 of 2355) PASS: lldb-api :: commands/target/stop-hooks/TestStopHooks.py (2148 of 2355) PASS: lldb-unit :: Utility/./UtilityTests/ArgsTest.ReplaceArgumentAtIndexEqual (2149 of 2355) PASS: lldb-unit :: Process/minidump/./LLDBMinidumpTests/MinidumpParserTest.GetMiscInfo_no_stream (2150 of 2355) PASS: lldb-shell :: SymbolFile/symbol-binding.test (2151 of 2355) PASS: lldb-shell :: Register/Core/x86-64-freebsd-gp.test (2152 of 2355) PASS: lldb-unit :: Thread/./ThreadTests/ThreadTest.GetPrivateStopInfo (2153 of 2355) PASS: lldb-unit :: Utility/./UtilityTests/StreamTest.ShiftOperatorChars (2154 of 2355) UNSUPPORTED: lldb-shell :: SymbolFile/PDB/expressions.test (2155 of 2355) PASS: lldb-api :: functionalities/process_crash_info/TestProcessCrashInfo.py (2156 of 2355) PASS: lldb-unit :: Utility/./UtilityTests/ReproducerTest.SetCapture (2157 of 2355) PASS: lldb-unit :: API/./APITests/SBStructuredDataTest.NullImpl (2158 of 2355) PASS: lldb-shell :: Unwind/thread-step-out-ret-addr-check.test (2159 of 2355) UNSUPPORTED: lldb-shell :: SymbolFile/PDB/type-quals.test (2160 of 2355) PASS: lldb-api :: functionalities/thread/concurrent_events/TestConcurrentTwoWatchpointsOneSignal.py (2161 of 2355) PASS: lldb-api :: functionalities/data-formatter/data-formatter-objc/TestDataFormatterObjCNSURL.py (2162 of 2355) PASS: lldb-shell :: SymbolFile/DWARF/x86/debug_loclists-dwo.s (2163 of 2355) PASS: lldb-unit :: Utility/./UtilityTests/StringListTest.LongestCommonPrefixNoPrefix (2164 of 2355) PASS: lldb-unit :: SymbolFile/DWARF/./SymbolFileDWARFTests/DWARFUnitTest.MissingSentinel (2165 of 2355) PASS: lldb-api :: functionalities/data-formatter/data-formatter-objc/TestDataFormatterObjCPlain.py (2166 of 2355) PASS: lldb-unit :: Core/./LLDBCoreTests/FormatEntityTest.DefinitionConstructionNameTypeChildren (2167 of 2355) PASS: lldb-shell :: Minidump/disassemble-no-module.yaml (2168 of 2355) PASS: lldb-api :: lang/cpp/frame-var-anon-unions/TestFrameVariableAnonymousUnions.py (2169 of 2355) PASS: lldb-unit :: Process/gdb-remote/./ProcessGdbRemoteTests/GDBRemoteClientBaseTest.SendContinueAndInterrupt (2170 of 2355) PASS: lldb-shell :: SymbolFile/DWARF/x86/debug-line-basic.s (2171 of 2355) PASS: lldb-api :: macosx/save_crashlog/TestSaveCrashlog.py (2172 of 2355) PASS: lldb-unit :: Language/Highlighting/./HighlighterTests/HighlighterTest.HighlighterSelectionType (2173 of 2355) UNSUPPORTED: lldb-shell :: Register/x86-64-ymm16-write.test (2174 of 2355) PASS: lldb-unit :: Utility/./UtilityTests/ProcessInstanceInfo.DumpTable_invalidUID (2175 of 2355) PASS: lldb-api :: api/listeners/TestListener.py (2176 of 2355) PASS: lldb-unit :: Utility/./UtilityTests/UserIDResolver.GetGroupName (2177 of 2355) PASS: lldb-shell :: SymbolFile/DWARF/x86/dwarf5_locations.s (2178 of 2355) PASS: lldb-api :: types/TestFloatTypesExpr.py (2179 of 2355) PASS: lldb-unit :: SymbolFile/DWARF/./SymbolFileDWARFTests/SymbolFileDWARFTests.TestAbbrevOrder1Start1 (2180 of 2355) PASS: lldb-unit :: Utility/./UtilityTests/StreamTest.AddressNoSuffix (2181 of 2355) PASS: lldb-api :: lang/cpp/class_static/TestStaticVariables.py (2182 of 2355) PASS: lldb-unit :: UnwindAssembly/x86/./UnwindAssemblyx86Tests/Testx86AssemblyInspectionEngine.TestPopRBP (2183 of 2355) PASS: lldb-api :: lang/objc/global_ptrs/TestGlobalObjects.py (2184 of 2355) UNSUPPORTED: lldb-api :: commands/register/register/aarch64_sve_registers/rw_access_static_config/TestSVERegisters.py (2185 of 2355) UNSUPPORTED: lldb-api :: lang/objc/foundation/TestFoundationDisassembly.py (2186 of 2355) PASS: lldb-unit :: SymbolFile/NativePDB/./SymbolFileNativePDBTests/PDBFPOProgramToDWARFExpressionTests.UnsupportedRASearch (2187 of 2355) PASS: lldb-api :: types/TestIntegerTypeExpr.py (2188 of 2355) PASS: lldb-unit :: Core/./LLDBCoreTests/DumpDataExtractorTest.StartOffset (2189 of 2355) PASS: lldb-unit :: Utility/./UtilityTests/RangeTest.Copy (2190 of 2355) PASS: lldb-api :: commands/platform/file/read/TestPlatformFileRead.py (2191 of 2355) PASS: lldb-unit :: Utility/./UtilityTests/UriParserTest.SchemeHostSeparator4 (2192 of 2355) UNSUPPORTED: lldb-shell :: SymbolFile/NativePDB/local-variables.cpp (2193 of 2355) PASS: lldb-unit :: Utility/./UtilityTests/ArgsTest.TestMultipleArgs (2194 of 2355) PASS: lldb-unit :: SymbolFile/NativePDB/./SymbolFileNativePDBTests/PDBFPOProgramToDWARFExpressionTests.UnresolvedCyclicRegisterAssignmentReference (2195 of 2355) PASS: lldb-api :: functionalities/data-formatter/frameformat_smallstruct/TestFrameFormatSmallStruct.py (2196 of 2355) PASS: lldb-api :: functionalities/thread/concurrent_events/TestConcurrentTwoWatchpointsOneDelayBreakpoint.py (2197 of 2355) PASS: lldb-shell :: SymbolFile/Breakpad/symtab.test (2198 of 2355) PASS: lldb-unit :: Utility/./UtilityTests/StringListTest.GetMaxStringLengthMixed (2199 of 2355) PASS: lldb-unit :: Utility/./UtilityTests/StringLexerTest.HasAtLeast (2200 of 2355) PASS: lldb-unit :: Utility/./UtilityTests/NameMatchesTest.Contains (2201 of 2355) PASS: lldb-api :: commands/frame/diagnose/dereference-argument/TestDiagnoseDereferenceArgument.py (2202 of 2355) PASS: lldb-unit :: Utility/./UtilityTests/VMRange.Comparison (2203 of 2355) PASS: lldb-unit :: Host/./HostTests/SocketTests/SocketTest.TCPGetAddress/ipv4 (2204 of 2355) PASS: lldb-api :: functionalities/thread/concurrent_events/TestConcurrentManyBreakpoints.py (2205 of 2355) PASS: lldb-api :: functionalities/thread/concurrent_events/TestConcurrentSignalBreak.py (2206 of 2355) PASS: lldb-unit :: Utility/./UtilityTests/ScalarTest.Getters (2207 of 2355) PASS: lldb-unit :: UnwindAssembly/x86/./UnwindAssemblyx86Tests/Testx86AssemblyInspectionEngine.TestSimplex86_64Augmented (2208 of 2355) PASS: lldb-unit :: Utility/./UtilityTests/AnsiTerminal.WhiteSpace (2209 of 2355) PASS: lldb-shell :: Commands/command-stop-hook-output.test (2210 of 2355) PASS: lldb-api :: commands/watchpoints/watchpoint_commands/command/TestWatchpointCommandLLDB.py (2211 of 2355) PASS: lldb-shell :: SymbolFile/DWARF/x86/find-method-local-struct.cpp (2212 of 2355) PASS: lldb-api :: functionalities/load_unload/TestLoadUnload.py (2213 of 2355) PASS: lldb-api :: commands/frame/diagnose/local-variable/TestLocalVariable.py (2214 of 2355) PASS: lldb-shell :: ScriptInterpreter/Python/Crashlog/parser_text.test (2215 of 2355) PASS: lldb-unit :: ObjectFile/PECOFF/./ObjectFilePECOFFTests/PECallFrameInfoTest.Frame_reg_eh (2216 of 2355) PASS: lldb-shell :: ObjectFile/PDB/object.test (2217 of 2355) UNSUPPORTED: lldb-shell :: SymbolFile/PDB/enums-layout.test (2218 of 2355) PASS: lldb-api :: commands/expression/weak_symbols/TestWeakSymbols.py (2219 of 2355) PASS: lldb-api :: python_api/disassemble-raw-data/TestDisassembleRawData.py (2220 of 2355) PASS: lldb-api :: commands/expression/codegen-crash-import-def-arraytype-element/TestImportDefinitionArrayType.py (2221 of 2355) PASS: lldb-unit :: Utility/./UtilityTests/ArgsTest.TestQuotedUnknownEscape (2222 of 2355) PASS: lldb-shell :: Settings/TestFrameFormatNoColor.test (2223 of 2355) PASS: lldb-api :: functionalities/history/TestHistoryRecall.py (2224 of 2355) PASS: lldb-api :: python_api/lldbutil/iter/TestRegistersIterator.py (2225 of 2355) PASS: lldb-api :: functionalities/data-formatter/data-formatter-objc/TestDataFormatterObjCKVO.py (2226 of 2355) PASS: lldb-api :: lang/objc/bitfield_ivars/TestBitfieldIvars.py (2227 of 2355) PASS: lldb-api :: functionalities/data-formatter/data-formatter-python-synth/TestDataFormatterPythonSynth.py (2228 of 2355) PASS: lldb-shell :: Driver/TestRepl.test (2229 of 2355) PASS: lldb-api :: functionalities/data-formatter/summary-string-onfail/Test-rdar-9974002.py (2230 of 2355) PASS: lldb-unit :: Language/Highlighting/./HighlighterTests/HighlighterTest.ClangCursorPosAfterOtherToken (2231 of 2355) PASS: lldb-api :: functionalities/data-formatter/user-format-vs-summary/TestUserFormatVsSummary.py (2232 of 2355) PASS: lldb-api :: functionalities/breakpoint/cpp/TestCPPBreakpointLocations.py (2233 of 2355) UNSUPPORTED: lldb-api :: functionalities/data-formatter/data-formatter-stl/libstdcpp/unique_ptr/TestDataFormatterStdUniquePtr.py (2234 of 2355) PASS: lldb-shell :: ObjectFile/PECOFF/symbol.yaml (2235 of 2355) PASS: lldb-api :: tools/lldb-server/TestGdbRemoteThreadsInStopReply.py (2236 of 2355) PASS: lldb-unit :: Utility/./UtilityTests/StreamTest.ShiftOperatorPtr (2237 of 2355) PASS: lldb-api :: lang/cpp/call-function/TestCallCPPFunction.py (2238 of 2355) PASS: lldb-unit :: Utility/./UtilityTests/ArgsTest.GetArgumentArrayRef (2239 of 2355) UNSUPPORTED: lldb-api :: functionalities/data-formatter/data-formatter-stl/libstdcpp/smart_ptr/TestDataFormatterStdSmartPtr.py (2240 of 2355) PASS: lldb-api :: commands/target/stop-hook/disable/TestTargetStopHookDisable.py (2241 of 2355) PASS: lldb-unit :: Utility/./UtilityTests/RangeTest.LessThanInvalid (2242 of 2355) PASS: lldb-unit :: Utility/./UtilityTests/StringExtractorTest.GetU64BigEndian (2243 of 2355) UNSUPPORTED: lldb-shell :: SymbolFile/PDB/function-level-linking.test (2244 of 2355) PASS: lldb-unit :: Language/Highlighting/./HighlighterTests/HighlighterTest.ClangScalarLiterals (2245 of 2355) PASS: lldb-api :: python_api/sberror/TestSBError.py (2246 of 2355) PASS: lldb-unit :: ScriptInterpreter/Python/./ScriptInterpreterPythonTests/PythonDataObjectsTest.TestPythonDictionaryToStructuredDictionary (2247 of 2355) PASS: lldb-unit :: Expression/./ExpressionTests/DiagnosticManagerTest.AddDiagnostic (2248 of 2355) PASS: lldb-unit :: Utility/./UtilityTests/UriParserTest.MinimalPortPath (2249 of 2355) PASS: lldb-api :: lang/cpp/gmodules-templates/TestGModules.py (2250 of 2355) PASS: lldb-api :: functionalities/data-formatter/data-formatter-proper-plurals/TestFormattersOneIsSingular.py (2251 of 2355) PASS: lldb-api :: lang/cpp/incompatible-class-templates/TestCppIncompatibleClassTemplates.py (2252 of 2355) PASS: lldb-unit :: ObjectFile/ELF/./ObjectFileELFTests/ObjectFileELFTest.SectionsResolveConsistently (2253 of 2355) PASS: lldb-unit :: Utility/./UtilityTests/NameMatchesTest.StartsWith (2254 of 2355) PASS: lldb-api :: python_api/section/TestSectionAPI.py (2255 of 2355) PASS: lldb-unit :: Utility/./UtilityTests/ArchSpecTest.OperatorBool (2256 of 2355) PASS: lldb-api :: python_api/process/read-mem-cstring/TestReadMemCString.py (2257 of 2355) PASS: lldb-unit :: Utility/./UtilityTests/LogChannelTest.List (2258 of 2355) PASS: lldb-api :: functionalities/data-formatter/data-formatter-cpp/TestDataFormatterCpp.py (2259 of 2355) PASS: lldb-unit :: Utility/./UtilityTests/Flags.Reset (2260 of 2355) PASS: lldb-shell :: ObjectFile/ELF/PT_TLS-overlap-PT_LOAD.yaml (2261 of 2355) PASS: lldb-unit :: Utility/./UtilityTests/ArchSpecTest.YAML (2262 of 2355) PASS: lldb-unit :: SymbolFile/DWARF/./SymbolFileDWARFTests/SymbolFileDWARFTests.ParseArangesSkipErrors (2263 of 2355) PASS: lldb-api :: tools/lldb-server/TestGdbRemoteAttachOrWait.py (2264 of 2355) PASS: lldb-unit :: UnwindAssembly/x86/./UnwindAssemblyx86Tests/Testx86AssemblyInspectionEngine.TestPushR14 (2265 of 2355) PASS: lldb-api :: lang/cpp/lambdas/TestLambdas.py (2266 of 2355) PASS: lldb-unit :: Language/Highlighting/./HighlighterTests/HighlighterTest.ClangCursorPosBeforeOtherToken (2267 of 2355) PASS: lldb-shell :: Driver/TestNoUseColor.test (2268 of 2355) PASS: lldb-unit :: Utility/./UtilityTests/ArgsTest.TestSingleQuotedArgWithSpace (2269 of 2355) PASS: lldb-unit :: Utility/./UtilityTests/BinaryStreamTest.PutSLEB128Zero (2270 of 2355) PASS: lldb-unit :: Host/./HostTests/SocketTests/SocketTest.TCPListen0GetPort/ipv6 (2271 of 2355) PASS: lldb-api :: functionalities/reproducers/fs-case-sensitivity/TestReproducerFSCaseSensitivity.py (2272 of 2355) PASS: lldb-api :: functionalities/breakpoint/breakpoint_ids/TestBreakpointIDs.py (2273 of 2355) PASS: lldb-api :: functionalities/data-formatter/data-formatter-stl/libcxx/tuple/TestDataFormatterLibcxxTuple.py (2274 of 2355) PASS: lldb-shell :: Quit/TestQuitExitCodeTooManyArgs.test (2275 of 2355) PASS: lldb-unit :: Signals/./SignalsTests/UnixSignalsTest.GetFilteredSignals (2276 of 2355) XFAIL: lldb-shell :: Register/x86-64-ymm-write.test (2277 of 2355) PASS: lldb-unit :: Symbol/./SymbolTests/SymbolsTest.TerminateLocateExecutableSymbolFileForUnknownExecutableAndUnknownSymbolFile (2278 of 2355) UNSUPPORTED: lldb-api :: commands/register/register/intel_xtended_registers/mpx_offset_intersection/TestMPXOffsetIntersection.py (2279 of 2355) PASS: lldb-api :: commands/statistics/basic/TestStats.py (2280 of 2355) PASS: lldb-api :: commands/expression/import-std-module/queue/TestQueueFromStdModule.py (2281 of 2355) PASS: lldb-unit :: Utility/./UtilityTests/RangeTest.Equal (2282 of 2355) PASS: lldb-api :: functionalities/postmortem/elf-core/gcore/TestGCore.py (2283 of 2355) PASS: lldb-api :: commands/expression/xvalue/TestXValuePrinting.py (2284 of 2355) PASS: lldb-api :: commands/expression/timeout/TestCallWithTimeout.py (2285 of 2355) PASS: lldb-unit :: Process/gdb-remote/./ProcessGdbRemoteTests/PortMapTest.FreePortForProcess (2286 of 2355) PASS: lldb-api :: functionalities/breakpoint/source_regexp/TestSourceRegexBreakpoints.py (2287 of 2355) PASS: lldb-unit :: Utility/./UtilityTests/LogTest.Register (2288 of 2355) PASS: lldb-shell :: ObjectFile/ELF/PT_LOAD.yaml (2289 of 2355) UNSUPPORTED: lldb-shell :: ScriptInterpreter/Lua/quit.test (2290 of 2355) PASS: lldb-shell :: Settings/TestLineMarkerColor.test (2291 of 2355) PASS: lldb-api :: functionalities/find-line-entry/TestFindLineEntry.py (2292 of 2355) UNSUPPORTED: lldb-shell :: ScriptInterpreter/Lua/lua.test (2293 of 2355) PASS: lldb-unit :: Host/./HostTests/SocketTests/SocketTest.DomainGetConnectURI/ipv4 (2294 of 2355) UNSUPPORTED: lldb-api :: commands/watchpoints/multi_watchpoint_slots/TestWatchpointMultipleSlots.py (2295 of 2355) PASS: lldb-api :: commands/apropos/basic/TestApropos.py (2296 of 2355) PASS: lldb-unit :: Process/gdb-remote/./ProcessGdbRemoteTests/GDBRemoteClientBaseTest.InterruptNoResponse (2297 of 2355) PASS: lldb-unit :: Utility/./UtilityTests/RangeDataVector.FindEntryIndexesThatContain_Overlap (2298 of 2355) PASS: lldb-api :: commands/expression/char/TestExprsChar.py (2299 of 2355) PASS: lldb-api :: functionalities/thread/concurrent_events/TestConcurrentDelayedCrashWithBreakpointSignal.py (2300 of 2355) PASS: lldb-api :: commands/expression/import-std-module/deque-dbg-info-content/TestDbgInfoContentDequeFromStdModule.py (2301 of 2355) PASS: lldb-unit :: Utility/./UtilityTests/CompletionRequest.DuplicateFiltering (2302 of 2355) PASS: lldb-unit :: Target/./TargetTests/ExecutionContextTest.GetByteOrderTarget (2303 of 2355) PASS: lldb-shell :: SymbolFile/NativePDB/load-pdb.cpp (2304 of 2355) PASS: lldb-api :: functionalities/pointer_num_children/TestPointerNumChildren.py (2305 of 2355) PASS: lldb-shell :: Register/Core/x86-64-linux-gp.test (2306 of 2355) PASS: lldb-unit :: tools/lldb-server/tests/./LLDBServerTests/TestBase.LaunchModePreservesEnvironment (2307 of 2355) UNSUPPORTED: lldb-api :: functionalities/darwin_log/source/info/TestDarwinLogSourceInfo.py (2308 of 2355) PASS: lldb-api :: macosx/universal/TestUniversal.py (2309 of 2355) PASS: lldb-shell :: SymbolFile/Breakpad/line-table-discontinuous-file-ids.test (2310 of 2355) PASS: lldb-api :: python_api/interpreter/TestRunCommandInterpreterAPI.py (2311 of 2355) UNSUPPORTED: lldb-api :: tools/lldb-vscode/disconnect/TestVSCode_disconnect.py (2312 of 2355) PASS: lldb-api :: commands/expression/po_verbosity/TestPoVerbosity.py (2313 of 2355) PASS: lldb-unit :: UnwindAssembly/x86/./UnwindAssemblyx86Tests/Testx86AssemblyInspectionEngine.TestStackRealignMSVC_i386 (2314 of 2355) UNSUPPORTED: lldb-api :: commands/trace/TestTraceLoad.py (2315 of 2355) PASS: lldb-unit :: Utility/./UtilityTests/StreamTeeTest.CopyConstructor (2316 of 2355) PASS: lldb-unit :: Target/./TargetTests/MemoryRegionInfoTest.Formatv (2317 of 2355) PASS: lldb-unit :: Host/./HostTests/File.GetWaitableHandleFileno (2318 of 2355) PASS: lldb-shell :: ObjectFile/Breakpad/sections.test (2319 of 2355) PASS: lldb-unit :: Utility/./UtilityTests/StreamTest.PutRawBytesToLittleEndian (2320 of 2355) PASS: lldb-api :: functionalities/backticks/TestBackticksWithoutATarget.py (2321 of 2355) PASS: lldb-api :: lang/cpp/stl/TestSTL.py (2322 of 2355) PASS: lldb-unit :: Utility/./UtilityTests/OptionsWithRawTest.SingleWhitespaceInput (2323 of 2355) PASS: lldb-shell :: Reproducer/TestDriverOptions.test (2324 of 2355) PASS: lldb-shell :: Commands/command-disassemble.s (2325 of 2355) PASS: lldb-api :: tools/lldb-server/register-reading/TestGdbRemoteGPacket.py (2326 of 2355) PASS: lldb-shell :: Reproducer/Functionalities/TestDataFormatter.test (2327 of 2355) PASS: lldb-unit :: UnwindAssembly/x86/./UnwindAssemblyx86Tests/Testx86AssemblyInspectionEngine.TestSimple32bitFrameFunction (2328 of 2355) PASS: lldb-unit :: ScriptInterpreter/Python/./ScriptInterpreterPythonTests/PythonDataObjectsTest.TestBorrowedReferences (2329 of 2355) PASS: lldb-shell :: Process/Optimization.test (2330 of 2355) PASS: lldb-unit :: Utility/./UtilityTests/OptionsWithRawTest.SingleWordSuffix (2331 of 2355) PASS: lldb-unit :: SymbolFile/DWARF/./SymbolFileDWARFTests/XcodeSDKModuleTests.TestModuleGetXcodeSDK (2332 of 2355) PASS: lldb-api :: python_api/type/TestTypeList.py (2333 of 2355) UNSUPPORTED: lldb-api :: functionalities/tsan/thread_numbers/TestTsanThreadNumbers.py (2334 of 2355) PASS: lldb-unit :: ScriptInterpreter/Python/./ScriptInterpreterPythonTests/PythonDataObjectsTest.TestPythonListManipulation (2335 of 2355) PASS: lldb-unit :: Utility/./UtilityTests/ReproducerTest.SetReplay (2336 of 2355) PASS: lldb-api :: lang/objc/foundation/TestConstStrings.py (2337 of 2355) PASS: lldb-unit :: Process/gdb-remote/./ProcessGdbRemoteTests/GDBRemoteCommunicationClientTest.SendTraceSupportedPacket (2338 of 2355) UNSUPPORTED: lldb-api :: functionalities/unwind/ehframe/TestEhFrameUnwind.py (2339 of 2355) PASS: lldb-unit :: Utility/./UtilityTests/ScalarTest.SetValueFromCString (2340 of 2355) UNSUPPORTED: lldb-api :: benchmarks/expression/TestRepeatedExprs.py (2341 of 2355) PASS: lldb-unit :: Utility/./UtilityTests/ArgsTest.BareSingleQuote (2342 of 2355) PASS: lldb-api :: lang/objcxx/objc-builtin-types/TestObjCBuiltinTypes.py (2343 of 2355) PASS: lldb-unit :: UnwindAssembly/x86/./UnwindAssemblyx86Tests/Testx86AssemblyInspectionEngine.TestPopEBX (2344 of 2355) PASS: lldb-api :: lang/cpp/template-arguments/TestCppTemplateArguments.py (2345 of 2355) PASS: lldb-unit :: Utility/./UtilityTests/StringExtractorTest.DecodeHexU8_Extra (2346 of 2355) PASS: lldb-api :: tools/lldb-server/TestGdbRemoteExitCode.py (2347 of 2355) PASS: lldb-unit :: Process/Utility/./ProcessUtilityTests/ProcSMapTests/LinuxProcSMapsTestFixture.ParseSMapRegions/3 (2348 of 2355) PASS: lldb-api :: functionalities/conditional_break/TestConditionalBreak.py (2349 of 2355) PASS: lldb-api :: lang/cpp/namespace/TestNamespaceLookup.py (2350 of 2355) PASS: lldb-api :: lang/cpp/this_class_type_mixing/TestThisClassTypeMixing.py (2351 of 2355) UNSUPPORTED: lldb-api :: linux/mix-dwo-and-regular-objects/TestMixedDwarfBinary.py (2352 of 2355) PASS: lldb-api :: lang/objc/foundation/TestRuntimeTypes.py (2353 of 2355) PASS: lldb-api :: python_api/target/TestTargetAPI.py (2354 of 2355) PASS: lldb-api :: tools/lldb-server/TestLldbGdbServer.py (2355 of 2355) Slowest Tests: -------------------------------------------------------------------------- 293.26s: lldb-api :: tools/lldb-server/TestLldbGdbServer.py 141.57s: lldb-api :: functionalities/memory-region/TestMemoryRegion.py 131.89s: lldb-api :: api/multithreaded/TestMultithreaded.py 116.88s: lldb-api :: macosx/skinny-corefile/TestSkinnyCorefile.py 91.39s: lldb-api :: functionalities/gdb_remote_client/TestWasm.py 85.60s: lldb-api :: types/TestLongTypesExpr.py 72.38s: lldb-api :: lang/objc/exceptions/TestObjCExceptions.py 71.63s: lldb-api :: lang/cpp/namespace/TestNamespaceLookup.py 69.04s: lldb-api :: commands/expression/import-std-module/stack/TestStackFromStdModule.py 66.64s: lldb-api :: lang/objc/hidden-ivars/TestHiddenIvars.py 65.99s: lldb-api :: commands/expression/import-std-module/queue/TestQueueFromStdModule.py 62.78s: lldb-api :: lang/objc/objc-new-syntax/TestObjCNewSyntaxLiteral.py 58.07s: lldb-api :: lang/objc/foundation/TestObjCMethods.py 57.71s: lldb-api :: commands/expression/import-std-module/vector/TestVectorFromStdModule.py 53.20s: lldb-api :: types/TestIntegerTypeExpr.py 52.42s: lldb-api :: python_api/target/TestTargetAPI.py 50.03s: lldb-api :: commands/expression/import-std-module/deque-basic/TestDequeFromStdModule.py 49.73s: lldb-api :: tools/lldb-server/TestGdbRemoteThreadsInStopReply.py 48.59s: lldb-api :: lang/objc/objc-new-syntax/TestObjCNewSyntaxDictionary.py 48.33s: lldb-api :: lang/objc/objc-new-syntax/TestObjCNewSyntaxArray.py

Hide Details

Tests Times: -------------------------------------------------------------------------- [ Range ] :: [ Percentage ] :: [ Count ] -------------------------------------------------------------------------- [280s,300s) :: [ ] :: [ 1/2355] [260s,280s) :: [ ] :: [ 0/2355] [240s,260s) :: [ ] :: [ 0/2355] [220s,240s) :: [ ] :: [ 0/2355] [200s,220s) :: [ ] :: [ 0/2355] [180s,200s) :: [ ] :: [ 0/2355] [160s,180s) :: [ ] :: [ 0/2355] [140s,160s) :: [ ] :: [ 1/2355] [120s,140s) :: [ ] :: [ 1/2355] [100s,120s) :: [ ] :: [ 1/2355] [ 80s,100s) :: [ ] :: [ 2/2355] [ 60s, 80s) :: [ ] :: [ 6/2355] [ 40s, 60s) :: [ ] :: [ 19/2355] [ 20s, 40s) :: [* ] :: [ 64/2355] [ 0s, 20s) :: [************************************** ] :: [2260/2355] -------------------------------------------------------------------------- ******************** Failed Tests (3): lldb-api :: tools/lldb-vscode/breakpoint/TestVSCode_setBreakpoints.py lldb-api :: tools/lldb-vscode/breakpoint/TestVSCode_setFunctionBreakpoints.py lldb-api :: tools/lldb-vscode/evaluate/TestVSCode_evaluate.py

Hide Details

Hide Details

Testing Time: 2497.49s Unsupported : 212 Passed : 2130 Expectedly Failed: 10 Failed : 3 FAILED: tools/lldb/test/CMakeFiles/check-lldb cd /Users/buildslave/jenkins/workspace/lldb-cmake-sanitized/lldb-build/tools/lldb/test && /usr/local/Frameworks/Python.framework/Versions/3.7/bin/python3.7 /Users/buildslave/jenkins/workspace/lldb-cmake-sanitized/lldb-build/./bin/llvm-lit -v --time-tests --shuffle --xunit-xml-output=/Users/buildslave/jenkins/workspace/lldb-cmake-sanitized/test/results.xml -v -j 4 --timeout 1200 /Users/buildslave/jenkins/workspace/lldb-cmake-sanitized/lldb-build/tools/lldb/test ninja: build stopped: subcommand failed. Command failed: Command '['/usr/bin/env', 'TERM=vt100', '/usr/local/bin/ninja', '-v', 'check-lldb']' returned non-zero exit status 1. Command: ['/usr/bin/env', 'TERM=vt100', '/usr/local/bin/ninja', '-v', 'check-lldb'] [Pipeline] } [Pipeline] // timeout [Pipeline] } [Pipeline] // stage [Pipeline] stage [Pipeline] { (Declarative: Post Actions) [Pipeline] scanForIssues [Clang (LLVM based)] Sleeping for 5 seconds due to JENKINS-32191... [Clang (LLVM based)] Parsing console log (workspace: '/Users/buildslave/jenkins/workspace/lldb-cmake-sanitized') [Clang (LLVM based)] Successfully parsed console log [Clang (LLVM based)] -> found 5 issues (skipped 3 duplicates) [Clang (LLVM based)] [-ERROR-] Can't create fingerprints for some files: [Clang (LLVM based)] [-ERROR-] - '/Users/buildslave/jenkins/workspace/lldb-cmake-sanitized/lldb-build/{"body":{"category":"console","output":"/Users/buildslave/jenkins/workspace/lldb-cmake-sanitized/llvm-project/lldb/tools/lldb-vscode/ProgressEvent.cpp', IO exception has been thrown: java.nio.file.NoSuchFileException: /Users/buildslave/jenkins/workspace/lldb-cmake-sanitized/lldb-build/{"body":{"category":"console","output":"/Users/buildslave/jenkins/workspace/lldb-cmake-sanitized/llvm-project/lldb/tools/lldb-vscode/ProgressEvent.cpp [Clang (LLVM based)] [-ERROR-] - '/Users/buildslave/jenkins/workspace/lldb-cmake-sanitized/lldb-build/{"body":{"category":"console","output":"/Users/buildslave/jenkins/workspace/lldb-cmake-sanitized/llvm-project/lldb/tools/lldb-vscode/ProgressEvent.cpp', IO exception has been thrown: java.nio.file.NoSuchFileException: /Users/buildslave/jenkins/workspace/lldb-cmake-sanitized/lldb-build/{"body":{"category":"console","output":"/Users/buildslave/jenkins/workspace/lldb-cmake-sanitized/llvm-project/lldb/tools/lldb-vscode/ProgressEvent.cpp [Clang (LLVM based)] Post processing issues on 'green-dragon-23' with source code encoding 'UTF-8' [Clang (LLVM based)] Creating SCM blamer to obtain author and commit information for affected files [Clang (LLVM based)] -> No blamer installed yet. You need to install the 'git-forensics' plugin to enable blaming for Git. [Clang (LLVM based)] Resolving file names for all issues in source directory '/Users/buildslave/jenkins/workspace/lldb-cmake-sanitized' [Clang (LLVM based)] -> resolved paths in source directory (3 found, 1 not found) [Clang (LLVM based)] Resolving module names from module definitions (build.xml, pom.xml, or Manifest.mf files) [Clang (LLVM based)] -> resolved module names for 5 issues [Clang (LLVM based)] Resolving package names (or namespaces) by parsing the affected files [Clang (LLVM based)] -> resolved package names of 4 affected files [Clang (LLVM based)] No filter has been set, publishing all 5 issues [Clang (LLVM based)] Creating fingerprints for all affected code blocks to track issues over different builds [Clang (LLVM based)] -> created fingerprints for 3 issues (skipped 2 issues) [Clang (LLVM based)] Copying affected files to Jenkins' build folder '/Users/Shared/Jenkins/Home/jobs/lldb-cmake-sanitized/builds/1905/files-with-issues' [Clang (LLVM based)] -> 3 copied, 0 not in workspace, 2 not-found, 0 with I/O error [Clang (LLVM based)] Repository miner is not configured, skipping repository mining [Pipeline] junit Recording test results [Checks API] No suitable checks publisher found. [Pipeline] } [Pipeline] // stage [Pipeline] } [Pipeline] // withEnv [Pipeline] } [Pipeline] // node [Pipeline] End of Pipeline ERROR: script returned exit code 1 Finished: FAILURE