Console Output

Skipping 9,563 KB.. Full Log
runCmd: settings clear -all
output: 

Hide Details

runCmd: settings set symbols.enable-external-lookup false output:

Hide Details

runCmd: settings set target.inherit-tcc true output:

Hide Details

runCmd: settings set target.detach-on-error false output:

Hide Details

runCmd: settings set target.auto-apply-fixits false output:

Hide Details

runCmd: settings set plugin.process.gdb-remote.packet-timeout 60 output:

Hide Details

runCmd: settings set symbols.clang-modules-cache-path "/Users/buildslave/jenkins/workspace/lldb-cmake-sanitized/lldb-build/lldb-test-build.noindex/module-cache-lldb/lldb-api" output:

Hide Details

runCmd: settings set use-color false output:

Hide Details

runCmd: setting set target.prefer-dynamic-value no-dynamic-values output:

Hide Details

runCmd: settings set target.env-vars ASAN_OPTIONS=detect_stack_use_after_return=1 DYLD_INSERT_LIBRARIES=/Users/buildslave/jenkins/workspace/lldb-cmake-sanitized/host-compiler/lib/clang/13.0.99/lib/darwin/libclang_rt.asan_osx_dynamic.dylib output:

Hide Details

Adding tearDown hook: def cleanup(): if disconnectAutomatically: self.vscode.request_disconnect(terminateDebuggee=True) self.vscode.terminate()

Hide Details

Hide Details

FAIL: LLDB (/Users/buildslave/jenkins/workspace/lldb-cmake-sanitized/host-compiler/bin/clang-x86_64) :: test_generic_evaluate_expressions (TestVSCode_evaluate.TestVSCode_variables) Executing tearDown hook: def cleanup(): if disconnectAutomatically: self.vscode.request_disconnect(terminateDebuggee=True) self.vscode.terminate()

Hide Details

Hide Details

CLEANUP ERROR: LLDB (/Users/buildslave/jenkins/workspace/lldb-cmake-sanitized/host-compiler/bin/clang-x86_64) :: test_generic_evaluate_expressions (TestVSCode_evaluate.TestVSCode_variables) Traceback (most recent call last): File "/Users/buildslave/jenkins/workspace/lldb-cmake-sanitized/llvm-project/lldb/third_party/Python/module/unittest2/unittest2/case.py", line 386, in run self.tearDown() File "/Users/buildslave/jenkins/workspace/lldb-cmake-sanitized/llvm-project/lldb/packages/Python/lldbsuite/test/lldbtest.py", line 2095, in tearDown Base.tearDown(self) File "/Users/buildslave/jenkins/workspace/lldb-cmake-sanitized/llvm-project/lldb/packages/Python/lldbsuite/test/lldbtest.py", line 1065, in tearDown hook() # try the plain call and hope it works File "/Users/buildslave/jenkins/workspace/lldb-cmake-sanitized/llvm-project/lldb/packages/Python/lldbsuite/test/tools/lldb-vscode/lldbvscode_testcase.py", line 294, in cleanup self.vscode.request_disconnect(terminateDebuggee=True) File "/Users/buildslave/jenkins/workspace/lldb-cmake-sanitized/llvm-project/lldb/packages/Python/lldbsuite/test/tools/lldb-vscode/vscode.py", line 590, in request_disconnect return self.send_recv(command_dict) File "/Users/buildslave/jenkins/workspace/lldb-cmake-sanitized/llvm-project/lldb/packages/Python/lldbsuite/test/tools/lldb-vscode/vscode.py", line 315, in send_recv self.send_packet(command) File "/Users/buildslave/jenkins/workspace/lldb-cmake-sanitized/llvm-project/lldb/packages/Python/lldbsuite/test/tools/lldb-vscode/vscode.py", line 271, in send_packet self.send.flush() BrokenPipeError: [Errno 32] Broken pipe

Hide Details

runCmd: settings clear -all output:

Hide Details

runCmd: settings set symbols.enable-external-lookup false output:

Hide Details

runCmd: settings set target.inherit-tcc true output:

Hide Details

runCmd: settings set target.detach-on-error false output:

Hide Details

runCmd: settings set target.auto-apply-fixits false output:

Hide Details

runCmd: settings set plugin.process.gdb-remote.packet-timeout 60 output:

Hide Details

runCmd: settings set symbols.clang-modules-cache-path "/Users/buildslave/jenkins/workspace/lldb-cmake-sanitized/lldb-build/lldb-test-build.noindex/module-cache-lldb/lldb-api" output:

Hide Details

runCmd: settings set use-color false output:

Hide Details

runCmd: setting set target.prefer-dynamic-value no-dynamic-values output:

Hide Details

runCmd: settings set target.env-vars ASAN_OPTIONS=detect_stack_use_after_return=1 DYLD_INSERT_LIBRARIES=/Users/buildslave/jenkins/workspace/lldb-cmake-sanitized/host-compiler/lib/clang/13.0.99/lib/darwin/libclang_rt.asan_osx_dynamic.dylib output:

Hide Details

Adding tearDown hook: def cleanup(): if disconnectAutomatically: self.vscode.request_disconnect(terminateDebuggee=True) self.vscode.terminate()

Hide Details

Hide Details

Executing tearDown hook: def cleanup(): if disconnectAutomatically: self.vscode.request_disconnect(terminateDebuggee=True) self.vscode.terminate()

Hide Details

Hide Details

PASS: LLDB (/Users/buildslave/jenkins/workspace/lldb-cmake-sanitized/host-compiler/bin/clang-x86_64) :: test_hover_evaluate_expressions (TestVSCode_evaluate.TestVSCode_variables) runCmd: settings clear -all output:

Hide Details

runCmd: settings set symbols.enable-external-lookup false output:

Hide Details

runCmd: settings set target.inherit-tcc true output:

Hide Details

runCmd: settings set target.detach-on-error false output:

Hide Details

runCmd: settings set target.auto-apply-fixits false output:

Hide Details

runCmd: settings set plugin.process.gdb-remote.packet-timeout 60 output:

Hide Details

runCmd: settings set symbols.clang-modules-cache-path "/Users/buildslave/jenkins/workspace/lldb-cmake-sanitized/lldb-build/lldb-test-build.noindex/module-cache-lldb/lldb-api" output:

Hide Details

runCmd: settings set use-color false output:

Hide Details

runCmd: setting set target.prefer-dynamic-value no-dynamic-values output:

Hide Details

runCmd: settings set target.env-vars ASAN_OPTIONS=detect_stack_use_after_return=1 DYLD_INSERT_LIBRARIES=/Users/buildslave/jenkins/workspace/lldb-cmake-sanitized/host-compiler/lib/clang/13.0.99/lib/darwin/libclang_rt.asan_osx_dynamic.dylib output:

Hide Details

Adding tearDown hook: def cleanup(): if disconnectAutomatically: self.vscode.request_disconnect(terminateDebuggee=True) self.vscode.terminate()

Hide Details

Hide Details

FAIL: LLDB (/Users/buildslave/jenkins/workspace/lldb-cmake-sanitized/host-compiler/bin/clang-x86_64) :: test_repl_evaluate_expressions (TestVSCode_evaluate.TestVSCode_variables) Executing tearDown hook: def cleanup(): if disconnectAutomatically: self.vscode.request_disconnect(terminateDebuggee=True) self.vscode.terminate()

Hide Details

Hide Details

CLEANUP ERROR: LLDB (/Users/buildslave/jenkins/workspace/lldb-cmake-sanitized/host-compiler/bin/clang-x86_64) :: test_repl_evaluate_expressions (TestVSCode_evaluate.TestVSCode_variables) Traceback (most recent call last): File "/Users/buildslave/jenkins/workspace/lldb-cmake-sanitized/llvm-project/lldb/third_party/Python/module/unittest2/unittest2/case.py", line 386, in run self.tearDown() File "/Users/buildslave/jenkins/workspace/lldb-cmake-sanitized/llvm-project/lldb/packages/Python/lldbsuite/test/lldbtest.py", line 2095, in tearDown Base.tearDown(self) File "/Users/buildslave/jenkins/workspace/lldb-cmake-sanitized/llvm-project/lldb/packages/Python/lldbsuite/test/lldbtest.py", line 1065, in tearDown hook() # try the plain call and hope it works File "/Users/buildslave/jenkins/workspace/lldb-cmake-sanitized/llvm-project/lldb/packages/Python/lldbsuite/test/tools/lldb-vscode/lldbvscode_testcase.py", line 294, in cleanup self.vscode.request_disconnect(terminateDebuggee=True) File "/Users/buildslave/jenkins/workspace/lldb-cmake-sanitized/llvm-project/lldb/packages/Python/lldbsuite/test/tools/lldb-vscode/vscode.py", line 590, in request_disconnect return self.send_recv(command_dict) File "/Users/buildslave/jenkins/workspace/lldb-cmake-sanitized/llvm-project/lldb/packages/Python/lldbsuite/test/tools/lldb-vscode/vscode.py", line 315, in send_recv self.send_packet(command) File "/Users/buildslave/jenkins/workspace/lldb-cmake-sanitized/llvm-project/lldb/packages/Python/lldbsuite/test/tools/lldb-vscode/vscode.py", line 271, in send_packet self.send.flush() BrokenPipeError: [Errno 32] Broken pipe

Hide Details

runCmd: settings clear -all output:

Hide Details

runCmd: settings set symbols.enable-external-lookup false output:

Hide Details

runCmd: settings set target.inherit-tcc true output:

Hide Details

runCmd: settings set target.detach-on-error false output:

Hide Details

runCmd: settings set target.auto-apply-fixits false output:

Hide Details

runCmd: settings set plugin.process.gdb-remote.packet-timeout 60 output:

Hide Details

runCmd: settings set symbols.clang-modules-cache-path "/Users/buildslave/jenkins/workspace/lldb-cmake-sanitized/lldb-build/lldb-test-build.noindex/module-cache-lldb/lldb-api" output:

Hide Details

runCmd: settings set use-color false output:

Hide Details

runCmd: setting set target.prefer-dynamic-value no-dynamic-values output:

Hide Details

runCmd: settings set target.env-vars ASAN_OPTIONS=detect_stack_use_after_return=1 DYLD_INSERT_LIBRARIES=/Users/buildslave/jenkins/workspace/lldb-cmake-sanitized/host-compiler/lib/clang/13.0.99/lib/darwin/libclang_rt.asan_osx_dynamic.dylib output:

Hide Details

Adding tearDown hook: def cleanup(): if disconnectAutomatically: self.vscode.request_disconnect(terminateDebuggee=True) self.vscode.terminate()

Hide Details

Hide Details

FAIL: LLDB (/Users/buildslave/jenkins/workspace/lldb-cmake-sanitized/host-compiler/bin/clang-x86_64) :: test_watch_evaluate_expressions (TestVSCode_evaluate.TestVSCode_variables) Executing tearDown hook: def cleanup(): if disconnectAutomatically: self.vscode.request_disconnect(terminateDebuggee=True) self.vscode.terminate()

Hide Details

Hide Details

CLEANUP ERROR: LLDB (/Users/buildslave/jenkins/workspace/lldb-cmake-sanitized/host-compiler/bin/clang-x86_64) :: test_watch_evaluate_expressions (TestVSCode_evaluate.TestVSCode_variables) Traceback (most recent call last): File "/Users/buildslave/jenkins/workspace/lldb-cmake-sanitized/llvm-project/lldb/third_party/Python/module/unittest2/unittest2/case.py", line 386, in run self.tearDown() File "/Users/buildslave/jenkins/workspace/lldb-cmake-sanitized/llvm-project/lldb/packages/Python/lldbsuite/test/lldbtest.py", line 2095, in tearDown Base.tearDown(self) File "/Users/buildslave/jenkins/workspace/lldb-cmake-sanitized/llvm-project/lldb/packages/Python/lldbsuite/test/lldbtest.py", line 1065, in tearDown hook() # try the plain call and hope it works File "/Users/buildslave/jenkins/workspace/lldb-cmake-sanitized/llvm-project/lldb/packages/Python/lldbsuite/test/tools/lldb-vscode/lldbvscode_testcase.py", line 294, in cleanup self.vscode.request_disconnect(terminateDebuggee=True) File "/Users/buildslave/jenkins/workspace/lldb-cmake-sanitized/llvm-project/lldb/packages/Python/lldbsuite/test/tools/lldb-vscode/vscode.py", line 590, in request_disconnect return self.send_recv(command_dict) File "/Users/buildslave/jenkins/workspace/lldb-cmake-sanitized/llvm-project/lldb/packages/Python/lldbsuite/test/tools/lldb-vscode/vscode.py", line 315, in send_recv self.send_packet(command) File "/Users/buildslave/jenkins/workspace/lldb-cmake-sanitized/llvm-project/lldb/packages/Python/lldbsuite/test/tools/lldb-vscode/vscode.py", line 271, in send_packet self.send.flush() BrokenPipeError: [Errno 32] Broken pipe

Hide Details

Restore dir to: /Users/buildslave/jenkins/workspace/lldb-cmake-sanitized/lldb-build/tools/lldb/test ====================================================================== ERROR: test_generic_evaluate_expressions (TestVSCode_evaluate.TestVSCode_variables) ---------------------------------------------------------------------- Traceback (most recent call last): File "/Users/buildslave/jenkins/workspace/lldb-cmake-sanitized/llvm-project/lldb/test/API/tools/lldb-vscode/evaluate/TestVSCode_evaluate.py", line 157, in test_generic_evaluate_expressions self.run_test_evaluate_expressions() File "/Users/buildslave/jenkins/workspace/lldb-cmake-sanitized/llvm-project/lldb/test/API/tools/lldb-vscode/evaluate/TestVSCode_evaluate.py", line 60, in run_test_evaluate_expressions self.assertEvaluateFailure("var") # local variable of a_function File "/Users/buildslave/jenkins/workspace/lldb-cmake-sanitized/llvm-project/lldb/test/API/tools/lldb-vscode/evaluate/TestVSCode_evaluate.py", line 24, in assertEvaluateFailure self.vscode.request_evaluate(expression, context=self.context)['body']) File "/Users/buildslave/jenkins/workspace/lldb-cmake-sanitized/llvm-project/lldb/packages/Python/lldbsuite/test/tools/lldb-vscode/vscode.py", line 607, in request_evaluate return self.send_recv(command_dict) File "/Users/buildslave/jenkins/workspace/lldb-cmake-sanitized/llvm-project/lldb/packages/Python/lldbsuite/test/tools/lldb-vscode/vscode.py", line 321, in send_recv raise ValueError(desc) ValueError: no response for "evaluate" Config=x86_64-/Users/buildslave/jenkins/workspace/lldb-cmake-sanitized/host-compiler/bin/clang ====================================================================== ERROR: test_repl_evaluate_expressions (TestVSCode_evaluate.TestVSCode_variables) ---------------------------------------------------------------------- Traceback (most recent call last): File "/Users/buildslave/jenkins/workspace/lldb-cmake-sanitized/llvm-project/lldb/test/API/tools/lldb-vscode/evaluate/TestVSCode_evaluate.py", line 163, in test_repl_evaluate_expressions self.run_test_evaluate_expressions("repl") File "/Users/buildslave/jenkins/workspace/lldb-cmake-sanitized/llvm-project/lldb/test/API/tools/lldb-vscode/evaluate/TestVSCode_evaluate.py", line 60, in run_test_evaluate_expressions self.assertEvaluateFailure("var") # local variable of a_function File "/Users/buildslave/jenkins/workspace/lldb-cmake-sanitized/llvm-project/lldb/test/API/tools/lldb-vscode/evaluate/TestVSCode_evaluate.py", line 24, in assertEvaluateFailure self.vscode.request_evaluate(expression, context=self.context)['body']) File "/Users/buildslave/jenkins/workspace/lldb-cmake-sanitized/llvm-project/lldb/packages/Python/lldbsuite/test/tools/lldb-vscode/vscode.py", line 607, in request_evaluate return self.send_recv(command_dict) File "/Users/buildslave/jenkins/workspace/lldb-cmake-sanitized/llvm-project/lldb/packages/Python/lldbsuite/test/tools/lldb-vscode/vscode.py", line 321, in send_recv raise ValueError(desc) ValueError: no response for "evaluate" Config=x86_64-/Users/buildslave/jenkins/workspace/lldb-cmake-sanitized/host-compiler/bin/clang ====================================================================== ERROR: test_watch_evaluate_expressions (TestVSCode_evaluate.TestVSCode_variables) ---------------------------------------------------------------------- Traceback (most recent call last): File "/Users/buildslave/jenkins/workspace/lldb-cmake-sanitized/llvm-project/lldb/test/API/tools/lldb-vscode/evaluate/TestVSCode_evaluate.py", line 169, in test_watch_evaluate_expressions self.run_test_evaluate_expressions("watch") File "/Users/buildslave/jenkins/workspace/lldb-cmake-sanitized/llvm-project/lldb/test/API/tools/lldb-vscode/evaluate/TestVSCode_evaluate.py", line 60, in run_test_evaluate_expressions self.assertEvaluateFailure("var") # local variable of a_function File "/Users/buildslave/jenkins/workspace/lldb-cmake-sanitized/llvm-project/lldb/test/API/tools/lldb-vscode/evaluate/TestVSCode_evaluate.py", line 24, in assertEvaluateFailure self.vscode.request_evaluate(expression, context=self.context)['body']) File "/Users/buildslave/jenkins/workspace/lldb-cmake-sanitized/llvm-project/lldb/packages/Python/lldbsuite/test/tools/lldb-vscode/vscode.py", line 607, in request_evaluate return self.send_recv(command_dict) File "/Users/buildslave/jenkins/workspace/lldb-cmake-sanitized/llvm-project/lldb/packages/Python/lldbsuite/test/tools/lldb-vscode/vscode.py", line 321, in send_recv raise ValueError(desc) ValueError: no response for "evaluate" Config=x86_64-/Users/buildslave/jenkins/workspace/lldb-cmake-sanitized/host-compiler/bin/clang ---------------------------------------------------------------------- Ran 4 tests in 14.568s

Hide Details

RESULT: FAILED (1 passes, 0 failures, 3 errors, 0 skipped, 0 expected failures, 0 unexpected successes)

Hide Details

--

Hide Details

******************** PASS: lldb-shell :: SymbolFile/Breakpad/unwind-via-stack-cfi.test (1260 of 2355) UNSUPPORTED: lldb-api :: tools/lldb-server/TestGdbRemoteModuleInfo.py (1261 of 2355) PASS: lldb-unit :: Editline/./EditlineTests/EditlineTestFixture.EditlineReceivesSingleLineText (1262 of 2355) PASS: lldb-shell :: Reproducer/TestVersionCheck.test (1263 of 2355) PASS: lldb-api :: functionalities/breakpoint/breakpoint_command/TestRegexpBreakCommand.py (1264 of 2355) PASS: lldb-shell :: SymbolFile/NativePDB/nested-types.cpp (1265 of 2355) PASS: lldb-unit :: Utility/./UtilityTests/RangeTest.EqualInvalid (1266 of 2355) PASS: lldb-shell :: SymbolFile/DWARF/x86/find-method-local-struct.cpp (1267 of 2355) UNSUPPORTED: lldb-shell :: ScriptInterpreter/Lua/nested_sessions.test (1268 of 2355) PASS: lldb-shell :: SymbolFile/NativePDB/function-types-classes.cpp (1269 of 2355) PASS: lldb-unit :: Utility/./UtilityTests/StringExtractorTest.DecodeHexU8_Extra (1270 of 2355) PASS: lldb-unit :: Utility/./UtilityTests/FileSpecTest.RemoveLastPathComponent (1271 of 2355) PASS: lldb-unit :: Utility/./UtilityTests/LogChannelTest.List (1272 of 2355) PASS: lldb-api :: python_api/value/empty_class/TestValueAPIEmptyClass.py (1273 of 2355) PASS: lldb-shell :: SymbolFile/DWARF/x86/dwp-separate-debug-file.cpp (1274 of 2355) PASS: lldb-api :: functionalities/data-formatter/data-formatter-stl/libcxx/string/TestDataFormatterLibcxxString.py (1275 of 2355) PASS: lldb-unit :: Process/gdb-remote/./ProcessGdbRemoteTests/GDBRemoteClientBaseTest.SendContinueDelegateInterface (1276 of 2355) PASS: lldb-api :: commands/expression/import-std-module/conflicts/TestStdModuleWithConflicts.py (1277 of 2355) PASS: lldb-unit :: debugserver/./debugserverTests/RNBSocket.LoopBackConnectIPv6 (1278 of 2355) PASS: lldb-unit :: Utility/./UtilityTests/RegularExpression.Invalid (1279 of 2355) PASS: lldb-unit :: Utility/./UtilityTests/StringListTest.DefaultConstructor (1280 of 2355) PASS: lldb-api :: tools/lldb-server/TestGdbRemote_vCont.py (1281 of 2355) PASS: lldb-api :: commands/expression/xvalue/TestXValuePrinting.py (1282 of 2355) PASS: lldb-api :: functionalities/optimized_code/TestNoASanExceptionAfterEvalOP_piece.py (1283 of 2355) PASS: lldb-unit :: Utility/./UtilityTests/StreamTeeTest.CopyConstructor (1284 of 2355) PASS: lldb-unit :: Core/./LLDBCoreTests/UniqueCStringMap.NoDefaultConstructor (1285 of 2355) PASS: lldb-api :: python_api/sbvalue_persist/TestSBValuePersist.py (1286 of 2355) PASS: lldb-api :: functionalities/jitloader_gdb/TestJITLoaderGDB.py (1287 of 2355) PASS: lldb-shell :: Recognizer/assert.test (1288 of 2355) PASS: lldb-api :: lang/objc/rdar-11355592/TestRdar11355592.py (1289 of 2355) PASS: lldb-api :: lang/objc/foundation/TestObjCMethods2.py (1290 of 2355) PASS: lldb-api :: lang/objc/objc_direct-methods/TestObjCDirectMethods.py (1291 of 2355) PASS: lldb-api :: lang/objc/modules-app-update/TestClangModulesAppUpdate.py (1292 of 2355) PASS: lldb-unit :: ScriptInterpreter/Python/./ScriptInterpreterPythonTests/PythonDataObjectsTest.TestPythonStringToStructuredString (1293 of 2355) PASS: lldb-api :: functionalities/postmortem/elf-core/thread_crash/TestLinuxCoreThreads.py (1294 of 2355) PASS: lldb-shell :: ScriptInterpreter/Python/eof.test (1295 of 2355) PASS: lldb-shell :: Watchpoint/SetErrorCases.test (1296 of 2355) PASS: lldb-unit :: Utility/./UtilityTests/RangeTest.Copy (1297 of 2355) PASS: lldb-shell :: ObjectFile/ELF/PT_LOAD-empty.yaml (1298 of 2355) PASS: lldb-unit :: UnwindAssembly/x86/./UnwindAssemblyx86Tests/Testx86AssemblyInspectionEngine.Testi386IgnoredRegisters (1299 of 2355) PASS: lldb-shell :: SymbolFile/DWARF/x86/debug-types-address-ranges.s (1300 of 2355) PASS: lldb-unit :: UnwindAssembly/x86/./UnwindAssemblyx86Tests/Testx86AssemblyInspectionEngine.TestPopR15 (1301 of 2355) PASS: lldb-unit :: Process/Utility/./ProcessUtilityTests/MemoryTagManagerAArch64MTETest.ExpandToGranule (1302 of 2355) PASS: lldb-api :: commands/expression/context-object-objc/TestContextObjectObjc.py (1303 of 2355) PASS: lldb-api :: lang/cpp/covariant-return-types/TestCovariantReturnTypes.py (1304 of 2355) PASS: lldb-unit :: Expression/./ExpressionTests/DiagnosticManagerTest.GetStringSeverityLabels (1305 of 2355) PASS: lldb-shell :: BuildScript/modes.test (1306 of 2355) PASS: lldb-unit :: Utility/./UtilityTests/ArchSpecTest.TripleComponentsWereSpecified (1307 of 2355) PASS: lldb-api :: functionalities/data-formatter/data-formatter-objc/nsindexpath/TestDataFormatterNSIndexPath.py (1308 of 2355) PASS: lldb-api :: functionalities/type_get_module/TestTypeGetModule.py (1309 of 2355) PASS: lldb-api :: functionalities/memory/tag/TestMemoryTag.py (1310 of 2355) PASS: lldb-api :: functionalities/thread/concurrent_events/TestConcurrentSignalBreak.py (1311 of 2355) PASS: lldb-unit :: UnwindAssembly/x86/./UnwindAssemblyx86Tests/Testx86AssemblyInspectionEngine.TestLEAVE (1312 of 2355) PASS: lldb-unit :: Language/Highlighting/./HighlighterTests/HighlighterTest.ClangTrailingBackslashBeforeNewline (1313 of 2355) PASS: lldb-api :: python_api/value/TestValueAPI.py (1314 of 2355) UNSUPPORTED: lldb-api :: commands/gui/viewlarge/TestGuiViewLarge.py (1315 of 2355) PASS: lldb-unit :: Utility/./UtilityTests/StreamTest.AddressPrefix (1316 of 2355) PASS: lldb-unit :: Host/./HostTests/MainLoopTest.ReadObject (1317 of 2355) PASS: lldb-api :: functionalities/inferior-crashing/recursive-inferior/TestRecursiveInferior.py (1318 of 2355) PASS: lldb-api :: lang/objc/objc-super/TestObjCSuper.py (1319 of 2355) PASS: lldb-unit :: Utility/./UtilityTests/DataExtractorTest.GetMaxU64 (1320 of 2355) PASS: lldb-unit :: Expression/./ExpressionTests/DWARFExpressionMockProcessTest.DW_OP_deref (1321 of 2355) PASS: lldb-unit :: Target/./TargetTests/PathMappingListTest.RemapRoot (1322 of 2355) UNSUPPORTED: lldb-api :: functionalities/tsan/global_location/TestTsanGlobalLocation.py (1323 of 2355) PASS: lldb-unit :: Host/./HostTests/ConnectionFileDescriptorTest.TCPGetURIv6 (1324 of 2355) PASS: lldb-unit :: Core/./LLDBCoreTests/ModuleSpecTest.TestMachOFile (1325 of 2355) PASS: lldb-api :: tools/lldb-vscode/console/TestVSCode_console.py (1326 of 2355) UNSUPPORTED: lldb-shell :: SymbolFile/PDB/pointers.test (1327 of 2355) PASS: lldb-api :: functionalities/reproducers/attach/TestReproducerAttach.py (1328 of 2355) PASS: lldb-unit :: Expression/./ExpressionTests/DiagnosticManagerTest.FixedExpression (1329 of 2355) PASS: lldb-api :: lang/cpp/dynamic-value-same-basename/TestDynamicValueSameBase.py (1330 of 2355) PASS: lldb-unit :: Host/./HostTests/SocketTests/SocketTest.TCPGetAddress/ipv4 (1331 of 2355) PASS: lldb-unit :: Utility/./UtilityTests/ScalarTest.Scalar_512 (1332 of 2355) PASS: lldb-shell :: SymbolFile/DWARF/x86/dir-separator-no-comp-dir.s (1333 of 2355) PASS: lldb-api :: functionalities/signal/raise/TestRaise.py (1334 of 2355) PASS: lldb-unit :: Expression/./ExpressionTests/CppModuleConfigurationTest.AmbiguousLibCpp (1335 of 2355) PASS: lldb-api :: functionalities/data-formatter/data-formatter-stl/libcxx/shared_ptr/TestDataFormatterLibcxxSharedPtr.py (1336 of 2355) PASS: lldb-api :: python_api/objc_type/TestObjCType.py (1337 of 2355) PASS: lldb-api :: commands/expression/import-std-module/forward_decl_from_module/TestForwardDeclFromStdModule.py (1338 of 2355) PASS: lldb-shell :: SymbolFile/DWARF/x86/debug_ranges-missing-section.s (1339 of 2355) PASS: lldb-unit :: Symbol/./SymbolTests/TestTypeSystemClang.AddMethodToObjCObjectType (1340 of 2355) PASS: lldb-shell :: ObjectFile/MachO/symtab.yaml (1341 of 2355) PASS: lldb-api :: lang/cpp/this/TestCPPThis.py (1342 of 2355) PASS: lldb-unit :: Breakpoint/./LLDBBreakpointTests/BreakpointIDTest.StringIsBreakpointName (1343 of 2355) PASS: lldb-api :: lang/cpp/typeof/TestTypeOfDeclTypeExpr.py (1344 of 2355) PASS: lldb-api :: driver/batch_mode/TestBatchMode.py (1345 of 2355) PASS: lldb-unit :: Utility/./UtilityTests/StringListTest.AppendStringCString (1346 of 2355) PASS: lldb-unit :: Core/./LLDBCoreTests/StreamCallbackTest.Callback (1347 of 2355) PASS: lldb-unit :: Expression/./ExpressionTests/DiagnosticManagerTest.GetStringPreserveOrder (1348 of 2355) PASS: lldb-api :: lang/objc/objc-property/TestObjCProperty.py (1349 of 2355) PASS: lldb-api :: commands/breakpoint/set/func-regex/TestBreakpointRegexError.py (1350 of 2355) PASS: lldb-api :: commands/target/stop-hooks/TestStopHooks.py (1351 of 2355) PASS: lldb-api :: functionalities/set-data/TestSetData.py (1352 of 2355) PASS: lldb-unit :: Process/Utility/./ProcessUtilityTests/ProcSMapTests/LinuxProcSMapsTestFixture.ParseSMapRegions/8 (1353 of 2355) PASS: lldb-unit :: Host/./HostTests/FileSystemTest.Exists (1354 of 2355) UNSUPPORTED: lldb-api :: commands/expression/completion-crash-invalid-iterator/TestInvalidIteratorCompletionCrash.py (1355 of 2355) PASS: lldb-unit :: Core/./LLDBCoreTests/DumpDataExtractorTest.Formats (1356 of 2355) PASS: lldb-unit :: SymbolFile/DWARF/./SymbolFileDWARFTests/SymbolFileDWARFTests.TestAbbrevOutOfOrder (1357 of 2355) PASS: lldb-shell :: SymbolFile/DWARF/x86/find-variable-file.cpp (1358 of 2355) UNSUPPORTED: lldb-shell :: SymbolFile/PDB/calling-conventions.test (1359 of 2355) PASS: lldb-unit :: Utility/./UtilityTests/FileSpecTest.AppendPathComponent (1360 of 2355) UNSUPPORTED: lldb-api :: functionalities/darwin_log/filter/regex/activity/TestDarwinLogFilterRegexActivity.py (1361 of 2355) PASS: lldb-shell :: Commands/command-breakpoint-col.test (1362 of 2355) PASS: lldb-api :: python_api/watchpoint/condition/TestWatchpointConditionAPI.py (1363 of 2355) PASS: lldb-shell :: Register/Core/x86-64-freebsd-gp.test (1364 of 2355) PASS: lldb-api :: commands/expression/import-std-module/queue/TestQueueFromStdModule.py (1365 of 2355) PASS: lldb-shell :: SymbolFile/DWARF/x86/subprogram_ranges.test (1366 of 2355) UNSUPPORTED: lldb-api :: tools/lldb-server/memory-tagging/TestGdbRemoteMemoryTagging.py (1367 of 2355) PASS: lldb-shell :: ObjectFile/PECOFF/basic-info-arm.yaml (1368 of 2355) PASS: lldb-api :: commands/help/TestHelp.py (1369 of 2355) PASS: lldb-unit :: Utility/./UtilityTests/FileSpecTest.GetPath (1370 of 2355) PASS: lldb-unit :: Utility/./UtilityTests/StringListTest.InsertStringAtIndexStart (1371 of 2355) PASS: lldb-unit :: Process/Utility/./ProcessUtilityTests/ProcSMapTests/LinuxProcSMapsTestFixture.ParseSMapRegions/9 (1372 of 2355) PASS: lldb-unit :: Host/./HostTests/NativeProcessProtocolTest.ReadCStringFromMemory_MaxSize (1373 of 2355) PASS: lldb-api :: lang/cpp/virtual-overload/TestVirtualOverload.py (1374 of 2355) PASS: lldb-unit :: Utility/./UtilityTests/StreamTest.AddressRangeSize (1375 of 2355) PASS: lldb-unit :: Expression/./ExpressionTests/ClangHostTest.MacOSX (1376 of 2355) PASS: lldb-api :: tools/lldb-vscode/launch/TestVSCode_launch.py (1377 of 2355) PASS: lldb-api :: functionalities/data-formatter/frameformat_smallstruct/TestFrameFormatSmallStruct.py (1378 of 2355) PASS: lldb-api :: types/TestLongTypesExpr.py (1379 of 2355) PASS: lldb-unit :: Platform/Android/./AdbClientTests/AdbClientTest.CreateByDeviceId_ByEnvVar (1380 of 2355) PASS: lldb-unit :: Host/./HostTests/NativeProcessProtocolTest.ReadCStringFromMemory_CrossPageBoundary (1381 of 2355) PASS: lldb-unit :: ScriptInterpreter/Python/./ScriptInterpreterPythonTests/PythonDataObjectsTest.TestOwnedReferences (1382 of 2355) UNSUPPORTED: lldb-api :: functionalities/thread/break_after_join/TestBreakAfterJoin.py (1383 of 2355) PASS: lldb-api :: functionalities/data-formatter/data-formatter-stl/libcxx/function/TestLibCxxFunction.py (1384 of 2355) PASS: lldb-unit :: Host/./HostTests/PipeTest.OpenAsReader (1385 of 2355) PASS: lldb-unit :: Utility/./UtilityTests/Flags.GetBitSize (1386 of 2355) PASS: lldb-unit :: Utility/./UtilityTests/BinaryStreamTest.PutULEB128OneByte (1387 of 2355) PASS: lldb-unit :: Expression/./ExpressionTests/DiagnosticManagerTest.PutString (1388 of 2355) PASS: lldb-api :: linux/builtin_trap/TestBuiltinTrap.py (1389 of 2355) PASS: lldb-unit :: Utility/./UtilityTests/StructuredDataTest.ParseJSONFromFile (1390 of 2355) XFAIL: lldb-shell :: Register/x86-mm-xmm-write.test (1391 of 2355) PASS: lldb-unit :: ScriptInterpreter/Python/./ScriptInterpreterPythonTests/PythonDataObjectsTest.TestModuleNameResolutionNoDot (1392 of 2355) UNSUPPORTED: lldb-api :: functionalities/darwin_log/basic/TestDarwinLogBasic.py (1393 of 2355) PASS: lldb-unit :: Process/minidump/./LLDBMinidumpTests/MinidumpParserTest.MinidumpDuplicateModuleMappedSecondHigh (1394 of 2355) PASS: lldb-api :: functionalities/thread/concurrent_events/TestConcurrentManyWatchpoints.py (1395 of 2355) PASS: lldb-api :: functionalities/deleted-executable/TestDeletedExecutable.py (1396 of 2355) PASS: lldb-api :: functionalities/load_unload/TestLoadUnload.py (1397 of 2355) PASS: lldb-unit :: Utility/./UtilityTests/ArgsTest.TestSingleArgWithQuotedSpace (1398 of 2355) PASS: lldb-shell :: SymbolFile/NativePDB/break-by-function.cpp (1399 of 2355) PASS: lldb-api :: lang/objc/objc-optimized/TestObjcOptimized.py (1400 of 2355) UNSUPPORTED: lldb-api :: functionalities/darwin_log/source/info/TestDarwinLogSourceInfo.py (1401 of 2355) PASS: lldb-unit :: Utility/./UtilityTests/RangeTest.ContainsEndInclusive (1402 of 2355) UNSUPPORTED: lldb-shell :: ObjectFile/ELF/minidebuginfo-set-and-hit-breakpoint.test (1403 of 2355) PASS: lldb-unit :: Utility/./UtilityTests/AnsiTerminal.Empty (1404 of 2355) PASS: lldb-unit :: Utility/./UtilityTests/BinaryStreamTest.PutSLEB128Zero (1405 of 2355) PASS: lldb-api :: lang/objc/objc-ivar-stripped/TestObjCIvarStripped.py (1406 of 2355) PASS: lldb-unit :: Host/./HostTests/NativeProcessProtocolTest.SetBreakpointFailRead (1407 of 2355) PASS: lldb-api :: commands/apropos/basic/TestApropos.py (1408 of 2355) PASS: lldb-unit :: Utility/./UtilityTests/RangeTest.DoesAdjoinOrIntersect (1409 of 2355) PASS: lldb-api :: commands/statistics/basic/TestStats.py (1410 of 2355) PASS: lldb-api :: python_api/file_handle/TestFileHandle.py (1411 of 2355) PASS: lldb-api :: lang/objc/foundation/TestObjectDescriptionAPI.py (1412 of 2355) UNSUPPORTED: lldb-api :: macosx/macCatalystAppMacOSFramework/TestMacCatalystAppWithMacOSFramework.py (1413 of 2355) PASS: lldb-unit :: Utility/./UtilityTests/StringExtractorTest.GetHexBytesAvail_OddPair2 (1414 of 2355) PASS: lldb-unit :: Utility/./UtilityTests/StringListTest.SplitIntoLines (1415 of 2355) PASS: lldb-shell :: Commands/command-disassemble.s (1416 of 2355) PASS: lldb-api :: commands/expression/class_template_specialization_empty_pack/TestClassTemplateSpecializationParametersHandling.py (1417 of 2355) PASS: lldb-unit :: ObjectFile/Breakpad/./ObjectFileBreakpadTests/StackWinRecord.parse (1418 of 2355) PASS: lldb-api :: commands/expression/namespace_local_var_same_name_obj_c/TestNamespaceLocalVarSameNameObjC.py (1419 of 2355) PASS: lldb-unit :: Utility/./UtilityTests/StreamTest.AddressSuffix (1420 of 2355) PASS: lldb-api :: lang/cpp/member-and-local-vars-with-same-name/TestMembersAndLocalsWithSameName.py (1421 of 2355) PASS: lldb-unit :: Utility/./UtilityTests/Flags.AnyClear (1422 of 2355) PASS: lldb-api :: commands/platform/file/read/TestPlatformFileRead.py (1423 of 2355) PASS: lldb-unit :: UnwindAssembly/x86/./UnwindAssemblyx86Tests/Testx86AssemblyInspectionEngine.TestPushRBPWithREX (1424 of 2355) PASS: lldb-api :: functionalities/thread/state_after_expression/TestStateAfterExpression.py (1425 of 2355) PASS: lldb-api :: functionalities/data-formatter/data-formatter-advanced/TestDataFormatterAdv.py (1426 of 2355) PASS: lldb-api :: macosx/find-dsym/bundle-with-dot-in-filename/TestBundleWithDotInFilename.py (1427 of 2355) UNSUPPORTED: lldb-shell :: SymbolFile/NativePDB/stack_unwinding01.cpp (1428 of 2355) PASS: lldb-shell :: SymbolFile/DWARF/x86/gnu-style-compression.cpp (1429 of 2355) PASS: lldb-api :: python_api/name_lookup/TestNameLookup.py (1430 of 2355) UNSUPPORTED: lldb-shell :: SymbolFile/PDB/func-symbols.test (1431 of 2355) PASS: lldb-api :: commands/expression/calculator_mode/TestCalculatorMode.py (1432 of 2355) PASS: lldb-shell :: Register/Core/x86-64-freebsd-addr.test (1433 of 2355) PASS: lldb-unit :: Utility/./UtilityTests/StreamTeeTest.GetStreamAtIndexOutOfBoundsEmpty (1434 of 2355) UNSUPPORTED: lldb-api :: functionalities/exec/TestExec.py (1435 of 2355) PASS: lldb-unit :: Language/Highlighting/./HighlighterTests/HighlighterTest.DefaultHighlighterWithCursorOutOfBounds (1436 of 2355) PASS: lldb-unit :: UnwindAssembly/x86/./UnwindAssemblyx86Tests/Testx86AssemblyInspectionEngine.TestPushR14 (1437 of 2355) PASS: lldb-unit :: Target/./TargetTests/PathMappingListTest.RelativeTests (1438 of 2355) PASS: lldb-api :: functionalities/thread/concurrent_events/TestConcurrentBreakpointDelayBreakpointOneSignal.py (1439 of 2355) PASS: lldb-unit :: Utility/./UtilityTests/XcodeSDKTest.SDKSupportsSwift (1440 of 2355) PASS: lldb-api :: commands/settings/use_source_cache/TestUseSourceCache.py (1441 of 2355) PASS: lldb-unit :: Utility/./UtilityTests/SubsystemRAIITest.NormalSubsystem (1442 of 2355) PASS: lldb-api :: functionalities/gdb_remote_client/TestMultiprocess.py (1443 of 2355) PASS: lldb-api :: functionalities/multidebugger_commands/TestMultipleDebuggersCommands.py (1444 of 2355) UNSUPPORTED: lldb-shell :: ScriptInterpreter/Lua/partial_statements.test (1445 of 2355) PASS: lldb-unit :: Expression/./ExpressionTests/DiagnosticManagerTest.AppendMessageSubsequentDiags (1446 of 2355) PASS: lldb-api :: terminal/TestSTTYBeforeAndAfter.py (1447 of 2355) PASS: lldb-shell :: SymbolFile/DWARF/x86/debug_rnglists.s (1448 of 2355) PASS: lldb-api :: commands/expression/import-std-module/deque-dbg-info-content/TestDbgInfoContentDequeFromStdModule.py (1449 of 2355) PASS: lldb-shell :: ObjectFile/wasm/unified-debug-sections.yaml (1450 of 2355) UNSUPPORTED: lldb-api :: macosx/simulator/TestSimulatorPlatform.py (1451 of 2355) PASS: lldb-unit :: Utility/./UtilityTests/RangeTest.Clear (1452 of 2355) PASS: lldb-api :: lang/cpp/namespace_definitions/TestNamespaceDefinitions.py (1453 of 2355) PASS: lldb-api :: functionalities/gdb_remote_client/TestWriteMemory.py (1454 of 2355) PASS: lldb-unit :: UnwindAssembly/x86/./UnwindAssemblyx86Tests/Testx86AssemblyInspectionEngine.TestPopR13 (1455 of 2355) PASS: lldb-unit :: Process/gdb-remote/./ProcessGdbRemoteTests/PortMapTest.FreePort (1456 of 2355) PASS: lldb-unit :: UnwindAssembly/x86/./UnwindAssemblyx86Tests/Testx86AssemblyInspectionEngine.TestDisassemblyJunkBytes (1457 of 2355) PASS: lldb-api :: python_api/frame/TestFrames.py (1458 of 2355) PASS: lldb-unit :: Utility/./UtilityTests/UriParserTest.LongPath (1459 of 2355) PASS: lldb-unit :: Utility/./UtilityTests/OptionsWithRawTest.TerminatedQuote (1460 of 2355) PASS: lldb-shell :: ObjectFile/PECOFF/basic-info.yaml (1461 of 2355) PASS: lldb-unit :: Utility/./UtilityTests/StringListTest.ShiftStdString (1462 of 2355) PASS: lldb-unit :: Symbol/./SymbolTests/TestTypeSystemClang.TestGetTypeClassDeclType (1463 of 2355) PASS: lldb-api :: commands/frame/diagnose/local-variable/TestLocalVariable.py (1464 of 2355) PASS: lldb-unit :: Utility/./UtilityTests/StringExtractorTest.GetHexBytesAvail_Partial (1465 of 2355) PASS: lldb-unit :: Utility/./UtilityTests/VASprintfTest.NoBufferResize (1466 of 2355) PASS: lldb-api :: functionalities/type_lookup/TestTypeLookup.py (1467 of 2355) PASS: lldb-api :: functionalities/thread/concurrent_events/TestConcurrentSignalWatchBreak.py (1468 of 2355) PASS: lldb-unit :: ScriptInterpreter/Python/./ScriptInterpreterPythonTests/PythonDataObjectsTest.TestPythonIntegerToStructuredInteger (1469 of 2355) PASS: lldb-unit :: Core/./LLDBCoreTests/MangledTest.NameIndexes_FindFunctionSymbols (1470 of 2355) PASS: lldb-unit :: UnwindAssembly/x86/./UnwindAssemblyx86Tests/Testx86AssemblyInspectionEngine.TestPushEBX (1471 of 2355) PASS: lldb-shell :: Minidump/dump-all.test (1472 of 2355) PASS: lldb-api :: functionalities/unwind/noreturn/TestNoreturnUnwind.py (1473 of 2355) PASS: lldb-api :: lang/cpp/frame-var-anon-unions/TestFrameVariableAnonymousUnions.py (1474 of 2355) PASS: lldb-unit :: UnwindAssembly/x86/./UnwindAssemblyx86Tests/Testx86AssemblyInspectionEngine.TestPush0 (1475 of 2355) PASS: lldb-api :: lang/objc/objc-struct-return/TestObjCStructReturn.py (1476 of 2355) PASS: lldb-unit :: Process/gdb-remote/./ProcessGdbRemoteTests/GDBRemoteCommunicationClientTest.TestPacketSpeedJSON (1477 of 2355) PASS: lldb-unit :: Utility/./UtilityTests/Flags.AllClear (1478 of 2355) PASS: lldb-api :: functionalities/unwind/zeroth_frame/TestZerothFrame.py (1479 of 2355) PASS: lldb-unit :: Target/./TargetTests/ModuleCacheTest.GetAndPut (1480 of 2355) PASS: lldb-unit :: UnwindAssembly/x86/./UnwindAssemblyx86Tests/Testx86AssemblyInspectionEngine.TestSubESP (1481 of 2355) PASS: lldb-unit :: Target/./TargetTests/StackFrameRecognizerTest.NullModuleRegex (1482 of 2355) PASS: lldb-unit :: Utility/./UtilityTests/BinaryStreamTest.PutULEB128TwoBytes (1483 of 2355) PASS: lldb-api :: functionalities/tail_call_frames/disambiguate_call_site/TestDisambiguateCallSite.py (1484 of 2355) PASS: lldb-unit :: Process/minidump/./LLDBMinidumpTests/MinidumpParserTest.GetLinuxProcStatus (1485 of 2355) UNSUPPORTED: lldb-shell :: Unwind/eh-frame-small-fde.test (1486 of 2355) PASS: lldb-api :: functionalities/breakpoint/source_regexp/TestSourceRegexBreakpoints.py (1487 of 2355) PASS: lldb-unit :: Utility/./UtilityTests/ArgsTest.Yaml (1488 of 2355) PASS: lldb-api :: lang/cpp/extern_c/TestExternCSymbols.py (1489 of 2355) UNSUPPORTED: lldb-shell :: ScriptInterpreter/Lua/lua-python.test (1490 of 2355) PASS: lldb-unit :: Utility/./UtilityTests/ArchSpecTest.TestParseMachCPUDashSubtypeTripleSimple (1491 of 2355) PASS: lldb-unit :: Expression/./ExpressionTests/ClangExpressionDeclMapTest.TestPersistentDeclLookup (1492 of 2355) PASS: lldb-shell :: SymbolFile/DWARF/x86/find-basic-function.cpp (1493 of 2355) UNSUPPORTED: lldb-api :: functionalities/data-formatter/data-formatter-stl/libstdcpp/unique_ptr/TestDataFormatterStdUniquePtr.py (1494 of 2355) PASS: lldb-unit :: Utility/./UtilityTests/StringListTest.SplitIntoLinesSingleTrailingCR (1495 of 2355) PASS: lldb-unit :: Interpreter/./InterpreterTests/OptionArgParserTest.toScriptLanguage (1496 of 2355) PASS: lldb-unit :: ScriptInterpreter/Python/./ScriptInterpreterPythonTests/PythonDataObjectsTest.TestResetting (1497 of 2355) PASS: lldb-unit :: Utility/./UtilityTests/ScalarTest.CastOperations (1498 of 2355) PASS: lldb-unit :: Utility/./UtilityTests/UUIDTest.RelationalOperators (1499 of 2355) PASS: lldb-unit :: Symbol/./SymbolTests/TestTypeSystemClang.TestGetEnumIntegerTypeBasicTypes (1500 of 2355) PASS: lldb-api :: lang/cpp/unsigned_types/TestUnsignedTypes.py (1501 of 2355) PASS: lldb-unit :: Utility/./UtilityTests/RangeTest.ContainsAddrInvalid (1502 of 2355) UNSUPPORTED: lldb-api :: iohandler/autosuggestion/TestAutosuggestion.py (1503 of 2355) PASS: lldb-unit :: Utility/./UtilityTests/ArgsTest.TestMultipleArgs (1504 of 2355) PASS: lldb-unit :: Utility/./UtilityTests/NameMatchesTest.StartsWith (1505 of 2355) PASS: lldb-shell :: Commands/command-thread-select.test (1506 of 2355) PASS: lldb-unit :: Utility/./UtilityTests/LogTest.LLDB_LOG_nullptr (1507 of 2355) PASS: lldb-api :: python_api/thread/TestThreadAPI.py (1508 of 2355) PASS: lldb-api :: tools/lldb-server/TestGdbRemoteExpeditedRegisters.py (1509 of 2355) PASS: lldb-unit :: Host/./HostTests/Host.GetEnvironment (1510 of 2355) PASS: lldb-unit :: Utility/./UtilityTests/RegisterValueTest.GetSet8 (1511 of 2355) PASS: lldb-shell :: SymbolFile/DWARF/x86/find-basic-variable.cpp (1512 of 2355) PASS: lldb-api :: commands/frame/recognizer/TestFrameRecognizer.py (1513 of 2355) PASS: lldb-unit :: Process/gdb-remote/./ProcessGdbRemoteTests/GDBRemoteCommunicationClientTest.GetModulesInfoInvalidResponse (1514 of 2355) PASS: lldb-api :: functionalities/data-formatter/data-formatter-ptr-to-array/TestPtrToArrayFormatting.py (1515 of 2355) PASS: lldb-shell :: Minidump/breakpad-symbols.test (1516 of 2355) PASS: lldb-shell :: SymbolFile/Breakpad/line-table-missing-file.test (1517 of 2355) PASS: lldb-shell :: Minidump/memory-region-from-module.yaml (1518 of 2355) PASS: lldb-api :: functionalities/thread/exit_during_break/TestExitDuringBreak.py (1519 of 2355) PASS: lldb-api :: commands/frame/diagnose/dereference-argument/TestDiagnoseDereferenceArgument.py (1520 of 2355) PASS: lldb-unit :: Utility/./UtilityTests/BroadcasterTest.BroadcastEvent (1521 of 2355) PASS: lldb-api :: macosx/profile_vrs_detach/TestDetachVrsProfile.py (1522 of 2355) UNSUPPORTED: lldb-shell :: ScriptInterpreter/Lua/bindings.test (1523 of 2355) PASS: lldb-api :: functionalities/mtc/simple/TestMTCSimple.py (1524 of 2355) PASS: lldb-shell :: Reproducer/TestReuseDirectory.test (1525 of 2355) PASS: lldb-api :: tools/lldb-server/TestGdbRemoteKill.py (1526 of 2355) PASS: lldb-api :: tools/lldb-server/TestGdbRemoteAttachWait.py (1527 of 2355) PASS: lldb-api :: functionalities/data-formatter/hexcaps/TestDataFormatterHexCaps.py (1528 of 2355) PASS: lldb-api :: commands/settings/quoting/TestQuoting.py (1529 of 2355) PASS: lldb-api :: functionalities/thread/concurrent_events/TestConcurrentDelaySignalBreak.py (1530 of 2355) PASS: lldb-api :: commands/expression/import-std-module/unique_ptr/TestUniquePtrFromStdModule.py (1531 of 2355) PASS: lldb-unit :: Host/./HostTests/SocketAddressTest.Set (1532 of 2355) PASS: lldb-shell :: Breakpoint/debug_rnglist_rlestartend.test (1533 of 2355) PASS: lldb-api :: lang/cpp/static_methods/TestCPPStaticMethods.py (1534 of 2355) PASS: lldb-unit :: Utility/./UtilityTests/StreamTest.SetIndentLevel (1535 of 2355) PASS: lldb-unit :: ObjectFile/ELF/./ObjectFileELFTests/ObjectFileELFTest.SectionsResolveConsistently (1536 of 2355) PASS: lldb-shell :: Commands/command-regex-unalias.test (1537 of 2355) PASS: lldb-shell :: Register/x86-64-ymm-read.test (1538 of 2355) PASS: lldb-api :: lang/cpp/operator-overload/TestOperatorOverload.py (1539 of 2355) PASS: lldb-unit :: Utility/./UtilityTests/DataExtractorTest.GetCStrAtEnd (1540 of 2355) PASS: lldb-unit :: Utility/./UtilityTests/FileSpecTest.Match (1541 of 2355) PASS: lldb-unit :: Host/./HostTests/SocketTests/SocketTest.TCPListen0GetPort/ipv4 (1542 of 2355) PASS: lldb-api :: functionalities/limit-debug-info/TestLimitDebugInfo.py (1543 of 2355) PASS: lldb-unit :: ScriptInterpreter/Python/./ScriptInterpreterPythonTests/PythonDataObjectsTest.TestPythonListValueEquality (1544 of 2355) PASS: lldb-unit :: Utility/./UtilityTests/StringListTest.LongestCommonPrefixEmpty (1545 of 2355) PASS: lldb-unit :: Process/Utility/./ProcessUtilityTests/ProcSMapTests/LinuxProcSMapsTestFixture.ParseSMapRegions/6 (1546 of 2355) PASS: lldb-shell :: Reproducer/TestVerify.test (1547 of 2355) PASS: lldb-unit :: Utility/./UtilityTests/StringLexerTest.PutBack (1548 of 2355) PASS: lldb-shell :: ObjectFile/PECOFF/basic-info-arm64.yaml (1549 of 2355) PASS: lldb-api :: lang/cpp/char1632_t/TestChar1632T.py (1550 of 2355) UNSUPPORTED: lldb-api :: functionalities/longjmp/TestLongjmp.py (1551 of 2355) PASS: lldb-unit :: Utility/./UtilityTests/RangeTest.SizeTypes (1552 of 2355) PASS: lldb-unit :: Process/gdb-remote/./ProcessGdbRemoteTests/GDBRemoteClientBaseTest.SendContinueAndAsyncSignal (1553 of 2355) PASS: lldb-unit :: Interpreter/./InterpreterTests/CompletionTest.DirCompletionUsername (1554 of 2355) PASS: lldb-api :: tools/lldb-server/TestGdbRemoteSingleStep.py (1555 of 2355) PASS: lldb-unit :: Host/./HostTests/NativeProcessProtocolTest.ReadCStringFromMemory (1556 of 2355) PASS: lldb-shell :: Quit/TestQuitExitCodeHex0.test (1557 of 2355) PASS: lldb-shell :: SymbolFile/DWARF/x86/find-qualified-variable.cpp (1558 of 2355) UNSUPPORTED: lldb-api :: functionalities/ubsan/basic/TestUbsanBasic.py (1559 of 2355) PASS: lldb-unit :: Host/./HostTests/PipeTest.CreateWithUniqueName (1560 of 2355) PASS: lldb-shell :: ObjectFile/ELF/basic-info.yaml (1561 of 2355) PASS: lldb-shell :: SymbolFile/DWARF/x86/split-dwarf-multiple-cu.ll (1562 of 2355) XFAIL: lldb-shell :: Register/x86-64-write.test (1563 of 2355) PASS: lldb-shell :: SymbolFile/DWARF/x86/debug_aranges-empty-section.s (1564 of 2355) PASS: lldb-api :: functionalities/process_crash_info/TestProcessCrashInfo.py (1565 of 2355) PASS: lldb-unit :: Utility/./UtilityTests/DataExtractorTest.GetCStr (1566 of 2355) UNSUPPORTED: lldb-api :: commands/expression/multiline-completion/TestMultilineCompletion.py (1567 of 2355) PASS: lldb-api :: lang/c/step-target/TestStepTarget.py (1568 of 2355) PASS: lldb-shell :: SymbolFile/DWARF/x86/DW_AT_data_bit_offset-DW_OP_stack_value.s (1569 of 2355) PASS: lldb-api :: types/TestFloatTypes.py (1570 of 2355) PASS: lldb-unit :: Utility/./UtilityTests/BinaryStreamTest.PutSLEB128TwoBytes (1571 of 2355) UNSUPPORTED: lldb-shell :: Subprocess/clone-follow-parent-wp.test (1572 of 2355) PASS: lldb-api :: functionalities/data-formatter/refpointer-recursion/TestDataFormatterRefPtrRecursion.py (1573 of 2355) PASS: lldb-unit :: Core/./LLDBCoreTests/FormatEntityTest.DefinitionConstructionNameAndString (1574 of 2355) PASS: lldb-api :: commands/command/delete/TestCommandDelete.py (1575 of 2355) PASS: lldb-unit :: Utility/./UtilityTests/UriParserTest.BracketedHostnameWithPortIPv6 (1576 of 2355) PASS: lldb-api :: lang/cpp/inlines/TestInlines.py (1577 of 2355) PASS: lldb-shell :: Register/Core/x86-64-linux-addr.test (1578 of 2355) PASS: lldb-unit :: UnwindAssembly/x86/./UnwindAssemblyx86Tests/Testx86AssemblyInspectionEngine.TestPushR12 (1579 of 2355) UNSUPPORTED: lldb-api :: functionalities/gdb_remote_client/TestAArch64XMLRegOffsets.py (1580 of 2355) PASS: lldb-unit :: Expression/./ExpressionTests/DWARFExpression.DW_OP_piece (1581 of 2355) PASS: lldb-unit :: Utility/./UtilityTests/ArgsTest.GetArgumentArrayRef (1582 of 2355) PASS: lldb-unit :: Expression/./ExpressionTests/DWARFExpression.DW_OP_stack_value (1583 of 2355) PASS: lldb-shell :: ObjectFile/ELF/duplicate-section.yaml (1584 of 2355) PASS: lldb-unit :: Utility/./UtilityTests/DataExtractorTest.GetBitfield (1585 of 2355) PASS: lldb-unit :: Process/minidump/./LLDBMinidumpTests/MinidumpParserTest.GetPidWow64 (1586 of 2355) PASS: lldb-api :: types/TestShortType.py (1587 of 2355) PASS: lldb-unit :: SymbolFile/DWARF/./SymbolFileDWARFTests/SymbolFileDWARFTests.ParseArangesWithMultipleTerminators (1588 of 2355) PASS: lldb-api :: lang/c/local_variables/TestLocalVariables.py (1589 of 2355) PASS: lldb-unit :: Utility/./UtilityTests/VMRange.CollectionContains (1590 of 2355) PASS: lldb-shell :: SymbolFile/NativePDB/function-types-builtins.cpp (1591 of 2355) PASS: lldb-unit :: Utility/./UtilityTests/StringExtractorTest.GetHexU8_InvalidHex_NoEof (1592 of 2355) PASS: lldb-unit :: Utility/./UtilityTests/StreamTest.PutRawBytesToBigEndian (1593 of 2355) PASS: lldb-unit :: Utility/./UtilityTests/FileSpecTest.EqualDotsPosix (1594 of 2355) PASS: lldb-shell :: SymbolFile/DWARF/x86/win-i386-line-table.s (1595 of 2355) PASS: lldb-unit :: ScriptInterpreter/Python/./ScriptInterpreterPythonTests/PythonDataObjectsTest.TestPythonCallableInvoke (1596 of 2355) PASS: lldb-unit :: Utility/./UtilityTests/StringExtractorTest.DecodeHexU8_Underflow2 (1597 of 2355) PASS: lldb-unit :: DataFormatter/./LLDBFormatterTests/TypeMatcherTests.ExactName (1598 of 2355) PASS: lldb-unit :: Language/Highlighting/./HighlighterTests/HighlighterTest.HighlighterSelectionPath (1599 of 2355) XFAIL: lldb-shell :: Register/x86-64-fp-write.test (1600 of 2355) PASS: lldb-api :: tools/lldb-server/inferior-crash/TestGdbRemoteAbort.py (1601 of 2355) PASS: lldb-unit :: Host/./HostTests/NativeProcessProtocolTest.SetBreakpoint (1602 of 2355) PASS: lldb-unit :: Language/Highlighting/./HighlighterTests/HighlighterTest.ClangBraces (1603 of 2355) PASS: lldb-api :: sample_test/TestSampleInlineTest.py (1604 of 2355) PASS: lldb-unit :: Utility/./UtilityTests/StringExtractorTest.GetHexU8_Underflow (1605 of 2355) PASS: lldb-unit :: Symbol/./SymbolTests/TestTypeSystemClang.TestGetEnumIntegerTypeInvalid (1606 of 2355) PASS: lldb-unit :: Core/./LLDBCoreTests/MangledTest.ResultForValidName (1607 of 2355) PASS: lldb-api :: lang/cpp/keywords_enabled/TestCppKeywordsEnabled.py (1608 of 2355) PASS: lldb-shell :: ObjectFile/PECOFF/section-types.yaml (1609 of 2355) PASS: lldb-unit :: Process/Utility/./ProcessUtilityTests/ProcSMapTests/LinuxProcSMapsTestFixture.ParseSMapRegions/0 (1610 of 2355) PASS: lldb-unit :: Utility/./UtilityTests/StreamTeeTest.Constructor1Stream (1611 of 2355) PASS: lldb-api :: functionalities/thread/step_until/TestStepUntil.py (1612 of 2355) PASS: lldb-api :: iohandler/resize/TestIOHandlerResizeNoEditline.py (1613 of 2355) PASS: lldb-unit :: Utility/./UtilityTests/ScalarTest.Getters (1614 of 2355) PASS: lldb-api :: functionalities/data-formatter/data-formatter-script/TestDataFormatterScript.py (1615 of 2355) PASS: lldb-unit :: ObjectFile/Breakpad/./ObjectFileBreakpadTests/FileRecord.parse (1616 of 2355) PASS: lldb-api :: lang/cpp/call-function/TestCallCPPFunction.py (1617 of 2355) PASS: lldb-shell :: SymbolFile/DWARF/x86/DW_AT_location-DW_AT_const_value.s (1618 of 2355) PASS: lldb-unit :: Utility/./UtilityTests/StringExtractorTest.GetHexU8_Extra (1619 of 2355) PASS: lldb-shell :: Breakpoint/case-sensitive.test (1620 of 2355) UNSUPPORTED: lldb-shell :: SymbolFile/PDB/vbases.test (1621 of 2355) PASS: lldb-unit :: Utility/./UtilityTests/AnsiTerminal.Basic (1622 of 2355) PASS: lldb-unit :: Utility/./UtilityTests/SubsystemRAIITest.SubsystemWithErrorFailure (1623 of 2355) PASS: lldb-unit :: UnwindAssembly/x86/./UnwindAssemblyx86Tests/Testx86AssemblyInspectionEngine.TestPushESI (1624 of 2355) PASS: lldb-api :: lang/objc/objc-stepping/TestObjCStepping.py (1625 of 2355) PASS: lldb-api :: functionalities/thread/concurrent_events/TestConcurrentCrashWithBreak.py (1626 of 2355) PASS: lldb-api :: lang/objc/objc-runtime-ivars/TestRuntimeIvars.py (1627 of 2355) PASS: lldb-unit :: UnwindAssembly/x86/./UnwindAssemblyx86Tests/Testx86AssemblyInspectionEngine.TestDisassemblyMidFunctionEpilogues (1628 of 2355) XFAIL: lldb-shell :: Expr/nodefaultlib.cpp (1629 of 2355) UNSUPPORTED: lldb-shell :: ScriptInterpreter/Lua/print.test (1630 of 2355) PASS: lldb-api :: functionalities/completion/TestCompletion.py (1631 of 2355) PASS: lldb-api :: functionalities/thread/concurrent_events/TestConcurrentManyCrash.py (1632 of 2355) PASS: lldb-unit :: Core/./LLDBCoreTests/ModuleSpecTest.InvalidInMemoryBuffer (1633 of 2355) PASS: lldb-unit :: Utility/./UtilityTests/GeneratorTest.GetOrCreate (1634 of 2355) PASS: lldb-unit :: Core/./LLDBCoreTests/DumpDataExtractorTest.MultiLine (1635 of 2355) PASS: lldb-unit :: Utility/./UtilityTests/StringExtractorTest.GetU64LittleEndian (1636 of 2355) PASS: lldb-shell :: SymbolFile/DWARF/clang-ast-from-dwarf-unamed-and-anon-structs.cpp (1637 of 2355) PASS: lldb-unit :: Utility/./UtilityTests/ScalarTest.GetBytes (1638 of 2355) PASS: lldb-shell :: ScriptInterpreter/Python/command_relative_import.test (1639 of 2355) PASS: lldb-unit :: Utility/./UtilityTests/BroadcasterTest.EventTypeHasListeners (1640 of 2355) PASS: lldb-unit :: Process/Utility/./ProcessUtilityTests/MemoryTagManagerAArch64MTETest.AddressDiff (1641 of 2355) PASS: lldb-api :: lang/cpp/namespace/TestNamespaceLookup.py (1642 of 2355) PASS: lldb-shell :: Process/Optimization.test (1643 of 2355) PASS: lldb-api :: python_api/exprpath_synthetic/TestExprPathSynthetic.py (1644 of 2355) PASS: lldb-unit :: Utility/./UtilityTests/StringExtractorTest.DecodeHexU8_InvalidHex2 (1645 of 2355) PASS: lldb-api :: commands/frame/language/TestGuessLanguage.py (1646 of 2355) PASS: lldb-api :: commands/frame/diagnose/bad-reference/TestBadReference.py (1647 of 2355) PASS: lldb-api :: commands/expression/import-std-module/missing-module-sources/TestStdModuleSourcesMissing.py (1648 of 2355) PASS: lldb-api :: functionalities/data-formatter/data-formatter-objc/TestDataFormatterObjCNSContainer.py (1649 of 2355) PASS: lldb-unit :: Utility/./UtilityTests/StreamTest.AddressRangeEmptyRange (1650 of 2355) PASS: lldb-unit :: Utility/./UtilityTests/StringListTest.InsertStringAtIndexEnd (1651 of 2355) PASS: lldb-unit :: Language/Highlighting/./HighlighterTests/HighlighterTest.ClangCursorPosAfterOtherToken (1652 of 2355) PASS: lldb-api :: functionalities/gdb_remote_client/TestGDBRemoteLoad.py (1653 of 2355) PASS: lldb-api :: commands/expression/issue_11588/Test11588.py (1654 of 2355) PASS: lldb-unit :: Utility/./UtilityTests/FileSpecTest.FileAndDirectoryComponents (1655 of 2355) PASS: lldb-api :: functionalities/backticks/TestBackticksWithoutATarget.py (1656 of 2355) PASS: lldb-api :: functionalities/data-formatter/data-formatter-stl/libcxx/deque/TestDataFormatterLibcxxDeque.py (1657 of 2355) PASS: lldb-unit :: Utility/./UtilityTests/RangeTest.ContainsAddr (1658 of 2355) PASS: lldb-unit :: Expression/./ExpressionTests/DiagnosticManagerTest.GetStringMultiline (1659 of 2355) PASS: lldb-unit :: Utility/./UtilityTests/SerializationRountripTest.SerializeDeserializeCStringArray (1660 of 2355) PASS: lldb-unit :: Utility/./UtilityTests/UriParserTest.BracketedHostname (1661 of 2355) PASS: lldb-api :: lang/objc/foundation/TestSymbolTable.py (1662 of 2355) PASS: lldb-unit :: SymbolFile/DWARF/./SymbolFileDWARFTests/SymbolFileDWARFTests.TestAbbrevMissingTerminator (1663 of 2355) UNSUPPORTED: lldb-shell :: Unwind/basic-block-sections.test (1664 of 2355) PASS: lldb-unit :: Expression/./ExpressionTests/CppModuleConfigurationTest.Sysroot (1665 of 2355) PASS: lldb-api :: lang/cpp/offsetof/TestOffsetofCpp.py (1666 of 2355) PASS: lldb-shell :: ObjectFile/ELF/section-addresses.yaml (1667 of 2355) PASS: lldb-api :: lang/objc/modules-incomplete/TestIncompleteModules.py (1668 of 2355) PASS: lldb-api :: commands/disassemble/basic/TestDisassembleBreakpoint.py (1669 of 2355) PASS: lldb-api :: tools/lldb-vscode/module/TestVSCode_module.py (1670 of 2355) UNSUPPORTED: lldb-shell :: SymbolFile/PDB/expressions.test (1671 of 2355) PASS: lldb-unit :: Utility/./UtilityTests/BinaryStreamTest.PutSLEB128SixBytes (1672 of 2355) PASS: lldb-api :: functionalities/thread/exit_during_step/TestExitDuringStep.py (1673 of 2355) UNSUPPORTED: lldb-shell :: SymbolFile/PDB/udt-layout.test (1674 of 2355) UNSUPPORTED: lldb-api :: tools/lldb-server/TestGdbRemoteFork.py (1675 of 2355) PASS: lldb-shell :: ObjectFile/ELF/compressed-sections.yaml (1676 of 2355) PASS: lldb-shell :: SymbolFile/NativePDB/ast-methods.cpp (1677 of 2355) PASS: lldb-unit :: ObjectFile/MachO/./ObjectFileMachOTests/ObjectFileMachOTest.ModuleFromSharedCacheInfo (1678 of 2355) PASS: lldb-unit :: Utility/./UtilityTests/StreamTest.AddressPrefixAndSuffix (1679 of 2355) PASS: lldb-unit :: Expression/./ExpressionTests/DiagnosticManagerTest.GetStringMultipleDiags (1680 of 2355) PASS: lldb-api :: lang/cpp/unicode-literals/TestUnicodeLiterals.py (1681 of 2355) PASS: lldb-unit :: Host/./HostTests/SocketAddressTest.GetAddressInfo (1682 of 2355) PASS: lldb-unit :: Utility/./UtilityTests/OptionsWithRawTest.ArgsButNoLeadingDash (1683 of 2355) PASS: lldb-api :: commands/command/script/import/rdar-12586188/TestRdar12586188.py (1684 of 2355) UNSUPPORTED: lldb-api :: commands/expression/import-std-module/pair/TestPairFromStdModule.py (1685 of 2355) PASS: lldb-unit :: Expression/./ExpressionTests/DWARFExpression.DW_OP_convert (1686 of 2355) PASS: lldb-unit :: Utility/./UtilityTests/StringLexerTest.NextIf (1687 of 2355) PASS: lldb-shell :: SymbolFile/DWARF/x86/limit-debug-info.s (1688 of 2355) UNSUPPORTED: lldb-api :: commands/register/register/aarch64_dynamic_regset/TestArm64DynamicRegsets.py (1689 of 2355) PASS: lldb-unit :: Host/./HostTests/HostInfoTest.GetHostname (1690 of 2355) PASS: lldb-unit :: Symbol/./SymbolTests/Type.CompilerContextPattern (1691 of 2355) PASS: lldb-unit :: Process/minidump/./LLDBMinidumpTests/MinidumpParserTest.GetThreadContext_x86_32_wow64 (1692 of 2355) PASS: lldb-unit :: Utility/./UtilityTests/CompletionRequest.FakeLastArg (1693 of 2355) PASS: lldb-unit :: UnwindAssembly/x86/./UnwindAssemblyx86Tests/Testx86AssemblyInspectionEngine.Test64bitFramelessBigStackFrame (1694 of 2355) PASS: lldb-api :: functionalities/breakpoint/breakpoint_conditions/TestBreakpointConditions.py (1695 of 2355) PASS: lldb-api :: commands/expression/unwind_expression/TestUnwindExpression.py (1696 of 2355) PASS: lldb-unit :: Utility/./UtilityTests/StringListTest.JoinNonSpace (1697 of 2355) PASS: lldb-api :: lang/cpp/this_class_type_mixing/TestThisClassTypeMixing.py (1698 of 2355) PASS: lldb-unit :: Core/./LLDBCoreTests/DumpDataExtractorTest.StartOffset (1699 of 2355) PASS: lldb-api :: api/multithreaded/TestMultithreaded.py (1700 of 2355) PASS: lldb-shell :: Driver/TestTarget.test (1701 of 2355) UNSUPPORTED: lldb-api :: functionalities/process_save_core/TestProcessSaveCore.py (1702 of 2355) PASS: lldb-api :: commands/expression/regression-access-function-template-in-record/TestRegressionAccessFunctionTemplateInRecord.py (1703 of 2355) PASS: lldb-api :: sample_test/TestSampleTest.py (1704 of 2355) PASS: lldb-api :: functionalities/gdb_remote_client/TestRemoteRegNums.py (1705 of 2355) PASS: lldb-unit :: UnwindAssembly/x86/./UnwindAssemblyx86Tests/Testx86AssemblyInspectionEngine.TestPopRBX (1706 of 2355) PASS: lldb-shell :: SymbolFile/Breakpad/stack-cfi-parsing.test (1707 of 2355) PASS: lldb-unit :: Utility/./UtilityTests/ArgsTest.TestAppendArg (1708 of 2355) PASS: lldb-api :: lang/cpp/enum_types/TestCPP11EnumTypes.py (1709 of 2355) PASS: lldb-shell :: Settings/TestDefaultModuleCachePath.test (1710 of 2355) PASS: lldb-api :: functionalities/data-formatter/data-formatter-python-synth/TestDataFormatterPythonSynth.py (1711 of 2355) UNSUPPORTED: lldb-api :: lang/objc/foundation/TestFoundationDisassembly.py (1712 of 2355) PASS: lldb-api :: commands/expression/call-function/TestCallStopAndContinue.py (1713 of 2355) PASS: lldb-shell :: BuildScript/script-args.test (1714 of 2355) PASS: lldb-api :: lang/cpp/symbols/TestSymbols.py (1715 of 2355) PASS: lldb-api :: functionalities/gdb_remote_client/TestPlatformClient.py (1716 of 2355) PASS: lldb-unit :: Language/CPlusPlus/./LanguageCPlusPlusTests/CPlusPlusLanguage.FindAlternateFunctionManglings (1717 of 2355) PASS: lldb-unit :: Host/./HostTests/MainLoopTest.TwoSignalCallbacks (1718 of 2355) PASS: lldb-api :: functionalities/target_var/no_vars/TestTargetVarNoVars.py (1719 of 2355) PASS: lldb-api :: lang/objc/single-entry-dictionary/TestObjCSingleEntryDictionary.py (1720 of 2355) PASS: lldb-unit :: Utility/./UtilityTests/StreamTest.PutMaxHex64ByteOrderLittle (1721 of 2355) PASS: lldb-shell :: ObjectFile/Breakpad/discontiguous-sections.test (1722 of 2355) PASS: lldb-shell :: Register/Core/x86-32-linux-gp.test (1723 of 2355) PASS: lldb-unit :: Utility/./UtilityTests/OptionsWithRawTest.UnterminatedQuote (1724 of 2355) PASS: lldb-api :: functionalities/data-formatter/varscript_formatting/TestDataFormatterVarScriptFormatting.py (1725 of 2355) PASS: lldb-unit :: Utility/./UtilityTests/StreamTest.PutHex16ByteOrderLittle (1726 of 2355) PASS: lldb-shell :: Reproducer/TestProcessList.test (1727 of 2355) PASS: lldb-unit :: Process/Utility/./ProcessUtilityTests/ProcSMapTests/LinuxProcSMapsTestFixture.ParseSMapRegions/2 (1728 of 2355) PASS: lldb-unit :: Utility/./UtilityTests/StreamTest.PutHex64ByteOrderLittle (1729 of 2355) PASS: lldb-unit :: Utility/./UtilityTests/StringExtractorTest.GetNameColonValueNoColon (1730 of 2355) PASS: lldb-unit :: Process/minidump/./LLDBMinidumpTests/MinidumpParserTest.GetThreadContext_x86_64 (1731 of 2355) PASS: lldb-shell :: ScriptInterpreter/Python/Crashlog/json.test (1732 of 2355) PASS: lldb-api :: python_api/sbplatform/TestSBPlatform.py (1733 of 2355) PASS: lldb-api :: lang/cpp/unique-types/TestUniqueTypes.py (1734 of 2355) PASS: lldb-unit :: Host/./HostTests/SocketTests/SocketTest.DomainGetConnectURI/ipv6 (1735 of 2355) PASS: lldb-shell :: SymbolFile/DWARF/DW_AT_range-DW_FORM_sec_offset.s (1736 of 2355) UNSUPPORTED: lldb-api :: functionalities/data-formatter/data-formatter-stl/libstdcpp/vbool/TestDataFormatterStdVBool.py (1737 of 2355) PASS: lldb-api :: lang/c/register_variables/TestRegisterVariables.py (1738 of 2355) PASS: lldb-unit :: Utility/./UtilityTests/VMRange.Reset (1739 of 2355) PASS: lldb-api :: commands/expression/codegen-crash-import-def-arraytype-element/TestImportDefinitionArrayType.py (1740 of 2355) PASS: lldb-unit :: Utility/./UtilityTests/LogChannelTest.EnableOptions (1741 of 2355) PASS: lldb-api :: tools/lldb-server/TestGdbRemote_qThreadStopInfo.py (1742 of 2355) PASS: lldb-unit :: Process/Utility/./ProcessUtilityTests/ProcMapTests/LinuxProcMapsTestFixture.ParseMapRegions/8 (1743 of 2355) PASS: lldb-unit :: SymbolFile/NativePDB/./SymbolFileNativePDBTests/PDBFPOProgramToDWARFExpressionTests.InvalidAssignmentMultiple (1744 of 2355) PASS: lldb-unit :: Host/./HostTests/SocketTests/SocketTest.UDPGetConnectURI/ipv6 (1745 of 2355) PASS: lldb-unit :: Process/minidump/./LLDBMinidumpTests/RegisterContextMinidump.CheckRegisterContextMinidump_ARM (1746 of 2355) PASS: lldb-unit :: Utility/./UtilityTests/StringListTest.SplitIntoLinesEmpty (1747 of 2355) PASS: lldb-shell :: ObjectFile/ELF/avr-basic-info.yaml (1748 of 2355) PASS: lldb-api :: functionalities/breakpoint/consecutive_breakpoints/TestConsecutiveBreakpoints.py (1749 of 2355) PASS: lldb-api :: functionalities/breakpoint/address_breakpoints/TestAddressBreakpoints.py (1750 of 2355) PASS: lldb-unit :: Utility/./UtilityTests/VMRange.Clear (1751 of 2355) PASS: lldb-unit :: Utility/./UtilityTests/StreamTeeTest.Write (1752 of 2355) PASS: lldb-unit :: Symbol/./SymbolTests/PostfixExpression.ParseOneExpression (1753 of 2355) UNSUPPORTED: lldb-api :: commands/trace/TestTraceDumpInstructions.py (1754 of 2355) PASS: lldb-unit :: UnwindAssembly/x86/./UnwindAssemblyx86Tests/Testx86AssemblyInspectionEngine.TestPushRBP (1755 of 2355) PASS: lldb-api :: lang/objc/foundation/TestConstStrings.py (1756 of 2355) PASS: lldb-shell :: Settings/TestSettingsSet.test (1757 of 2355) PASS: lldb-unit :: Utility/./UtilityTests/RegisterValueTest.GetScalarValue (1758 of 2355) PASS: lldb-api :: commands/expression/completion-crash-incomplete-record/TestCompletionCrashIncompleteRecord.py (1759 of 2355) PASS: lldb-api :: functionalities/tail_call_frames/cross_dso/TestCrossDSOTailCalls.py (1760 of 2355) PASS: lldb-unit :: Utility/./UtilityTests/StringExtractorTest.DecodeHexU8_InvalidHex (1761 of 2355) PASS: lldb-api :: python_api/function_symbol/TestSymbolAPI.py (1762 of 2355) UNSUPPORTED: lldb-api :: tools/lldb-server/TestGdbRemoteCompletion.py (1763 of 2355) PASS: lldb-api :: functionalities/breakpoint/move_nearest/TestMoveNearest.py (1764 of 2355) PASS: lldb-api :: functionalities/history/TestHistoryRecall.py (1765 of 2355) PASS: lldb-unit :: UnwindAssembly/x86/./UnwindAssemblyx86Tests/Testx86AssemblyInspectionEngine.TestAddRSP (1766 of 2355) PASS: lldb-api :: functionalities/gdb_remote_client/TestRegDefinitionInParts.py (1767 of 2355) PASS: lldb-unit :: Utility/./UtilityTests/NameMatchesTest.Contains (1768 of 2355) PASS: lldb-shell :: Register/Core/x86-32-freebsd-gp.test (1769 of 2355) PASS: lldb-shell :: SymbolFile/DWARF/x86/find-variable-dwo.cpp (1770 of 2355) PASS: lldb-shell :: SymbolFile/DWARF/deterministic-build.cpp (1771 of 2355) PASS: lldb-unit :: Utility/./UtilityTests/ConstStringTest.CompareStringRef (1772 of 2355) PASS: lldb-unit :: Language/Highlighting/./HighlighterTests/HighlighterTest.Keywords (1773 of 2355) PASS: lldb-unit :: Utility/./UtilityTests/ArchSpecTest.TestParseMachCPUDashSubtypeTripleExtra (1774 of 2355) UNSUPPORTED: lldb-shell :: SymbolFile/NativePDB/ast-functions-msvc.cpp (1775 of 2355) PASS: lldb-shell :: Register/Core/x86-32-freebsd-fp.test (1776 of 2355) PASS: lldb-unit :: SymbolFile/NativePDB/./SymbolFileNativePDBTests/PDBFPOProgramToDWARFExpressionTests.UnsupportedRASearch (1777 of 2355) PASS: lldb-unit :: ObjectFile/ELF/./ObjectFileELFTests/ObjectFileELFTest.GetModuleSpecifications_EarlySectionHeaders (1778 of 2355) PASS: lldb-unit :: Host/./HostTests/SocketTests/SocketTest.DomainGetConnectURI/ipv4 (1779 of 2355) PASS: lldb-unit :: Process/gdb-remote/./ProcessGdbRemoteTests/GDBRemoteCommunicationTest.ReadPacket_checksum (1780 of 2355) UNSUPPORTED: lldb-api :: functionalities/breakpoint/hardware_breakpoints/hardware_breakpoint_on_multiple_threads/TestHWBreakMultiThread.py (1781 of 2355) PASS: lldb-shell :: ObjectFile/PECOFF/uuid.yaml (1782 of 2355) PASS: lldb-api :: lang/cpp/alignas_base_class/TestAlignAsBaseClass.py (1783 of 2355) PASS: lldb-shell :: ObjectFile/ELF/null-jmprel.yaml (1784 of 2355) PASS: lldb-api :: api/command-return-object/TestSBCommandReturnObject.py (1785 of 2355) UNSUPPORTED: lldb-api :: iohandler/resize/TestIOHandlerResize.py (1786 of 2355) PASS: lldb-api :: python_api/process/TestProcessAPI.py (1787 of 2355) PASS: lldb-unit :: ObjectFile/Breakpad/./ObjectFileBreakpadTests/StackCFIRecord.parse (1788 of 2355) PASS: lldb-unit :: DataFormatter/./LLDBFormatterTests/TypeMatcherTests.RegexMatchPart (1789 of 2355) PASS: lldb-api :: lang/cpp/operators/TestCppOperators.py (1790 of 2355) PASS: lldb-unit :: Utility/./UtilityTests/StringListTest.AppendListCStringArray (1791 of 2355) PASS: lldb-api :: functionalities/data-formatter/data-formatter-stl/libcxx/vbool/TestDataFormatterLibcxxVBool.py (1792 of 2355) PASS: lldb-shell :: ObjectFile/ELF/build-id-case.yaml (1793 of 2355) UNSUPPORTED: lldb-api :: functionalities/unwind/standard/TestStandardUnwind.py (1794 of 2355) PASS: lldb-api :: functionalities/multiword-commands/TestMultiWordCommands.py (1795 of 2355) UNSUPPORTED: lldb-api :: functionalities/gdb_remote_client/TestQemuAArch64TargetXml.py (1796 of 2355) PASS: lldb-unit :: Utility/./UtilityTests/UUIDTest.Validity (1797 of 2355) PASS: lldb-unit :: Utility/./UtilityTests/StreamTest.PutChar (1798 of 2355) PASS: lldb-unit :: Core/./LLDBCoreTests/ModuleSpecTest.InvalidInMemoryBufferValidFile (1799 of 2355) PASS: lldb-unit :: Utility/./UtilityTests/StreamTest.PutBytesAsRawHex8ToMixedEndian (1800 of 2355) PASS: lldb-unit :: Utility/./UtilityTests/SerializationRountripTest.SerializeDeserializePodReferences (1801 of 2355) PASS: lldb-unit :: Utility/./UtilityTests/Flags.AnySet (1802 of 2355) PASS: lldb-unit :: Symbol/./SymbolTests/TestTypeSystemClang.TestGetBasicTypeFromName (1803 of 2355) PASS: lldb-api :: lang/cpp/diamond/TestDiamond.py (1804 of 2355) PASS: lldb-api :: functionalities/data-formatter/typedef_array/TestTypedefArray.py (1805 of 2355) PASS: lldb-unit :: Utility/./UtilityTests/ArchSpecTest.YAML (1806 of 2355) PASS: lldb-api :: python_api/symbol-context/TestSymbolContext.py (1807 of 2355) PASS: lldb-api :: functionalities/postmortem/netbsd-core/TestNetBSDCore.py (1808 of 2355) PASS: lldb-api :: functionalities/thread/concurrent_events/TestConcurrentTwoBreakpointsOneSignal.py (1809 of 2355) PASS: lldb-unit :: Host/./HostTests/NativeProcessProtocolTest.ReadMemoryWithoutTrap (1810 of 2355) PASS: lldb-unit :: SymbolFile/NativePDB/./SymbolFileNativePDBTests/PDBFPOProgramToDWARFExpressionTests.UnresolvedRegisterAssignmentReference (1811 of 2355) PASS: lldb-api :: functionalities/type_completion/TestTypeCompletion.py (1812 of 2355) PASS: lldb-api :: commands/expression/import-std-module/list/TestListFromStdModule.py (1813 of 2355) PASS: lldb-api :: functionalities/rerun/TestRerun.py (1814 of 2355) PASS: lldb-unit :: Symbol/./SymbolTests/TestTypeSystemClang.TemplateArguments (1815 of 2355) PASS: lldb-api :: lang/objc/warnings-in-expr-parser/TestObjCWarningsInExprParser.py (1816 of 2355) PASS: lldb-api :: functionalities/thread/thread_exit/TestThreadExit.py (1817 of 2355) PASS: lldb-unit :: Process/minidump/./LLDBMinidumpTests/MinidumpParserTest.InvalidMinidump (1818 of 2355) PASS: lldb-api :: functionalities/breakpoint/dummy_target_breakpoints/TestBreakpointsWithNoTargets.py (1819 of 2355) PASS: lldb-unit :: Utility/./UtilityTests/StringExtractorGDBRemoteTest.GetPidTid (1820 of 2355) PASS: lldb-shell :: SymbolFile/DWARF/x86/dwarf5-implicit-const.s (1821 of 2355) PASS: lldb-api :: tools/lldb-vscode/stackTrace/TestVSCode_stackTrace.py (1822 of 2355) PASS: lldb-unit :: Expression/./ExpressionTests/CppModuleConfigurationTest.Xcode (1823 of 2355) PASS: lldb-shell :: ObjectFile/ELF/PT_LOAD-overlap-PT_INTERP.yaml (1824 of 2355) PASS: lldb-api :: functionalities/breakpoint/breakpoint_names/TestBreakpointNames.py (1825 of 2355) PASS: lldb-api :: lang/cpp/forward-declared-template-specialization/TestCppForwardDeclaredTemplateSpecialization.py (1826 of 2355) PASS: lldb-shell :: ObjectFile/ELF/gnu-debuglink.yaml (1827 of 2355) PASS: lldb-api :: tools/lldb-vscode/step/TestVSCode_step.py (1828 of 2355) PASS: lldb-shell :: SymbolFile/DWARF/x86/debug_loc.s (1829 of 2355) PASS: lldb-unit :: Host/./HostTests/MainLoopTest.DetectsEOF (1830 of 2355) PASS: lldb-unit :: Utility/./UtilityTests/UriParserTest.BracketedHostnameWithColon (1831 of 2355) PASS: lldb-api :: commands/expression/codegen-crash-typedefdecl-not-in_declcontext/TestCodegenCrashTypedefDeclNotInDeclContext.py (1832 of 2355) UNSUPPORTED: lldb-shell :: ScriptInterpreter/Lua/breakpoint_function_callback.test (1833 of 2355) PASS: lldb-api :: python_api/type/TestTypeList.py (1834 of 2355) PASS: lldb-unit :: Utility/./UtilityTests/FileSpecTest.CopyByAppendingPathComponent (1835 of 2355) PASS: lldb-shell :: SymbolFile/DWARF/x86/debug-types-signature-loop.s (1836 of 2355) PASS: lldb-shell :: ObjectFile/ELF/many-sections.s (1837 of 2355) PASS: lldb-api :: lang/cpp/scope/TestCppScope.py (1838 of 2355) PASS: lldb-api :: commands/expression/ir-interpreter-phi-nodes/TestIRInterpreterPHINodes.py (1839 of 2355) PASS: lldb-api :: functionalities/data-formatter/nsdictionarysynth/TestNSDictionarySynthetic.py (1840 of 2355) PASS: lldb-unit :: Utility/./UtilityTests/IndexToObjectTest.ObjectForIndex (1841 of 2355) PASS: lldb-shell :: Breakpoint/debug_rnglist_basic.test (1842 of 2355) PASS: lldb-api :: commands/expression/test/TestExprs.py (1843 of 2355) PASS: lldb-shell :: SymbolFile/DWARF/x86/dwarf5-atomic.s (1844 of 2355) PASS: lldb-api :: functionalities/data-formatter/data-formatter-objc/TestDataFormatterObjCNSDate.py (1845 of 2355) PASS: lldb-unit :: Utility/./UtilityTests/ArchSpecTest.MergeFromMachOUnknown (1846 of 2355) PASS: lldb-unit :: Language/Highlighting/./HighlighterTests/HighlighterTest.ClangEmptyInput (1847 of 2355) PASS: lldb-api :: lang/cpp/class-template-non-type-parameter-pack/TestClassTemplateNonTypeParameterPack.py (1848 of 2355) PASS: lldb-unit :: Utility/./UtilityTests/StringExtractorTest.GetHexBytes_OddPair2 (1849 of 2355) PASS: lldb-shell :: Subprocess/fork-follow-parent-wp.test (1850 of 2355) PASS: lldb-unit :: Language/Highlighting/./HighlighterTests/HighlighterTest.ClangPreserveNewLine (1851 of 2355) PASS: lldb-shell :: Reproducer/TestMultipleTargets.test (1852 of 2355) PASS: lldb-unit :: Utility/./UtilityTests/StringListTest.ShiftMove (1853 of 2355) PASS: lldb-shell :: BuildScript/compiler-full-path.test (1854 of 2355) PASS: lldb-api :: functionalities/thread/crash_during_step/TestCrashDuringStep.py (1855 of 2355) PASS: lldb-unit :: SymbolFile/NativePDB/./SymbolFileNativePDBTests/PDBFPOProgramToDWARFExpressionTests.MissingTargetRegister (1856 of 2355) PASS: lldb-unit :: Utility/./UtilityTests/RangeTest.ContainsRange (1857 of 2355) PASS: lldb-unit :: Utility/./UtilityTests/StringExtractorTest.GetU32LittleEndian (1858 of 2355) PASS: lldb-unit :: Target/./TargetTests/ModuleCacheTest.GetAndPutUuidExists (1859 of 2355) PASS: lldb-api :: functionalities/thread/concurrent_events/TestConcurrentDelayedCrashWithBreakpointSignal.py (1860 of 2355) PASS: lldb-unit :: Target/./TargetTests/ExecutionContextTest.GetByteOrder (1861 of 2355) UNSUPPORTED: lldb-api :: functionalities/darwin_log/filter/regex/message/TestDarwinLogFilterRegexMessage.py (1862 of 2355) PASS: lldb-shell :: Driver/TestConvenienceVariables.test (1863 of 2355) PASS: lldb-unit :: Utility/./UtilityTests/OptionsWithRawTest.SingleWordSuffix (1864 of 2355) PASS: lldb-shell :: Settings/TestSettingsWrite.test (1865 of 2355) UNSUPPORTED: lldb-shell :: ScriptInterpreter/Lua/lua.test (1866 of 2355) PASS: lldb-unit :: Symbol/./SymbolTests/LineEntryTest.GetSameLineContiguousAddressRangeOneInline (1867 of 2355) UNSUPPORTED: lldb-shell :: Register/aarch64-fp-read.test (1868 of 2355) UNSUPPORTED: lldb-api :: functionalities/tsan/thread_leak/TestTsanThreadLeak.py (1869 of 2355) PASS: lldb-api :: functionalities/thread/concurrent_events/TestConcurrentTwoBreakpointsOneWatchpoint.py (1870 of 2355) PASS: lldb-unit :: Utility/./UtilityTests/AnsiTerminal.AtEnd (1871 of 2355) PASS: lldb-api :: functionalities/lazy-loading/TestLazyLoading.py (1872 of 2355) PASS: lldb-api :: python_api/value/linked_list/TestValueAPILinkedList.py (1873 of 2355) PASS: lldb-unit :: Utility/./UtilityTests/DataExtractorTest.GetDoubleUnaligned (1874 of 2355) PASS: lldb-api :: commands/frame/diagnose/virtual-method-call/TestDiagnoseDereferenceVirtualMethodCall.py (1875 of 2355) PASS: lldb-unit :: Utility/./UtilityTests/UriParserTest.TypicalPortPathIPv6 (1876 of 2355) PASS: lldb-api :: functionalities/gdb_remote_client/TestqOffsets.py (1877 of 2355) UNSUPPORTED: lldb-shell :: ScriptInterpreter/Lua/io.test (1878 of 2355) PASS: lldb-unit :: Process/./ProcessEventDataTests/ProcessEventDataTest.ShouldStop (1879 of 2355) PASS: lldb-unit :: Host/./HostTests/SocketTests/SocketTest.DomainListenConnectAccept/ipv6 (1880 of 2355) PASS: lldb-unit :: Process/gdb-remote/./ProcessGdbRemoteTests/GDBRemoteCommunicationClientTest.WriteRegister (1881 of 2355) PASS: lldb-unit :: Expression/./ExpressionTests/CppModuleConfigurationTest.UnknownLibCppFile (1882 of 2355) PASS: lldb-api :: functionalities/data-formatter/user-format-vs-summary/TestUserFormatVsSummary.py (1883 of 2355) PASS: lldb-shell :: Subprocess/vfork-follow-parent.test (1884 of 2355) PASS: lldb-unit :: UnwindAssembly/x86/./UnwindAssemblyx86Tests/Testx86AssemblyInspectionEngine.TestPushEDX (1885 of 2355) PASS: lldb-api :: python_api/sblaunchinfo/TestSBLaunchInfo.py (1886 of 2355) PASS: lldb-shell :: Register/Core/x86-64-netbsd-addr.test (1887 of 2355) PASS: lldb-api :: commands/frame/var/TestFrameVar.py (1888 of 2355) PASS: lldb-api :: lang/cpp/rvalue-references/TestRvalueReferences.py (1889 of 2355) PASS: lldb-unit :: Utility/./UtilityTests/ProcessInstanceInfo.Yaml (1890 of 2355) PASS: lldb-unit :: ScriptInterpreter/Python/./ScriptInterpreterPythonTests/PythonDataObjectsTest.TestPythonDictionaryValueEquality (1891 of 2355) PASS: lldb-unit :: Utility/./UtilityTests/ProcessInstanceInfo.DumpTable (1892 of 2355) PASS: lldb-api :: lang/objc/blocks/TestObjCIvarsInBlocks.py (1893 of 2355) PASS: lldb-unit :: Platform/./LLDBPlatformTests/PlatformAppleSimulatorTest.TestHostPlatformToSim (1894 of 2355) PASS: lldb-api :: commands/expression/import-std-module/array/TestArrayFromStdModule.py (1895 of 2355) PASS: lldb-api :: tools/lldb-server/TestAppleSimulatorOSType.py (1896 of 2355) PASS: lldb-unit :: Utility/./UtilityTests/DataExtractorTest.UncommonAddressSize (1897 of 2355) PASS: lldb-api :: functionalities/thread/concurrent_events/TestConcurrentTwoWatchpointThreads.py (1898 of 2355) PASS: lldb-unit :: Host/./HostTests/FileSystemTest.EnumerateDirectory (1899 of 2355) PASS: lldb-unit :: Utility/./UtilityTests/UriParserTest.MinimalPort (1900 of 2355) PASS: lldb-api :: commands/target/create-no-such-arch/TestNoSuchArch.py (1901 of 2355) PASS: lldb-unit :: Core/./LLDBCoreTests/FormatEntityTest.DefinitionConstructionNameTypeData (1902 of 2355) PASS: lldb-shell :: SymbolFile/Breakpad/line-table-edgecases.test (1903 of 2355) PASS: lldb-api :: functionalities/thread/concurrent_events/TestConcurrentTwoWatchpointsOneBreakpoint.py (1904 of 2355) PASS: lldb-unit :: Utility/./UtilityTests/StreamTest.PutCharWhitespace (1905 of 2355) PASS: lldb-api :: functionalities/gdb_remote_client/TestIOSSimulator.py (1906 of 2355) PASS: lldb-unit :: Utility/./UtilityTests/ArgsTest.GetQuotedCommandString (1907 of 2355) UNSUPPORTED: lldb-api :: functionalities/data-formatter/data-formatter-stl/libstdcpp/string/TestDataFormatterStdString.py (1908 of 2355) PASS: lldb-api :: lang/cpp/wchar_t/TestCxxWCharT.py (1909 of 2355) PASS: lldb-api :: lang/cpp/accelerator-table/TestCPPAccelerator.py (1910 of 2355) PASS: lldb-api :: commands/command/script/TestCommandScript.py (1911 of 2355) PASS: lldb-unit :: Process/Utility/./ProcessUtilityTests/MemoryTagManagerAArch64MTETest.UnpackTagsData (1912 of 2355) UNSUPPORTED: lldb-shell :: ExecControl/StopHook/stop-hook-threads.test (1913 of 2355) PASS: lldb-api :: lang/objc/modules-non-objc-target/TestObjCModulesNonObjCTarget.py (1914 of 2355) PASS: lldb-api :: python_api/debugger/TestDebuggerAPI.py (1915 of 2355) PASS: lldb-unit :: ObjectFile/Breakpad/./ObjectFileBreakpadTests/Record.classify (1916 of 2355) UNSUPPORTED: lldb-shell :: Process/Windows/exception_access_violation.cpp (1917 of 2355) PASS: lldb-api :: lang/cpp/pointer_to_member_type_depending_on_parent_size/TestPointerToMemberTypeDependingOnParentSize.py (1918 of 2355) PASS: lldb-unit :: Language/Highlighting/./HighlighterTests/HighlighterTest.ClangCursorPosEndOfLine (1919 of 2355) PASS: lldb-unit :: Language/Highlighting/./HighlighterTests/HighlighterTest.ClangStringLiterals (1920 of 2355) PASS: lldb-unit :: Symbol/./SymbolTests/SymbolsTest.LocateExecutableSymbolFileForUnknownExecutableAndMissingSymbolFile (1921 of 2355) PASS: lldb-api :: functionalities/data-formatter/data-formatter-objc/TestDataFormatterObjCKVO.py (1922 of 2355) UNSUPPORTED: lldb-api :: functionalities/thread/thread_specific_break_plus_condition/TestThreadSpecificBpPlusCondition.py (1923 of 2355) PASS: lldb-api :: commands/expression/import-std-module/vector-of-vectors/TestVectorOfVectorsFromStdModule.py (1924 of 2355) PASS: lldb-unit :: debugserver/./debugserverTests/RNBSocket.LoopBackListenIPv4 (1925 of 2355) PASS: lldb-api :: functionalities/data-formatter/data-formatter-skip-summary/TestDataFormatterSkipSummary.py (1926 of 2355) PASS: lldb-api :: python_api/lldbutil/frame/TestFrameUtils.py (1927 of 2355) PASS: lldb-api :: functionalities/thread/concurrent_events/TestConcurrentWatchpointWithDelayWatchpointThreads.py (1928 of 2355) PASS: lldb-api :: functionalities/breakpoint/comp_dir_symlink/TestCompDirSymLink.py (1929 of 2355) PASS: lldb-shell :: SymbolFile/DWARF/clang-ast-from-dwarf-objc-property.m (1930 of 2355) PASS: lldb-api :: commands/target/create-deps/TestTargetCreateDeps.py (1931 of 2355) PASS: lldb-api :: commands/frame/diagnose/array/TestArray.py (1932 of 2355) PASS: lldb-api :: commands/command/invalid-args/TestInvalidArgsCommand.py (1933 of 2355) PASS: lldb-shell :: SymbolFile/Breakpad/unwind-via-stack-win-no-memory-info.yaml (1934 of 2355) UNSUPPORTED: lldb-shell :: Register/x86-zmm-write.test (1935 of 2355) PASS: lldb-shell :: VSCode/TestOptions.test (1936 of 2355) PASS: lldb-shell :: Register/Core/x86-64-freebsd-fp.test (1937 of 2355) PASS: lldb-unit :: Utility/./UtilityTests/RangeTest.Constructor (1938 of 2355) PASS: lldb-unit :: Host/./HostTests/SocketTests/SocketTest.TCPListen0ConnectAccept/ipv6 (1939 of 2355) UNSUPPORTED: lldb-shell :: SymbolFile/PDB/compilands.test (1940 of 2355) UNSUPPORTED: lldb-shell :: Register/x86-ymm-write.test (1941 of 2355) PASS: lldb-api :: lang/cpp/gmodules-templates/TestGModules.py (1942 of 2355) PASS: lldb-unit :: Utility/./UtilityTests/RegularExpression.CopyAssignment (1943 of 2355) PASS: lldb-unit :: Process/gdb-remote/./ProcessGdbRemoteTests/GDBRemoteCommunicationServerTest.SendErrorResponse_StringError (1944 of 2355) PASS: lldb-unit :: Utility/./UtilityTests/OptionsWithRawTest.SingleWhitespaceInput (1945 of 2355) PASS: lldb-unit :: Utility/./UtilityTests/StringLexerTest.NextIfList (1946 of 2355) PASS: lldb-shell :: SymbolFile/DWARF/x86/array-sizes.s (1947 of 2355) PASS: lldb-unit :: Utility/./UtilityTests/XcodeSDKTest.GetCanonicalNameAndConstruct (1948 of 2355) PASS: lldb-unit :: DataFormatter/./LLDBFormatterTests/TypeMatcherTests.CreatedBySameMatchStringExactNamePrefixes (1949 of 2355) PASS: lldb-shell :: Breakpoint/split-dwarf5-debug-stroffsets.test (1950 of 2355) PASS: lldb-api :: functionalities/archives/TestBSDArchives.py (1951 of 2355) UNSUPPORTED: lldb-shell :: Register/x86-64-zmm-read.test (1952 of 2355) PASS: lldb-shell :: SymbolFile/DWARF/x86/split-dwarf-inlining.cpp (1953 of 2355) PASS: lldb-unit :: Process/gdb-remote/./ProcessGdbRemoteTests/GDBRemoteClientBaseTest.SendContinueAndAsyncPacket (1954 of 2355) PASS: lldb-shell :: Register/Core/x86-32-netbsd-addr.test (1955 of 2355) PASS: lldb-api :: lang/objc/unicode-string/TestUnicodeString.py (1956 of 2355) PASS: lldb-api :: commands/watchpoints/hello_watchpoint/TestMyFirstWatchpoint.py (1957 of 2355) PASS: lldb-api :: commands/command/script/import/TestImport.py (1958 of 2355) PASS: lldb-unit :: SymbolFile/DWARF/./SymbolFileDWARFTests/SymbolFileDWARFTests.ParseAranges (1959 of 2355) PASS: lldb-unit :: Utility/./UtilityTests/ArgsTest.ReplaceArgumentAtIndexEqual (1960 of 2355) PASS: lldb-shell :: ObjectFile/ELF/PT_TLS-overlap-PT_LOAD.yaml (1961 of 2355) PASS: lldb-api :: functionalities/thread/concurrent_events/TestConcurrentDelayedCrashWithBreakpointWatchpoint.py (1962 of 2355) PASS: lldb-unit :: Utility/./UtilityTests/OptionsWithRawTest.WhitespaceInput (1963 of 2355) PASS: lldb-api :: python_api/process/read-mem-cstring/TestReadMemCString.py (1964 of 2355) PASS: lldb-api :: commands/expression/import-std-module/retry-with-std-module/TestRetryWithStdModule.py (1965 of 2355) PASS: lldb-unit :: Utility/./UtilityTests/ProcessInstanceInfoList.Yaml (1966 of 2355) PASS: lldb-unit :: Process/gdb-remote/./ProcessGdbRemoteTests/PortMapTest.Constructors (1967 of 2355) PASS: lldb-unit :: UnwindAssembly/x86/./UnwindAssemblyx86Tests/Testx86AssemblyInspectionEngine.TestPopEBP (1968 of 2355) PASS: lldb-api :: macosx/lc-note/firmware-corefile/TestFirmwareCorefiles.py (1969 of 2355) PASS: lldb-unit :: API/./APITests/SBCommandInterpreterTest.MultiWordCommand (1970 of 2355) UNSUPPORTED: lldb-api :: macosx/posix_spawn/TestLaunchProcessPosixSpawn.py (1971 of 2355) PASS: lldb-api :: functionalities/thread/concurrent_events/TestConcurrentManyBreakpoints.py (1972 of 2355) PASS: lldb-unit :: Utility/./UtilityTests/StringListTest.AppendListCStringArrayEmpty (1973 of 2355) PASS: lldb-unit :: SymbolFile/NativePDB/./SymbolFileNativePDBTests/PDBFPOProgramToDWARFExpressionTests.MultipleIndependentAssignments (1974 of 2355) PASS: lldb-api :: commands/expression/call-function/TestCallUserDefinedFunction.py (1975 of 2355) PASS: lldb-api :: lang/cpp/exceptions/TestCPPExceptionBreakpoints.py (1976 of 2355) PASS: lldb-api :: lang/objc/modules-compile-error/TestModulesCompileError.py (1977 of 2355) PASS: lldb-api :: functionalities/data-formatter/data-formatter-stl/libcxx/variant/TestDataFormatterLibcxxVariant.py (1978 of 2355) PASS: lldb-api :: macosx/macCatalyst/TestMacCatalyst.py (1979 of 2355) PASS: lldb-unit :: Host/./HostTests/SocketTests/SocketTest.DecodeHostAndPort/ipv4 (1980 of 2355) PASS: lldb-unit :: Utility/./UtilityTests/EventTest.DumpEventDataBytes (1981 of 2355) UNSUPPORTED: lldb-api :: functionalities/data-formatter/data-formatter-stl/libstdcpp/tuple/TestDataFormatterStdTuple.py (1982 of 2355) PASS: lldb-api :: lang/cpp/trivial_abi/TestTrivialABI.py (1983 of 2355) UNSUPPORTED: lldb-shell :: Minidump/Windows/arm-fp-unwind.test (1984 of 2355) PASS: lldb-unit :: Process/minidump/./LLDBMinidumpTests/MinidumpParserTest.GetMiscInfo_no_stream (1985 of 2355) PASS: lldb-api :: functionalities/data-formatter/data-formatter-objc/nsstring/TestDataFormatterNSString.py (1986 of 2355) PASS: lldb-api :: lang/c/strings/TestCStrings.py (1987 of 2355) PASS: lldb-unit :: Utility/./UtilityTests/DataExtractorTest.GetDouble (1988 of 2355) PASS: lldb-unit :: UnwindAssembly/x86/./UnwindAssemblyx86Tests/Testx86AssemblyInspectionEngine.TestSubRSP (1989 of 2355) PASS: lldb-unit :: Utility/./UtilityTests/VASprintfTest.BufferResize (1990 of 2355) PASS: lldb-shell :: Register/Core/x86-64-linux-fp.test (1991 of 2355) PASS: lldb-api :: lang/cpp/struct_with_keyword_name/TestStructWithKeywordName.py (1992 of 2355) UNSUPPORTED: lldb-shell :: Register/arm-gp-read.test (1993 of 2355) PASS: lldb-unit :: Utility/./UtilityTests/UriParserTest.BadPort2 (1994 of 2355) PASS: lldb-shell :: Driver/TestSingleQuote.test (1995 of 2355) PASS: lldb-shell :: Breakpoint/dummy-target.test (1996 of 2355) PASS: lldb-api :: functionalities/postmortem/mach-core/TestMachCore.py (1997 of 2355) PASS: lldb-unit :: Symbol/./SymbolTests/PostfixExpression.ParseFPOProgram (1998 of 2355) PASS: lldb-unit :: Symbol/./SymbolTests/TestClangASTImporter.DeportDeclTagDecl (1999 of 2355) PASS: lldb-unit :: Editline/./EditlineTests/EditlineTestFixture.EditlineReceivesMultiLineText (2000 of 2355) PASS: lldb-api :: functionalities/fat_archives/TestFatArchives.py (2001 of 2355) PASS: lldb-unit :: Symbol/./SymbolTests/TestTypeSystemClang.TestGetBasicTypeFromEnum (2002 of 2355) PASS: lldb-api :: functionalities/stats_api/TestStatisticsAPI.py (2003 of 2355) PASS: lldb-api :: lang/objc/variadic_methods/TestVariadicMethods.py (2004 of 2355) UNSUPPORTED: lldb-shell :: SymbolFile/PDB/type-quals.test (2005 of 2355) PASS: lldb-unit :: Process/minidump/./LLDBMinidumpTests/MinidumpParserTest.GetMemoryRegionInfoFromMemory64List (2006 of 2355) PASS: lldb-api :: functionalities/stop-on-sharedlibrary-load/TestStopOnSharedlibraryEvents.py (2007 of 2355) PASS: lldb-api :: commands/watchpoints/watchpoint_on_vectors/TestValueOfVectorVariable.py (2008 of 2355) PASS: lldb-unit :: Symbol/./SymbolTests/TestClangASTImporter.CopyTypeTagDecl (2009 of 2355) PASS: lldb-api :: lang/objc/foundation/TestObjCMethodsString.py (2010 of 2355) PASS: lldb-unit :: Utility/./UtilityTests/BinaryStreamTest.PutULEB128EightBytes (2011 of 2355) PASS: lldb-api :: commands/thread/select/TestThreadSelect.py (2012 of 2355) PASS: lldb-shell :: ObjectFile/ELF/PT_LOAD-overlap-PT_TLS.yaml (2013 of 2355) PASS: lldb-api :: lang/cpp/static_members/TestCPPStaticMembers.py (2014 of 2355) PASS: lldb-api :: functionalities/data-formatter/data-formatter-stl/libcxx/tuple/TestDataFormatterLibcxxTuple.py (2015 of 2355) PASS: lldb-api :: python_api/watchpoint/watchlocation/TestTargetWatchAddress.py (2016 of 2355) PASS: lldb-unit :: Utility/./UtilityTests/ConstStringTest.MangledCounterpart (2017 of 2355) PASS: lldb-unit :: Utility/./UtilityTests/StringExtractorTest.InitEmpty (2018 of 2355) PASS: lldb-shell :: Reproducer/TestHomeDir.test (2019 of 2355) PASS: lldb-api :: tools/lldb-server/inferior-crash/TestGdbRemoteSegFault.py (2020 of 2355) PASS: lldb-shell :: ObjectFile/PECOFF/export-dllfunc.yaml (2021 of 2355) UNSUPPORTED: lldb-shell :: SymbolFile/PDB/ast-restore.test (2022 of 2355) PASS: lldb-api :: lang/cpp/class-template-parameter-pack/TestClassTemplateParameterPack.py (2023 of 2355) UNSUPPORTED: lldb-shell :: SymbolFile/dissassemble-entry-point.s (2024 of 2355) PASS: lldb-shell :: SymbolFile/Breakpad/unwind-via-stack-win.test (2025 of 2355) PASS: lldb-unit :: Utility/./UtilityTests/StateTest.Formatv (2026 of 2355) PASS: lldb-api :: functionalities/postmortem/minidump-new/TestMiniDumpNew.py (2027 of 2355) PASS: lldb-unit :: SymbolFile/NativePDB/./SymbolFileNativePDBTests/PDBFPOProgramToDWARFExpressionTests.UnresolvedRegisterReference (2028 of 2355) UNSUPPORTED: lldb-api :: functionalities/darwin_log/filter/regex/activity-chain/TestDarwinLogFilterRegexActivityChain.py (2029 of 2355) PASS: lldb-unit :: Process/Utility/./ProcessUtilityTests/ProcMapTests/LinuxProcMapsTestFixture.ParseMapRegions/3 (2030 of 2355) PASS: lldb-shell :: Reproducer/TestFileRepro.test (2031 of 2355) PASS: lldb-api :: functionalities/breakpoint/step_over_breakpoint/TestStepOverBreakpoint.py (2032 of 2355) PASS: lldb-api :: functionalities/tail_call_frames/ambiguous_tail_call_seq1/TestAmbiguousTailCallSeq1.py (2033 of 2355) PASS: lldb-api :: tools/lldb-vscode/runInTerminal/TestVSCode_runInTerminal.py (2034 of 2355) UNSUPPORTED: lldb-shell :: Unwind/unwind-plan-dwarf-dump.test (2035 of 2355) PASS: lldb-shell :: SymbolFile/NativePDB/tag-types.cpp (2036 of 2355) PASS: lldb-unit :: Utility/./UtilityTests/TildeExpressionResolver.ResolveFullPath (2037 of 2355) PASS: lldb-unit :: Process/minidump/./LLDBMinidumpTests/MinidumpParserTest.GetMemoryRegionInfo (2038 of 2355) PASS: lldb-api :: functionalities/inferior-crashing/recursive-inferior/TestRecursiveInferiorStep.py (2039 of 2355) PASS: lldb-unit :: ScriptInterpreter/Python/./ScriptInterpreterPythonTests/PythonDataObjectsTest.TestPythonIntegerToStr (2040 of 2355) PASS: lldb-shell :: Minidump/Windows/Sigsegv/sigsegv.test (2041 of 2355) PASS: lldb-api :: functionalities/data-formatter/data-formatter-stl/libcxx/initializerlist/TestInitializerList.py (2042 of 2355) PASS: lldb-api :: lang/cpp/class-template-type-parameter-pack/TestClassTemplateTypeParameterPack.py (2043 of 2355) PASS: lldb-api :: python_api/default-constructor/TestDefaultConstructorForAPIObjects.py (2044 of 2355) PASS: lldb-api :: functionalities/float-display/TestFloatDisplay.py (2045 of 2355) PASS: lldb-api :: functionalities/postmortem/minidump/TestMiniDump.py (2046 of 2355) PASS: lldb-api :: functionalities/show_location/TestShowLocationDwarf5.py (2047 of 2355) PASS: lldb-shell :: SymbolFile/DWARF/x86/module-ownership.mm (2048 of 2355) PASS: lldb-unit :: ScriptInterpreter/Python/./ScriptInterpreterPythonTests/PythonDataObjectsTest.TestRun (2049 of 2355) UNSUPPORTED: lldb-shell :: SymbolFile/PDB/class-layout.test (2050 of 2355) PASS: lldb-shell :: Reproducer/TestSynchronous.test (2051 of 2355) PASS: lldb-api :: python_api/sbstructureddata/TestStructuredDataAPI.py (2052 of 2355) PASS: lldb-shell :: Commands/command-source.test (2053 of 2355) FAIL: lldb-api :: tools/lldb-vscode/breakpoint/TestVSCode_setFunctionBreakpoints.py (2054 of 2355) ******************** TEST 'lldb-api :: tools/lldb-vscode/breakpoint/TestVSCode_setFunctionBreakpoints.py' FAILED ******************** Script: -- /Users/buildslave/jenkins/workspace/lldb-cmake-sanitized/lldb-build/lldb-test-build.noindex/copied-python /Users/buildslave/jenkins/workspace/lldb-cmake-sanitized/llvm-project/lldb/test/API/dotest.py -u CXXFLAGS -u CFLAGS --codesign-identity lldb_codesign --arch x86_64 --build-dir /Users/buildslave/jenkins/workspace/lldb-cmake-sanitized/lldb-build/lldb-test-build.noindex -t --env TERM=vt100 --env LLVM_LIBS_DIR=/Users/buildslave/jenkins/workspace/lldb-cmake-sanitized/lldb-build/./lib --inferior-env ASAN_OPTIONS=detect_stack_use_after_return=1 --inferior-env DYLD_INSERT_LIBRARIES=/Users/buildslave/jenkins/workspace/lldb-cmake-sanitized/host-compiler/lib/clang/13.0.99/lib/darwin/libclang_rt.asan_osx_dynamic.dylib --arch x86_64 --build-dir /Users/buildslave/jenkins/workspace/lldb-cmake-sanitized/lldb-build/lldb-test-build.noindex --lldb-module-cache-dir /Users/buildslave/jenkins/workspace/lldb-cmake-sanitized/lldb-build/lldb-test-build.noindex/module-cache-lldb/lldb-api --clang-module-cache-dir /Users/buildslave/jenkins/workspace/lldb-cmake-sanitized/lldb-build/lldb-test-build.noindex/module-cache-clang/lldb-api --executable /Users/buildslave/jenkins/workspace/lldb-cmake-sanitized/lldb-build/./bin/lldb --compiler /Users/buildslave/jenkins/workspace/lldb-cmake-sanitized/host-compiler/bin/clang --dsymutil /Users/buildslave/jenkins/workspace/lldb-cmake-sanitized/lldb-build/./bin/dsymutil --llvm-tools-dir /Users/buildslave/jenkins/workspace/lldb-cmake-sanitized/lldb-build/./bin --lldb-libs-dir /Users/buildslave/jenkins/workspace/lldb-cmake-sanitized/lldb-build/./lib /Users/buildslave/jenkins/workspace/lldb-cmake-sanitized/llvm-project/lldb/test/API/tools/lldb-vscode/breakpoint -p TestVSCode_setFunctionBreakpoints.py -- Exit Code: 1

Hide Details

Command Output (stdout): -- lldb version 13.0.99 (http://labmaster3.local/git/llvm-project.git revision 88326bbce38c53f4782ba3b593b6720438a9569c) clang revision 88326bbce38c53f4782ba3b593b6720438a9569c llvm revision 88326bbce38c53f4782ba3b593b6720438a9569c Skipping the following test categories: ['darwin-log', 'libstdcxx', 'dwo', 'llgs', 'fork'] ========= DEBUG ADAPTER PROTOCOL LOGS ========= --> Content-Length: 284

Hide Details

{"command":"initialize","type":"request","arguments":{"adapterID":"lldb-native","clientID":"vscode","columnsStartAt1":true,"linesStartAt1":true,"locale":"en-us","pathFormat":"path","supportsRunInTerminalRequest":true,"supportsVariablePaging":true,"supportsVariableType":true},"seq":1} <-- Content-Length: 1222

Hide Details

{"body":{"exceptionBreakpointFilters":[{"default":false,"filter":"cpp_catch","label":"C++ Catch"},{"default":false,"filter":"cpp_throw","label":"C++ Throw"},{"default":false,"filter":"objc_catch","label":"Objective C Catch"},{"default":false,"filter":"objc_throw","label":"Objective C Throw"},{"default":false,"filter":"swift_catch","label":"Swift Catch"},{"default":false,"filter":"swift_throw","label":"Swift Throw"}],"supportTerminateDebuggee":true,"supportsCompletionsRequest":false,"supportsConditionalBreakpoints":true,"supportsConfigurationDoneRequest":true,"supportsDelayedStackTraceLoading":true,"supportsEvaluateForHovers":true,"supportsExceptionInfoRequest":true,"supportsExceptionOptions":true,"supportsFunctionBreakpoints":true,"supportsGotoTargetsRequest":false,"supportsHitConditionalBreakpoints":true,"supportsLoadedSourcesRequest":false,"supportsModulesRequest":false,"supportsProgressReporting":true,"supportsRestartFrame":false,"supportsRestartRequest":false,"supportsRunInTerminalRequest":true,"supportsSetVariable":true,"supportsStepBack":false,"supportsStepInTargetsRequest":false,"supportsValueFormattingOptions":true},"command":"initialize","request_seq":1,"seq":0,"success":true,"type":"response"} --> Content-Length: 1044

Hide Details

{"command":"launch","type":"request","arguments":{"program":"/Users/buildslave/jenkins/workspace/lldb-cmake-sanitized/lldb-build/lldb-test-build.noindex/tools/lldb-vscode/breakpoint/TestVSCode_setFunctionBreakpoints.test_functionality/a.out","disableASLR":true,"initCommands":["settings clear -all","settings set symbols.enable-external-lookup false","settings set target.inherit-tcc true","settings set target.detach-on-error false","settings set target.auto-apply-fixits false","settings set plugin.process.gdb-remote.packet-timeout 60","settings set symbols.clang-modules-cache-path \"/Users/buildslave/jenkins/workspace/lldb-cmake-sanitized/lldb-build/lldb-test-build.noindex/module-cache-lldb/lldb-api\"","settings set use-color false","setting set target.prefer-dynamic-value no-dynamic-values","settings set target.env-vars ASAN_OPTIONS=detect_stack_use_after_return=1 DYLD_INSERT_LIBRARIES=/Users/buildslave/jenkins/workspace/lldb-cmake-sanitized/host-compiler/lib/clang/13.0.99/lib/darwin/libclang_rt.asan_osx_dynamic.dylib"]},"seq":2} <-- Content-Length: 923

Hide Details

{"body":{"category":"console","output":"Running initCommands:\n(lldb) settings clear -all\n(lldb) settings set symbols.enable-external-lookup false\n(lldb) settings set target.inherit-tcc true\n(lldb) settings set target.detach-on-error false\n(lldb) settings set target.auto-apply-fixits false\n(lldb) settings set plugin.process.gdb-remote.packet-timeout 60\n(lldb) settings set symbols.clang-modules-cache-path \"/Users/buildslave/jenkins/workspace/lldb-cmake-sanitized/lldb-build/lldb-test-build.noindex/module-cache-lldb/lldb-api\"\n(lldb) settings set use-color false\n(lldb) setting set target.prefer-dynamic-value no-dynamic-values\n(lldb) settings set target.env-vars ASAN_OPTIONS=detect_stack_use_after_return=1 DYLD_INSERT_LIBRARIES=/Users/buildslave/jenkins/workspace/lldb-cmake-sanitized/host-compiler/lib/clang/13.0.99/lib/darwin/libclang_rt.asan_osx_dynamic.dylib\n"},"event":"output","seq":0,"type":"event"} <-- Content-Length: 77

Hide Details

{"command":"launch","request_seq":2,"seq":0,"success":true,"type":"response"} <-- Content-Length: 309

Hide Details

{"body":{"isLocalProcess":true,"name":"/Users/buildslave/jenkins/workspace/lldb-cmake-sanitized/lldb-build/lldb-test-build.noindex/tools/lldb-vscode/breakpoint/TestVSCode_setFunctionBreakpoints.test_functionality/a.out","startMethod":"launch","systemProcessId":61255},"event":"process","seq":0,"type":"event"} <-- Content-Length: 46

Hide Details

{"event":"initialized","seq":0,"type":"event"} --> Content-Length: 109

Hide Details

{"command":"setFunctionBreakpoints","type":"request","arguments":{"breakpoints":[{"name":"twelve"}]},"seq":3} <-- Content-Length: 383

Hide Details

{"body":{"breakpoints":[{"id":1,"line":6,"source":{"name":"main-copy.cpp","path":"/Users/buildslave/jenkins/workspace/lldb-cmake-sanitized/lldb-build/lldb-test-build.noindex/tools/lldb-vscode/breakpoint/TestVSCode_setFunctionBreakpoints.test_functionality/main-copy.cpp"},"verified":true}]},"command":"setFunctionBreakpoints","request_seq":3,"seq":0,"success":true,"type":"response"} --> Content-Length: 71

Hide Details

{"command":"configurationDone","type":"request","arguments":{},"seq":4} <-- Content-Length: 88

Hide Details

{"command":"configurationDone","request_seq":4,"seq":0,"success":true,"type":"response"} <-- Content-Length: 198

Hide Details

{"body":{"allThreadsStopped":true,"description":"breakpoint 1.1","preserveFocusHint":false,"reason":"breakpoint","threadCausedFocus":true,"threadId":265161},"event":"stopped","seq":0,"type":"event"} --> Content-Length: 61

Hide Details

{"command":"threads","type":"request","arguments":{},"seq":5} <-- Content-Length: 132

Hide Details

{"body":{"threads":[{"id":265161,"name":"Thread #1"}]},"command":"threads","request_seq":5,"seq":0,"success":true,"type":"response"} --> Content-Length: 107

Hide Details

{"command":"stackTrace","type":"request","arguments":{"threadId":265161,"startFrame":0,"levels":1},"seq":6} <-- Content-Length: 409

Hide Details

{"body":{"stackFrames":[{"column":15,"id":524288,"line":6,"name":"twelve(int)","source":{"name":"main-copy.cpp","path":"/Users/buildslave/jenkins/workspace/lldb-cmake-sanitized/lldb-build/lldb-test-build.noindex/tools/lldb-vscode/breakpoint/TestVSCode_setFunctionBreakpoints.test_functionality/main-copy.cpp"}}],"totalFrames":4},"command":"stackTrace","request_seq":6,"seq":0,"success":true,"type":"response"} --> Content-Length: 76

Hide Details

{"command":"scopes","type":"request","arguments":{"frameId":524288},"seq":7} <-- Content-Length: 335

Hide Details

{"body":{"scopes":[{"expensive":false,"name":"Locals","namedVariables":1,"variablesReference":1},{"expensive":false,"name":"Globals","namedVariables":0,"variablesReference":2},{"expensive":false,"name":"Registers","namedVariables":3,"variablesReference":3}]},"command":"scopes","request_seq":7,"seq":0,"success":true,"type":"response"} --> Content-Length: 85

Hide Details

{"command":"variables","type":"request","arguments":{"variablesReference":1},"seq":8} <-- Content-Length: 190

Hide Details

{"body":{"variables":[{"evaluateName":"i","id":0,"name":"i","type":"int","value":"0","variablesReference":0}]},"command":"variables","request_seq":8,"seq":0,"success":true,"type":"response"} --> Content-Length: 128

Hide Details

{"command":"setFunctionBreakpoints","type":"request","arguments":{"breakpoints":[{"name":"twelve","condition":"i==4"}]},"seq":9} <-- Content-Length: 383

Hide Details

{"body":{"breakpoints":[{"id":1,"line":6,"source":{"name":"main-copy.cpp","path":"/Users/buildslave/jenkins/workspace/lldb-cmake-sanitized/lldb-build/lldb-test-build.noindex/tools/lldb-vscode/breakpoint/TestVSCode_setFunctionBreakpoints.test_functionality/main-copy.cpp"},"verified":true}]},"command":"setFunctionBreakpoints","request_seq":9,"seq":0,"success":true,"type":"response"} --> Content-Length: 80

Hide Details

{"command":"continue","type":"request","arguments":{"threadId":265161},"seq":10} <-- Content-Length: 116

Hide Details

{"body":{"allThreadsContinued":true},"command":"continue","request_seq":10,"seq":0,"success":true,"type":"response"} <-- Content-Length: 311

Hide Details

{"body":{"category":"console","output":"/Users/buildslave/jenkins/workspace/lldb-cmake-sanitized/llvm-project/lldb/tools/lldb-vscode/ProgressEvent.cpp:89:64: runtime error: load of value 829960214, which is not a valid value for type 'lldb_vscode::ProgressEventType'\n"},"event":"output","seq":0,"type":"event"} <-- Content-Length: 261

Hide Details

{"body":{"category":"console","output":"SUMMARY: UndefinedBehaviorSanitizer: undefined-behavior /Users/buildslave/jenkins/workspace/lldb-cmake-sanitized/llvm-project/lldb/tools/lldb-vscode/ProgressEvent.cpp:89:64 in \n"},"event":"output","seq":0,"type":"event"} <-- Content-Length: 170

Hide Details

{"body":{"category":"console","output":"PLEASE submit a bug report to https://bugs.llvm.org/ and include the crash backtrace.\n"},"event":"output","seq":0,"type":"event"}

Hide Details

========= END ========= ========= DEBUG ADAPTER PROTOCOL LOGS ========= --> Content-Length: 284

Hide Details

{"command":"initialize","type":"request","arguments":{"adapterID":"lldb-native","clientID":"vscode","columnsStartAt1":true,"linesStartAt1":true,"locale":"en-us","pathFormat":"path","supportsRunInTerminalRequest":true,"supportsVariablePaging":true,"supportsVariableType":true},"seq":1} <-- Content-Length: 1222

Hide Details

{"body":{"exceptionBreakpointFilters":[{"default":false,"filter":"cpp_catch","label":"C++ Catch"},{"default":false,"filter":"cpp_throw","label":"C++ Throw"},{"default":false,"filter":"objc_catch","label":"Objective C Catch"},{"default":false,"filter":"objc_throw","label":"Objective C Throw"},{"default":false,"filter":"swift_catch","label":"Swift Catch"},{"default":false,"filter":"swift_throw","label":"Swift Throw"}],"supportTerminateDebuggee":true,"supportsCompletionsRequest":false,"supportsConditionalBreakpoints":true,"supportsConfigurationDoneRequest":true,"supportsDelayedStackTraceLoading":true,"supportsEvaluateForHovers":true,"supportsExceptionInfoRequest":true,"supportsExceptionOptions":true,"supportsFunctionBreakpoints":true,"supportsGotoTargetsRequest":false,"supportsHitConditionalBreakpoints":true,"supportsLoadedSourcesRequest":false,"supportsModulesRequest":false,"supportsProgressReporting":true,"supportsRestartFrame":false,"supportsRestartRequest":false,"supportsRunInTerminalRequest":true,"supportsSetVariable":true,"supportsStepBack":false,"supportsStepInTargetsRequest":false,"supportsValueFormattingOptions":true},"command":"initialize","request_seq":1,"seq":0,"success":true,"type":"response"} --> Content-Length: 1044

Hide Details

{"command":"launch","type":"request","arguments":{"program":"/Users/buildslave/jenkins/workspace/lldb-cmake-sanitized/lldb-build/lldb-test-build.noindex/tools/lldb-vscode/breakpoint/TestVSCode_setFunctionBreakpoints.test_set_and_clear/a.out","disableASLR":true,"initCommands":["settings clear -all","settings set symbols.enable-external-lookup false","settings set target.inherit-tcc true","settings set target.detach-on-error false","settings set target.auto-apply-fixits false","settings set plugin.process.gdb-remote.packet-timeout 60","settings set symbols.clang-modules-cache-path \"/Users/buildslave/jenkins/workspace/lldb-cmake-sanitized/lldb-build/lldb-test-build.noindex/module-cache-lldb/lldb-api\"","settings set use-color false","setting set target.prefer-dynamic-value no-dynamic-values","settings set target.env-vars ASAN_OPTIONS=detect_stack_use_after_return=1 DYLD_INSERT_LIBRARIES=/Users/buildslave/jenkins/workspace/lldb-cmake-sanitized/host-compiler/lib/clang/13.0.99/lib/darwin/libclang_rt.asan_osx_dynamic.dylib"]},"seq":2} <-- Content-Length: 923

Hide Details

{"body":{"category":"console","output":"Running initCommands:\n(lldb) settings clear -all\n(lldb) settings set symbols.enable-external-lookup false\n(lldb) settings set target.inherit-tcc true\n(lldb) settings set target.detach-on-error false\n(lldb) settings set target.auto-apply-fixits false\n(lldb) settings set plugin.process.gdb-remote.packet-timeout 60\n(lldb) settings set symbols.clang-modules-cache-path \"/Users/buildslave/jenkins/workspace/lldb-cmake-sanitized/lldb-build/lldb-test-build.noindex/module-cache-lldb/lldb-api\"\n(lldb) settings set use-color false\n(lldb) setting set target.prefer-dynamic-value no-dynamic-values\n(lldb) settings set target.env-vars ASAN_OPTIONS=detect_stack_use_after_return=1 DYLD_INSERT_LIBRARIES=/Users/buildslave/jenkins/workspace/lldb-cmake-sanitized/host-compiler/lib/clang/13.0.99/lib/darwin/libclang_rt.asan_osx_dynamic.dylib\n"},"event":"output","seq":0,"type":"event"} <-- Content-Length: 77

Hide Details

{"command":"launch","request_seq":2,"seq":0,"success":true,"type":"response"} <-- Content-Length: 309

Hide Details

{"body":{"isLocalProcess":true,"name":"/Users/buildslave/jenkins/workspace/lldb-cmake-sanitized/lldb-build/lldb-test-build.noindex/tools/lldb-vscode/breakpoint/TestVSCode_setFunctionBreakpoints.test_set_and_clear/a.out","startMethod":"launch","systemProcessId":61304},"event":"process","seq":0,"type":"event"} <-- Content-Length: 46

Hide Details

{"event":"initialized","seq":0,"type":"event"} --> Content-Length: 109

Hide Details

{"command":"setFunctionBreakpoints","type":"request","arguments":{"breakpoints":[{"name":"twelve"}]},"seq":3} <-- Content-Length: 383

Hide Details

{"body":{"breakpoints":[{"id":1,"line":6,"source":{"name":"main-copy.cpp","path":"/Users/buildslave/jenkins/workspace/lldb-cmake-sanitized/lldb-build/lldb-test-build.noindex/tools/lldb-vscode/breakpoint/TestVSCode_setFunctionBreakpoints.test_set_and_clear/main-copy.cpp"},"verified":true}]},"command":"setFunctionBreakpoints","request_seq":3,"seq":0,"success":true,"type":"response"} --> Content-Length: 129

Hide Details

{"command":"setFunctionBreakpoints","type":"request","arguments":{"breakpoints":[{"name":"twelve"},{"name":"thirteen"}]},"seq":4} <-- Content-Length: 649

Hide Details

{"body":{"breakpoints":[{"id":1,"line":6,"source":{"name":"main-copy.cpp","path":"/Users/buildslave/jenkins/workspace/lldb-cmake-sanitized/lldb-build/lldb-test-build.noindex/tools/lldb-vscode/breakpoint/TestVSCode_setFunctionBreakpoints.test_set_and_clear/main-copy.cpp"},"verified":true},{"id":2,"line":10,"source":{"name":"main-copy.cpp","path":"/Users/buildslave/jenkins/workspace/lldb-cmake-sanitized/lldb-build/lldb-test-build.noindex/tools/lldb-vscode/breakpoint/TestVSCode_setFunctionBreakpoints.test_set_and_clear/main-copy.cpp"},"verified":true}]},"command":"setFunctionBreakpoints","request_seq":4,"seq":0,"success":true,"type":"response"} --> Content-Length: 109

Hide Details

{"command":"setFunctionBreakpoints","type":"request","arguments":{"breakpoints":[{"name":"twelve"}]},"seq":5} <-- Content-Length: 383

Hide Details

{"body":{"breakpoints":[{"id":1,"line":6,"source":{"name":"main-copy.cpp","path":"/Users/buildslave/jenkins/workspace/lldb-cmake-sanitized/lldb-build/lldb-test-build.noindex/tools/lldb-vscode/breakpoint/TestVSCode_setFunctionBreakpoints.test_set_and_clear/main-copy.cpp"},"verified":true}]},"command":"setFunctionBreakpoints","request_seq":5,"seq":0,"success":true,"type":"response"} --> Content-Length: 79

Hide Details

{"command":"_testGetTargetBreakpoints","type":"request","arguments":{},"seq":6} <-- Content-Length: 386

Hide Details

{"body":{"breakpoints":[{"id":1,"line":6,"source":{"name":"main-copy.cpp","path":"/Users/buildslave/jenkins/workspace/lldb-cmake-sanitized/lldb-build/lldb-test-build.noindex/tools/lldb-vscode/breakpoint/TestVSCode_setFunctionBreakpoints.test_set_and_clear/main-copy.cpp"},"verified":true}]},"command":"_testGetTargetBreakpoints","request_seq":6,"seq":0,"success":true,"type":"response"} --> Content-Length: 92

Hide Details

{"command":"setFunctionBreakpoints","type":"request","arguments":{"breakpoints":[]},"seq":7} <-- Content-Length: 119

Hide Details

{"body":{"breakpoints":[]},"command":"setFunctionBreakpoints","request_seq":7,"seq":0,"success":true,"type":"response"} --> Content-Length: 79

Hide Details

{"command":"_testGetTargetBreakpoints","type":"request","arguments":{},"seq":8} <-- Content-Length: 122

Hide Details

{"body":{"breakpoints":[]},"command":"_testGetTargetBreakpoints","request_seq":8,"seq":0,"success":true,"type":"response"} --> Content-Length: 88

Hide Details

{"command":"disconnect","type":"request","arguments":{"terminateDebuggee":true},"seq":9} <-- Content-Length: 45

Hide Details

{"event":"terminated","seq":0,"type":"event"} <-- Content-Length: 63

Hide Details

{"body":{"exitCode":9},"event":"exited","seq":0,"type":"event"} <-- Content-Length: 81

Hide Details

{"command":"disconnect","request_seq":9,"seq":0,"success":true,"type":"response"}

Hide Details

========= END =========

Hide Details

-- Command Output (stderr): -- Change dir to: /Users/buildslave/jenkins/workspace/lldb-cmake-sanitized/llvm-project/lldb/test/API/tools/lldb-vscode/breakpoint runCmd: settings clear -all output:

Hide Details

runCmd: settings set symbols.enable-external-lookup false output:

Hide Details

runCmd: settings set target.inherit-tcc true output:

Hide Details

runCmd: settings set target.detach-on-error false output:

Hide Details

runCmd: settings set target.auto-apply-fixits false output:

Hide Details

runCmd: settings set plugin.process.gdb-remote.packet-timeout 60 output:

Hide Details

runCmd: settings set symbols.clang-modules-cache-path "/Users/buildslave/jenkins/workspace/lldb-cmake-sanitized/lldb-build/lldb-test-build.noindex/module-cache-lldb/lldb-api" output:

Hide Details

runCmd: settings set use-color false output:

Hide Details

runCmd: setting set target.prefer-dynamic-value no-dynamic-values output:

Hide Details

runCmd: settings set target.env-vars ASAN_OPTIONS=detect_stack_use_after_return=1 DYLD_INSERT_LIBRARIES=/Users/buildslave/jenkins/workspace/lldb-cmake-sanitized/host-compiler/lib/clang/13.0.99/lib/darwin/libclang_rt.asan_osx_dynamic.dylib output:

Hide Details

Adding tearDown hook: def cleanup(): if disconnectAutomatically: self.vscode.request_disconnect(terminateDebuggee=True) self.vscode.terminate()

Hide Details

Hide Details

FAIL: LLDB (/Users/buildslave/jenkins/workspace/lldb-cmake-sanitized/host-compiler/bin/clang-x86_64) :: test_functionality (TestVSCode_setFunctionBreakpoints.TestVSCode_setFunctionBreakpoints) Executing tearDown hook: def cleanup(): if disconnectAutomatically: self.vscode.request_disconnect(terminateDebuggee=True) self.vscode.terminate()

Hide Details

Hide Details

CLEANUP ERROR: LLDB (/Users/buildslave/jenkins/workspace/lldb-cmake-sanitized/host-compiler/bin/clang-x86_64) :: test_functionality (TestVSCode_setFunctionBreakpoints.TestVSCode_setFunctionBreakpoints) Traceback (most recent call last): File "/Users/buildslave/jenkins/workspace/lldb-cmake-sanitized/llvm-project/lldb/third_party/Python/module/unittest2/unittest2/case.py", line 386, in run self.tearDown() File "/Users/buildslave/jenkins/workspace/lldb-cmake-sanitized/llvm-project/lldb/packages/Python/lldbsuite/test/lldbtest.py", line 2095, in tearDown Base.tearDown(self) File "/Users/buildslave/jenkins/workspace/lldb-cmake-sanitized/llvm-project/lldb/packages/Python/lldbsuite/test/lldbtest.py", line 1065, in tearDown hook() # try the plain call and hope it works File "/Users/buildslave/jenkins/workspace/lldb-cmake-sanitized/llvm-project/lldb/packages/Python/lldbsuite/test/tools/lldb-vscode/lldbvscode_testcase.py", line 294, in cleanup self.vscode.request_disconnect(terminateDebuggee=True) File "/Users/buildslave/jenkins/workspace/lldb-cmake-sanitized/llvm-project/lldb/packages/Python/lldbsuite/test/tools/lldb-vscode/vscode.py", line 590, in request_disconnect return self.send_recv(command_dict) File "/Users/buildslave/jenkins/workspace/lldb-cmake-sanitized/llvm-project/lldb/packages/Python/lldbsuite/test/tools/lldb-vscode/vscode.py", line 315, in send_recv self.send_packet(command) File "/Users/buildslave/jenkins/workspace/lldb-cmake-sanitized/llvm-project/lldb/packages/Python/lldbsuite/test/tools/lldb-vscode/vscode.py", line 271, in send_packet self.send.flush() BrokenPipeError: [Errno 32] Broken pipe

Hide Details

runCmd: settings clear -all output:

Hide Details

runCmd: settings set symbols.enable-external-lookup false output:

Hide Details

runCmd: settings set target.inherit-tcc true output:

Hide Details

runCmd: settings set target.detach-on-error false output:

Hide Details

runCmd: settings set target.auto-apply-fixits false output:

Hide Details

runCmd: settings set plugin.process.gdb-remote.packet-timeout 60 output:

Hide Details

runCmd: settings set symbols.clang-modules-cache-path "/Users/buildslave/jenkins/workspace/lldb-cmake-sanitized/lldb-build/lldb-test-build.noindex/module-cache-lldb/lldb-api" output:

Hide Details

runCmd: settings set use-color false output:

Hide Details

runCmd: setting set target.prefer-dynamic-value no-dynamic-values output:

Hide Details

runCmd: settings set target.env-vars ASAN_OPTIONS=detect_stack_use_after_return=1 DYLD_INSERT_LIBRARIES=/Users/buildslave/jenkins/workspace/lldb-cmake-sanitized/host-compiler/lib/clang/13.0.99/lib/darwin/libclang_rt.asan_osx_dynamic.dylib output:

Hide Details

Adding tearDown hook: def cleanup(): if disconnectAutomatically: self.vscode.request_disconnect(terminateDebuggee=True) self.vscode.terminate()

Hide Details

Hide Details

Executing tearDown hook: def cleanup(): if disconnectAutomatically: self.vscode.request_disconnect(terminateDebuggee=True) self.vscode.terminate()

Hide Details

Hide Details

PASS: LLDB (/Users/buildslave/jenkins/workspace/lldb-cmake-sanitized/host-compiler/bin/clang-x86_64) :: test_set_and_clear (TestVSCode_setFunctionBreakpoints.TestVSCode_setFunctionBreakpoints) Restore dir to: /Users/buildslave/jenkins/workspace/lldb-cmake-sanitized/lldb-build/tools/lldb/test ====================================================================== FAIL: test_functionality (TestVSCode_setFunctionBreakpoints.TestVSCode_setFunctionBreakpoints) Tests hitting breakpoints and the functionality of a single ---------------------------------------------------------------------- Traceback (most recent call last): File "/Users/buildslave/jenkins/workspace/lldb-cmake-sanitized/llvm-project/lldb/test/API/tools/lldb-vscode/breakpoint/TestVSCode_setFunctionBreakpoints.py", line 139, in test_functionality self.continue_to_breakpoints(breakpoint_ids) File "/Users/buildslave/jenkins/workspace/lldb-cmake-sanitized/llvm-project/lldb/packages/Python/lldbsuite/test/tools/lldb-vscode/lldbvscode_testcase.py", line 233, in continue_to_breakpoints self.verify_breakpoint_hit(breakpoint_ids) File "/Users/buildslave/jenkins/workspace/lldb-cmake-sanitized/llvm-project/lldb/packages/Python/lldbsuite/test/tools/lldb-vscode/lldbvscode_testcase.py", line 92, in verify_breakpoint_hit self.assertTrue(False, "breakpoint not hit") AssertionError: False is not True : breakpoint not hit Config=x86_64-/Users/buildslave/jenkins/workspace/lldb-cmake-sanitized/host-compiler/bin/clang ---------------------------------------------------------------------- Ran 2 tests in 4.101s

Hide Details

RESULT: FAILED (1 passes, 1 failures, 0 errors, 0 skipped, 0 expected failures, 0 unexpected successes)

Hide Details

--

Hide Details

******************** PASS: lldb-unit :: Host/./HostTests/MainLoopTest.UnmonitoredSignal (2055 of 2355) PASS: lldb-unit :: ScriptInterpreter/Python/./ScriptInterpreterPythonTests/PythonDataObjectsTest.TestPythonTupleInitializerList (2056 of 2355) UNSUPPORTED: lldb-api :: lang/objc/objc-dynamic-value/TestObjCDynamicValue.py (2057 of 2355) PASS: lldb-shell :: SymbolFile/DWARF/x86/debug-types-line-tables.s (2058 of 2355) PASS: lldb-unit :: Process/Utility/./ProcessUtilityTests/ProcSMapTests/LinuxProcSMapsTestFixture.ParseSMapRegions/4 (2059 of 2355) PASS: lldb-unit :: Utility/./UtilityTests/FileSpecTest.Yaml (2060 of 2355) PASS: lldb-unit :: UnwindAssembly/x86/./UnwindAssemblyx86Tests/Testx86AssemblyInspectionEngine.TestStackRealignMSVC_i386 (2061 of 2355) UNSUPPORTED: lldb-api :: commands/gui/breakpoints/TestGuiBreakpoints.py (2062 of 2355) PASS: lldb-shell :: SymbolFile/DWARF/x86/debug-types-basic.test (2063 of 2355) PASS: lldb-api :: commands/expression/import-std-module/stack/TestStackFromStdModule.py (2064 of 2355) PASS: lldb-api :: commands/watchpoints/watchpoint_commands/TestWatchpointCommands.py (2065 of 2355) PASS: lldb-shell :: ScriptInterpreter/Python/scripted_breakpoint_lua.test (2066 of 2355) PASS: lldb-shell :: Register/Core/x86-32-linux-fp.test (2067 of 2355) PASS: lldb-api :: lang/c/cpp_keyword_identifiers/TestCppKeywordsAsCIdentifiers.py (2068 of 2355) PASS: lldb-unit :: Host/./HostTests/MainLoopTest.TerminatesImmediately (2069 of 2355) UNSUPPORTED: lldb-shell :: BuildScript/toolchain-clang-cl.test (2070 of 2355) PASS: lldb-api :: functionalities/data-formatter/data-formatter-stl/libcxx/vector/TestDataFormatterLibcxxVector.py (2071 of 2355) PASS: lldb-api :: lang/objc/objc-foundation-dictionary-empty/TestNSDictionary0.py (2072 of 2355) PASS: lldb-shell :: SymbolFile/DWARF/x86/debug_line-tombstone.s (2073 of 2355) PASS: lldb-unit :: Language/Highlighting/./HighlighterTests/HighlighterTest.Colons (2074 of 2355) PASS: lldb-unit :: Utility/./UtilityTests/ConstStringTest.format_provider (2075 of 2355) PASS: lldb-shell :: ObjectFile/ELF/minidebuginfo-corrupt-xz.yaml (2076 of 2355) PASS: lldb-api :: types/TestCharType.py (2077 of 2355) PASS: lldb-unit :: Utility/./UtilityTests/BinaryStreamTest.PutULEB128SixBytes (2078 of 2355) PASS: lldb-unit :: Utility/./UtilityTests/ScalarTest.TruncOrExtendTo (2079 of 2355) PASS: lldb-unit :: Utility/./UtilityTests/SerializationRountripTest.SerializeDeserializeCString (2080 of 2355) PASS: lldb-unit :: Symbol/./SymbolTests/Type.GetTypeScopeAndBasename (2081 of 2355) PASS: lldb-unit :: Utility/./UtilityTests/RecordReplayTest.InstrumentedFooSameThis (2082 of 2355) PASS: lldb-api :: commands/command/script_alias/TestCommandScriptAlias.py (2083 of 2355) PASS: lldb-unit :: Utility/./UtilityTests/DataExtractorTest.GetCStrAtNullOffset (2084 of 2355) PASS: lldb-api :: commands/expression/radar_8638051/Test8638051.py (2085 of 2355) PASS: lldb-api :: lang/objc/direct-dispatch-step/TestObjCDirectDispatchStepping.py (2086 of 2355) PASS: lldb-shell :: Commands/command-stop-hook-output.test (2087 of 2355) PASS: lldb-api :: functionalities/pointer_num_children/TestPointerNumChildren.py (2088 of 2355) PASS: lldb-unit :: Symbol/./SymbolTests/DWARFCallFrameInfoTest.Basic_dwarf3 (2089 of 2355) PASS: lldb-shell :: Minidump/Windows/broken-unwind.test (2090 of 2355) PASS: lldb-api :: tools/lldb-server/TestGdbRemoteHostInfo.py (2091 of 2355) PASS: lldb-api :: commands/expression/import-std-module/vector-dbg-info-content/TestDbgInfoContentVectorFromStdModule.py (2092 of 2355) PASS: lldb-unit :: ScriptInterpreter/Python/./ScriptInterpreterPythonTests/PythonDataObjectsTest.TestPythonDictionaryToStructuredDictionary (2093 of 2355) PASS: lldb-unit :: Utility/./UtilityTests/SubsystemRAIITest.SubsystemWithErrorSuccess (2094 of 2355) PASS: lldb-unit :: Utility/./UtilityTests/RegularExpression.Match (2095 of 2355) PASS: lldb-unit :: Utility/./UtilityTests/StreamTest.ShiftOperatorStrings (2096 of 2355) PASS: lldb-api :: functionalities/inferior-crashing/TestInferiorCrashing.py (2097 of 2355) PASS: lldb-api :: lang/objc/foundation/TestObjCMethodsNSArray.py (2098 of 2355) PASS: lldb-unit :: ScriptInterpreter/Python/./ScriptInterpreterPythonTests/PythonDataObjectsTest.TestPythonStringToStr (2099 of 2355) PASS: lldb-api :: commands/target/select/TestTargetSelect.py (2100 of 2355) PASS: lldb-api :: tools/lldb-server/register-reading/TestGdbRemoteGPacket.py (2101 of 2355) PASS: lldb-unit :: Utility/./UtilityTests/ScalarTest.APIntConstructor (2102 of 2355) PASS: lldb-unit :: Utility/./UtilityTests/ArchSpecTest.MergeFrom (2103 of 2355) PASS: lldb-api :: functionalities/data-formatter/data-formatter-stl/libcxx/unordered/TestDataFormatterUnordered.py (2104 of 2355) PASS: lldb-api :: functionalities/data-formatter/data-formatter-globals/TestDataFormatterGlobals.py (2105 of 2355) PASS: lldb-api :: lang/cpp/class_static/TestStaticVariables.py (2106 of 2355) PASS: lldb-unit :: Process/Utility/./ProcessUtilityTests/MemoryTagManagerAArch64MTETest.GetLogicalTag (2107 of 2355) PASS: lldb-unit :: Language/Highlighting/./HighlighterTests/HighlighterTest.ClangCursorPosInOtherToken (2108 of 2355) UNSUPPORTED: lldb-shell :: ScriptInterpreter/Lua/persistent_state.test (2109 of 2355) PASS: lldb-unit :: Utility/./UtilityTests/RangeTest.DefaultConstructor (2110 of 2355) UNSUPPORTED: lldb-api :: benchmarks/continue/TestBenchmarkContinue.py (2111 of 2355) PASS: lldb-api :: commands/process/attach/attach_denied/TestAttachDenied.py (2112 of 2355) PASS: lldb-unit :: Expression/./ExpressionTests/CppModuleConfigurationTest.LinuxLocalLibCpp (2113 of 2355) UNSUPPORTED: lldb-api :: tools/lldb-server/registers-target-xml-reading/TestGdbRemoteTargetXmlPacket.py (2114 of 2355) PASS: lldb-api :: lang/objc/foundation/TestObjCMethods.py (2115 of 2355) PASS: lldb-api :: lang/cpp/template/TestTemplateArgs.py (2116 of 2355) PASS: lldb-unit :: DataFormatter/./LLDBFormatterTests/TypeMatcherTests.GetMatchStringExactName (2117 of 2355) PASS: lldb-api :: tools/lldb-server/commandline/TestGdbRemoteConnection.py (2118 of 2355) PASS: lldb-unit :: Language/Highlighting/./HighlighterTests/HighlighterTest.DefaultHighlighter (2119 of 2355) PASS: lldb-shell :: Commands/command-regex-delete.test (2120 of 2355) PASS: lldb-unit :: Target/./TargetTests/MemoryRegionInfoTest.Formatv (2121 of 2355) PASS: lldb-api :: commands/expression/call-function/TestCallStdStringFunction.py (2122 of 2355) PASS: lldb-api :: lang/c/stepping/TestStepAndBreakpoints.py (2123 of 2355) PASS: lldb-unit :: Process/gdb-remote/./ProcessGdbRemoteTests/GDBRemoteCommunicationClientTest.SendSignalsToIgnore (2124 of 2355) PASS: lldb-unit :: Utility/./UtilityTests/VMRange.IsValid (2125 of 2355) UNSUPPORTED: lldb-shell :: ScriptInterpreter/Lua/quit.test (2126 of 2355) PASS: lldb-unit :: Utility/./UtilityTests/StringListTest.SetSize (2127 of 2355) PASS: lldb-api :: lang/c/enum_types/TestEnumTypes.py (2128 of 2355) PASS: lldb-api :: functionalities/load_using_paths/TestLoadUsingPaths.py (2129 of 2355) PASS: lldb-api :: functionalities/breakpoint/auto_continue/TestBreakpointAutoContinue.py (2130 of 2355) PASS: lldb-api :: lang/objc/forward-decl/TestForwardDecl.py (2131 of 2355) PASS: lldb-unit :: Utility/./UtilityTests/StringExtractorTest.InitMisc (2132 of 2355) PASS: lldb-unit :: DataFormatter/./LLDBFormatterTests/FormatManagerTests.CompatibleLangs (2133 of 2355) PASS: lldb-unit :: Utility/./UtilityTests/RangeTest.SetRangeBase (2134 of 2355) PASS: lldb-unit :: Utility/./UtilityTests/StringExtractorTest.GetNameColonValueContainsColon (2135 of 2355) PASS: lldb-unit :: Expression/./ExpressionTests/DiagnosticManagerTest.AppendMessageAttachToLastDiag (2136 of 2355) PASS: lldb-api :: lang/c/modules/TestCModules.py (2137 of 2355) PASS: lldb-shell :: Minidump/no-process-id.yaml (2138 of 2355) PASS: lldb-api :: commands/expression/import-std-module/weak_ptr-dbg-info-content/TestDbgInfoContentWeakPtrFromStdModule.py (2139 of 2355) PASS: lldb-api :: commands/expression/import-std-module/shared_ptr/TestSharedPtrFromStdModule.py (2140 of 2355) PASS: lldb-shell :: Driver/TestNoUseColor.test (2141 of 2355) PASS: lldb-shell :: SymbolFile/Breakpad/symtab.test (2142 of 2355) PASS: lldb-unit :: Interpreter/./InterpreterTests/CompletionTest.DirCompletionAbsolute (2143 of 2355) PASS: lldb-shell :: SymbolFile/DWARF/x86/debug-types-dwo-cross-reference.cpp (2144 of 2355) PASS: lldb-unit :: Utility/./UtilityTests/ArgsTest.TestOverwriteArgs (2145 of 2355) PASS: lldb-unit :: Utility/./UtilityTests/RangeDataVector.FindEntryIndexesThatContain (2146 of 2355) PASS: lldb-api :: functionalities/data-formatter/data-formatter-objc/TestDataFormatterObjCExpr.py (2147 of 2355) PASS: lldb-unit :: Utility/./UtilityTests/DataExtractorTest.GetFloatUnaligned (2148 of 2355) PASS: lldb-unit :: Utility/./UtilityTests/ConstStringTest.NullAndEmptyStates (2149 of 2355) PASS: lldb-shell :: ObjectFile/PDB/object.test (2150 of 2355) PASS: lldb-api :: functionalities/data-formatter/nssetsynth/TestNSSetSynthetic.py (2151 of 2355) UNSUPPORTED: lldb-api :: tools/intel-features/intel-pt/test/TestIntelPTSimpleBinary.py (2152 of 2355) XFAIL: lldb-shell :: Register/x86-mm-xmm-read.test (2153 of 2355) PASS: lldb-api :: lang/objc/modules-hash-mismatch/TestClangModulesHashMismatch.py (2154 of 2355) PASS: lldb-unit :: Utility/./UtilityTests/StreamTeeTest.AppendStream (2155 of 2355) PASS: lldb-api :: tools/lldb-server/commandline/TestStubSetSID.py (2156 of 2355) PASS: lldb-api :: functionalities/abbreviation/TestAbbreviations.py (2157 of 2355) PASS: lldb-unit :: Utility/./UtilityTests/CompletionRequest.DuplicateFilteringWithComments (2158 of 2355) PASS: lldb-unit :: Expression/./ExpressionTests/DWARFExpression.DW_OP_pick (2159 of 2355) UNSUPPORTED: lldb-api :: linux/aarch64/mte_tag_read/TestAArch64LinuxMTEMemoryTagRead.py (2160 of 2355) PASS: lldb-shell :: Settings/TestDisassemblyFormat.test (2161 of 2355) PASS: lldb-unit :: Process/minidump/./LLDBMinidumpTests/MinidumpParserTest.MinidumpDuplicateModuleMinAddress (2162 of 2355) PASS: lldb-api :: functionalities/breakpoint/objc/TestObjCBreakpoints.py (2163 of 2355) PASS: lldb-unit :: Utility/./UtilityTests/StreamTest.PutRawBytesToLittleEndian (2164 of 2355) PASS: lldb-unit :: Expression/./ExpressionTests/DWARFExpression.DW_OP_unknown (2165 of 2355) PASS: lldb-api :: functionalities/data-formatter/data-formatter-named-summaries/TestDataFormatterNamedSummaries.py (2166 of 2355) PASS: lldb-api :: commands/expression/options/TestExprOptions.py (2167 of 2355) PASS: lldb-shell :: Breakpoint/split-dwarf-5-addrbase.test (2168 of 2355) PASS: lldb-api :: lang/c/find_struct_type/TestFindStructTypes.py (2169 of 2355) PASS: lldb-unit :: ScriptInterpreter/Python/./ScriptInterpreterPythonTests/PythonDataObjectsTest.TestPythonString (2170 of 2355) PASS: lldb-api :: python_api/value/change_values/TestChangeValueAPI.py (2171 of 2355) PASS: lldb-api :: tools/lldb-server/TestLldbGdbServer.py (2172 of 2355) PASS: lldb-shell :: SymbolFile/DWARF/x86/DW_OP_piece-smaller-than-struct.s (2173 of 2355) PASS: lldb-unit :: Utility/./UtilityTests/StringExtractorTest.GetHexBytesAvail_OddPair (2174 of 2355) PASS: lldb-unit :: Utility/./UtilityTests/ScalarTest.Equality (2175 of 2355) PASS: lldb-unit :: Utility/./UtilityTests/RangeTest.LessThanInvalid (2176 of 2355) PASS: lldb-unit :: UnwindAssembly/x86/./UnwindAssemblyx86Tests/Testx86AssemblyInspectionEngine.Test32BitOnlyInstruction (2177 of 2355) XFAIL: lldb-shell :: Unwind/prefer-debug-over-eh-frame.test (2178 of 2355) PASS: lldb-api :: lang/objc/objc-dyn-sbtype/TestObjCDynamicSBType.py (2179 of 2355) PASS: lldb-shell :: Quit/TestQuitExitCodeImplicit0.test (2180 of 2355) PASS: lldb-api :: functionalities/breakpoint/cpp/TestCPPBreakpointLocations.py (2181 of 2355) PASS: lldb-unit :: SymbolFile/NativePDB/./SymbolFileNativePDBTests/PDBFPOProgramToDWARFExpressionTests.UnresolvedCyclicRegisterAssignmentReference (2182 of 2355) PASS: lldb-shell :: ObjectFile/ELF/PT_LOAD-overlap-section.yaml (2183 of 2355) PASS: lldb-api :: commands/watchpoints/step_over_watchpoint/TestStepOverWatchpoint.py (2184 of 2355) PASS: lldb-api :: commands/expression/invalid-args/TestInvalidArgsExpression.py (2185 of 2355) PASS: lldb-api :: functionalities/memory/read/TestMemoryRead.py (2186 of 2355) PASS: lldb-api :: commands/quit/TestQuit.py (2187 of 2355) PASS: lldb-unit :: Utility/./UtilityTests/UriParserTest.BracketedHostnameWithPortIPv4 (2188 of 2355) PASS: lldb-api :: functionalities/thread/num_threads/TestNumThreads.py (2189 of 2355) PASS: lldb-api :: functionalities/thread/backtrace_limit/TestBacktraceLimit.py (2190 of 2355) PASS: lldb-unit :: Utility/./UtilityTests/OptionsWithRawTest.ArgsButNoDelimiter (2191 of 2355) UNSUPPORTED: lldb-api :: commands/gui/basic/TestGuiBasic.py (2192 of 2355) PASS: lldb-unit :: Process/gdb-remote/./ProcessGdbRemoteTests/GDBRemoteCommunicationClientTest.GetModulesInfo_UUID20 (2193 of 2355) PASS: lldb-unit :: Utility/./UtilityTests/ArgsTest.TestUnknownEscape (2194 of 2355) PASS: lldb-shell :: SymbolFile/DWARF/x86/dwarf5-debug_line-file-index.s (2195 of 2355) PASS: lldb-shell :: Breakpoint/debug_addrx.test (2196 of 2355) PASS: lldb-shell :: Commands/CommandScriptImmediateOutput/CommandScriptImmediateOutputFile.test (2197 of 2355) UNSUPPORTED: lldb-shell :: SymbolFile/NativePDB/typedefs.cpp (2198 of 2355) PASS: lldb-api :: functionalities/find-line-entry/TestFindLineEntry.py (2199 of 2355) PASS: lldb-shell :: Reproducer/TestDiscard.test (2200 of 2355) PASS: lldb-shell :: Reproducer/TestDebugSymbols.test (2201 of 2355) UNSUPPORTED: lldb-api :: linux/aarch64/mte_memory_region/TestAArch64LinuxMTEMemoryRegion.py (2202 of 2355) PASS: lldb-shell :: SymbolFile/DWARF/x86/DW_OP_piece-struct.s (2203 of 2355) PASS: lldb-shell :: Reproducer/Functionalities/TestDataFormatter.test (2204 of 2355) PASS: lldb-api :: lang/objc/objc-ivar-protocols/TestIvarProtocols.py (2205 of 2355) PASS: lldb-shell :: Commands/command-script-import.test (2206 of 2355) PASS: lldb-unit :: Utility/./UtilityTests/RangeTest.NotEqualInvalid (2207 of 2355) PASS: lldb-unit :: Expression/./ExpressionTests/DiagnosticManagerTest.HasFixits (2208 of 2355) PASS: lldb-unit :: Utility/./UtilityTests/StringListTest.ShiftCString (2209 of 2355) PASS: lldb-api :: commands/expression/argument_passing_restrictions/TestArgumentPassingRestrictions.py (2210 of 2355) PASS: lldb-api :: functionalities/gdb_remote_client/TestRecognizeBreakpoint.py (2211 of 2355) UNSUPPORTED: lldb-shell :: Register/x86-db-read.test (2212 of 2355) PASS: lldb-unit :: Utility/./UtilityTests/EnvironmentTest.EnvpConstruction (2213 of 2355) PASS: lldb-unit :: Utility/./UtilityTests/XcodeSDKTest.FindXcodeContentsDirectoryInPath (2214 of 2355) PASS: lldb-api :: commands/expression/top-level/TestTopLevelExprs.py (2215 of 2355) PASS: lldb-api :: commands/expression/persist_objc_pointeetype/TestPersistObjCPointeeType.py (2216 of 2355) PASS: lldb-api :: commands/log/basic/TestLogging.py (2217 of 2355) PASS: lldb-api :: macosx/lc-note/kern-ver-str/TestKernVerStrLCNOTE.py (2218 of 2355) PASS: lldb-unit :: Utility/./UtilityTests/ArgsTest.TestTrailingBackslash (2219 of 2355) PASS: lldb-unit :: Utility/./UtilityTests/OptionsWithRawTest.EmptySuffix (2220 of 2355) PASS: lldb-api :: lang/objc/modules-objc-property/TestModulesObjCProperty.py (2221 of 2355) PASS: lldb-api :: python_api/value_var_update/TestValueVarUpdate.py (2222 of 2355) PASS: lldb-shell :: Commands/command-target-modules-dump-sections.yaml (2223 of 2355) PASS: lldb-api :: functionalities/breakpoint/breakpoint_ignore_count/TestBreakpointIgnoreCount.py (2224 of 2355) PASS: lldb-unit :: Utility/./UtilityTests/StreamTest.PutNHex8 (2225 of 2355) UNSUPPORTED: lldb-api :: functionalities/data-formatter/data-formatter-stl/libstdcpp/vector/TestDataFormatterStdVector.py (2226 of 2355) PASS: lldb-api :: functionalities/return-value/TestReturnValue.py (2227 of 2355) PASS: lldb-unit :: DataFormatter/./LLDBFormatterTests/TypeMatcherTests.GetMatchStringRegex (2228 of 2355) PASS: lldb-api :: functionalities/signal/TestSendSignal.py (2229 of 2355) UNSUPPORTED: lldb-api :: commands/watchpoints/multi_watchpoint_slots/TestWatchpointMultipleSlots.py (2230 of 2355) PASS: lldb-unit :: Host/./HostTests/SocketTests/SocketTest.UDPConnect/ipv6 (2231 of 2355) UNSUPPORTED: lldb-api :: benchmarks/startup/TestStartupDelays.py (2232 of 2355) PASS: lldb-api :: tools/lldb-vscode/coreFile/TestVSCode_coreFile.py (2233 of 2355) PASS: lldb-api :: lang/objc/objc-new-syntax/TestObjCNewSyntaxArray.py (2234 of 2355) PASS: lldb-api :: tools/lldb-vscode/console/TestVSCode_redirection_to_console.py (2235 of 2355) PASS: lldb-unit :: Process/minidump/./LLDBMinidumpTests/MinidumpParserTest.MinidumpDuplicateModuleMappedFirst (2236 of 2355) PASS: lldb-unit :: Utility/./UtilityTests/ConstStringTest.FromMidOfBufferStringRef (2237 of 2355) PASS: lldb-unit :: Utility/./UtilityTests/BinaryStreamTest.PutULEB128One (2238 of 2355) PASS: lldb-api :: commands/watchpoints/watchpoint_events/TestWatchpointEvents.py (2239 of 2355) PASS: lldb-shell :: SymbolFile/DWARF/x86/debug-line-basic.s (2240 of 2355) PASS: lldb-unit :: Process/gdb-remote/./ProcessGdbRemoteTests/GDBRemoteClientBaseTest.InterruptNoResponse (2241 of 2355) PASS: lldb-api :: functionalities/data-formatter/data-formatter-stl/libcxx/set/TestDataFormatterLibcxxSet.py (2242 of 2355) PASS: lldb-api :: functionalities/data-formatter/ptr_ref_typedef/TestPtrRef2Typedef.py (2243 of 2355) PASS: lldb-unit :: Host/./HostTests/HostInfoTestInitialization.InitTwice (2244 of 2355) PASS: lldb-shell :: SymbolFile/DWARF/x86/DW_AT_declaration-with-children.s (2245 of 2355) PASS: lldb-unit :: Signals/./SignalsTests/UnixSignalsTest.GetFilteredSignals (2246 of 2355) PASS: lldb-api :: functionalities/gdb_remote_client/TestTargetXMLArch.py (2247 of 2355) PASS: lldb-unit :: Utility/./UtilityTests/StringExtractorTest.GetU64BigEndian (2248 of 2355) PASS: lldb-shell :: Driver/TestRepl.test (2249 of 2355) PASS: lldb-api :: commands/expression/two-files/TestObjCTypeQueryFromOtherCompileUnit.py (2250 of 2355) PASS: lldb-shell :: ObjectFile/wasm/basic.yaml (2251 of 2355) PASS: lldb-api :: functionalities/data-formatter/synthupdate/TestSyntheticFilterRecompute.py (2252 of 2355) UNSUPPORTED: lldb-shell :: Register/x86-64-xmm16-write.test (2253 of 2355) PASS: lldb-api :: lang/c/record_decl_in_expr/TestRecordDeclInExpr.py (2254 of 2355) PASS: lldb-api :: lang/cpp/auto/TestCPPAuto.py (2255 of 2355) PASS: lldb-api :: functionalities/breakpoint/inlined_breakpoints/TestInlinedBreakpoints.py (2256 of 2355) PASS: lldb-unit :: Utility/./UtilityTests/CompletionRequest.TryCompleteCurrentArgMode (2257 of 2355) PASS: lldb-unit :: Interpreter/./InterpreterTests/OptionArgParserTest.toBoolean (2258 of 2355) PASS: lldb-shell :: SymbolFile/DWARF/x86/find-basic-type.cpp (2259 of 2355) PASS: lldb-shell :: ScriptInterpreter/Python/Crashlog/parser_json.test (2260 of 2355) PASS: lldb-shell :: Expr/TestIRMemoryMap.test (2261 of 2355) PASS: lldb-api :: functionalities/value_md5_crash/TestValueMD5Crash.py (2262 of 2355) PASS: lldb-api :: python_api/symbol-context/two-files/TestSymbolContextTwoFiles.py (2263 of 2355) PASS: lldb-unit :: Utility/./UtilityTests/ArgsTest.StringListConstructor (2264 of 2355) PASS: lldb-unit :: Utility/./UtilityTests/StringExtractorTest.DecodeHexU8_Exact (2265 of 2355) PASS: lldb-shell :: Settings/TestEchoCommands.test (2266 of 2355) UNSUPPORTED: lldb-api :: iohandler/unicode/TestUnicode.py (2267 of 2355) PASS: lldb-unit :: Core/./LLDBCoreTests/MangledTest.EmptyForInvalidRustV0Name (2268 of 2355) PASS: lldb-unit :: Utility/./UtilityTests/StringExtractorTest.GetHexU8_Underflow2_NoEof (2269 of 2355) PASS: lldb-api :: commands/expression/import-std-module/vector-bool/TestVectorBoolFromStdModule.py (2270 of 2355) PASS: lldb-unit :: Host/./HostTests/NativeProcessProtocolTest.SetBreakpointFailVerify (2271 of 2355) PASS: lldb-api :: lang/cpp/static_member_type_depending_on_parent_size/TestStaticMemberTypeDependingOnParentSize.py (2272 of 2355) PASS: lldb-api :: functionalities/gdb_remote_client/TestGDBRemoteClient.py (2273 of 2355) PASS: lldb-unit :: Utility/./UtilityTests/OptionsWithRawTest.WhitespaceSuffix (2274 of 2355) PASS: lldb-unit :: Utility/./UtilityTests/DataExtractorTest.GetSLEB128_bit63 (2275 of 2355) PASS: lldb-shell :: ObjectFile/Breakpad/sections-trailing-func.test (2276 of 2355) PASS: lldb-api :: commands/watchpoints/watchpoint_size/TestWatchpointSizes.py (2277 of 2355) PASS: lldb-unit :: Utility/./UtilityTests/SerializationRountripTest.SerializeDeserializeCStringArrayNullptr (2278 of 2355) PASS: lldb-shell :: Unwind/eh-frame-dwarf-unwind.test (2279 of 2355) UNSUPPORTED: lldb-api :: functionalities/tsan/multiple/TestTsanMultiple.py (2280 of 2355) PASS: lldb-unit :: Utility/./UtilityTests/BinaryStreamTest.PutSLEB128NineBytes (2281 of 2355) PASS: lldb-shell :: SymbolFile/DWARF/x86/apple-index-is-used.cpp (2282 of 2355) PASS: lldb-unit :: Utility/./UtilityTests/StringExtractorTest.GetHexU8_Underflow_NoEof (2283 of 2355) PASS: lldb-unit :: ObjectFile/Breakpad/./ObjectFileBreakpadTests/PublicRecord.parse (2284 of 2355) UNSUPPORTED: lldb-shell :: SymbolFile/DWARF/x86/DW_TAG_variable-DW_AT_decl_file-DW_AT_abstract_origin-crosscu1.s (2285 of 2355) PASS: lldb-api :: lang/cpp/elaborated-types/TestElaboratedTypes.py (2286 of 2355) PASS: lldb-api :: lang/objc/objc-new-syntax/TestObjCNewSyntaxDictionary.py (2287 of 2355) PASS: lldb-api :: commands/expression/import-std-module/deque-basic/TestDequeFromStdModule.py (2288 of 2355) PASS: lldb-unit :: Utility/./UtilityTests/LogChannelEnabledTest.LogVerboseThread (2289 of 2355) PASS: lldb-unit :: Host/./HostTests/SocketTests/SocketTest.TCPGetConnectURI/ipv4 (2290 of 2355) UNSUPPORTED: lldb-shell :: Register/x86-64-zmm-write.test (2291 of 2355) PASS: lldb-shell :: SymbolFile/DWARF/x86/inline-function-address.ll (2292 of 2355) PASS: lldb-api :: commands/expression/weak_symbols/TestWeakSymbols.py (2293 of 2355) PASS: lldb-shell :: Reproducer/TestRelativePath.test (2294 of 2355) PASS: lldb-shell :: SymbolFile/DWARF/x86/debug_loclists-dwo.s (2295 of 2355) PASS: lldb-unit :: Process/minidump/./LLDBMinidumpTests/MinidumpParserTest.GetPidWindows (2296 of 2355) PASS: lldb-unit :: Core/./LLDBCoreTests/CommunicationTest.SynchronizeWhileClosing (2297 of 2355) PASS: lldb-api :: macosx/nslog/TestDarwinNSLogOutput.py (2298 of 2355) PASS: lldb-unit :: Host/./HostTests/NativeProcessProtocolTest.SetBreakpointFailWrite (2299 of 2355) PASS: lldb-shell :: Register/Core/x86-32-netbsd-gp.test (2300 of 2355) PASS: lldb-unit :: Utility/./UtilityTests/StreamTest.QuotedCString (2301 of 2355) PASS: lldb-unit :: UnwindAssembly/x86/./UnwindAssemblyx86Tests/Testx86AssemblyInspectionEngine.TestStackRealign8BitDisp_i386 (2302 of 2355) PASS: lldb-api :: lang/cpp/nested-class-other-compilation-unit/TestNestedClassWithParentInAnotherCU.py (2303 of 2355) PASS: lldb-api :: lang/cpp/dynamic-value/TestDynamicValue.py (2304 of 2355) PASS: lldb-unit :: Utility/./UtilityTests/StreamTest.ShiftOperatorPtr (2305 of 2355) UNSUPPORTED: lldb-api :: benchmarks/expression/TestRepeatedExprs.py (2306 of 2355) PASS: lldb-unit :: UnwindAssembly/x86/./UnwindAssemblyx86Tests/Testx86AssemblyInspectionEngine.TestPushRBX (2307 of 2355) PASS: lldb-api :: functionalities/gdb_remote_client/TestGDBRemoteDiskFileCompletion.py (2308 of 2355) PASS: lldb-unit :: Utility/./UtilityTests/UriParserTest.Minimal (2309 of 2355) PASS: lldb-unit :: Symbol/./SymbolTests/TestClangASTImporter.MetadataPropagationIndirectImport (2310 of 2355) PASS: lldb-unit :: Target/./TargetTests/PathMappingListTest.CrossPlatformTests (2311 of 2355) PASS: lldb-unit :: Utility/./UtilityTests/StringExtractorTest.DecodeHexU8_Underflow (2312 of 2355) PASS: lldb-unit :: Core/./LLDBCoreTests/SourceLocationSpecTest.FileLineColumnComponents (2313 of 2355) PASS: lldb-shell :: Commands/command-backtrace-parser-2.test (2314 of 2355) UNSUPPORTED: lldb-shell :: SymbolFile/NativePDB/local-variables.cpp (2315 of 2355) PASS: lldb-shell :: SymbolFile/DWARF/x86/dwarf5-index-is-used.cpp (2316 of 2355) PASS: lldb-unit :: ObjectFile/Breakpad/./ObjectFileBreakpadTests/ModuleRecord.parse (2317 of 2355) PASS: lldb-shell :: SymbolFile/DWARF/x86/debug-types-missing-signature.test (2318 of 2355) PASS: lldb-unit :: Symbol/./SymbolTests/TestTypeSystemClang.GetExeModuleWhenMissingSymbolFile (2319 of 2355) PASS: lldb-api :: commands/watchpoints/watchpoint_count/TestWatchpointCount.py (2320 of 2355) PASS: lldb-unit :: Language/Highlighting/./HighlighterTests/HighlighterTest.ClangScalarLiterals (2321 of 2355) PASS: lldb-unit :: Utility/./UtilityTests/RecordReplayTest.InvalidSequence (2322 of 2355) PASS: lldb-unit :: Utility/./UtilityTests/ArgsTest.GetShellSafeArgument (2323 of 2355) PASS: lldb-unit :: Symbol/./SymbolTests/TestTypeSystemClang.TestNotDeletingUserCopyCstrDueToMoveCStr (2324 of 2355) PASS: lldb-shell :: SymbolFile/DWARF/x86/debug_rnglists-dwo.s (2325 of 2355) PASS: lldb-unit :: Host/./HostTests/SocketTests/SocketTest.DecodeHostAndPort/ipv6 (2326 of 2355) PASS: lldb-unit :: Utility/./UtilityTests/RecordReplayTest.ValidSequence (2327 of 2355) PASS: lldb-unit :: Utility/./UtilityTests/XcodeSDKTest.GetSDKTypeForTriple (2328 of 2355) PASS: lldb-api :: commands/disassemble/basic/TestFrameDisassemble.py (2329 of 2355) UNSUPPORTED: lldb-api :: functionalities/tsan/thread_numbers/TestTsanThreadNumbers.py (2330 of 2355) PASS: lldb-shell :: Driver/LocalLLDBInit.test (2331 of 2355) PASS: lldb-unit :: Utility/./UtilityTests/VMRange.SetEndAddress (2332 of 2355) PASS: lldb-unit :: Utility/./UtilityTests/ArgsTest.ReplaceArgumentAtIndexOutOfRange (2333 of 2355) PASS: lldb-unit :: Utility/./UtilityTests/StreamTest.PutCStringWithStringRef (2334 of 2355) PASS: lldb-unit :: Process/gdb-remote/./ProcessGdbRemoteTests/GDBRemoteCommunicationClientTest.GetMemoryRegionInfoInvalidResponse (2335 of 2355) PASS: lldb-unit :: Utility/./UtilityTests/UserIDResolver.GetUserName (2336 of 2355) PASS: lldb-shell :: Minidump/memory-region.yaml (2337 of 2355) PASS: lldb-unit :: Utility/./UtilityTests/StringExtractorTest.GetNameColonValueSuccess (2338 of 2355) PASS: lldb-unit :: Process/Utility/./ProcessUtilityTests/ProcMapTests/LinuxProcMapsTestFixture.ParseMapRegions/6 (2339 of 2355) PASS: lldb-shell :: SymbolFile/symbol-binding.test (2340 of 2355) PASS: lldb-api :: types/TestFloatTypesExpr.py (2341 of 2355) PASS: lldb-unit :: Utility/./UtilityTests/ArgsTest.TestSingleArg (2342 of 2355) PASS: lldb-api :: functionalities/thread/concurrent_events/TestConcurrentBreakpointOneDelayBreakpointThreads.py (2343 of 2355) PASS: lldb-shell :: Register/Core/x86-32-freebsd-addr.test (2344 of 2355) PASS: lldb-api :: functionalities/thread_plan/TestThreadPlanCommands.py (2345 of 2355) PASS: lldb-api :: python_api/sbenvironment/TestSBEnvironment.py (2346 of 2355) PASS: lldb-unit :: Host/./HostTests/FileSystemTest.GetPermissions (2347 of 2355) PASS: lldb-api :: commands/expression/namespace_local_var_same_name_cpp_and_c/TestNamespaceLocalVarSameNameCppAndC.py (2348 of 2355) PASS: lldb-unit :: Process/gdb-remote/./ProcessGdbRemoteTests/GDBRemoteCommunicationClientTest.SaveRestoreRegistersNoSuffix (2349 of 2355) PASS: lldb-api :: lang/c/function_types/TestFunctionTypes.py (2350 of 2355) PASS: lldb-unit :: Utility/./UtilityTests/NameMatchesTest.RegularExpression (2351 of 2355) PASS: lldb-unit :: Utility/./UtilityTests/FileSpecTest.FormatFileSpec (2352 of 2355) PASS: lldb-unit :: Process/Utility/./ProcessUtilityTests/RegisterContext_x86Test.AbridgedToFullTagWord (2353 of 2355) PASS: lldb-api :: functionalities/breakpoint/breakpoint_language/TestBreakpointLanguage.py (2354 of 2355) PASS: lldb-api :: lang/mixed/TestMixedLanguages.py (2355 of 2355) Slowest Tests: -------------------------------------------------------------------------- 262.94s: lldb-api :: tools/lldb-server/TestLldbGdbServer.py 136.56s: lldb-api :: functionalities/memory-region/TestMemoryRegion.py 129.42s: lldb-api :: api/multithreaded/TestMultithreaded.py 111.97s: lldb-api :: macosx/skinny-corefile/TestSkinnyCorefile.py 91.31s: lldb-api :: functionalities/gdb_remote_client/TestWasm.py 84.22s: lldb-api :: types/TestLongTypesExpr.py 72.97s: lldb-api :: lang/objc/exceptions/TestObjCExceptions.py 69.90s: lldb-api :: commands/expression/import-std-module/queue/TestQueueFromStdModule.py 65.77s: lldb-api :: commands/expression/import-std-module/stack/TestStackFromStdModule.py 64.70s: lldb-api :: lang/cpp/namespace/TestNamespaceLookup.py 63.72s: lldb-api :: lang/objc/hidden-ivars/TestHiddenIvars.py 63.52s: lldb-api :: lang/objc/objc-new-syntax/TestObjCNewSyntaxLiteral.py 56.90s: lldb-api :: commands/expression/import-std-module/vector/TestVectorFromStdModule.py 55.48s: lldb-api :: lang/objc/foundation/TestObjCMethods.py 50.60s: lldb-api :: commands/expression/import-std-module/deque-basic/TestDequeFromStdModule.py 50.22s: lldb-api :: tools/lldb-server/TestGdbRemoteThreadsInStopReply.py 49.97s: lldb-api :: types/TestIntegerTypeExpr.py 48.70s: lldb-api :: python_api/target/TestTargetAPI.py 48.26s: lldb-api :: lang/objc/objc-new-syntax/TestObjCNewSyntaxDictionary.py 48.07s: lldb-api :: lang/objc/modules/TestObjCModules.py

Hide Details

Tests Times: -------------------------------------------------------------------------- [ Range ] :: [ Percentage ] :: [ Count ] -------------------------------------------------------------------------- [260s,280s) :: [ ] :: [ 1/2355] [240s,260s) :: [ ] :: [ 0/2355] [220s,240s) :: [ ] :: [ 0/2355] [200s,220s) :: [ ] :: [ 0/2355] [180s,200s) :: [ ] :: [ 0/2355] [160s,180s) :: [ ] :: [ 0/2355] [140s,160s) :: [ ] :: [ 1/2355] [120s,140s) :: [ ] :: [ 1/2355] [100s,120s) :: [ ] :: [ 1/2355] [ 80s,100s) :: [ ] :: [ 2/2355] [ 60s, 80s) :: [ ] :: [ 7/2355] [ 40s, 60s) :: [ ] :: [ 18/2355] [ 20s, 40s) :: [* ] :: [ 69/2355] [ 0s, 20s) :: [************************************** ] :: [2255/2355] -------------------------------------------------------------------------- ******************** Failed Tests (3): lldb-api :: tools/lldb-vscode/breakpoint/TestVSCode_setBreakpoints.py lldb-api :: tools/lldb-vscode/breakpoint/TestVSCode_setFunctionBreakpoints.py lldb-api :: tools/lldb-vscode/evaluate/TestVSCode_evaluate.py

Hide Details

Hide Details

Testing Time: 2400.43s Unsupported : 212 Passed : 2130 Expectedly Failed: 10 Failed : 3 FAILED: tools/lldb/test/CMakeFiles/check-lldb cd /Users/buildslave/jenkins/workspace/lldb-cmake-sanitized/lldb-build/tools/lldb/test && /usr/local/Frameworks/Python.framework/Versions/3.7/bin/python3.7 /Users/buildslave/jenkins/workspace/lldb-cmake-sanitized/lldb-build/./bin/llvm-lit -v --time-tests --shuffle --xunit-xml-output=/Users/buildslave/jenkins/workspace/lldb-cmake-sanitized/test/results.xml -v -j 4 --timeout 1200 /Users/buildslave/jenkins/workspace/lldb-cmake-sanitized/lldb-build/tools/lldb/test ninja: build stopped: subcommand failed. Command failed: Command '['/usr/bin/env', 'TERM=vt100', '/usr/local/bin/ninja', '-v', 'check-lldb']' returned non-zero exit status 1. Command: ['/usr/bin/env', 'TERM=vt100', '/usr/local/bin/ninja', '-v', 'check-lldb'] [Pipeline] } [Pipeline] // timeout [Pipeline] } [Pipeline] // stage [Pipeline] stage [Pipeline] { (Declarative: Post Actions) [Pipeline] scanForIssues [Clang (LLVM based)] Sleeping for 5 seconds due to JENKINS-32191... [Clang (LLVM based)] Parsing console log (workspace: '/Users/buildslave/jenkins/workspace/lldb-cmake-sanitized') [Clang (LLVM based)] Successfully parsed console log [Clang (LLVM based)] -> found 5 issues (skipped 3 duplicates) [Clang (LLVM based)] [-ERROR-] Can't create fingerprints for some files: [Clang (LLVM based)] [-ERROR-] - '/Users/buildslave/jenkins/workspace/lldb-cmake-sanitized/lldb-build/{"body":{"category":"console","output":"/Users/buildslave/jenkins/workspace/lldb-cmake-sanitized/llvm-project/lldb/tools/lldb-vscode/ProgressEvent.cpp', IO exception has been thrown: java.nio.file.NoSuchFileException: /Users/buildslave/jenkins/workspace/lldb-cmake-sanitized/lldb-build/{"body":{"category":"console","output":"/Users/buildslave/jenkins/workspace/lldb-cmake-sanitized/llvm-project/lldb/tools/lldb-vscode/ProgressEvent.cpp [Clang (LLVM based)] [-ERROR-] - '/Users/buildslave/jenkins/workspace/lldb-cmake-sanitized/lldb-build/{"body":{"category":"console","output":"/Users/buildslave/jenkins/workspace/lldb-cmake-sanitized/llvm-project/lldb/tools/lldb-vscode/ProgressEvent.cpp', IO exception has been thrown: java.nio.file.NoSuchFileException: /Users/buildslave/jenkins/workspace/lldb-cmake-sanitized/lldb-build/{"body":{"category":"console","output":"/Users/buildslave/jenkins/workspace/lldb-cmake-sanitized/llvm-project/lldb/tools/lldb-vscode/ProgressEvent.cpp [Clang (LLVM based)] Post processing issues on 'green-dragon-23' with source code encoding 'UTF-8' [Clang (LLVM based)] Creating SCM blamer to obtain author and commit information for affected files [Clang (LLVM based)] -> No blamer installed yet. You need to install the 'git-forensics' plugin to enable blaming for Git. [Clang (LLVM based)] Resolving file names for all issues in source directory '/Users/buildslave/jenkins/workspace/lldb-cmake-sanitized' [Clang (LLVM based)] -> resolved paths in source directory (3 found, 1 not found) [Clang (LLVM based)] Resolving module names from module definitions (build.xml, pom.xml, or Manifest.mf files) [Clang (LLVM based)] -> resolved module names for 5 issues [Clang (LLVM based)] Resolving package names (or namespaces) by parsing the affected files [Clang (LLVM based)] -> resolved package names of 4 affected files [Clang (LLVM based)] No filter has been set, publishing all 5 issues [Clang (LLVM based)] Creating fingerprints for all affected code blocks to track issues over different builds [Clang (LLVM based)] -> created fingerprints for 3 issues (skipped 2 issues) [Clang (LLVM based)] Copying affected files to Jenkins' build folder '/Users/Shared/Jenkins/Home/jobs/lldb-cmake-sanitized/builds/1907/files-with-issues' [Clang (LLVM based)] -> 3 copied, 0 not in workspace, 2 not-found, 0 with I/O error [Clang (LLVM based)] Repository miner is not configured, skipping repository mining [Pipeline] junit Recording test results [Checks API] No suitable checks publisher found. [Pipeline] } [Pipeline] // stage [Pipeline] } [Pipeline] // withEnv [Pipeline] } [Pipeline] // node [Pipeline] End of Pipeline ERROR: script returned exit code 1 Finished: FAILURE