Console Output

Skipping 9,565 KB.. Full Log
<-- 
Content-Length: 119

Hide Details

{"body":{},"command":"evaluate","message":"error: No value","request_seq":91,"seq":0,"success":false,"type":"response"} --> Content-Length: 109

Hide Details

{"command":"stackTrace","type":"request","arguments":{"threadId":8491866,"startFrame":0,"levels":1},"seq":92} <-- Content-Length: 342

Hide Details

{"body":{"stackFrames":[{"column":10,"id":524288,"line":11,"name":"a_function(int)","source":{"name":"main.cpp","path":"/Users/buildslave/jenkins/workspace/lldb-cmake-sanitized/llvm-project/lldb/test/API/tools/lldb-vscode/evaluate/main.cpp"}}],"totalFrames":3},"command":"stackTrace","request_seq":92,"seq":0,"success":true,"type":"response"} --> Content-Length: 120

Hide Details

{"command":"evaluate","type":"request","arguments":{"expression":"foo_var","context":"hover","frameId":524288},"seq":93} <-- Content-Length: 119

Hide Details

{"body":{},"command":"evaluate","message":"error: No value","request_seq":93,"seq":0,"success":false,"type":"response"} --> Content-Length: 81

Hide Details

{"command":"continue","type":"request","arguments":{"threadId":8491866},"seq":94} <-- Content-Length: 116

Hide Details

{"body":{"allThreadsContinued":true},"command":"continue","request_seq":94,"seq":0,"success":true,"type":"response"} <-- Content-Length: 199

Hide Details

{"body":{"allThreadsStopped":true,"description":"breakpoint 4.1","preserveFocusHint":false,"reason":"breakpoint","threadCausedFocus":true,"threadId":8491866},"event":"stopped","seq":0,"type":"event"} --> Content-Length: 62

Hide Details

{"command":"threads","type":"request","arguments":{},"seq":95} <-- Content-Length: 134

Hide Details

{"body":{"threads":[{"id":8491866,"name":"Thread #1"}]},"command":"threads","request_seq":95,"seq":0,"success":true,"type":"response"} --> Content-Length: 109

Hide Details

{"command":"stackTrace","type":"request","arguments":{"threadId":8491866,"startFrame":0,"levels":1},"seq":96} <-- Content-Length: 331

Hide Details

{"body":{"stackFrames":[{"column":20,"id":524288,"line":35,"name":"main","source":{"name":"main.cpp","path":"/Users/buildslave/jenkins/workspace/lldb-cmake-sanitized/llvm-project/lldb/test/API/tools/lldb-vscode/evaluate/main.cpp"}}],"totalFrames":2},"command":"stackTrace","request_seq":96,"seq":0,"success":true,"type":"response"} --> Content-Length: 119

Hide Details

{"command":"evaluate","type":"request","arguments":{"expression":"my_vec","context":"hover","frameId":524288},"seq":97} <-- Content-Length: 179

Hide Details

{"body":{"result":" size=2","type":"std::vector<int, std::allocator<int> >","variablesReference":6},"command":"evaluate","request_seq":97,"seq":0,"success":true,"type":"response"} --> Content-Length: 81

Hide Details

{"command":"continue","type":"request","arguments":{"threadId":8491866},"seq":98} <-- Content-Length: 116

Hide Details

{"body":{"allThreadsContinued":true},"command":"continue","request_seq":98,"seq":0,"success":true,"type":"response"} <-- Content-Length: 199

Hide Details

{"body":{"allThreadsStopped":true,"description":"breakpoint 5.1","preserveFocusHint":false,"reason":"breakpoint","threadCausedFocus":true,"threadId":8491866},"event":"stopped","seq":0,"type":"event"} --> Content-Length: 62

Hide Details

{"command":"threads","type":"request","arguments":{},"seq":99} <-- Content-Length: 134

Hide Details

{"body":{"threads":[{"id":8491866,"name":"Thread #1"}]},"command":"threads","request_seq":99,"seq":0,"success":true,"type":"response"} --> Content-Length: 110

Hide Details

{"command":"stackTrace","type":"request","arguments":{"threadId":8491866,"startFrame":0,"levels":1},"seq":100} <-- Content-Length: 332

Hide Details

{"body":{"stackFrames":[{"column":10,"id":524288,"line":40,"name":"main","source":{"name":"main.cpp","path":"/Users/buildslave/jenkins/workspace/lldb-cmake-sanitized/llvm-project/lldb/test/API/tools/lldb-vscode/evaluate/main.cpp"}}],"totalFrames":2},"command":"stackTrace","request_seq":100,"seq":0,"success":true,"type":"response"} --> Content-Length: 120

Hide Details

{"command":"evaluate","type":"request","arguments":{"expression":"my_vec","context":"hover","frameId":524288},"seq":101} <-- Content-Length: 180

Hide Details

{"body":{"result":" size=3","type":"std::vector<int, std::allocator<int> >","variablesReference":7},"command":"evaluate","request_seq":101,"seq":0,"success":true,"type":"response"} --> Content-Length: 110

Hide Details

{"command":"stackTrace","type":"request","arguments":{"threadId":8491866,"startFrame":0,"levels":1},"seq":102} <-- Content-Length: 332

Hide Details

{"body":{"stackFrames":[{"column":10,"id":524288,"line":40,"name":"main","source":{"name":"main.cpp","path":"/Users/buildslave/jenkins/workspace/lldb-cmake-sanitized/llvm-project/lldb/test/API/tools/lldb-vscode/evaluate/main.cpp"}}],"totalFrames":2},"command":"stackTrace","request_seq":102,"seq":0,"success":true,"type":"response"} --> Content-Length: 120

Hide Details

{"command":"evaluate","type":"request","arguments":{"expression":"my_map","context":"hover","frameId":524288},"seq":103} <-- Content-Length: 221

Hide Details

{"body":{"result":" size=2","type":"std::map<int, int, std::less<int>, std::allocator<std::pair<const int, int> > >","variablesReference":8},"command":"evaluate","request_seq":103,"seq":0,"success":true,"type":"response"} --> Content-Length: 82

Hide Details

{"command":"continue","type":"request","arguments":{"threadId":8491866},"seq":104} <-- Content-Length: 117

Hide Details

{"body":{"allThreadsContinued":true},"command":"continue","request_seq":104,"seq":0,"success":true,"type":"response"} <-- Content-Length: 199

Hide Details

{"body":{"allThreadsStopped":true,"description":"breakpoint 6.1","preserveFocusHint":false,"reason":"breakpoint","threadCausedFocus":true,"threadId":8491866},"event":"stopped","seq":0,"type":"event"} --> Content-Length: 63

Hide Details

{"command":"threads","type":"request","arguments":{},"seq":105} <-- Content-Length: 135

Hide Details

{"body":{"threads":[{"id":8491866,"name":"Thread #1"}]},"command":"threads","request_seq":105,"seq":0,"success":true,"type":"response"} --> Content-Length: 110

Hide Details

{"command":"stackTrace","type":"request","arguments":{"threadId":8491866,"startFrame":0,"levels":1},"seq":106} <-- Content-Length: 332

Hide Details

{"body":{"stackFrames":[{"column":25,"id":524288,"line":44,"name":"main","source":{"name":"main.cpp","path":"/Users/buildslave/jenkins/workspace/lldb-cmake-sanitized/llvm-project/lldb/test/API/tools/lldb-vscode/evaluate/main.cpp"}}],"totalFrames":2},"command":"stackTrace","request_seq":106,"seq":0,"success":true,"type":"response"} --> Content-Length: 120

Hide Details

{"command":"evaluate","type":"request","arguments":{"expression":"my_map","context":"hover","frameId":524288},"seq":107} <-- Content-Length: 221

Hide Details

{"body":{"result":" size=3","type":"std::map<int, int, std::less<int>, std::allocator<std::pair<const int, int> > >","variablesReference":9},"command":"evaluate","request_seq":107,"seq":0,"success":true,"type":"response"} --> Content-Length: 110

Hide Details

{"command":"stackTrace","type":"request","arguments":{"threadId":8491866,"startFrame":0,"levels":1},"seq":108} <-- Content-Length: 332

Hide Details

{"body":{"stackFrames":[{"column":25,"id":524288,"line":44,"name":"main","source":{"name":"main.cpp","path":"/Users/buildslave/jenkins/workspace/lldb-cmake-sanitized/llvm-project/lldb/test/API/tools/lldb-vscode/evaluate/main.cpp"}}],"totalFrames":2},"command":"stackTrace","request_seq":108,"seq":0,"success":true,"type":"response"} --> Content-Length: 125

Hide Details

{"command":"evaluate","type":"request","arguments":{"expression":"my_bool_vec","context":"hover","frameId":524288},"seq":109} <-- Content-Length: 183

Hide Details

{"body":{"result":" size=1","type":"std::vector<bool, std::allocator<bool> >","variablesReference":10},"command":"evaluate","request_seq":109,"seq":0,"success":true,"type":"response"} --> Content-Length: 82

Hide Details

{"command":"continue","type":"request","arguments":{"threadId":8491866},"seq":110} <-- Content-Length: 117

Hide Details

{"body":{"allThreadsContinued":true},"command":"continue","request_seq":110,"seq":0,"success":true,"type":"response"} <-- Content-Length: 199

Hide Details

{"body":{"allThreadsStopped":true,"description":"breakpoint 7.1","preserveFocusHint":false,"reason":"breakpoint","threadCausedFocus":true,"threadId":8491866},"event":"stopped","seq":0,"type":"event"} --> Content-Length: 63

Hide Details

{"command":"threads","type":"request","arguments":{},"seq":111} <-- Content-Length: 135

Hide Details

{"body":{"threads":[{"id":8491866,"name":"Thread #1"}]},"command":"threads","request_seq":111,"seq":0,"success":true,"type":"response"} --> Content-Length: 110

Hide Details

{"command":"stackTrace","type":"request","arguments":{"threadId":8491866,"startFrame":0,"levels":1},"seq":112} <-- Content-Length: 332

Hide Details

{"body":{"stackFrames":[{"column":25,"id":524288,"line":45,"name":"main","source":{"name":"main.cpp","path":"/Users/buildslave/jenkins/workspace/lldb-cmake-sanitized/llvm-project/lldb/test/API/tools/lldb-vscode/evaluate/main.cpp"}}],"totalFrames":2},"command":"stackTrace","request_seq":112,"seq":0,"success":true,"type":"response"} --> Content-Length: 125

Hide Details

{"command":"evaluate","type":"request","arguments":{"expression":"my_bool_vec","context":"hover","frameId":524288},"seq":113} <-- Content-Length: 183

Hide Details

{"body":{"result":" size=2","type":"std::vector<bool, std::allocator<bool> >","variablesReference":11},"command":"evaluate","request_seq":113,"seq":0,"success":true,"type":"response"} --> Content-Length: 90

Hide Details

{"command":"disconnect","type":"request","arguments":{"terminateDebuggee":true},"seq":114} <-- Content-Length: 45

Hide Details

{"event":"terminated","seq":0,"type":"event"} <-- Content-Length: 63

Hide Details

{"body":{"exitCode":9},"event":"exited","seq":0,"type":"event"} <-- Content-Length: 83

Hide Details

{"command":"disconnect","request_seq":114,"seq":0,"success":true,"type":"response"}

Hide Details

========= END ========= ========= DEBUG ADAPTER PROTOCOL LOGS ========= --> Content-Length: 284

Hide Details

{"command":"initialize","type":"request","arguments":{"adapterID":"lldb-native","clientID":"vscode","columnsStartAt1":true,"linesStartAt1":true,"locale":"en-us","pathFormat":"path","supportsRunInTerminalRequest":true,"supportsVariablePaging":true,"supportsVariableType":true},"seq":1} <-- Content-Length: 1222

Hide Details

{"body":{"exceptionBreakpointFilters":[{"default":false,"filter":"cpp_catch","label":"C++ Catch"},{"default":false,"filter":"cpp_throw","label":"C++ Throw"},{"default":false,"filter":"objc_catch","label":"Objective C Catch"},{"default":false,"filter":"objc_throw","label":"Objective C Throw"},{"default":false,"filter":"swift_catch","label":"Swift Catch"},{"default":false,"filter":"swift_throw","label":"Swift Throw"}],"supportTerminateDebuggee":true,"supportsCompletionsRequest":false,"supportsConditionalBreakpoints":true,"supportsConfigurationDoneRequest":true,"supportsDelayedStackTraceLoading":true,"supportsEvaluateForHovers":true,"supportsExceptionInfoRequest":true,"supportsExceptionOptions":true,"supportsFunctionBreakpoints":true,"supportsGotoTargetsRequest":false,"supportsHitConditionalBreakpoints":true,"supportsLoadedSourcesRequest":false,"supportsModulesRequest":false,"supportsProgressReporting":true,"supportsRestartFrame":false,"supportsRestartRequest":false,"supportsRunInTerminalRequest":true,"supportsSetVariable":true,"supportsStepBack":false,"supportsStepInTargetsRequest":false,"supportsValueFormattingOptions":true},"command":"initialize","request_seq":1,"seq":0,"success":true,"type":"response"} --> Content-Length: 1040

Hide Details

{"command":"launch","type":"request","arguments":{"program":"/Users/buildslave/jenkins/workspace/lldb-cmake-sanitized/lldb-build/lldb-test-build.noindex/tools/lldb-vscode/evaluate/TestVSCode_evaluate.test_repl_evaluate_expressions/a.out","disableASLR":true,"initCommands":["settings clear -all","settings set symbols.enable-external-lookup false","settings set target.inherit-tcc true","settings set target.detach-on-error false","settings set target.auto-apply-fixits false","settings set plugin.process.gdb-remote.packet-timeout 60","settings set symbols.clang-modules-cache-path \"/Users/buildslave/jenkins/workspace/lldb-cmake-sanitized/lldb-build/lldb-test-build.noindex/module-cache-lldb/lldb-api\"","settings set use-color false","setting set target.prefer-dynamic-value no-dynamic-values","settings set target.env-vars ASAN_OPTIONS=detect_stack_use_after_return=1 DYLD_INSERT_LIBRARIES=/Users/buildslave/jenkins/workspace/lldb-cmake-sanitized/host-compiler/lib/clang/13.0.99/lib/darwin/libclang_rt.asan_osx_dynamic.dylib"]},"seq":2} <-- Content-Length: 923

Hide Details

{"body":{"category":"console","output":"Running initCommands:\n(lldb) settings clear -all\n(lldb) settings set symbols.enable-external-lookup false\n(lldb) settings set target.inherit-tcc true\n(lldb) settings set target.detach-on-error false\n(lldb) settings set target.auto-apply-fixits false\n(lldb) settings set plugin.process.gdb-remote.packet-timeout 60\n(lldb) settings set symbols.clang-modules-cache-path \"/Users/buildslave/jenkins/workspace/lldb-cmake-sanitized/lldb-build/lldb-test-build.noindex/module-cache-lldb/lldb-api\"\n(lldb) settings set use-color false\n(lldb) setting set target.prefer-dynamic-value no-dynamic-values\n(lldb) settings set target.env-vars ASAN_OPTIONS=detect_stack_use_after_return=1 DYLD_INSERT_LIBRARIES=/Users/buildslave/jenkins/workspace/lldb-cmake-sanitized/host-compiler/lib/clang/13.0.99/lib/darwin/libclang_rt.asan_osx_dynamic.dylib\n"},"event":"output","seq":0,"type":"event"} <-- Content-Length: 77

Hide Details

{"command":"launch","request_seq":2,"seq":0,"success":true,"type":"response"} <-- Content-Length: 305

Hide Details

{"body":{"isLocalProcess":true,"name":"/Users/buildslave/jenkins/workspace/lldb-cmake-sanitized/lldb-build/lldb-test-build.noindex/tools/lldb-vscode/evaluate/TestVSCode_evaluate.test_repl_evaluate_expressions/a.out","startMethod":"launch","systemProcessId":68256},"event":"process","seq":0,"type":"event"} <-- Content-Length: 46

Hide Details

{"event":"initialized","seq":0,"type":"event"} --> Content-Length: 276

Hide Details

{"command":"setBreakpoints","type":"request","arguments":{"source":{"name":"main.cpp","path":"main.cpp"},"sourceModified":false,"lines":"[23, 27, 11, 35, 40, 44, 45]","breakpoints":[{"line":23},{"line":27},{"line":11},{"line":35},{"line":40},{"line":44},{"line":45}]},"seq":3} <-- Content-Length: 684

Hide Details

{"body":{"breakpoints":[{"id":1,"line":23,"source":{"name":"main.cpp","path":"main.cpp"},"verified":true},{"id":2,"line":27,"source":{"name":"main.cpp","path":"main.cpp"},"verified":true},{"id":3,"line":11,"source":{"name":"main.cpp","path":"main.cpp"},"verified":true},{"id":4,"line":35,"source":{"name":"main.cpp","path":"main.cpp"},"verified":true},{"id":5,"line":40,"source":{"name":"main.cpp","path":"main.cpp"},"verified":true},{"id":6,"line":44,"source":{"name":"main.cpp","path":"main.cpp"},"verified":true},{"id":7,"line":45,"source":{"name":"main.cpp","path":"main.cpp"},"verified":true}]},"command":"setBreakpoints","request_seq":3,"seq":0,"success":true,"type":"response"} --> Content-Length: 71

Hide Details

{"command":"configurationDone","type":"request","arguments":{},"seq":4} <-- Content-Length: 88

Hide Details

{"command":"configurationDone","request_seq":4,"seq":0,"success":true,"type":"response"} <-- Content-Length: 199

Hide Details

{"body":{"allThreadsStopped":true,"description":"breakpoint 1.1","preserveFocusHint":false,"reason":"breakpoint","threadCausedFocus":true,"threadId":8492281},"event":"stopped","seq":0,"type":"event"} --> Content-Length: 61

Hide Details

{"command":"threads","type":"request","arguments":{},"seq":5} <-- Content-Length: 133

Hide Details

{"body":{"threads":[{"id":8492281,"name":"Thread #1"}]},"command":"threads","request_seq":5,"seq":0,"success":true,"type":"response"} --> Content-Length: 108

Hide Details

{"command":"stackTrace","type":"request","arguments":{"threadId":8492281,"startFrame":0,"levels":1},"seq":6} <-- Content-Length: 330

Hide Details

{"body":{"stackFrames":[{"column":14,"id":524288,"line":23,"name":"main","source":{"name":"main.cpp","path":"/Users/buildslave/jenkins/workspace/lldb-cmake-sanitized/llvm-project/lldb/test/API/tools/lldb-vscode/evaluate/main.cpp"}}],"totalFrames":3},"command":"stackTrace","request_seq":6,"seq":0,"success":true,"type":"response"} --> Content-Length: 115

Hide Details

{"command":"evaluate","type":"request","arguments":{"expression":"var1","context":"repl","frameId":524288},"seq":7} <-- Content-Length: 138

Hide Details

{"body":{"result":"20","type":"int","variablesReference":0},"command":"evaluate","request_seq":7,"seq":0,"success":true,"type":"response"} --> Content-Length: 108

Hide Details

{"command":"stackTrace","type":"request","arguments":{"threadId":8492281,"startFrame":0,"levels":1},"seq":8} <-- Content-Length: 330

Hide Details

{"body":{"stackFrames":[{"column":14,"id":524288,"line":23,"name":"main","source":{"name":"main.cpp","path":"/Users/buildslave/jenkins/workspace/lldb-cmake-sanitized/llvm-project/lldb/test/API/tools/lldb-vscode/evaluate/main.cpp"}}],"totalFrames":3},"command":"stackTrace","request_seq":8,"seq":0,"success":true,"type":"response"} --> Content-Length: 115

Hide Details

{"command":"evaluate","type":"request","arguments":{"expression":"var2","context":"repl","frameId":524288},"seq":9} <-- Content-Length: 138

Hide Details

{"body":{"result":"21","type":"int","variablesReference":0},"command":"evaluate","request_seq":9,"seq":0,"success":true,"type":"response"} --> Content-Length: 109

Hide Details

{"command":"stackTrace","type":"request","arguments":{"threadId":8492281,"startFrame":0,"levels":1},"seq":10} <-- Content-Length: 331

Hide Details

{"body":{"stackFrames":[{"column":14,"id":524288,"line":23,"name":"main","source":{"name":"main.cpp","path":"/Users/buildslave/jenkins/workspace/lldb-cmake-sanitized/llvm-project/lldb/test/API/tools/lldb-vscode/evaluate/main.cpp"}}],"totalFrames":3},"command":"stackTrace","request_seq":10,"seq":0,"success":true,"type":"response"} --> Content-Length: 122

Hide Details

{"command":"evaluate","type":"request","arguments":{"expression":"static_int","context":"repl","frameId":524288},"seq":11} <-- Content-Length: 139

Hide Details

{"body":{"result":"42","type":"int","variablesReference":0},"command":"evaluate","request_seq":11,"seq":0,"success":true,"type":"response"} --> Content-Length: 109

Hide Details

{"command":"stackTrace","type":"request","arguments":{"threadId":8492281,"startFrame":0,"levels":1},"seq":12} <-- Content-Length: 331

Hide Details

{"body":{"stackFrames":[{"column":14,"id":524288,"line":23,"name":"main","source":{"name":"main.cpp","path":"/Users/buildslave/jenkins/workspace/lldb-cmake-sanitized/llvm-project/lldb/test/API/tools/lldb-vscode/evaluate/main.cpp"}}],"totalFrames":3},"command":"stackTrace","request_seq":12,"seq":0,"success":true,"type":"response"} --> Content-Length: 126

Hide Details

{"command":"evaluate","type":"request","arguments":{"expression":"non_static_int","context":"repl","frameId":524288},"seq":13} <-- Content-Length: 139

Hide Details

{"body":{"result":"43","type":"int","variablesReference":0},"command":"evaluate","request_seq":13,"seq":0,"success":true,"type":"response"} --> Content-Length: 109

Hide Details

{"command":"stackTrace","type":"request","arguments":{"threadId":8492281,"startFrame":0,"levels":1},"seq":14} <-- Content-Length: 331

Hide Details

{"body":{"stackFrames":[{"column":14,"id":524288,"line":23,"name":"main","source":{"name":"main.cpp","path":"/Users/buildslave/jenkins/workspace/lldb-cmake-sanitized/llvm-project/lldb/test/API/tools/lldb-vscode/evaluate/main.cpp"}}],"totalFrames":3},"command":"stackTrace","request_seq":14,"seq":0,"success":true,"type":"response"} --> Content-Length: 119

Hide Details

{"command":"evaluate","type":"request","arguments":{"expression":"struct1","context":"repl","frameId":524288},"seq":15} <-- Content-Length: 169

Hide Details

{"body":{"result":"my_struct @ 0x7ffeefbff7c8","type":"my_struct","variablesReference":4},"command":"evaluate","request_seq":15,"seq":0,"success":true,"type":"response"} --> Content-Length: 109

Hide Details

{"command":"stackTrace","type":"request","arguments":{"threadId":8492281,"startFrame":0,"levels":1},"seq":16} <-- Content-Length: 331

Hide Details

{"body":{"stackFrames":[{"column":14,"id":524288,"line":23,"name":"main","source":{"name":"main.cpp","path":"/Users/buildslave/jenkins/workspace/lldb-cmake-sanitized/llvm-project/lldb/test/API/tools/lldb-vscode/evaluate/main.cpp"}}],"totalFrames":3},"command":"stackTrace","request_seq":16,"seq":0,"success":true,"type":"response"} --> Content-Length: 123

Hide Details

{"command":"evaluate","type":"request","arguments":{"expression":"struct1.foo","context":"repl","frameId":524288},"seq":17} <-- Content-Length: 139

Hide Details

{"body":{"result":"15","type":"int","variablesReference":0},"command":"evaluate","request_seq":17,"seq":0,"success":true,"type":"response"} --> Content-Length: 109

Hide Details

{"command":"stackTrace","type":"request","arguments":{"threadId":8492281,"startFrame":0,"levels":1},"seq":18} <-- Content-Length: 331

Hide Details

{"body":{"stackFrames":[{"column":14,"id":524288,"line":23,"name":"main","source":{"name":"main.cpp","path":"/Users/buildslave/jenkins/workspace/lldb-cmake-sanitized/llvm-project/lldb/test/API/tools/lldb-vscode/evaluate/main.cpp"}}],"totalFrames":3},"command":"stackTrace","request_seq":18,"seq":0,"success":true,"type":"response"} --> Content-Length: 124

Hide Details

{"command":"evaluate","type":"request","arguments":{"expression":"struct2->foo","context":"repl","frameId":524288},"seq":19} <-- Content-Length: 139

Hide Details

{"body":{"result":"16","type":"int","variablesReference":0},"command":"evaluate","request_seq":19,"seq":0,"success":true,"type":"response"} --> Content-Length: 109

Hide Details

{"command":"stackTrace","type":"request","arguments":{"threadId":8492281,"startFrame":0,"levels":1},"seq":20} <-- Content-Length: 331

Hide Details

{"body":{"stackFrames":[{"column":14,"id":524288,"line":23,"name":"main","source":{"name":"main.cpp","path":"/Users/buildslave/jenkins/workspace/lldb-cmake-sanitized/llvm-project/lldb/test/API/tools/lldb-vscode/evaluate/main.cpp"}}],"totalFrames":3},"command":"stackTrace","request_seq":20,"seq":0,"success":true,"type":"response"} --> Content-Length: 115

Hide Details

{"command":"evaluate","type":"request","arguments":{"expression":"var","context":"repl","frameId":524288},"seq":21} <-- Content-Length: 311

Hide Details

{"body":{"category":"console","output":"/Users/buildslave/jenkins/workspace/lldb-cmake-sanitized/llvm-project/lldb/tools/lldb-vscode/ProgressEvent.cpp:89:64: runtime error: load of value 808464432, which is not a valid value for type 'lldb_vscode::ProgressEventType'\n"},"event":"output","seq":0,"type":"event"} <-- Content-Length: 261

Hide Details

{"body":{"category":"console","output":"SUMMARY: UndefinedBehaviorSanitizer: undefined-behavior /Users/buildslave/jenkins/workspace/lldb-cmake-sanitized/llvm-project/lldb/tools/lldb-vscode/ProgressEvent.cpp:89:64 in \n"},"event":"output","seq":0,"type":"event"} <-- Content-Length: 170

Hide Details

{"body":{"category":"console","output":"PLEASE submit a bug report to https://bugs.llvm.org/ and include the crash backtrace.\n"},"event":"output","seq":0,"type":"event"}

Hide Details

========= END ========= ========= DEBUG ADAPTER PROTOCOL LOGS ========= --> Content-Length: 284

Hide Details

{"command":"initialize","type":"request","arguments":{"adapterID":"lldb-native","clientID":"vscode","columnsStartAt1":true,"linesStartAt1":true,"locale":"en-us","pathFormat":"path","supportsRunInTerminalRequest":true,"supportsVariablePaging":true,"supportsVariableType":true},"seq":1} <-- Content-Length: 1222

Hide Details

{"body":{"exceptionBreakpointFilters":[{"default":false,"filter":"cpp_catch","label":"C++ Catch"},{"default":false,"filter":"cpp_throw","label":"C++ Throw"},{"default":false,"filter":"objc_catch","label":"Objective C Catch"},{"default":false,"filter":"objc_throw","label":"Objective C Throw"},{"default":false,"filter":"swift_catch","label":"Swift Catch"},{"default":false,"filter":"swift_throw","label":"Swift Throw"}],"supportTerminateDebuggee":true,"supportsCompletionsRequest":false,"supportsConditionalBreakpoints":true,"supportsConfigurationDoneRequest":true,"supportsDelayedStackTraceLoading":true,"supportsEvaluateForHovers":true,"supportsExceptionInfoRequest":true,"supportsExceptionOptions":true,"supportsFunctionBreakpoints":true,"supportsGotoTargetsRequest":false,"supportsHitConditionalBreakpoints":true,"supportsLoadedSourcesRequest":false,"supportsModulesRequest":false,"supportsProgressReporting":true,"supportsRestartFrame":false,"supportsRestartRequest":false,"supportsRunInTerminalRequest":true,"supportsSetVariable":true,"supportsStepBack":false,"supportsStepInTargetsRequest":false,"supportsValueFormattingOptions":true},"command":"initialize","request_seq":1,"seq":0,"success":true,"type":"response"} --> Content-Length: 1041

Hide Details

{"command":"launch","type":"request","arguments":{"program":"/Users/buildslave/jenkins/workspace/lldb-cmake-sanitized/lldb-build/lldb-test-build.noindex/tools/lldb-vscode/evaluate/TestVSCode_evaluate.test_watch_evaluate_expressions/a.out","disableASLR":true,"initCommands":["settings clear -all","settings set symbols.enable-external-lookup false","settings set target.inherit-tcc true","settings set target.detach-on-error false","settings set target.auto-apply-fixits false","settings set plugin.process.gdb-remote.packet-timeout 60","settings set symbols.clang-modules-cache-path \"/Users/buildslave/jenkins/workspace/lldb-cmake-sanitized/lldb-build/lldb-test-build.noindex/module-cache-lldb/lldb-api\"","settings set use-color false","setting set target.prefer-dynamic-value no-dynamic-values","settings set target.env-vars ASAN_OPTIONS=detect_stack_use_after_return=1 DYLD_INSERT_LIBRARIES=/Users/buildslave/jenkins/workspace/lldb-cmake-sanitized/host-compiler/lib/clang/13.0.99/lib/darwin/libclang_rt.asan_osx_dynamic.dylib"]},"seq":2} <-- Content-Length: 923

Hide Details

{"body":{"category":"console","output":"Running initCommands:\n(lldb) settings clear -all\n(lldb) settings set symbols.enable-external-lookup false\n(lldb) settings set target.inherit-tcc true\n(lldb) settings set target.detach-on-error false\n(lldb) settings set target.auto-apply-fixits false\n(lldb) settings set plugin.process.gdb-remote.packet-timeout 60\n(lldb) settings set symbols.clang-modules-cache-path \"/Users/buildslave/jenkins/workspace/lldb-cmake-sanitized/lldb-build/lldb-test-build.noindex/module-cache-lldb/lldb-api\"\n(lldb) settings set use-color false\n(lldb) setting set target.prefer-dynamic-value no-dynamic-values\n(lldb) settings set target.env-vars ASAN_OPTIONS=detect_stack_use_after_return=1 DYLD_INSERT_LIBRARIES=/Users/buildslave/jenkins/workspace/lldb-cmake-sanitized/host-compiler/lib/clang/13.0.99/lib/darwin/libclang_rt.asan_osx_dynamic.dylib\n"},"event":"output","seq":0,"type":"event"} <-- Content-Length: 77

Hide Details

{"command":"launch","request_seq":2,"seq":0,"success":true,"type":"response"} <-- Content-Length: 306

Hide Details

{"body":{"isLocalProcess":true,"name":"/Users/buildslave/jenkins/workspace/lldb-cmake-sanitized/lldb-build/lldb-test-build.noindex/tools/lldb-vscode/evaluate/TestVSCode_evaluate.test_watch_evaluate_expressions/a.out","startMethod":"launch","systemProcessId":68360},"event":"process","seq":0,"type":"event"} <-- Content-Length: 46

Hide Details

{"event":"initialized","seq":0,"type":"event"} --> Content-Length: 276

Hide Details

{"command":"setBreakpoints","type":"request","arguments":{"source":{"name":"main.cpp","path":"main.cpp"},"sourceModified":false,"lines":"[23, 27, 11, 35, 40, 44, 45]","breakpoints":[{"line":23},{"line":27},{"line":11},{"line":35},{"line":40},{"line":44},{"line":45}]},"seq":3} <-- Content-Length: 684

Hide Details

{"body":{"breakpoints":[{"id":1,"line":23,"source":{"name":"main.cpp","path":"main.cpp"},"verified":true},{"id":2,"line":27,"source":{"name":"main.cpp","path":"main.cpp"},"verified":true},{"id":3,"line":11,"source":{"name":"main.cpp","path":"main.cpp"},"verified":true},{"id":4,"line":35,"source":{"name":"main.cpp","path":"main.cpp"},"verified":true},{"id":5,"line":40,"source":{"name":"main.cpp","path":"main.cpp"},"verified":true},{"id":6,"line":44,"source":{"name":"main.cpp","path":"main.cpp"},"verified":true},{"id":7,"line":45,"source":{"name":"main.cpp","path":"main.cpp"},"verified":true}]},"command":"setBreakpoints","request_seq":3,"seq":0,"success":true,"type":"response"} --> Content-Length: 71

Hide Details

{"command":"configurationDone","type":"request","arguments":{},"seq":4} <-- Content-Length: 88

Hide Details

{"command":"configurationDone","request_seq":4,"seq":0,"success":true,"type":"response"} <-- Content-Length: 199

Hide Details

{"body":{"allThreadsStopped":true,"description":"breakpoint 1.1","preserveFocusHint":false,"reason":"breakpoint","threadCausedFocus":true,"threadId":8492764},"event":"stopped","seq":0,"type":"event"} --> Content-Length: 61

Hide Details

{"command":"threads","type":"request","arguments":{},"seq":5} <-- Content-Length: 133

Hide Details

{"body":{"threads":[{"id":8492764,"name":"Thread #1"}]},"command":"threads","request_seq":5,"seq":0,"success":true,"type":"response"} --> Content-Length: 108

Hide Details

{"command":"stackTrace","type":"request","arguments":{"threadId":8492764,"startFrame":0,"levels":1},"seq":6} <-- Content-Length: 330

Hide Details

{"body":{"stackFrames":[{"column":14,"id":524288,"line":23,"name":"main","source":{"name":"main.cpp","path":"/Users/buildslave/jenkins/workspace/lldb-cmake-sanitized/llvm-project/lldb/test/API/tools/lldb-vscode/evaluate/main.cpp"}}],"totalFrames":2},"command":"stackTrace","request_seq":6,"seq":0,"success":true,"type":"response"} --> Content-Length: 116

Hide Details

{"command":"evaluate","type":"request","arguments":{"expression":"var1","context":"watch","frameId":524288},"seq":7} <-- Content-Length: 138

Hide Details

{"body":{"result":"20","type":"int","variablesReference":0},"command":"evaluate","request_seq":7,"seq":0,"success":true,"type":"response"} --> Content-Length: 108

Hide Details

{"command":"stackTrace","type":"request","arguments":{"threadId":8492764,"startFrame":0,"levels":1},"seq":8} <-- Content-Length: 330

Hide Details

{"body":{"stackFrames":[{"column":14,"id":524288,"line":23,"name":"main","source":{"name":"main.cpp","path":"/Users/buildslave/jenkins/workspace/lldb-cmake-sanitized/llvm-project/lldb/test/API/tools/lldb-vscode/evaluate/main.cpp"}}],"totalFrames":2},"command":"stackTrace","request_seq":8,"seq":0,"success":true,"type":"response"} --> Content-Length: 116

Hide Details

{"command":"evaluate","type":"request","arguments":{"expression":"var2","context":"watch","frameId":524288},"seq":9} <-- Content-Length: 138

Hide Details

{"body":{"result":"21","type":"int","variablesReference":0},"command":"evaluate","request_seq":9,"seq":0,"success":true,"type":"response"} --> Content-Length: 109

Hide Details

{"command":"stackTrace","type":"request","arguments":{"threadId":8492764,"startFrame":0,"levels":1},"seq":10} <-- Content-Length: 331

Hide Details

{"body":{"stackFrames":[{"column":14,"id":524288,"line":23,"name":"main","source":{"name":"main.cpp","path":"/Users/buildslave/jenkins/workspace/lldb-cmake-sanitized/llvm-project/lldb/test/API/tools/lldb-vscode/evaluate/main.cpp"}}],"totalFrames":2},"command":"stackTrace","request_seq":10,"seq":0,"success":true,"type":"response"} --> Content-Length: 123

Hide Details

{"command":"evaluate","type":"request","arguments":{"expression":"static_int","context":"watch","frameId":524288},"seq":11} <-- Content-Length: 139

Hide Details

{"body":{"result":"42","type":"int","variablesReference":0},"command":"evaluate","request_seq":11,"seq":0,"success":true,"type":"response"} --> Content-Length: 109

Hide Details

{"command":"stackTrace","type":"request","arguments":{"threadId":8492764,"startFrame":0,"levels":1},"seq":12} <-- Content-Length: 331

Hide Details

{"body":{"stackFrames":[{"column":14,"id":524288,"line":23,"name":"main","source":{"name":"main.cpp","path":"/Users/buildslave/jenkins/workspace/lldb-cmake-sanitized/llvm-project/lldb/test/API/tools/lldb-vscode/evaluate/main.cpp"}}],"totalFrames":2},"command":"stackTrace","request_seq":12,"seq":0,"success":true,"type":"response"} --> Content-Length: 127

Hide Details

{"command":"evaluate","type":"request","arguments":{"expression":"non_static_int","context":"watch","frameId":524288},"seq":13} <-- Content-Length: 139

Hide Details

{"body":{"result":"43","type":"int","variablesReference":0},"command":"evaluate","request_seq":13,"seq":0,"success":true,"type":"response"} --> Content-Length: 109

Hide Details

{"command":"stackTrace","type":"request","arguments":{"threadId":8492764,"startFrame":0,"levels":1},"seq":14} <-- Content-Length: 331

Hide Details

{"body":{"stackFrames":[{"column":14,"id":524288,"line":23,"name":"main","source":{"name":"main.cpp","path":"/Users/buildslave/jenkins/workspace/lldb-cmake-sanitized/llvm-project/lldb/test/API/tools/lldb-vscode/evaluate/main.cpp"}}],"totalFrames":2},"command":"stackTrace","request_seq":14,"seq":0,"success":true,"type":"response"} --> Content-Length: 120

Hide Details

{"command":"evaluate","type":"request","arguments":{"expression":"struct1","context":"watch","frameId":524288},"seq":15} <-- Content-Length: 169

Hide Details

{"body":{"result":"my_struct @ 0x7ffeefbff7c8","type":"my_struct","variablesReference":4},"command":"evaluate","request_seq":15,"seq":0,"success":true,"type":"response"} --> Content-Length: 109

Hide Details

{"command":"stackTrace","type":"request","arguments":{"threadId":8492764,"startFrame":0,"levels":1},"seq":16} <-- Content-Length: 331

Hide Details

{"body":{"stackFrames":[{"column":14,"id":524288,"line":23,"name":"main","source":{"name":"main.cpp","path":"/Users/buildslave/jenkins/workspace/lldb-cmake-sanitized/llvm-project/lldb/test/API/tools/lldb-vscode/evaluate/main.cpp"}}],"totalFrames":2},"command":"stackTrace","request_seq":16,"seq":0,"success":true,"type":"response"} --> Content-Length: 124

Hide Details

{"command":"evaluate","type":"request","arguments":{"expression":"struct1.foo","context":"watch","frameId":524288},"seq":17} <-- Content-Length: 139

Hide Details

{"body":{"result":"15","type":"int","variablesReference":0},"command":"evaluate","request_seq":17,"seq":0,"success":true,"type":"response"} --> Content-Length: 109

Hide Details

{"command":"stackTrace","type":"request","arguments":{"threadId":8492764,"startFrame":0,"levels":1},"seq":18} <-- Content-Length: 331

Hide Details

{"body":{"stackFrames":[{"column":14,"id":524288,"line":23,"name":"main","source":{"name":"main.cpp","path":"/Users/buildslave/jenkins/workspace/lldb-cmake-sanitized/llvm-project/lldb/test/API/tools/lldb-vscode/evaluate/main.cpp"}}],"totalFrames":2},"command":"stackTrace","request_seq":18,"seq":0,"success":true,"type":"response"} --> Content-Length: 125

Hide Details

{"command":"evaluate","type":"request","arguments":{"expression":"struct2->foo","context":"watch","frameId":524288},"seq":19} <-- Content-Length: 139

Hide Details

{"body":{"result":"16","type":"int","variablesReference":0},"command":"evaluate","request_seq":19,"seq":0,"success":true,"type":"response"} --> Content-Length: 109

Hide Details

{"command":"stackTrace","type":"request","arguments":{"threadId":8492764,"startFrame":0,"levels":1},"seq":20} <-- Content-Length: 331

Hide Details

{"body":{"stackFrames":[{"column":14,"id":524288,"line":23,"name":"main","source":{"name":"main.cpp","path":"/Users/buildslave/jenkins/workspace/lldb-cmake-sanitized/llvm-project/lldb/test/API/tools/lldb-vscode/evaluate/main.cpp"}}],"totalFrames":2},"command":"stackTrace","request_seq":20,"seq":0,"success":true,"type":"response"} --> Content-Length: 116

Hide Details

{"command":"evaluate","type":"request","arguments":{"expression":"var","context":"watch","frameId":524288},"seq":21} <-- Content-Length: 311

Hide Details

{"body":{"category":"console","output":"/Users/buildslave/jenkins/workspace/lldb-cmake-sanitized/llvm-project/lldb/tools/lldb-vscode/ProgressEvent.cpp:89:64: runtime error: load of value 829960214, which is not a valid value for type 'lldb_vscode::ProgressEventType'\n"},"event":"output","seq":0,"type":"event"} <-- Content-Length: 261

Hide Details

{"body":{"category":"console","output":"SUMMARY: UndefinedBehaviorSanitizer: undefined-behavior /Users/buildslave/jenkins/workspace/lldb-cmake-sanitized/llvm-project/lldb/tools/lldb-vscode/ProgressEvent.cpp:89:64 in \n"},"event":"output","seq":0,"type":"event"} <-- Content-Length: 170

Hide Details

{"body":{"category":"console","output":"PLEASE submit a bug report to https://bugs.llvm.org/ and include the crash backtrace.\n"},"event":"output","seq":0,"type":"event"}

Hide Details

========= END =========

Hide Details

-- Command Output (stderr): -- Change dir to: /Users/buildslave/jenkins/workspace/lldb-cmake-sanitized/llvm-project/lldb/test/API/tools/lldb-vscode/evaluate runCmd: settings clear -all output:

Hide Details

runCmd: settings set symbols.enable-external-lookup false output:

Hide Details

runCmd: settings set target.inherit-tcc true output:

Hide Details

runCmd: settings set target.detach-on-error false output:

Hide Details

runCmd: settings set target.auto-apply-fixits false output:

Hide Details

runCmd: settings set plugin.process.gdb-remote.packet-timeout 60 output:

Hide Details

runCmd: settings set symbols.clang-modules-cache-path "/Users/buildslave/jenkins/workspace/lldb-cmake-sanitized/lldb-build/lldb-test-build.noindex/module-cache-lldb/lldb-api" output:

Hide Details

runCmd: settings set use-color false output:

Hide Details

runCmd: setting set target.prefer-dynamic-value no-dynamic-values output:

Hide Details

runCmd: settings set target.env-vars ASAN_OPTIONS=detect_stack_use_after_return=1 DYLD_INSERT_LIBRARIES=/Users/buildslave/jenkins/workspace/lldb-cmake-sanitized/host-compiler/lib/clang/13.0.99/lib/darwin/libclang_rt.asan_osx_dynamic.dylib output:

Hide Details

Adding tearDown hook: def cleanup(): if disconnectAutomatically: self.vscode.request_disconnect(terminateDebuggee=True) self.vscode.terminate()

Hide Details

Hide Details

FAIL: LLDB (/Users/buildslave/jenkins/workspace/lldb-cmake-sanitized/host-compiler/bin/clang-x86_64) :: test_generic_evaluate_expressions (TestVSCode_evaluate.TestVSCode_variables) Executing tearDown hook: def cleanup(): if disconnectAutomatically: self.vscode.request_disconnect(terminateDebuggee=True) self.vscode.terminate()

Hide Details

Hide Details

CLEANUP ERROR: LLDB (/Users/buildslave/jenkins/workspace/lldb-cmake-sanitized/host-compiler/bin/clang-x86_64) :: test_generic_evaluate_expressions (TestVSCode_evaluate.TestVSCode_variables) Traceback (most recent call last): File "/Users/buildslave/jenkins/workspace/lldb-cmake-sanitized/llvm-project/lldb/third_party/Python/module/unittest2/unittest2/case.py", line 386, in run self.tearDown() File "/Users/buildslave/jenkins/workspace/lldb-cmake-sanitized/llvm-project/lldb/packages/Python/lldbsuite/test/lldbtest.py", line 2095, in tearDown Base.tearDown(self) File "/Users/buildslave/jenkins/workspace/lldb-cmake-sanitized/llvm-project/lldb/packages/Python/lldbsuite/test/lldbtest.py", line 1065, in tearDown hook() # try the plain call and hope it works File "/Users/buildslave/jenkins/workspace/lldb-cmake-sanitized/llvm-project/lldb/packages/Python/lldbsuite/test/tools/lldb-vscode/lldbvscode_testcase.py", line 294, in cleanup self.vscode.request_disconnect(terminateDebuggee=True) File "/Users/buildslave/jenkins/workspace/lldb-cmake-sanitized/llvm-project/lldb/packages/Python/lldbsuite/test/tools/lldb-vscode/vscode.py", line 590, in request_disconnect return self.send_recv(command_dict) File "/Users/buildslave/jenkins/workspace/lldb-cmake-sanitized/llvm-project/lldb/packages/Python/lldbsuite/test/tools/lldb-vscode/vscode.py", line 315, in send_recv self.send_packet(command) File "/Users/buildslave/jenkins/workspace/lldb-cmake-sanitized/llvm-project/lldb/packages/Python/lldbsuite/test/tools/lldb-vscode/vscode.py", line 271, in send_packet self.send.flush() BrokenPipeError: [Errno 32] Broken pipe

Hide Details

runCmd: settings clear -all output:

Hide Details

runCmd: settings set symbols.enable-external-lookup false output:

Hide Details

runCmd: settings set target.inherit-tcc true output:

Hide Details

runCmd: settings set target.detach-on-error false output:

Hide Details

runCmd: settings set target.auto-apply-fixits false output:

Hide Details

runCmd: settings set plugin.process.gdb-remote.packet-timeout 60 output:

Hide Details

runCmd: settings set symbols.clang-modules-cache-path "/Users/buildslave/jenkins/workspace/lldb-cmake-sanitized/lldb-build/lldb-test-build.noindex/module-cache-lldb/lldb-api" output:

Hide Details

runCmd: settings set use-color false output:

Hide Details

runCmd: setting set target.prefer-dynamic-value no-dynamic-values output:

Hide Details

runCmd: settings set target.env-vars ASAN_OPTIONS=detect_stack_use_after_return=1 DYLD_INSERT_LIBRARIES=/Users/buildslave/jenkins/workspace/lldb-cmake-sanitized/host-compiler/lib/clang/13.0.99/lib/darwin/libclang_rt.asan_osx_dynamic.dylib output:

Hide Details

Adding tearDown hook: def cleanup(): if disconnectAutomatically: self.vscode.request_disconnect(terminateDebuggee=True) self.vscode.terminate()

Hide Details

Hide Details

Executing tearDown hook: def cleanup(): if disconnectAutomatically: self.vscode.request_disconnect(terminateDebuggee=True) self.vscode.terminate()

Hide Details

Hide Details

PASS: LLDB (/Users/buildslave/jenkins/workspace/lldb-cmake-sanitized/host-compiler/bin/clang-x86_64) :: test_hover_evaluate_expressions (TestVSCode_evaluate.TestVSCode_variables) runCmd: settings clear -all output:

Hide Details

runCmd: settings set symbols.enable-external-lookup false output:

Hide Details

runCmd: settings set target.inherit-tcc true output:

Hide Details

runCmd: settings set target.detach-on-error false output:

Hide Details

runCmd: settings set target.auto-apply-fixits false output:

Hide Details

runCmd: settings set plugin.process.gdb-remote.packet-timeout 60 output:

Hide Details

runCmd: settings set symbols.clang-modules-cache-path "/Users/buildslave/jenkins/workspace/lldb-cmake-sanitized/lldb-build/lldb-test-build.noindex/module-cache-lldb/lldb-api" output:

Hide Details

runCmd: settings set use-color false output:

Hide Details

runCmd: setting set target.prefer-dynamic-value no-dynamic-values output:

Hide Details

runCmd: settings set target.env-vars ASAN_OPTIONS=detect_stack_use_after_return=1 DYLD_INSERT_LIBRARIES=/Users/buildslave/jenkins/workspace/lldb-cmake-sanitized/host-compiler/lib/clang/13.0.99/lib/darwin/libclang_rt.asan_osx_dynamic.dylib output:

Hide Details

Adding tearDown hook: def cleanup(): if disconnectAutomatically: self.vscode.request_disconnect(terminateDebuggee=True) self.vscode.terminate()

Hide Details

Hide Details

FAIL: LLDB (/Users/buildslave/jenkins/workspace/lldb-cmake-sanitized/host-compiler/bin/clang-x86_64) :: test_repl_evaluate_expressions (TestVSCode_evaluate.TestVSCode_variables) Executing tearDown hook: def cleanup(): if disconnectAutomatically: self.vscode.request_disconnect(terminateDebuggee=True) self.vscode.terminate()

Hide Details

Hide Details

CLEANUP ERROR: LLDB (/Users/buildslave/jenkins/workspace/lldb-cmake-sanitized/host-compiler/bin/clang-x86_64) :: test_repl_evaluate_expressions (TestVSCode_evaluate.TestVSCode_variables) Traceback (most recent call last): File "/Users/buildslave/jenkins/workspace/lldb-cmake-sanitized/llvm-project/lldb/third_party/Python/module/unittest2/unittest2/case.py", line 386, in run self.tearDown() File "/Users/buildslave/jenkins/workspace/lldb-cmake-sanitized/llvm-project/lldb/packages/Python/lldbsuite/test/lldbtest.py", line 2095, in tearDown Base.tearDown(self) File "/Users/buildslave/jenkins/workspace/lldb-cmake-sanitized/llvm-project/lldb/packages/Python/lldbsuite/test/lldbtest.py", line 1065, in tearDown hook() # try the plain call and hope it works File "/Users/buildslave/jenkins/workspace/lldb-cmake-sanitized/llvm-project/lldb/packages/Python/lldbsuite/test/tools/lldb-vscode/lldbvscode_testcase.py", line 294, in cleanup self.vscode.request_disconnect(terminateDebuggee=True) File "/Users/buildslave/jenkins/workspace/lldb-cmake-sanitized/llvm-project/lldb/packages/Python/lldbsuite/test/tools/lldb-vscode/vscode.py", line 590, in request_disconnect return self.send_recv(command_dict) File "/Users/buildslave/jenkins/workspace/lldb-cmake-sanitized/llvm-project/lldb/packages/Python/lldbsuite/test/tools/lldb-vscode/vscode.py", line 315, in send_recv self.send_packet(command) File "/Users/buildslave/jenkins/workspace/lldb-cmake-sanitized/llvm-project/lldb/packages/Python/lldbsuite/test/tools/lldb-vscode/vscode.py", line 271, in send_packet self.send.flush() BrokenPipeError: [Errno 32] Broken pipe

Hide Details

runCmd: settings clear -all output:

Hide Details

runCmd: settings set symbols.enable-external-lookup false output:

Hide Details

runCmd: settings set target.inherit-tcc true output:

Hide Details

runCmd: settings set target.detach-on-error false output:

Hide Details

runCmd: settings set target.auto-apply-fixits false output:

Hide Details

runCmd: settings set plugin.process.gdb-remote.packet-timeout 60 output:

Hide Details

runCmd: settings set symbols.clang-modules-cache-path "/Users/buildslave/jenkins/workspace/lldb-cmake-sanitized/lldb-build/lldb-test-build.noindex/module-cache-lldb/lldb-api" output:

Hide Details

runCmd: settings set use-color false output:

Hide Details

runCmd: setting set target.prefer-dynamic-value no-dynamic-values output:

Hide Details

runCmd: settings set target.env-vars ASAN_OPTIONS=detect_stack_use_after_return=1 DYLD_INSERT_LIBRARIES=/Users/buildslave/jenkins/workspace/lldb-cmake-sanitized/host-compiler/lib/clang/13.0.99/lib/darwin/libclang_rt.asan_osx_dynamic.dylib output:

Hide Details

Adding tearDown hook: def cleanup(): if disconnectAutomatically: self.vscode.request_disconnect(terminateDebuggee=True) self.vscode.terminate()

Hide Details

Hide Details

FAIL: LLDB (/Users/buildslave/jenkins/workspace/lldb-cmake-sanitized/host-compiler/bin/clang-x86_64) :: test_watch_evaluate_expressions (TestVSCode_evaluate.TestVSCode_variables) Executing tearDown hook: def cleanup(): if disconnectAutomatically: self.vscode.request_disconnect(terminateDebuggee=True) self.vscode.terminate()

Hide Details

Hide Details

CLEANUP ERROR: LLDB (/Users/buildslave/jenkins/workspace/lldb-cmake-sanitized/host-compiler/bin/clang-x86_64) :: test_watch_evaluate_expressions (TestVSCode_evaluate.TestVSCode_variables) Traceback (most recent call last): File "/Users/buildslave/jenkins/workspace/lldb-cmake-sanitized/llvm-project/lldb/third_party/Python/module/unittest2/unittest2/case.py", line 386, in run self.tearDown() File "/Users/buildslave/jenkins/workspace/lldb-cmake-sanitized/llvm-project/lldb/packages/Python/lldbsuite/test/lldbtest.py", line 2095, in tearDown Base.tearDown(self) File "/Users/buildslave/jenkins/workspace/lldb-cmake-sanitized/llvm-project/lldb/packages/Python/lldbsuite/test/lldbtest.py", line 1065, in tearDown hook() # try the plain call and hope it works File "/Users/buildslave/jenkins/workspace/lldb-cmake-sanitized/llvm-project/lldb/packages/Python/lldbsuite/test/tools/lldb-vscode/lldbvscode_testcase.py", line 294, in cleanup self.vscode.request_disconnect(terminateDebuggee=True) File "/Users/buildslave/jenkins/workspace/lldb-cmake-sanitized/llvm-project/lldb/packages/Python/lldbsuite/test/tools/lldb-vscode/vscode.py", line 590, in request_disconnect return self.send_recv(command_dict) File "/Users/buildslave/jenkins/workspace/lldb-cmake-sanitized/llvm-project/lldb/packages/Python/lldbsuite/test/tools/lldb-vscode/vscode.py", line 315, in send_recv self.send_packet(command) File "/Users/buildslave/jenkins/workspace/lldb-cmake-sanitized/llvm-project/lldb/packages/Python/lldbsuite/test/tools/lldb-vscode/vscode.py", line 271, in send_packet self.send.flush() BrokenPipeError: [Errno 32] Broken pipe

Hide Details

Restore dir to: /Users/buildslave/jenkins/workspace/lldb-cmake-sanitized/lldb-build/tools/lldb/test ====================================================================== ERROR: test_generic_evaluate_expressions (TestVSCode_evaluate.TestVSCode_variables) ---------------------------------------------------------------------- Traceback (most recent call last): File "/Users/buildslave/jenkins/workspace/lldb-cmake-sanitized/llvm-project/lldb/test/API/tools/lldb-vscode/evaluate/TestVSCode_evaluate.py", line 157, in test_generic_evaluate_expressions self.run_test_evaluate_expressions() File "/Users/buildslave/jenkins/workspace/lldb-cmake-sanitized/llvm-project/lldb/test/API/tools/lldb-vscode/evaluate/TestVSCode_evaluate.py", line 60, in run_test_evaluate_expressions self.assertEvaluateFailure("var") # local variable of a_function File "/Users/buildslave/jenkins/workspace/lldb-cmake-sanitized/llvm-project/lldb/test/API/tools/lldb-vscode/evaluate/TestVSCode_evaluate.py", line 24, in assertEvaluateFailure self.vscode.request_evaluate(expression, context=self.context)['body']) File "/Users/buildslave/jenkins/workspace/lldb-cmake-sanitized/llvm-project/lldb/packages/Python/lldbsuite/test/tools/lldb-vscode/vscode.py", line 607, in request_evaluate return self.send_recv(command_dict) File "/Users/buildslave/jenkins/workspace/lldb-cmake-sanitized/llvm-project/lldb/packages/Python/lldbsuite/test/tools/lldb-vscode/vscode.py", line 321, in send_recv raise ValueError(desc) ValueError: no response for "evaluate" Config=x86_64-/Users/buildslave/jenkins/workspace/lldb-cmake-sanitized/host-compiler/bin/clang ====================================================================== ERROR: test_repl_evaluate_expressions (TestVSCode_evaluate.TestVSCode_variables) ---------------------------------------------------------------------- Traceback (most recent call last): File "/Users/buildslave/jenkins/workspace/lldb-cmake-sanitized/llvm-project/lldb/test/API/tools/lldb-vscode/evaluate/TestVSCode_evaluate.py", line 163, in test_repl_evaluate_expressions self.run_test_evaluate_expressions("repl") File "/Users/buildslave/jenkins/workspace/lldb-cmake-sanitized/llvm-project/lldb/test/API/tools/lldb-vscode/evaluate/TestVSCode_evaluate.py", line 60, in run_test_evaluate_expressions self.assertEvaluateFailure("var") # local variable of a_function File "/Users/buildslave/jenkins/workspace/lldb-cmake-sanitized/llvm-project/lldb/test/API/tools/lldb-vscode/evaluate/TestVSCode_evaluate.py", line 24, in assertEvaluateFailure self.vscode.request_evaluate(expression, context=self.context)['body']) File "/Users/buildslave/jenkins/workspace/lldb-cmake-sanitized/llvm-project/lldb/packages/Python/lldbsuite/test/tools/lldb-vscode/vscode.py", line 607, in request_evaluate return self.send_recv(command_dict) File "/Users/buildslave/jenkins/workspace/lldb-cmake-sanitized/llvm-project/lldb/packages/Python/lldbsuite/test/tools/lldb-vscode/vscode.py", line 321, in send_recv raise ValueError(desc) ValueError: no response for "evaluate" Config=x86_64-/Users/buildslave/jenkins/workspace/lldb-cmake-sanitized/host-compiler/bin/clang ====================================================================== ERROR: test_watch_evaluate_expressions (TestVSCode_evaluate.TestVSCode_variables) ---------------------------------------------------------------------- Traceback (most recent call last): File "/Users/buildslave/jenkins/workspace/lldb-cmake-sanitized/llvm-project/lldb/test/API/tools/lldb-vscode/evaluate/TestVSCode_evaluate.py", line 169, in test_watch_evaluate_expressions self.run_test_evaluate_expressions("watch") File "/Users/buildslave/jenkins/workspace/lldb-cmake-sanitized/llvm-project/lldb/test/API/tools/lldb-vscode/evaluate/TestVSCode_evaluate.py", line 60, in run_test_evaluate_expressions self.assertEvaluateFailure("var") # local variable of a_function File "/Users/buildslave/jenkins/workspace/lldb-cmake-sanitized/llvm-project/lldb/test/API/tools/lldb-vscode/evaluate/TestVSCode_evaluate.py", line 24, in assertEvaluateFailure self.vscode.request_evaluate(expression, context=self.context)['body']) File "/Users/buildslave/jenkins/workspace/lldb-cmake-sanitized/llvm-project/lldb/packages/Python/lldbsuite/test/tools/lldb-vscode/vscode.py", line 607, in request_evaluate return self.send_recv(command_dict) File "/Users/buildslave/jenkins/workspace/lldb-cmake-sanitized/llvm-project/lldb/packages/Python/lldbsuite/test/tools/lldb-vscode/vscode.py", line 321, in send_recv raise ValueError(desc) ValueError: no response for "evaluate" Config=x86_64-/Users/buildslave/jenkins/workspace/lldb-cmake-sanitized/host-compiler/bin/clang ---------------------------------------------------------------------- Ran 4 tests in 19.207s

Hide Details

RESULT: FAILED (1 passes, 0 failures, 3 errors, 0 skipped, 0 expected failures, 0 unexpected successes)

Hide Details

--

Hide Details

******************** PASS: lldb-api :: functionalities/load_using_paths/TestLoadUsingPaths.py (1389 of 2356) PASS: lldb-unit :: Utility/./UtilityTests/ArgsTest.TestOverwriteArgs (1390 of 2356) PASS: lldb-api :: functionalities/breakpoint/step_over_breakpoint/TestStepOverBreakpoint.py (1391 of 2356) PASS: lldb-unit :: Core/./LLDBCoreTests/SourceLocationSpecTest.OperatorBool (1392 of 2356) PASS: lldb-unit :: Symbol/./SymbolTests/Type.GetTypeScopeAndBasename (1393 of 2356) PASS: lldb-api :: functionalities/unwind/noreturn/TestNoreturnUnwind.py (1394 of 2356) PASS: lldb-unit :: Utility/./UtilityTests/LogTest.Unregister (1395 of 2356) PASS: lldb-api :: lang/cpp/offsetof/TestOffsetofCpp.py (1396 of 2356) PASS: lldb-api :: tools/lldb-vscode/launch/TestVSCode_launch.py (1397 of 2356) PASS: lldb-api :: commands/expression/error-limit/TestExprErrorLimit.py (1398 of 2356) UNSUPPORTED: lldb-shell :: SymbolFile/Breakpad/stack-cfi-arm.yaml (1399 of 2356) PASS: lldb-api :: functionalities/optimized_code/TestNoASanExceptionAfterEvalOP_piece.py (1400 of 2356) UNSUPPORTED: lldb-api :: macosx/macCatalystAppMacOSFramework/TestMacCatalystAppWithMacOSFramework.py (1401 of 2356) PASS: lldb-api :: tools/lldb-vscode/runInTerminal/TestVSCode_runInTerminal.py (1402 of 2356) PASS: lldb-unit :: Expression/./ExpressionTests/ClangExpressionDeclMapTest.TestUnknownIdentifierLookup (1403 of 2356) PASS: lldb-api :: functionalities/data-formatter/data-formatter-objc/TestDataFormatterObjCExpr.py (1404 of 2356) PASS: lldb-unit :: Utility/./UtilityTests/StreamTest.PutNHex8 (1405 of 2356) PASS: lldb-api :: functionalities/pointer_num_children/TestPointerNumChildren.py (1406 of 2356) PASS: lldb-unit :: Process/Utility/./ProcessUtilityTests/ProcMapTests/LinuxProcMapsTestFixture.ParseMapRegions/1 (1407 of 2356) PASS: lldb-shell :: SymbolFile/DWARF/x86/DW_TAG_basic_type_DW_ATE_UTF_nonC.ll (1408 of 2356) PASS: lldb-unit :: Utility/./UtilityTests/CompletionRequest.TryCompleteCurrentArgGood (1409 of 2356) PASS: lldb-api :: commands/expression/import-std-module/weak_ptr/TestWeakPtrFromStdModule.py (1410 of 2356) PASS: lldb-unit :: Utility/./UtilityTests/ArchSpecTest.TripleComponentsWereSpecified (1411 of 2356) UNSUPPORTED: lldb-api :: functionalities/darwin_log/source/debug/TestDarwinLogSourceDebug.py (1412 of 2356) PASS: lldb-api :: lang/cpp/global_operators/TestCppGlobalOperators.py (1413 of 2356) PASS: lldb-unit :: Symbol/./SymbolTests/TestTypeSystemClang.TestIsClangType (1414 of 2356) PASS: lldb-unit :: Utility/./UtilityTests/PassiveReplayTest.InstrumentedFooInvalid (1415 of 2356) PASS: lldb-api :: lang/objc/objc++/TestObjCXX.py (1416 of 2356) PASS: lldb-unit :: Process/minidump/./LLDBMinidumpTests/MinidumpParserTest.GetLinuxProcStatus (1417 of 2356) PASS: lldb-unit :: Expression/./ExpressionTests/DWARFExpression.DW_OP_pick (1418 of 2356) PASS: lldb-api :: lang/objc/foundation/TestObjCMethodsNSError.py (1419 of 2356) PASS: lldb-api :: python_api/symbol-context/two-files/TestSymbolContextTwoFiles.py (1420 of 2356) PASS: lldb-unit :: Host/./HostTests/MainLoopTest.DetectsEOF (1421 of 2356) PASS: lldb-shell :: ScriptInterpreter/Python/command_relative_import.test (1422 of 2356) PASS: lldb-api :: functionalities/data-formatter/data-formatter-skip-summary/TestDataFormatterSkipSummary.py (1423 of 2356) PASS: lldb-unit :: Utility/./UtilityTests/StringExtractorTest.GetU64BigEndian (1424 of 2356) PASS: lldb-unit :: SymbolFile/DWARF/./SymbolFileDWARFTests/DWARFUnitTest.MissingSentinel (1425 of 2356) PASS: lldb-unit :: Language/Highlighting/./HighlighterTests/HighlighterTest.ClangStringLiterals (1426 of 2356) PASS: lldb-unit :: Utility/./UtilityTests/ArgsTest.StringListConstructor (1427 of 2356) PASS: lldb-api :: functionalities/data-formatter/data-formatter-named-summaries/TestDataFormatterNamedSummaries.py (1428 of 2356) PASS: lldb-api :: functionalities/tail_call_frames/disambiguate_tail_call_seq/TestDisambiguateTailCallSeq.py (1429 of 2356) PASS: lldb-unit :: DataFormatter/./LLDBFormatterTests/StringPrinterTests.CxxASCII (1430 of 2356) PASS: lldb-shell :: Unwind/eh-frame-dwarf-unwind.test (1431 of 2356) PASS: lldb-api :: macosx/thread_suspend/TestInternalThreadSuspension.py (1432 of 2356) PASS: lldb-api :: lang/c/offsetof/TestOffsetof.py (1433 of 2356) UNSUPPORTED: lldb-api :: functionalities/breakpoint/breakpoint_callback_command_source/TestBreakpointCallbackCommandSource.py (1434 of 2356) UNSUPPORTED: lldb-api :: functionalities/signal/handle-segv/TestHandleSegv.py (1435 of 2356) PASS: lldb-api :: functionalities/data-formatter/data-formatter-stl/libcxx/queue/TestDataFormatterLibcxxQueue.py (1436 of 2356) PASS: lldb-unit :: Interpreter/./InterpreterTests/OptionValueArgs.DeepCopy (1437 of 2356) PASS: lldb-unit :: Target/./TargetTests/ExecutionContextTest.GetByteOrderTarget (1438 of 2356) UNSUPPORTED: lldb-api :: python_api/event/TestEvents.py (1439 of 2356) PASS: lldb-api :: commands/expression/import-std-module/no-std-module/TestMissingStdModule.py (1440 of 2356) PASS: lldb-api :: tools/lldb-vscode/variables/TestVSCode_variables.py (1441 of 2356) PASS: lldb-unit :: Expression/./ExpressionTests/DWARFExpression.DW_OP_piece (1442 of 2356) PASS: lldb-api :: macosx/queues/TestQueues.py (1443 of 2356) PASS: lldb-api :: commands/target/create-no-such-arch/TestNoSuchArch.py (1444 of 2356) PASS: lldb-unit :: Expression/./ExpressionTests/DiagnosticManagerTest.AppendMessageNoDiag (1445 of 2356) UNSUPPORTED: lldb-shell :: Watchpoint/netbsd-nouserdbregs.test (1446 of 2356) PASS: lldb-api :: lang/c/modules/TestCModules.py (1447 of 2356) PASS: lldb-api :: python_api/type/TestTypeList.py (1448 of 2356) PASS: lldb-api :: functionalities/gdb_remote_client/TestPartialGPacket.py (1449 of 2356) PASS: lldb-shell :: Breakpoint/jit-loader_jitlink_elf.test (1450 of 2356) PASS: lldb-unit :: Process/Utility/./ProcessUtilityTests/ProcSMapTests/LinuxProcSMapsTestFixture.ParseSMapRegions/0 (1451 of 2356) PASS: lldb-unit :: Core/./LLDBCoreTests/SourceFileCache.FindSourceFileFound (1452 of 2356) PASS: lldb-unit :: Utility/./UtilityTests/StringListTest.SplitIntoLinesEmpty (1453 of 2356) PASS: lldb-unit :: Utility/./UtilityTests/SerializationRountripTest.SerializeDeserializeObjectPointer (1454 of 2356) PASS: lldb-api :: commands/frame/diagnose/dereference-argument/TestDiagnoseDereferenceArgument.py (1455 of 2356) PASS: lldb-unit :: Process/Utility/./ProcessUtilityTests/MemoryTagManagerAArch64MTETest.GetLogicalTag (1456 of 2356) PASS: lldb-api :: commands/frame/diagnose/local-variable/TestLocalVariable.py (1457 of 2356) PASS: lldb-api :: functionalities/postmortem/wow64_minidump/TestWow64MiniDump.py (1458 of 2356) UNSUPPORTED: lldb-api :: functionalities/gdb_remote_client/TestWasm.py (1459 of 2356) PASS: lldb-shell :: SymbolFile/DWARF/x86/debug-line-basic.s (1460 of 2356) PASS: lldb-api :: commands/expression/codegen-crash-import-def-arraytype-element/TestImportDefinitionArrayType.py (1461 of 2356) PASS: lldb-api :: functionalities/thread/concurrent_events/TestConcurrentCrashWithBreak.py (1462 of 2356) PASS: lldb-unit :: Utility/./UtilityTests/ListenerTest.GetEventWait (1463 of 2356) PASS: lldb-unit :: Utility/./UtilityTests/StreamTest.PutCharNull (1464 of 2356) PASS: lldb-api :: commands/expression/persist_objc_pointeetype/TestPersistObjCPointeeType.py (1465 of 2356) PASS: lldb-shell :: Quit/TestQuitExitCodeTooManyArgs.test (1466 of 2356) PASS: lldb-unit :: Utility/./UtilityTests/ArgsTest.ReplaceArgumentAtIndexOutOfRange (1467 of 2356) PASS: lldb-api :: commands/settings/TestSettings.py (1468 of 2356) PASS: lldb-api :: lang/objc/objc-runtime-ivars/TestRuntimeIvars.py (1469 of 2356) PASS: lldb-shell :: SymbolFile/DWARF/x86/debug_ranges_and_rnglists.test (1470 of 2356) PASS: lldb-unit :: Symbol/./SymbolTests/TestClangASTImporter.CompleteFwdDeclWithOtherOrigin (1471 of 2356) PASS: lldb-api :: functionalities/tail_call_frames/disambiguate_call_site/TestDisambiguateCallSite.py (1472 of 2356) PASS: lldb-unit :: Process/minidump/./LLDBMinidumpTests/RegisterContextMinidump.ConvertMinidumpContext_x86_32 (1473 of 2356) PASS: lldb-unit :: Utility/./UtilityTests/BinaryStreamTest.PutULEB128Zero (1474 of 2356) PASS: lldb-api :: python_api/breakpoint/TestBreakpointAPI.py (1475 of 2356) PASS: lldb-shell :: Commands/command-source.test (1476 of 2356) PASS: lldb-unit :: Language/Highlighting/./HighlighterTests/HighlighterTest.DefaultHighlighter (1477 of 2356) PASS: lldb-unit :: DataFormatter/./LLDBFormatterTests/TypeMatcherTests.CreatedBySameMatchString (1478 of 2356) PASS: lldb-api :: functionalities/memory/tag/TestMemoryTag.py (1479 of 2356) PASS: lldb-unit :: Utility/./UtilityTests/RangeTest.ContainsEndInclusive (1480 of 2356) PASS: lldb-api :: lang/objc/modules-hash-mismatch/TestClangModulesHashMismatch.py (1481 of 2356) PASS: lldb-api :: commands/add-dsym/uuid/TestAddDsymCommand.py (1482 of 2356) PASS: lldb-unit :: Process/gdb-remote/./ProcessGdbRemoteTests/GDBRemoteCommunicationClientTest.GetMemoryRegionInfo (1483 of 2356) PASS: lldb-api :: tools/lldb-server/commandline/TestGdbRemoteConnection.py (1484 of 2356) PASS: lldb-api :: commands/expression/no-deadlock/TestExprDoesntBlock.py (1485 of 2356) PASS: lldb-api :: commands/command/source/TestCommandSource.py (1486 of 2356) PASS: lldb-api :: commands/expression/pr35310/TestExprsBug35310.py (1487 of 2356) PASS: lldb-api :: python_api/section/TestSectionAPI.py (1488 of 2356) PASS: lldb-api :: functionalities/data-formatter/parray/TestPrintArray.py (1489 of 2356) PASS: lldb-api :: lang/cpp/symbols/TestSymbols.py (1490 of 2356) PASS: lldb-shell :: SymbolFile/DWARF/clang-ast-from-dwarf-objc-property.m (1491 of 2356) PASS: lldb-shell :: ScriptInterpreter/Python/Crashlog/parser_text.test (1492 of 2356) PASS: lldb-api :: functionalities/breakpoint/debugbreak/TestDebugBreak.py (1493 of 2356) PASS: lldb-api :: functionalities/data-formatter/format-propagation/TestFormatPropagation.py (1494 of 2356) PASS: lldb-api :: lang/cpp/modules-import/TestCXXModulesImport.py (1495 of 2356) PASS: lldb-unit :: Utility/./UtilityTests/StringExtractorTest.GetHexU8_Underflow2 (1496 of 2356) PASS: lldb-unit :: Utility/./UtilityTests/RangeTest.DefaultConstructor (1497 of 2356) PASS: lldb-api :: tools/lldb-server/inferior-crash/TestGdbRemoteAbort.py (1498 of 2356) PASS: lldb-unit :: ScriptInterpreter/Python/./ScriptInterpreterPythonTests/PythonDataObjectsTest.TestPythonBoolean (1499 of 2356) PASS: lldb-unit :: Utility/./UtilityTests/StatusTest.ErrorCodeConstructor (1500 of 2356) PASS: lldb-unit :: ScriptInterpreter/Python/./ScriptInterpreterPythonTests/PythonDataObjectsTest.TestCallable (1501 of 2356) PASS: lldb-shell :: SymbolFile/DWARF/x86/debug-types-signature-loop.s (1502 of 2356) PASS: lldb-unit :: Utility/./UtilityTests/ProcessInstanceInfo.DumpTable_invalidUID (1503 of 2356) PASS: lldb-api :: commands/expression/call-function/TestCallStopAndContinue.py (1504 of 2356) PASS: lldb-api :: commands/frame/language/TestGuessLanguage.py (1505 of 2356) PASS: lldb-shell :: ScriptInterpreter/None/import_module.test (1506 of 2356) PASS: lldb-api :: lang/objc/modules-app-update/TestClangModulesAppUpdate.py (1507 of 2356) PASS: lldb-shell :: Process/UnsupportedLanguage.test (1508 of 2356) PASS: lldb-api :: commands/expression/class_template_specialization_empty_pack/TestClassTemplateSpecializationParametersHandling.py (1509 of 2356) PASS: lldb-unit :: Utility/./UtilityTests/ArgsTest.BareSingleQuote (1510 of 2356) PASS: lldb-unit :: Utility/./UtilityTests/StreamTest.PutHex32ByteOrderLittle (1511 of 2356) PASS: lldb-unit :: Utility/./UtilityTests/ScalarTest.LongLongAssigmentOperator (1512 of 2356) PASS: lldb-shell :: ObjectFile/PDB/object.test (1513 of 2356) PASS: lldb-unit :: Utility/./UtilityTests/PassiveReplayTest.InstrumentedBarPtr (1514 of 2356) PASS: lldb-api :: functionalities/tail_call_frames/disambiguate_paths_to_common_sink/TestDisambiguatePathsToCommonSink.py (1515 of 2356) PASS: lldb-unit :: Host/./HostTests/SocketAddressTest.GetAddressInfo (1516 of 2356) PASS: lldb-api :: functionalities/paths/TestPaths.py (1517 of 2356) PASS: lldb-unit :: SymbolFile/DWARF/./SymbolFileDWARFTests/SymbolFileDWARFTests.TestAbbrevMissingTerminator (1518 of 2356) PASS: lldb-unit :: Process/minidump/./LLDBMinidumpTests/MinidumpParserTest.GetMemoryRegionInfoLinuxMaps (1519 of 2356) PASS: lldb-shell :: SymbolFile/DWARF/x86/dir-separator-no-comp-dir.s (1520 of 2356) PASS: lldb-unit :: Utility/./UtilityTests/ScalarTest.ComparisonFloat (1521 of 2356) PASS: lldb-unit :: Process/gdb-remote/./ProcessGdbRemoteTests/GDBRemoteClientBaseTest.InterruptNoResponse (1522 of 2356) PASS: lldb-unit :: Utility/./UtilityTests/StreamTest.PutMaxHex64ByteOrderBig (1523 of 2356) PASS: lldb-api :: functionalities/thread/crash_during_step/TestCrashDuringStep.py (1524 of 2356) PASS: lldb-unit :: Core/./LLDBCoreTests/FormatEntityTest.DefinitionConstructionNameTypeData (1525 of 2356) PASS: lldb-unit :: Utility/./UtilityTests/StringExtractorTest.DecodeHexU8_InvalidHex2 (1526 of 2356) PASS: lldb-api :: lang/objc/self/TestObjCSelf.py (1527 of 2356) PASS: lldb-unit :: Utility/./UtilityTests/OptionsWithRawTest.ArgsButNoLeadingDash (1528 of 2356) UNSUPPORTED: lldb-shell :: Register/x86-64-gp-write.test (1529 of 2356) PASS: lldb-unit :: ScriptInterpreter/Python/./ScriptInterpreterPythonTests/PythonDataObjectsTest.TestExtractingUInt64ThroughStructuredData (1530 of 2356) PASS: lldb-api :: functionalities/thread/concurrent_events/TestConcurrentBreakpointOneDelayBreakpointThreads.py (1531 of 2356) PASS: lldb-unit :: Utility/./UtilityTests/BinaryStreamTest.PutULEB128OneByte (1532 of 2356) PASS: lldb-unit :: debugserver/./debugserverTests/RNBSocket.LoopBackConnectIPv4 (1533 of 2356) PASS: lldb-unit :: Editline/./EditlineTests/EditlineTestFixture.EditlineReceivesSingleLineText (1534 of 2356) PASS: lldb-unit :: Utility/./UtilityTests/StringListTest.InsertStringAtIndexStart (1535 of 2356) PASS: lldb-api :: functionalities/thread/thread_exit/TestThreadExit.py (1536 of 2356) PASS: lldb-unit :: ScriptInterpreter/Python/./ScriptInterpreterPythonTests/PythonDataObjectsTest.TestOwnedReferences (1537 of 2356) PASS: lldb-unit :: SymbolFile/DWARF/./SymbolFileDWARFTests/SymbolFileDWARFTests.ParseArangesWithMultipleTerminators (1538 of 2356) PASS: lldb-api :: python_api/value/change_values/TestChangeValueAPI.py (1539 of 2356) PASS: lldb-unit :: Host/./HostTests/NativeProcessProtocolTest.ReadCStringFromMemory (1540 of 2356) PASS: lldb-api :: functionalities/data-formatter/stringprinter/TestStringPrinter.py (1541 of 2356) PASS: lldb-api :: lang/objc/objc-static-method-stripped/TestObjCStaticMethodStripped.py (1542 of 2356) PASS: lldb-api :: functionalities/data-formatter/data-formatter-objc/TestDataFormatterObjCNSDate.py (1543 of 2356) PASS: lldb-api :: functionalities/step_scripted/TestStepScripted.py (1544 of 2356) PASS: lldb-shell :: SymbolFile/DWARF/x86/dwarf5-debug_line.s (1545 of 2356) PASS: lldb-unit :: Utility/./UtilityTests/StringListTest.GetMaxStringLengthMixed (1546 of 2356) PASS: lldb-unit :: Utility/./UtilityTests/StreamTest.AddressRangeInvalidRange (1547 of 2356) PASS: lldb-api :: commands/watchpoints/watchpoint_on_vectors/TestValueOfVectorVariable.py (1548 of 2356) PASS: lldb-shell :: Driver/TestHelp.test (1549 of 2356) PASS: lldb-api :: commands/expression/argument_passing_restrictions/TestArgumentPassingRestrictions.py (1550 of 2356) PASS: lldb-unit :: Utility/./UtilityTests/OptionsWithRawTest.QuotedSuffix (1551 of 2356) PASS: lldb-api :: functionalities/data-formatter/vector-types/TestVectorTypesFormatting.py (1552 of 2356) PASS: lldb-unit :: ScriptInterpreter/Python/./ScriptInterpreterPythonTests/PythonDataObjectsTest.TestPythonDictionaryValueEquality (1553 of 2356) PASS: lldb-api :: functionalities/breakpoint/consecutive_breakpoints/TestConsecutiveBreakpoints.py (1554 of 2356) PASS: lldb-unit :: Process/gdb-remote/./ProcessGdbRemoteTests/GDBRemoteCommunicationClientTest.GetModulesInfo (1555 of 2356) PASS: lldb-unit :: Utility/./UtilityTests/UriParserTest.BadPort2 (1556 of 2356) PASS: lldb-api :: tools/lldb-server/TestGdbRemote_vCont.py (1557 of 2356) UNSUPPORTED: lldb-shell :: Register/x86-64-ymm16-write.test (1558 of 2356) UNSUPPORTED: lldb-api :: functionalities/tsan/multiple/TestTsanMultiple.py (1559 of 2356) PASS: lldb-api :: lang/objc/foundation/TestConstStrings.py (1560 of 2356) UNSUPPORTED: lldb-shell :: Register/x86-gp-read.test (1561 of 2356) PASS: lldb-unit :: Utility/./UtilityTests/UriParserTest.TypicalPortPathIPv4 (1562 of 2356) PASS: lldb-unit :: UnwindAssembly/x86/./UnwindAssemblyx86Tests/Testx86AssemblyInspectionEngine.TestSimple64bitFrameFunction (1563 of 2356) PASS: lldb-api :: functionalities/thread/concurrent_events/TestConcurrentSignalDelayWatch.py (1564 of 2356) PASS: lldb-api :: lang/objcxx/objcxx-ivar-vector/TestIvarVector.py (1565 of 2356) PASS: lldb-api :: lang/cpp/bool/TestCPPBool.py (1566 of 2356) PASS: lldb-unit :: Host/./HostTests/NativeProcessProtocolTest.ReadCStringFromMemory_MaxSize (1567 of 2356) UNSUPPORTED: lldb-api :: functionalities/data-formatter/data-formatter-stl/libstdcpp/string/TestDataFormatterStdString.py (1568 of 2356) UNSUPPORTED: lldb-api :: functionalities/breakpoint/hardware_breakpoints/hardware_breakpoint_on_multiple_threads/TestHWBreakMultiThread.py (1569 of 2356) PASS: lldb-api :: functionalities/inferior-changed/TestInferiorChanged.py (1570 of 2356) PASS: lldb-unit :: Symbol/./SymbolTests/TestTypeSystemClang.TestGetEnumIntegerTypeInvalid (1571 of 2356) PASS: lldb-unit :: Process/Utility/./ProcessUtilityTests/ProcSMapTests/LinuxProcSMapsTestFixture.ParseSMapRegions/3 (1572 of 2356) PASS: lldb-unit :: Utility/./UtilityTests/ArgsTest.TestAppendArg (1573 of 2356) PASS: lldb-api :: functionalities/data-formatter/refpointer-recursion/TestDataFormatterRefPtrRecursion.py (1574 of 2356) PASS: lldb-unit :: Utility/./UtilityTests/StringExtractorTest.GetNameColonValueNoSemicolon (1575 of 2356) PASS: lldb-unit :: Host/./HostTests/SocketTests/SocketTest.DecodeHostAndPort/ipv4 (1576 of 2356) PASS: lldb-api :: assert_messages_test/TestAssertMessages.py (1577 of 2356) PASS: lldb-unit :: Utility/./UtilityTests/StringListTest.ForRangeEmpty (1578 of 2356) PASS: lldb-api :: tools/lldb-server/TestGdbRemoteAttachOrWait.py (1579 of 2356) UNSUPPORTED: lldb-api :: functionalities/thread/concurrent_events/TestConcurrentManySignals.py (1580 of 2356) PASS: lldb-unit :: Utility/./UtilityTests/StreamTest.QuotedCString (1581 of 2356) UNSUPPORTED: lldb-api :: functionalities/data-formatter/data-formatter-stl/libstdcpp/list/TestDataFormatterStdList.py (1582 of 2356) PASS: lldb-unit :: Expression/./ExpressionTests/DiagnosticManagerTest.GetStringPreserveOrder (1583 of 2356) PASS: lldb-unit :: Utility/./UtilityTests/VMRange.CollectionContains (1584 of 2356) PASS: lldb-unit :: Target/./TargetTests/StackFrameRecognizerTest.NullModuleRegex (1585 of 2356) PASS: lldb-unit :: Utility/./UtilityTests/StreamTest.PutMaxHex64ByteOrderLittle (1586 of 2356) PASS: lldb-unit :: Utility/./UtilityTests/StreamTeeTest.Assignment (1587 of 2356) PASS: lldb-api :: commands/expression/import_builtin_fileid/TestImportBuiltinFileID.py (1588 of 2356) PASS: lldb-api :: lang/cpp/class-template-type-parameter-pack/TestClassTemplateTypeParameterPack.py (1589 of 2356) PASS: lldb-unit :: Process/gdb-remote/./ProcessGdbRemoteTests/GDBRemoteCommunicationServerTest.SendErrorResponse_ErrorNumber (1590 of 2356) PASS: lldb-api :: lang/objc/hidden-ivars/TestHiddenIvars.py (1591 of 2356) PASS: lldb-unit :: Utility/./UtilityTests/RangeTest.Union (1592 of 2356) PASS: lldb-shell :: ObjectFile/ELF/PT_LOAD-overlap-PT_INTERP.yaml (1593 of 2356) PASS: lldb-api :: python_api/file_handle/TestFileHandle.py (1594 of 2356) UNSUPPORTED: lldb-shell :: SymbolFile/NativePDB/stack_unwinding01.cpp (1595 of 2356) PASS: lldb-shell :: SymbolFile/DWARF/x86/win-i386-line-table.s (1596 of 2356) UNSUPPORTED: lldb-api :: functionalities/longjmp/TestLongjmp.py (1597 of 2356) PASS: lldb-api :: lang/cpp/chained-calls/TestCppChainedCalls.py (1598 of 2356) PASS: lldb-unit :: Host/./HostTests/SocketTests/SocketTest.TCPListen0ConnectAccept/ipv6 (1599 of 2356) PASS: lldb-api :: lang/cpp/this/TestCPPThis.py (1600 of 2356) PASS: lldb-unit :: UnwindAssembly/x86/./UnwindAssemblyx86Tests/Testx86AssemblyInspectionEngine.TestPopR14 (1601 of 2356) PASS: lldb-unit :: Platform/./LLDBPlatformTests/PlatformDarwinTest.FindComponentInPath (1602 of 2356) PASS: lldb-unit :: Utility/./UtilityTests/NameMatchesTest.EndsWith (1603 of 2356) PASS: lldb-unit :: Utility/./UtilityTests/SubsystemRAIITest.NormalSubsystem (1604 of 2356) PASS: lldb-unit :: SymbolFile/DWARF/./SymbolFileDWARFTests/SymbolFileDWARFTests.TestAbbrevNullAttrValidForm (1605 of 2356) PASS: lldb-api :: functionalities/object-file/TestImageListMultiArchitecture.py (1606 of 2356) PASS: lldb-shell :: SymbolFile/DWARF/x86/dwp-debug-types.s (1607 of 2356) PASS: lldb-unit :: ScriptInterpreter/Python/./ScriptInterpreterPythonTests/PythonDataObjectsTest.TestInstanceNameResolutionNoDot (1608 of 2356) PASS: lldb-api :: commands/disassemble/basic/TestFrameDisassemble.py (1609 of 2356) PASS: lldb-unit :: Utility/./UtilityTests/VASprintfTest.BufferResize (1610 of 2356) UNSUPPORTED: lldb-shell :: Subprocess/clone-follow-parent.test (1611 of 2356) PASS: lldb-api :: functionalities/data-formatter/data-formatter-objc/cmtime/TestDataFormatterCMTime.py (1612 of 2356) PASS: lldb-shell :: ObjectFile/ELF/build-id-case.yaml (1613 of 2356) PASS: lldb-unit :: Utility/./UtilityTests/FileSpecTest.PrependPathComponent (1614 of 2356) PASS: lldb-api :: functionalities/gdb_remote_client/TestNestedRegDefinitions.py (1615 of 2356) PASS: lldb-api :: lang/cpp/inlines/TestInlines.py (1616 of 2356) PASS: lldb-unit :: SymbolFile/DWARF/./SymbolFileDWARFTests/XcodeSDKModuleTests.TestModuleGetXcodeSDK (1617 of 2356) PASS: lldb-shell :: SymbolFile/DWARF/x86/find-variable-file.cpp (1618 of 2356) PASS: lldb-api :: lang/cpp/forward-declared-template-specialization/TestCppForwardDeclaredTemplateSpecialization.py (1619 of 2356) PASS: lldb-api :: commands/expression/import_base_class_when_class_has_derived_member/TestImportBaseClassWhenClassHasDerivedMember.py (1620 of 2356) PASS: lldb-api :: python_api/thread/TestThreadAPI.py (1621 of 2356) PASS: lldb-api :: lang/cpp/auto/TestCPPAuto.py (1622 of 2356) PASS: lldb-unit :: Utility/./UtilityTests/ProcessInstanceInfo.DumpTable (1623 of 2356) PASS: lldb-unit :: Process/gdb-remote/./ProcessGdbRemoteTests/GDBRemoteCommunicationTest.ReadPacket_checksum (1624 of 2356) PASS: lldb-api :: functionalities/tail_call_frames/inlining_and_tail_calls/TestInliningAndTailCalls.py (1625 of 2356) PASS: lldb-unit :: Process/Utility/./ProcessUtilityTests/ProcSMapTests/LinuxProcSMapsTestFixture.ParseSMapRegions/5 (1626 of 2356) PASS: lldb-unit :: SymbolFile/NativePDB/./SymbolFileNativePDBTests/PDBFPOProgramToDWARFExpressionTests.MultipleDependentAssignments (1627 of 2356) PASS: lldb-api :: commands/help/TestHelp.py (1628 of 2356) PASS: lldb-unit :: Symbol/./SymbolTests/TestTypeSystemClang.TestGetTypeClassTypeOf (1629 of 2356) PASS: lldb-unit :: Symbol/./SymbolTests/DWARFCallFrameInfoTest.Basic_dwarf3 (1630 of 2356) PASS: lldb-unit :: Utility/./UtilityTests/ArgsTest.TestTrailingBackslash (1631 of 2356) UNSUPPORTED: lldb-api :: functionalities/data-formatter/data-formatter-stl/libstdcpp/smart_ptr/TestDataFormatterStdSmartPtr.py (1632 of 2356) UNSUPPORTED: lldb-shell :: Register/arm-fp-read.test (1633 of 2356) PASS: lldb-unit :: Expression/./ExpressionTests/CppModuleConfigurationTest.MissingUsrInclude (1634 of 2356) PASS: lldb-api :: test_utils/TestPExpectTest.py (1635 of 2356) PASS: lldb-api :: functionalities/data-formatter/synthcapping/TestSyntheticCapping.py (1636 of 2356) PASS: lldb-api :: lang/c/shared_lib_stripped_symbols/TestSharedLibStrippedSymbols.py (1637 of 2356) PASS: lldb-unit :: Utility/./UtilityTests/StringListTest.AppendStringStdString (1638 of 2356) PASS: lldb-api :: commands/command/script_alias/TestCommandScriptAlias.py (1639 of 2356) PASS: lldb-shell :: ObjectFile/wasm/unified-debug-sections.yaml (1640 of 2356) PASS: lldb-shell :: SymbolFile/DWARF/x86/DW_AT_loclists_base.s (1641 of 2356) PASS: lldb-shell :: lldb-server/TestGdbserverPort.test (1642 of 2356) PASS: lldb-shell :: Commands/command-image-lookup.yaml (1643 of 2356) UNSUPPORTED: lldb-shell :: Unwind/unwind-plan-dwarf-dump.test (1644 of 2356) UNSUPPORTED: lldb-api :: commands/expression/completion-crash-invalid-iterator/TestInvalidIteratorCompletionCrash.py (1645 of 2356) PASS: lldb-shell :: SymbolFile/DWARF/x86/debug_loclists-dwo.s (1646 of 2356) PASS: lldb-api :: lang/cpp/template-function/TestTemplateFunctions.py (1647 of 2356) UNSUPPORTED: lldb-shell :: ScriptInterpreter/Lua/breakpoint_oneline_callback.test (1648 of 2356) PASS: lldb-shell :: Register/Core/x86-64-linux-addr.test (1649 of 2356) UNSUPPORTED: lldb-shell :: SymbolFile/PDB/variables-locations.test (1650 of 2356) PASS: lldb-shell :: Commands/command-script-import.test (1651 of 2356) PASS: lldb-unit :: Process/minidump/./LLDBMinidumpTests/MinidumpParserTest.MinidumpDuplicateModuleMappedFirst (1652 of 2356) PASS: lldb-api :: lang/objc/objc-struct-return/TestObjCStructReturn.py (1653 of 2356) PASS: lldb-api :: tools/lldb-server/TestLldbGdbServer.py (1654 of 2356) PASS: lldb-unit :: Utility/./UtilityTests/BinaryStreamTest.PutSLEB128Zero (1655 of 2356) PASS: lldb-unit :: Utility/./UtilityTests/SerializationRountripTest.SerializeDeserializeCString (1656 of 2356) PASS: lldb-unit :: SymbolFile/NativePDB/./SymbolFileNativePDBTests/PDBFPOProgramToDWARFExpressionTests.UnsupportedRASearch (1657 of 2356) XFAIL: lldb-shell :: Register/x86-mm-xmm-write.test (1658 of 2356) PASS: lldb-unit :: Core/./LLDBCoreTests/DumpDataExtractorTest.Formats (1659 of 2356) PASS: lldb-shell :: Register/Core/x86-32-linux-addr.test (1660 of 2356) PASS: lldb-unit :: tools/lldb-server/tests/./LLDBServerTests/StandardStartupTest.TestStopReplyContainsThreadPcs (1661 of 2356) PASS: lldb-api :: lang/objc/radar-9691614/TestObjCMethodReturningBOOL.py (1662 of 2356) PASS: lldb-api :: lang/objc/forward-decl/TestForwardDecl.py (1663 of 2356) PASS: lldb-api :: functionalities/thread/concurrent_events/TestConcurrentTwoWatchpointThreads.py (1664 of 2356) PASS: lldb-api :: lang/cpp/unique-types/TestUniqueTypes.py (1665 of 2356) PASS: lldb-unit :: ScriptInterpreter/Python/./ScriptInterpreterPythonTests/PythonDataObjectsTest.TestPythonCallableInvoke (1666 of 2356) PASS: lldb-api :: commands/expression/completion-in-lambda-and-unnamed-class/TestCompletionInLambdaAndUnnamedClass.py (1667 of 2356) PASS: lldb-api :: lang/mixed/TestMixedLanguages.py (1668 of 2356) PASS: lldb-unit :: Utility/./UtilityTests/UriParserTest.BracketedHostname (1669 of 2356) UNSUPPORTED: lldb-api :: iohandler/completion/TestIOHandlerCompletion.py (1670 of 2356) PASS: lldb-unit :: Utility/./UtilityTests/ArchSpecTest.YAML (1671 of 2356) PASS: lldb-api :: commands/expression/codegen-crash-typedefdecl-not-in_declcontext/TestCodegenCrashTypedefDeclNotInDeclContext.py (1672 of 2356) PASS: lldb-shell :: Commands/CommandScriptImmediateOutput/CommandScriptImmediateOutputFile.test (1673 of 2356) PASS: lldb-unit :: Utility/./UtilityTests/AnsiTerminal.Basic (1674 of 2356) PASS: lldb-unit :: UnwindAssembly/x86/./UnwindAssemblyx86Tests/Testx86AssemblyInspectionEngine.TestDisassemblyMidFunctionEpilogues (1675 of 2356) PASS: lldb-shell :: Register/Core/x86-32-netbsd-addr.test (1676 of 2356) PASS: lldb-unit :: Utility/./UtilityTests/ReproducerTest.SetReplay (1677 of 2356) PASS: lldb-unit :: ScriptInterpreter/Python/./ScriptInterpreterPythonTests/PythonDataObjectsTest.TestPythonIntegerToStr (1678 of 2356) PASS: lldb-shell :: ObjectFile/PECOFF/dep-modules.yaml (1679 of 2356) PASS: lldb-api :: functionalities/data-formatter/summary-string-onfail/Test-rdar-9974002.py (1680 of 2356) PASS: lldb-unit :: Expression/./ExpressionTests/DWARFExpression.DW_OP_stack_value (1681 of 2356) PASS: lldb-shell :: SymbolFile/Breakpad/symtab.test (1682 of 2356) XFAIL: lldb-shell :: Expr/nodefaultlib.cpp (1683 of 2356) PASS: lldb-unit :: UnwindAssembly/x86/./UnwindAssemblyx86Tests/Testx86AssemblyInspectionEngine.TestSimplex86_64Augmented (1684 of 2356) PASS: lldb-api :: lang/c/forward/TestForwardDeclaration.py (1685 of 2356) PASS: lldb-shell :: ScriptInterpreter/Python/command_import.test (1686 of 2356) PASS: lldb-unit :: Utility/./UtilityTests/StreamTest.AddressRangeSize (1687 of 2356) PASS: lldb-api :: functionalities/data-formatter/data-formatter-stl/libcxx/variant/TestDataFormatterLibcxxVariant.py (1688 of 2356) PASS: lldb-api :: lang/objc/single-entry-dictionary/TestObjCSingleEntryDictionary.py (1689 of 2356) PASS: lldb-api :: commands/expression/import-std-module/sysroot/TestStdModuleSysroot.py (1690 of 2356) PASS: lldb-api :: python_api/function_symbol/TestDisasmAPI.py (1691 of 2356) PASS: lldb-api :: functionalities/data-formatter/nsarraysynth/TestNSArraySynthetic.py (1692 of 2356) PASS: lldb-unit :: SymbolFile/DWARF/./SymbolFileDWARFTests/SymbolFileDWARFTests.TestAbilitiesForDWARF (1693 of 2356) PASS: lldb-api :: commands/target/stop-hook/delete/TestTargetStopHookDelete.py (1694 of 2356) PASS: lldb-api :: commands/target/stop-hooks/TestStopHooks.py (1695 of 2356) UNSUPPORTED: lldb-shell :: ScriptInterpreter/Lua/lua.test (1696 of 2356) PASS: lldb-unit :: SymbolFile/NativePDB/./SymbolFileNativePDBTests/PDBFPOProgramToDWARFExpressionTests.UnresolvedRegisterReference (1697 of 2356) PASS: lldb-api :: commands/target/dump-symtab-demangle/TestDumpSymtabDemangle.py (1698 of 2356) PASS: lldb-api :: python_api/sblaunchinfo/TestSBLaunchInfo.py (1699 of 2356) PASS: lldb-unit :: Utility/./UtilityTests/StreamTest.PutPtr (1700 of 2356) PASS: lldb-shell :: Reproducer/TestSynchronous.test (1701 of 2356) PASS: lldb-unit :: Utility/./UtilityTests/UUIDTest.RelationalOperators (1702 of 2356) PASS: lldb-api :: functionalities/breakpoint/breakpoint_language/TestBreakpointLanguage.py (1703 of 2356) PASS: lldb-unit :: Symbol/./SymbolTests/TestTypeSystemClang.TestDisplayName (1704 of 2356) PASS: lldb-api :: commands/expression/import-std-module/vector-bool/TestVectorBoolFromStdModule.py (1705 of 2356) PASS: lldb-api :: commands/expression/import-std-module/vector-of-vectors/TestVectorOfVectorsFromStdModule.py (1706 of 2356) PASS: lldb-unit :: Interpreter/./InterpreterTests/CompletionTest.DirCompletionAbsolute (1707 of 2356) PASS: lldb-unit :: Utility/./UtilityTests/StreamTest.AddressSuffix (1708 of 2356) PASS: lldb-api :: macosx/profile_vrs_detach/TestDetachVrsProfile.py (1709 of 2356) PASS: lldb-unit :: Process/minidump/./LLDBMinidumpTests/RegisterContextMinidump.ConvertMinidumpContext_x86_64 (1710 of 2356) PASS: lldb-unit :: Signals/./SignalsTests/UnixSignalsTest.GetInfo (1711 of 2356) PASS: lldb-unit :: Process/gdb-remote/./ProcessGdbRemoteTests/GDBRemoteCommunicationServerTest.SendErrorResponse_ErrorList (1712 of 2356) PASS: lldb-unit :: Utility/./UtilityTests/StringExtractorTest.GetHexU8_Extra (1713 of 2356) PASS: lldb-shell :: Settings/TestFrameFormatMangling.test (1714 of 2356) PASS: lldb-unit :: Utility/./UtilityTests/GeneratorTest.GetOrCreate (1715 of 2356) PASS: lldb-api :: lang/c/inlines/TestRedefinitionsInInlines.py (1716 of 2356) PASS: lldb-unit :: Expression/./ExpressionTests/CppModuleConfigurationTest.UnrelatedLibrary (1717 of 2356) PASS: lldb-unit :: Utility/./UtilityTests/ScalarTest.Comparison (1718 of 2356) PASS: lldb-shell :: ObjectFile/MachO/symtab.yaml (1719 of 2356) PASS: lldb-api :: functionalities/gdb_remote_client/TestMultiprocess.py (1720 of 2356) PASS: lldb-api :: python_api/frame/get-variables/TestGetVariables.py (1721 of 2356) PASS: lldb-shell :: Minidump/Windows/Sigsegv/sigsegv.test (1722 of 2356) PASS: lldb-api :: functionalities/gdb_remote_client/TestRegDefinitionInParts.py (1723 of 2356) PASS: lldb-unit :: Utility/./UtilityTests/StringListTest.InsertStringAtIndexMove (1724 of 2356) PASS: lldb-unit :: Utility/./UtilityTests/OptionsWithRawTest.MultiWordSuffix (1725 of 2356) PASS: lldb-unit :: Host/./HostTests/NativeProcessProtocolTest.SetBreakpointFailVerify (1726 of 2356) PASS: lldb-api :: functionalities/signal/TestSendSignal.py (1727 of 2356) UNSUPPORTED: lldb-api :: functionalities/tsan/cpp_global_location/TestTsanCPPGlobalLocation.py (1728 of 2356) PASS: lldb-unit :: Expression/./ExpressionTests/DWARFExpression.DW_OP_convert (1729 of 2356) PASS: lldb-unit :: ObjectFile/Breakpad/./ObjectFileBreakpadTests/PublicRecord.parse (1730 of 2356) PASS: lldb-api :: functionalities/data-formatter/nsdictionarysynth/TestNSDictionarySynthetic.py (1731 of 2356) PASS: lldb-unit :: Language/Highlighting/./HighlighterTests/HighlighterTest.ClangTrailingBackslashMissingNewLine (1732 of 2356) PASS: lldb-unit :: Host/./HostTests/FileSystemTest.Readable (1733 of 2356) PASS: lldb-api :: lang/objc/objc-super/TestObjCSuper.py (1734 of 2356) PASS: lldb-shell :: SymbolFile/DWARF/x86/dwarf5-index-is-used.cpp (1735 of 2356) PASS: lldb-shell :: Driver/TestNoUseColor.test (1736 of 2356) PASS: lldb-unit :: Process/gdb-remote/./ProcessGdbRemoteTests/PortMapTest.FreePort (1737 of 2356) PASS: lldb-unit :: ScriptInterpreter/Python/./ScriptInterpreterPythonTests/PythonDataObjectsTest.TestModuleNameResolutionNoDot (1738 of 2356) PASS: lldb-shell :: lldb-server/TestErrorMessages.test (1739 of 2356) PASS: lldb-unit :: Symbol/./SymbolTests/TestTypeSystemClang.TestDeletingImplicitCopyCstrDueToMoveCStr (1740 of 2356) PASS: lldb-api :: lang/cpp/typedef/TestCppTypedef.py (1741 of 2356) UNSUPPORTED: lldb-api :: functionalities/darwin_log/filter/regex/subsystem/TestDarwinLogFilterRegexSubsystem.py (1742 of 2356) PASS: lldb-unit :: Symbol/./SymbolTests/SymbolsTest.LocateExecutableSymbolFileForUnknownExecutableAndMissingSymbolFile (1743 of 2356) PASS: lldb-shell :: ObjectFile/ELF/netbsd-exec-8.99.30-amd64.yaml (1744 of 2356) PASS: lldb-unit :: Process/gdb-remote/./ProcessGdbRemoteTests/GDBRemoteCommunicationServerTest.SendErrorResponse_Status (1745 of 2356) PASS: lldb-unit :: UnwindAssembly/x86/./UnwindAssemblyx86Tests/Testx86AssemblyInspectionEngine.TestPushR14 (1746 of 2356) PASS: lldb-unit :: Core/./LLDBCoreTests/ModuleSpecTest.TestMachOFile (1747 of 2356) PASS: lldb-unit :: Utility/./UtilityTests/StringListTest.AppendList (1748 of 2356) UNSUPPORTED: lldb-api :: commands/register/register/intel_xtended_registers/TestMPXRegisters.py (1749 of 2356) PASS: lldb-api :: commands/version/TestVersion.py (1750 of 2356) PASS: lldb-unit :: Utility/./UtilityTests/BinaryStreamTest.PutULEB128One (1751 of 2356) PASS: lldb-unit :: Process/minidump/./LLDBMinidumpTests/MinidumpParserTest.InvalidMinidump (1752 of 2356) PASS: lldb-api :: functionalities/breakpoint/global_constructor/TestBreakpointInGlobalConstructor.py (1753 of 2356) PASS: lldb-api :: functionalities/rerun/TestRerun.py (1754 of 2356) PASS: lldb-unit :: Core/./LLDBCoreTests/MangledTest.ResultForValidName (1755 of 2356) PASS: lldb-unit :: UnwindAssembly/x86/./UnwindAssemblyx86Tests/Testx86AssemblyInspectionEngine.TestPushRBPWithREX (1756 of 2356) PASS: lldb-shell :: Reproducer/Functionalities/TestExpressionEvaluation.test (1757 of 2356) PASS: lldb-unit :: Utility/./UtilityTests/RangeTest.SetRangeBase (1758 of 2356) PASS: lldb-unit :: UnwindAssembly/x86/./UnwindAssemblyx86Tests/Testx86AssemblyInspectionEngine.TestSpillRegToStackViaMOVx86_64 (1759 of 2356) PASS: lldb-api :: functionalities/gdb_remote_client/TestRecognizeBreakpoint.py (1760 of 2356) PASS: lldb-unit :: Expression/./ExpressionTests/DiagnosticManagerTest.GetStringNoDiags (1761 of 2356) PASS: lldb-unit :: UnwindAssembly/x86/./UnwindAssemblyx86Tests/Testx86AssemblyInspectionEngine.TestPushR12 (1762 of 2356) PASS: lldb-shell :: Commands/command-disassemble.s (1763 of 2356) PASS: lldb-unit :: Symbol/./SymbolTests/TestTypeSystemClang.TestGetBasicTypeFromEnum (1764 of 2356) PASS: lldb-unit :: Utility/./UtilityTests/BinaryStreamTest.PutSLEB128OneByte (1765 of 2356) PASS: lldb-unit :: Symbol/./SymbolTests/TestClangASTImporter.CanImportInvalidType (1766 of 2356) PASS: lldb-shell :: ObjectFile/ELF/section-types.yaml (1767 of 2356) PASS: lldb-shell :: ObjectFile/ELF/aarch64-relocations.yaml (1768 of 2356) PASS: lldb-unit :: DataFormatter/./LLDBFormatterTests/StringPrinterTests.SwiftUTF8 (1769 of 2356) PASS: lldb-api :: lang/objc/exceptions/TestObjCExceptions.py (1770 of 2356) PASS: lldb-shell :: Settings/TestDefaultModuleCachePath.test (1771 of 2356) UNSUPPORTED: lldb-api :: functionalities/data-formatter/data-formatter-stl/libstdcpp/vector/TestDataFormatterStdVector.py (1772 of 2356) PASS: lldb-unit :: Utility/./UtilityTests/RecordReplayTest.InvalidSequence (1773 of 2356) PASS: lldb-unit :: Language/Highlighting/./HighlighterTests/HighlighterTest.ClangBraces (1774 of 2356) PASS: lldb-unit :: Process/minidump/./LLDBMinidumpTests/MinidumpParserTest.GetPidWindows (1775 of 2356) PASS: lldb-unit :: Utility/./UtilityTests/VMRange.IsValid (1776 of 2356) PASS: lldb-api :: macosx/debugserver-exit-code/TestDebugServerExitCode.py (1777 of 2356) PASS: lldb-api :: commands/expression/anonymous-struct/TestCallUserAnonTypedef.py (1778 of 2356) PASS: lldb-unit :: Expression/./ExpressionTests/DiagnosticManagerTest.PutStringSeverities (1779 of 2356) PASS: lldb-shell :: ScriptInterpreter/Python/Crashlog/json.test (1780 of 2356) PASS: lldb-unit :: ScriptInterpreter/Python/./ScriptInterpreterPythonTests/PythonDataObjectsTest.TestPythonListValueEquality (1781 of 2356) PASS: lldb-shell :: ObjectFile/Breakpad/breakpad-identification.test (1782 of 2356) PASS: lldb-shell :: SymbolFile/DWARF/x86/subprogram_ranges.test (1783 of 2356) PASS: lldb-api :: functionalities/process_group/TestChangeProcessGroup.py (1784 of 2356) PASS: lldb-shell :: Driver/TestProcessAttach.test (1785 of 2356) PASS: lldb-unit :: Host/./HostTests/NativeProcessProtocolTest.ReadCStringFromMemory_CrossPageBoundary (1786 of 2356) PASS: lldb-api :: lang/cpp/limit-debug-info/TestWithLimitDebugInfo.py (1787 of 2356) PASS: lldb-unit :: Language/Highlighting/./HighlighterTests/HighlighterTest.ClangCursorPosBeforeOtherToken (1788 of 2356) PASS: lldb-unit :: Process/Utility/./ProcessUtilityTests/ProcMapTests/LinuxProcMapsTestFixture.ParseMapRegions/6 (1789 of 2356) PASS: lldb-shell :: Breakpoint/case-sensitive.test (1790 of 2356) PASS: lldb-api :: source-manager/TestSourceManager.py (1791 of 2356) PASS: lldb-unit :: Core/./LLDBCoreTests/DumpDataExtractorTest.BaseAddress (1792 of 2356) PASS: lldb-api :: tools/lldb-server/commandline/TestStubSetSID.py (1793 of 2356) PASS: lldb-shell :: Expr/TestIRMemoryMap.test (1794 of 2356) PASS: lldb-api :: functionalities/dead-strip/TestDeadStrip.py (1795 of 2356) PASS: lldb-unit :: Utility/./UtilityTests/ListenerTest.GetEventImmediate (1796 of 2356) UNSUPPORTED: lldb-api :: tools/lldb-server/TestGdbRemoteFork.py (1797 of 2356) PASS: lldb-api :: functionalities/thread/concurrent_events/TestConcurrentCrashWithWatchpoint.py (1798 of 2356) PASS: lldb-api :: lang/cpp/dynamic-value/TestCppValueCast.py (1799 of 2356) PASS: lldb-unit :: Utility/./UtilityTests/TimeoutTest.Construction (1800 of 2356) PASS: lldb-api :: commands/expression/radar_9531204/TestPrintfAfterUp.py (1801 of 2356) PASS: lldb-api :: lang/cpp/dynamic-value-same-basename/TestDynamicValueSameBase.py (1802 of 2356) PASS: lldb-api :: macosx/find-dsym/bundle-with-dot-in-filename/TestBundleWithDotInFilename.py (1803 of 2356) PASS: lldb-unit :: Utility/./UtilityTests/DeserializerTest.HasData (1804 of 2356) PASS: lldb-unit :: SymbolFile/DWARF/./SymbolFileDWARFTests/SymbolFileDWARFTests.TestAbbrevOrder1Start1 (1805 of 2356) PASS: lldb-unit :: Language/Highlighting/./HighlighterTests/HighlighterTest.ClangCursorPosInOtherToken (1806 of 2356) UNSUPPORTED: lldb-api :: functionalities/gdb_remote_client/TestQemuAArch64TargetXml.py (1807 of 2356) PASS: lldb-api :: commands/expression/entry-bp/TestExprEntryBP.py (1808 of 2356) PASS: lldb-unit :: Utility/./UtilityTests/SharedCluster.ClusterManager (1809 of 2356) PASS: lldb-shell :: SymbolFile/Breakpad/unwind-via-stack-win.test (1810 of 2356) PASS: lldb-unit :: UnwindAssembly/x86/./UnwindAssemblyx86Tests/Testx86AssemblyInspectionEngine.TestPushEDX (1811 of 2356) PASS: lldb-shell :: Register/Core/x86-32-freebsd-addr.test (1812 of 2356) UNSUPPORTED: lldb-shell :: ScriptInterpreter/Lua/lua-python.test (1813 of 2356) PASS: lldb-unit :: Process/gdb-remote/./ProcessGdbRemoteTests/GDBRemoteClientBaseTest.SendPacketAndReceiveResponseWithOutputSupport (1814 of 2356) PASS: lldb-unit :: Process/minidump/./LLDBMinidumpTests/MinidumpParserTest.GetThreadContext_x86_64 (1815 of 2356) PASS: lldb-unit :: Utility/./UtilityTests/ScalarTest.ExtractBitfield (1816 of 2356) PASS: lldb-api :: lang/cpp/namespace_definitions/TestNamespaceDefinitions.py (1817 of 2356) PASS: lldb-api :: lang/cpp/operators/TestCppOperators.py (1818 of 2356) PASS: lldb-api :: functionalities/thread/concurrent_events/TestConcurrentSignalBreak.py (1819 of 2356) PASS: lldb-unit :: Expression/./ExpressionTests/DiagnosticManagerTest.GetStringMultiline (1820 of 2356) PASS: lldb-unit :: Symbol/./SymbolTests/TestClangASTImporter.DeportTypeTagDecl (1821 of 2356) UNSUPPORTED: lldb-api :: arm/breakpoint-it/TestBreakpointIt.py (1822 of 2356) PASS: lldb-api :: functionalities/gdb_remote_client/TestGDBRemoteDiskFileCompletion.py (1823 of 2356) PASS: lldb-unit :: Host/./HostTests/NativeProcessProtocolTest.SetBreakpointFailRead (1824 of 2356) PASS: lldb-shell :: SymbolFile/Breakpad/unwind-via-stack-win-no-memory-info.yaml (1825 of 2356) UNSUPPORTED: lldb-shell :: SymbolFile/NativePDB/ast-functions-msvc.cpp (1826 of 2356) PASS: lldb-api :: lang/objc/variadic_methods/TestVariadicMethods.py (1827 of 2356) PASS: lldb-api :: functionalities/data-formatter/varscript_formatting/TestDataFormatterVarScriptFormatting.py (1828 of 2356) PASS: lldb-api :: functionalities/mtc/simple/TestMTCSimple.py (1829 of 2356) PASS: lldb-shell :: Subprocess/vfork-follow-parent.test (1830 of 2356) PASS: lldb-api :: lang/cpp/template/TestTemplateArgs.py (1831 of 2356) PASS: lldb-api :: functionalities/postmortem/elf-core/thread_crash/TestLinuxCoreThreads.py (1832 of 2356) PASS: lldb-unit :: Expression/./ExpressionTests/DiagnosticManagerTest.HasFixits (1833 of 2356) PASS: lldb-shell :: Reproducer/TestMultipleTargets.test (1834 of 2356) PASS: lldb-unit :: Host/./HostTests/SocketTests/SocketTest.TCPGetConnectURI/ipv4 (1835 of 2356) PASS: lldb-api :: lang/cpp/pointer_to_member_type_depending_on_parent_size/TestPointerToMemberTypeDependingOnParentSize.py (1836 of 2356) PASS: lldb-unit :: ObjectFile/MachO/./ObjectFileMachOTests/ObjectFileMachOTest.ModuleFromSharedCacheInfo (1837 of 2356) PASS: lldb-shell :: SymbolFile/NativePDB/break-by-function.cpp (1838 of 2356) PASS: lldb-unit :: Utility/./UtilityTests/DataExtractorTest.GetFloatUnaligned (1839 of 2356) PASS: lldb-unit :: Utility/./UtilityTests/LogTest.Register (1840 of 2356) PASS: lldb-unit :: Utility/./UtilityTests/StringExtractorTest.InitMisc (1841 of 2356) PASS: lldb-unit :: Utility/./UtilityTests/ArgsTest.TestInsertArg (1842 of 2356) UNSUPPORTED: lldb-shell :: SymbolFile/DWARF/x86/dwarf5-line-strp.s (1843 of 2356) PASS: lldb-unit :: Symbol/./SymbolTests/TestTypeSystemClang.TestUnifyAccessSpecifiers (1844 of 2356) PASS: lldb-api :: lang/objc/objc-property/TestObjCProperty.py (1845 of 2356) PASS: lldb-api :: lang/cpp/elaborated-types/TestElaboratedTypes.py (1846 of 2356) PASS: lldb-api :: commands/frame/recognizer/TestFrameRecognizer.py (1847 of 2356) PASS: lldb-unit :: Utility/./UtilityTests/StringListTest.LongestCommonPrefixEmpty (1848 of 2356) PASS: lldb-api :: functionalities/thread/concurrent_events/TestConcurrentCrashWithWatchpointBreakpointSignal.py (1849 of 2356) PASS: lldb-api :: functionalities/data-formatter/boolreference/TestFormattersBoolRefPtr.py (1850 of 2356) PASS: lldb-unit :: Utility/./UtilityTests/OptionsWithRawTest.WhitespaceInput (1851 of 2356) PASS: lldb-shell :: ObjectFile/PECOFF/basic-info.yaml (1852 of 2356) PASS: lldb-api :: sanity/TestSettingSkipping.py (1853 of 2356) PASS: lldb-api :: functionalities/data-formatter/data-formatter-smart-array/TestDataFormatterSmartArray.py (1854 of 2356) PASS: lldb-api :: python_api/watchpoint/TestSetWatchpoint.py (1855 of 2356) PASS: lldb-unit :: Utility/./UtilityTests/BinaryStreamTest.PutSLEB128SevenBytes (1856 of 2356) PASS: lldb-api :: functionalities/abbreviation/TestCommonShortSpellings.py (1857 of 2356) UNSUPPORTED: lldb-api :: functionalities/data-formatter/data-formatter-stl/libstdcpp/map/TestDataFormatterStdMap.py (1858 of 2356) PASS: lldb-unit :: Utility/./UtilityTests/RecordReplayTest.InstrumentedBar (1859 of 2356) PASS: lldb-unit :: Utility/./UtilityTests/OptionsWithRawTest.TerminatedQuote (1860 of 2356) UNSUPPORTED: lldb-shell :: Register/x86-64-xmm16-read.test (1861 of 2356) PASS: lldb-api :: python_api/watchpoint/TestWatchpointIgnoreCount.py (1862 of 2356) PASS: lldb-api :: lang/cpp/this_class_type_mixing/TestThisClassTypeMixing.py (1863 of 2356) PASS: lldb-api :: functionalities/load_lazy/TestLoadUsingLazyBind.py (1864 of 2356) PASS: lldb-shell :: ScriptInterpreter/Python/fail_breakpoint_oneline.test (1865 of 2356) PASS: lldb-shell :: ObjectFile/ELF/null-jmprel.yaml (1866 of 2356) PASS: lldb-unit :: SymbolFile/DWARF/./SymbolFileDWARFTests/SymbolFileDWARFTests.TestAbbrevValidAttrNullForm (1867 of 2356) PASS: lldb-unit :: Process/./ProcessEventDataTests/ProcessEventDataTest.DoOnRemoval (1868 of 2356) PASS: lldb-api :: commands/expression/call-function/TestCallUserDefinedFunction.py (1869 of 2356) PASS: lldb-shell :: Breakpoint/debug_rnglist_offset_pair.test (1870 of 2356) PASS: lldb-api :: functionalities/inferior-crashing/TestInferiorCrashingStep.py (1871 of 2356) PASS: lldb-unit :: Target/./TargetTests/MemoryRegionInfoTest.Formatv (1872 of 2356) PASS: lldb-unit :: debugserver/./debugserverTests/JSON.Parse (1873 of 2356) PASS: lldb-shell :: SymbolFile/NativePDB/ast-methods.cpp (1874 of 2356) PASS: lldb-shell :: SymbolFile/NativePDB/source-list.cpp (1875 of 2356) PASS: lldb-shell :: SymbolFile/DWARF/x86/childless-compile-unit.s (1876 of 2356) PASS: lldb-unit :: Interpreter/./InterpreterTests/OptionArgParserTest.toChar (1877 of 2356) PASS: lldb-api :: functionalities/data-formatter/data-formatter-stl/libstdcpp/unique_ptr/invalid/TestDataFormatterInvalidStdUniquePtr.py (1878 of 2356) PASS: lldb-api :: functionalities/data-formatter/data-formatter-stl/libcxx/vector/TestDataFormatterLibcxxVector.py (1879 of 2356) PASS: lldb-unit :: UnwindAssembly/x86/./UnwindAssemblyx86Tests/Testx86AssemblyInspectionEngine.TestPushEDI (1880 of 2356) PASS: lldb-unit :: Utility/./UtilityTests/StreamTest.ShiftOperatorStrings (1881 of 2356) PASS: lldb-unit :: Target/./TargetTests/ModuleCacheTest.GetAndPutStrangeHostname (1882 of 2356) PASS: lldb-api :: functionalities/testid/TestTestId.py (1883 of 2356) PASS: lldb-api :: functionalities/data-formatter/data-formatter-ptr-to-array/TestPtrToArrayFormatting.py (1884 of 2356) PASS: lldb-api :: lang/cpp/thread_local/TestThreadLocal.py (1885 of 2356) PASS: lldb-api :: macosx/macCatalyst/TestMacCatalyst.py (1886 of 2356) PASS: lldb-api :: lang/cpp/char8_t/TestCxxChar8_t.py (1887 of 2356) PASS: lldb-unit :: Utility/./UtilityTests/FileSpecTest.CopyByAppendingPathComponent (1888 of 2356) PASS: lldb-unit :: Utility/./UtilityTests/RangeTest.NotEqualInvalid (1889 of 2356) PASS: lldb-unit :: ScriptInterpreter/Python/./ScriptInterpreterPythonTests/PythonDataObjectsTest.TestPythonTupleInitializerList (1890 of 2356) PASS: lldb-api :: python_api/disassemble-raw-data/TestDisassembleRawData.py (1891 of 2356) PASS: lldb-unit :: Utility/./UtilityTests/StringLexerTest.NextIf (1892 of 2356) PASS: lldb-unit :: Utility/./UtilityTests/AnsiTerminal.Empty (1893 of 2356) PASS: lldb-unit :: Process/Utility/./ProcessUtilityTests/ProcSMapTests/LinuxProcSMapsTestFixture.ParseSMapRegions/1 (1894 of 2356) PASS: lldb-unit :: Expression/./ExpressionTests/ClangHostTest.MacOSX (1895 of 2356) PASS: lldb-unit :: Utility/./UtilityTests/ProcessInstanceInfo.Yaml (1896 of 2356) UNSUPPORTED: lldb-api :: linux/sepdebugsymlink/TestTargetSymbolsSepDebugSymlink.py (1897 of 2356) PASS: lldb-api :: functionalities/backticks/TestBackticksWithoutATarget.py (1898 of 2356) PASS: lldb-unit :: Thread/./ThreadTests/ThreadTest.SetStopInfo (1899 of 2356) PASS: lldb-shell :: ObjectFile/PECOFF/sections.yaml (1900 of 2356) PASS: lldb-unit :: Utility/./UtilityTests/PassiveReplayTest.InstrumentedBarRef (1901 of 2356) PASS: lldb-api :: functionalities/stats_api/TestStatisticsAPI.py (1902 of 2356) PASS: lldb-api :: functionalities/gdb_remote_client/TestJLink6Armv7RegisterDefinition.py (1903 of 2356) PASS: lldb-unit :: Utility/./UtilityTests/RecordReplayTest.InstrumentedBarRef (1904 of 2356) PASS: lldb-api :: lang/cpp/llvm-style/TestLLVMStyle.py (1905 of 2356) PASS: lldb-shell :: Driver/TestError.test (1906 of 2356) PASS: lldb-api :: commands/expression/issue_11588/Test11588.py (1907 of 2356) PASS: lldb-unit :: Utility/./UtilityTests/StringLexerTest.PutBack (1908 of 2356) PASS: lldb-unit :: ObjectFile/Breakpad/./ObjectFileBreakpadTests/ModuleRecord.parse (1909 of 2356) PASS: lldb-shell :: Breakpoint/dummy-target.test (1910 of 2356) PASS: lldb-unit :: Utility/./UtilityTests/UUIDTest.SetFromStringRef (1911 of 2356) PASS: lldb-api :: functionalities/thread/exit_during_break/TestExitDuringBreak.py (1912 of 2356) PASS: lldb-shell :: SymbolFile/NativePDB/function-types-calling-conv.cpp (1913 of 2356) PASS: lldb-unit :: Platform/./LLDBPlatformTests/PlatformAppleSimulatorTest.TestSimHasSimEnvionament (1914 of 2356) PASS: lldb-unit :: Utility/./UtilityTests/StringListTest.CopyList (1915 of 2356) UNSUPPORTED: lldb-api :: functionalities/data-formatter/data-formatter-stl/libstdcpp/iterator/TestDataFormatterStdIterator.py (1916 of 2356) PASS: lldb-api :: commands/target/stop-hook/disable/TestTargetStopHookDisable.py (1917 of 2356) PASS: lldb-unit :: Interpreter/./InterpreterTests/TestProperties.DeepCopy (1918 of 2356) PASS: lldb-unit :: Process/minidump/./LLDBMinidumpTests/MinidumpParserTest.GetArchitecture (1919 of 2356) PASS: lldb-shell :: SymbolFile/DWARF/x86/parallel-indexing-stress.s (1920 of 2356) PASS: lldb-unit :: debugserver/./debugserverTests/RNBSocket.LoopBackListenIPv6 (1921 of 2356) PASS: lldb-unit :: Core/./LLDBCoreTests/FormatEntity.LookupAllEntriesInTree (1922 of 2356) PASS: lldb-unit :: Host/./HostTests/MainLoopTest.ReadObject (1923 of 2356) PASS: lldb-unit :: Expression/./ExpressionTests/DiagnosticManagerTest.AppendMessageSubsequentDiags (1924 of 2356) PASS: lldb-api :: lang/cpp/typeof/TestTypeOfDeclTypeExpr.py (1925 of 2356) PASS: lldb-unit :: DataFormatter/./LLDBFormatterTests/TypeMatcherTests.RegexMatchPart (1926 of 2356) PASS: lldb-unit :: UnwindAssembly/x86/./UnwindAssemblyx86Tests/Testx86AssemblyInspectionEngine.TestPushECX (1927 of 2356) PASS: lldb-unit :: SymbolFile/NativePDB/./SymbolFileNativePDBTests/PDBFPOProgramToDWARFExpressionTests.DependencyChain (1928 of 2356) PASS: lldb-unit :: Utility/./UtilityTests/XcodeSDKTest.SDKSupportsSwift (1929 of 2356) PASS: lldb-api :: commands/expression/radar_8638051/Test8638051.py (1930 of 2356) PASS: lldb-unit :: Utility/./UtilityTests/BinaryStreamTest.PutULEB128NineBytes (1931 of 2356) PASS: lldb-unit :: Expression/./ExpressionTests/DWARFExpression.DW_OP_implicit_value (1932 of 2356) PASS: lldb-shell :: ObjectFile/wasm/basic.yaml (1933 of 2356) PASS: lldb-api :: commands/expression/test/TestExprs2.py (1934 of 2356) PASS: lldb-shell :: VSCode/TestOptions.test (1935 of 2356) PASS: lldb-api :: python_api/lldbutil/frame/TestFrameUtils.py (1936 of 2356) PASS: lldb-shell :: ObjectFile/PECOFF/basic-info-arm.yaml (1937 of 2356) PASS: lldb-api :: functionalities/gdb_remote_client/TestThreadSelectionBug.py (1938 of 2356) PASS: lldb-api :: functionalities/non-overlapping-index-variable-i/TestIndexVariable.py (1939 of 2356) PASS: lldb-api :: commands/expression/xvalue/TestXValuePrinting.py (1940 of 2356) PASS: lldb-unit :: Process/Utility/./ProcessUtilityTests/MemoryTagManagerAArch64MTETest.RemoveNonAddressBits (1941 of 2356) PASS: lldb-api :: lang/cpp/class_static/TestStaticVariables.py (1942 of 2356) PASS: lldb-api :: python_api/formatters/TestFormattersSBAPI.py (1943 of 2356) PASS: lldb-unit :: Utility/./UtilityTests/StringExtractorTest.GetHexU8_Underflow (1944 of 2356) PASS: lldb-shell :: SymbolFile/DWARF/anon_class_w_and_wo_export_symbols.ll (1945 of 2356) PASS: lldb-unit :: Utility/./UtilityTests/RangeDataVector.FindEntryThatContains_Overlap (1946 of 2356) PASS: lldb-unit :: Process/minidump/./LLDBMinidumpTests/MinidumpParserTest.GetPidWow64 (1947 of 2356) PASS: lldb-unit :: ScriptInterpreter/Python/./ScriptInterpreterPythonTests/PythonDataObjectsTest.TestBorrowedReferences (1948 of 2356) PASS: lldb-api :: lang/cpp/multiple-inheritance/TestCppMultipleInheritance.py (1949 of 2356) UNSUPPORTED: lldb-api :: lang/cpp/printf/TestPrintf.py (1950 of 2356) PASS: lldb-shell :: Reproducer/TestDSYM.test (1951 of 2356) UNSUPPORTED: lldb-shell :: ScriptInterpreter/Lua/command_script_import.test (1952 of 2356) PASS: lldb-api :: functionalities/data-formatter/data-formatter-categories/TestDataFormatterCategories.py (1953 of 2356) PASS: lldb-unit :: DataFormatter/./LLDBFormatterTests/TypeMatcherTests.RegexName (1954 of 2356) PASS: lldb-api :: functionalities/load_unload/TestLoadUnload.py (1955 of 2356) PASS: lldb-shell :: SymbolFile/DWARF/x86/find-method.cpp (1956 of 2356) PASS: lldb-api :: lang/cpp/non-type-template-param/TestCppNonTypeTemplateParam.py (1957 of 2356) PASS: lldb-api :: functionalities/breakpoint/objc/TestObjCBreakpoints.py (1958 of 2356) PASS: lldb-api :: functionalities/thread/concurrent_events/TestConcurrentSignalWatch.py (1959 of 2356) PASS: lldb-api :: functionalities/data-formatter/data-formatter-objc/nsstring/TestDataFormatterNSString.py (1960 of 2356) PASS: lldb-api :: python_api/hello_world/TestHelloWorld.py (1961 of 2356) PASS: lldb-api :: functionalities/thread/concurrent_events/TestConcurrentManyBreakpoints.py (1962 of 2356) PASS: lldb-api :: commands/expression/namespace_local_var_same_name_cpp_and_c/TestNamespaceLocalVarSameNameCppAndC.py (1963 of 2356) PASS: lldb-api :: types/TestShortTypeExpr.py (1964 of 2356) PASS: lldb-api :: macosx/DBGSourcePathRemapping/TestDSYMSourcePathRemapping.py (1965 of 2356) PASS: lldb-api :: commands/process/attach/TestProcessAttach.py (1966 of 2356) PASS: lldb-api :: functionalities/breakpoint/address_breakpoints/TestAddressBreakpoints.py (1967 of 2356) PASS: lldb-unit :: ScriptInterpreter/Python/./ScriptInterpreterPythonTests/PythonDataObjectsTest.TestScript (1968 of 2356) PASS: lldb-unit :: Utility/./UtilityTests/ArgsTest.GetArgumentArrayRef (1969 of 2356) PASS: lldb-unit :: Language/Highlighting/./HighlighterTests/HighlighterTest.ClangIdentifiers (1970 of 2356) UNSUPPORTED: lldb-shell :: Unwind/split-machine-functions.test (1971 of 2356) PASS: lldb-unit :: Utility/./UtilityTests/RangeTest.ClearWithStarAddress (1972 of 2356) PASS: lldb-shell :: Minidump/fb-dump.test (1973 of 2356) PASS: lldb-unit :: Utility/./UtilityTests/StringLexerTest.GetUnlexed (1974 of 2356) PASS: lldb-unit :: ScriptInterpreter/Python/./ScriptInterpreterPythonTests/PythonDataObjectsTest.TestPythonListManipulation (1975 of 2356) PASS: lldb-shell :: SymbolFile/DWARF/x86/dwarf5-split.s (1976 of 2356) PASS: lldb-api :: lang/cpp/member-and-local-vars-with-same-name/TestMembersAndLocalsWithSameName.py (1977 of 2356) PASS: lldb-api :: commands/watchpoints/hello_watchpoint/TestMyFirstWatchpoint.py (1978 of 2356) PASS: lldb-shell :: Commands/command-breakpoint-col.test (1979 of 2356) PASS: lldb-unit :: Process/Utility/./ProcessUtilityTests/ProcMapTests/LinuxProcMapsTestFixture.ParseMapRegions/4 (1980 of 2356) PASS: lldb-unit :: SymbolFile/NativePDB/./SymbolFileNativePDBTests/PDBFPOProgramToDWARFExpressionTests.UnknownOp (1981 of 2356) PASS: lldb-api :: functionalities/breakpoint/breakpoint_locations/TestBreakpointLocations.py (1982 of 2356) PASS: lldb-shell :: Reproducer/TestGDBRemoteRepro.test (1983 of 2356) PASS: lldb-shell :: ObjectFile/Breakpad/sections-trailing-func.test (1984 of 2356) PASS: lldb-api :: functionalities/data-formatter/user-format-vs-summary/TestUserFormatVsSummary.py (1985 of 2356) PASS: lldb-shell :: Settings/TestEchoCommands.test (1986 of 2356) PASS: lldb-unit :: Core/./LLDBCoreTests/FormatEntityTest.DefinitionConstructionNameTypeChildren (1987 of 2356) PASS: lldb-unit :: Process/Utility/./ProcessUtilityTests/ProcMapTests/LinuxProcMapsTestFixture.ParseMapRegions/5 (1988 of 2356) PASS: lldb-unit :: UnwindAssembly/x86/./UnwindAssemblyx86Tests/Testx86AssemblyInspectionEngine.TestSpArithx86_64Augmented (1989 of 2356) PASS: lldb-unit :: Utility/./UtilityTests/StringListTest.InsertStringAtIndexStdString (1990 of 2356) PASS: lldb-shell :: SymbolFile/DWARF/x86/DW_AT_declaration-with-children.s (1991 of 2356) PASS: lldb-unit :: Process/gdb-remote/./ProcessGdbRemoteTests/GDBRemoteClientBaseTest.SendContinueAndWait (1992 of 2356) PASS: lldb-shell :: SymbolFile/Breakpad/stack-cfi-parsing.test (1993 of 2356) PASS: lldb-api :: commands/expression/import-std-module/iterator/TestIteratorFromStdModule.py (1994 of 2356) PASS: lldb-api :: functionalities/gdb_remote_client/TestIOSSimulator.py (1995 of 2356) PASS: lldb-unit :: Utility/./UtilityTests/StringListTest.SplitIntoLines (1996 of 2356) UNSUPPORTED: lldb-api :: tools/intel-features/intel-pt/test/TestIntelPTSimpleBinary.py (1997 of 2356) PASS: lldb-shell :: SymbolFile/DWARF/x86/dwarf5-debug_line-file-index.s (1998 of 2356) PASS: lldb-shell :: Breakpoint/jit-loader_rtdyld_elf.test (1999 of 2356) PASS: lldb-api :: python_api/process/read-mem-cstring/TestReadMemCString.py (2000 of 2356) PASS: lldb-unit :: Host/./HostTests/FileActionTest.Open (2001 of 2356) PASS: lldb-unit :: Utility/./UtilityTests/UriParserTest.BadPort (2002 of 2356) PASS: lldb-unit :: Utility/./UtilityTests/StreamTest.PutHex16ByteOrderLittle (2003 of 2356) PASS: lldb-unit :: Utility/./UtilityTests/StringExtractorTest.GetHexBytesAvail_Partial (2004 of 2356) UNSUPPORTED: lldb-shell :: SymbolFile/DWARF/x86/DW_TAG_GNU_call_site-DW_AT_low_pc.s (2005 of 2356) PASS: lldb-unit :: Utility/./UtilityTests/XcodeSDKTest.FindXcodeContentsDirectoryInPath (2006 of 2356) PASS: lldb-api :: python_api/sbenvironment/TestSBEnvironment.py (2007 of 2356) PASS: lldb-shell :: Minidump/memory-region.yaml (2008 of 2356) PASS: lldb-unit :: Utility/./UtilityTests/FileSpecTest.AppendPathComponent (2009 of 2356) PASS: lldb-unit :: Utility/./UtilityTests/FileSpecTest.GuessPathStyle (2010 of 2356) PASS: lldb-api :: functionalities/gdb_remote_client/TestqOffsets.py (2011 of 2356) PASS: lldb-unit :: Symbol/./SymbolTests/TestClangASTImporter.DeportDeclTagDecl (2012 of 2356) PASS: lldb-unit :: Utility/./UtilityTests/BinaryStreamTest.PutSLEB128EightBytes (2013 of 2356) PASS: lldb-unit :: Utility/./UtilityTests/FileSpecTest.EqualDotsPosixRoot (2014 of 2356) PASS: lldb-api :: functionalities/data-formatter/ptr_ref_typedef/TestPtrRef2Typedef.py (2015 of 2356) PASS: lldb-unit :: Utility/./UtilityTests/StringExtractorTest.GetNameColonValueSuccess (2016 of 2356) PASS: lldb-api :: functionalities/thread/concurrent_events/TestConcurrentNWatchNBreak.py (2017 of 2356) PASS: lldb-api :: commands/platform/process/list/TestProcessList.py (2018 of 2356) PASS: lldb-shell :: Driver/TestPositionalArgs.test (2019 of 2356) PASS: lldb-api :: functionalities/gdb_remote_client/TestArmRegisterDefinition.py (2020 of 2356) PASS: lldb-unit :: Utility/./UtilityTests/StringListTest.AppendListCStringArray (2021 of 2356) PASS: lldb-shell :: SymbolFile/DWARF/x86/apple-index-is-used.cpp (2022 of 2356) PASS: lldb-shell :: ObjectFile/ELF/PT_LOAD-overlap.yaml (2023 of 2356) PASS: lldb-unit :: Utility/./UtilityTests/UserIDResolver.GetUserName (2024 of 2356) PASS: lldb-api :: functionalities/breakpoint/serialize/TestBreakpointSerialization.py (2025 of 2356) PASS: lldb-api :: lang/cpp/static_methods/TestCPPStaticMethods.py (2026 of 2356) PASS: lldb-unit :: Host/./HostTests/HostInfoTestInitialization.InitTwice (2027 of 2356) PASS: lldb-api :: tools/lldb-server/TestGdbRemoteRegisterState.py (2028 of 2356) UNSUPPORTED: lldb-api :: commands/trace/TestTraceDumpInstructions.py (2029 of 2356) UNSUPPORTED: lldb-shell :: ScriptInterpreter/Lua/persistent_state.test (2030 of 2356) PASS: lldb-unit :: Utility/./UtilityTests/ProcessInstanceInfo.Dump (2031 of 2356) PASS: lldb-api :: functionalities/thread/step_until/TestStepUntil.py (2032 of 2356) PASS: lldb-unit :: Process/minidump/./LLDBMinidumpTests/MinidumpParserTest.GetMemoryRegionInfoLinuxMapsError (2033 of 2356) PASS: lldb-unit :: Language/Highlighting/./HighlighterTests/HighlighterTest.HighlighterSelectionType (2034 of 2356) PASS: lldb-shell :: ObjectFile/ELF/section-permissions.yaml (2035 of 2356) PASS: lldb-shell :: ObjectFile/ELF/PT_LOAD-overlap-PT_TLS.yaml (2036 of 2356) PASS: lldb-unit :: Utility/./UtilityTests/BinaryStreamTest.PutULEB128FiveBytes (2037 of 2356) PASS: lldb-unit :: SymbolFile/DWARF/./SymbolFileDWARFTests/SymbolFileDWARFTests.ParseArangesIgnoreEmpty (2038 of 2356) PASS: lldb-api :: api/multiple-targets/TestMultipleTargets.py (2039 of 2356) PASS: lldb-api :: commands/command/nested_alias/TestNestedAlias.py (2040 of 2356) PASS: lldb-api :: functionalities/completion/TestCompletion.py (2041 of 2356) PASS: lldb-shell :: ObjectFile/ELF/section-addresses.yaml (2042 of 2356) UNSUPPORTED: lldb-api :: functionalities/breakpoint/hardware_breakpoints/write_memory_with_hw_breakpoint/TestWriteMemoryWithHWBreakpoint.py (2043 of 2356) PASS: lldb-api :: arm/emulation/TestEmulations.py (2044 of 2356) PASS: lldb-api :: lang/c/tls_globals/TestTlsGlobals.py (2045 of 2356) PASS: lldb-unit :: Utility/./UtilityTests/AnsiTerminal.KnownPrefix (2046 of 2356) PASS: lldb-unit :: Utility/./UtilityTests/FileSpecTest.FormatFileSpec (2047 of 2356) PASS: lldb-api :: functionalities/memory/read/TestMemoryRead.py (2048 of 2356) PASS: lldb-api :: commands/expression/call-throws/TestCallThatThrows.py (2049 of 2356) PASS: lldb-unit :: Utility/./UtilityTests/Flags.GetBitSize (2050 of 2356) PASS: lldb-shell :: Breakpoint/single-file-split-dwarf.test (2051 of 2356) PASS: lldb-unit :: Breakpoint/./LLDBBreakpointTests/BreakpointIDTest.StringIsBreakpointName (2052 of 2356) PASS: lldb-shell :: SymbolFile/DWARF/x86/debug_ranges.s (2053 of 2356) PASS: lldb-shell :: Register/Core/x86-64-linux-gp.test (2054 of 2356) PASS: lldb-unit :: Symbol/./SymbolTests/TestTypeSystemClang.OnlyPackName (2055 of 2356) PASS: lldb-unit :: Host/./HostTests/ProcessLaunchInfoTest.Constructor (2056 of 2356) PASS: lldb-api :: commands/expression/import-std-module/weak_ptr-dbg-info-content/TestDbgInfoContentWeakPtrFromStdModule.py (2057 of 2356) PASS: lldb-api :: commands/watchpoints/watchpoint_size/TestWatchpointSizes.py (2058 of 2356) PASS: lldb-unit :: Utility/./UtilityTests/StreamTest.SetIndentLevel (2059 of 2356) PASS: lldb-unit :: ScriptInterpreter/Python/./ScriptInterpreterPythonTests/PythonDataObjectsTest.TestPythonByteArray (2060 of 2356) PASS: lldb-shell :: ObjectFile/wasm/embedded-debug-sections.yaml (2061 of 2356) PASS: lldb-unit :: Utility/./UtilityTests/RegisterValueTest.GetSet8 (2062 of 2356) PASS: lldb-unit :: Utility/./UtilityTests/BinaryStreamTest.PutSLEB128SixBytes (2063 of 2356) PASS: lldb-api :: functionalities/data-formatter/data-formatter-objc/TestDataFormatterObjNSException.py (2064 of 2356) PASS: lldb-api :: python_api/lldbutil/TestSwigVersion.py (2065 of 2356) PASS: lldb-shell :: SymbolFile/DWARF/x86/debug_loc_and_loclists.s (2066 of 2356) PASS: lldb-unit :: Utility/./UtilityTests/VMRange.ContainsRange (2067 of 2356) PASS: lldb-api :: python_api/sbvalue_persist/TestSBValuePersist.py (2068 of 2356) PASS: lldb-api :: functionalities/data-formatter/data-formatter-stl/libcxx/bitset/TestDataFormatterLibcxxBitset.py (2069 of 2356) PASS: lldb-unit :: UnwindAssembly/x86/./UnwindAssemblyx86Tests/Testx86AssemblyInspectionEngine.TestMovRSPtoRBP (2070 of 2356) PASS: lldb-shell :: SymbolFile/DWARF/x86/debug_loc.s (2071 of 2356) PASS: lldb-api :: lang/c/unicode/TestUnicodeSymbols.py (2072 of 2356) PASS: lldb-shell :: Breakpoint/debug_rnglistx_rlex.test (2073 of 2356) PASS: lldb-unit :: Symbol/./SymbolTests/TestTypeSystemClang.GetExeModuleWhenMissingSymbolFile (2074 of 2356) PASS: lldb-unit :: Utility/./UtilityTests/StreamTest.PutBytesAsRawHex8ToBigEndian (2075 of 2356) PASS: lldb-unit :: Language/Highlighting/./HighlighterTests/HighlighterTest.ClangScalarLiterals (2076 of 2356) PASS: lldb-unit :: Utility/./UtilityTests/RangeDataVector.FindEntryIndexesThatContain_Overlap (2077 of 2356) PASS: lldb-shell :: Register/Core/x86-32-netbsd-gp.test (2078 of 2356) PASS: lldb-api :: tools/lldb-server/TestGdbRemoteProcessInfo.py (2079 of 2356) PASS: lldb-api :: commands/expression/inline-namespace/TestInlineNamespace.py (2080 of 2356) PASS: lldb-shell :: Quit/TestQuitExitCodeHexA.test (2081 of 2356) PASS: lldb-api :: lang/objc/objc_direct-methods/TestObjCDirectMethods.py (2082 of 2356) PASS: lldb-unit :: UnwindAssembly/x86/./UnwindAssemblyx86Tests/Testx86AssemblyInspectionEngine.Test64bitFramelessBigStackFrame (2083 of 2356) PASS: lldb-api :: lang/cpp/enum_types/TestCPP11EnumTypes.py (2084 of 2356) PASS: lldb-shell :: ObjectFile/ELF/duplicate-section.yaml (2085 of 2356) PASS: lldb-api :: lang/cpp/template-specialization-type/TestTemplateSpecializationType.py (2086 of 2356) PASS: lldb-api :: functionalities/breakpoint/breakpoint_command/TestBreakpointCommand.py (2087 of 2356) PASS: lldb-unit :: UnwindAssembly/x86/./UnwindAssemblyx86Tests/Testx86AssemblyInspectionEngine.TestPopR15 (2088 of 2356) PASS: lldb-unit :: Utility/./UtilityTests/DataExtractorTest.GetBitfield (2089 of 2356) PASS: lldb-unit :: Utility/./UtilityTests/DataExtractorTest.PeekData (2090 of 2356) PASS: lldb-shell :: Reproducer/TestVersionCheck.test (2091 of 2356) PASS: lldb-unit :: Utility/./UtilityTests/ScalarTest.Division (2092 of 2356) PASS: lldb-api :: lang/objc/objc-stepping/TestObjCStepping.py (2093 of 2356) PASS: lldb-api :: macosx/load-kext/TestLoadKext.py (2094 of 2356) PASS: lldb-shell :: SymbolFile/DWARF/x86/gnu-style-compression.cpp (2095 of 2356) PASS: lldb-api :: commands/watchpoints/step_over_watchpoint/TestStepOverWatchpoint.py (2096 of 2356) PASS: lldb-api :: lang/c/local_types/TestUseClosestType.py (2097 of 2356) PASS: lldb-shell :: BuildScript/script-args.test (2098 of 2356) PASS: lldb-shell :: SymbolFile/DWARF/x86/dir-separator-windows.s (2099 of 2356) UNSUPPORTED: lldb-shell :: Unwind/eh-frame-augment-noop.test (2100 of 2356) PASS: lldb-shell :: ObjectFile/PECOFF/basic-info-arm64.yaml (2101 of 2356) PASS: lldb-unit :: Target/./TargetTests/PathMappingListTest.CrossPlatformTests (2102 of 2356) PASS: lldb-api :: commands/expression/call-function/TestCallStdStringFunction.py (2103 of 2356) PASS: lldb-api :: api/multithreaded/TestMultithreaded.py (2104 of 2356) PASS: lldb-unit :: Target/./TargetTests/ExecutionContextTest.GetByteOrder (2105 of 2356) PASS: lldb-api :: tools/lldb-server/TestGdbRemoteThreadsInStopReply.py (2106 of 2356) PASS: lldb-unit :: Symbol/./SymbolTests/TestTypeSystemClang.TestGetTypeClassNested (2107 of 2356) PASS: lldb-unit :: Host/./HostTests/SocketTests/SocketTest.TCPListen0ConnectAccept/ipv4 (2108 of 2356) PASS: lldb-shell :: Reproducer/TestHomeDir.test (2109 of 2356) PASS: lldb-api :: functionalities/gdb_remote_client/TestStopPCs.py (2110 of 2356) PASS: lldb-unit :: Process/gdb-remote/./ProcessGdbRemoteTests/GDBRemoteClientBaseTest.SendContinueAndLateInterrupt (2111 of 2356) PASS: lldb-api :: functionalities/data-formatter/poarray/TestPrintObjectArray.py (2112 of 2356) PASS: lldb-api :: functionalities/thread/concurrent_events/TestConcurrentTwoWatchpointsOneSignal.py (2113 of 2356) PASS: lldb-shell :: ObjectFile/ELF/PT_TLS-overlap-PT_LOAD.yaml (2114 of 2356) PASS: lldb-shell :: Minidump/dump-all.test (2115 of 2356) PASS: lldb-shell :: SymbolFile/NativePDB/locate-pdb.cpp (2116 of 2356) PASS: lldb-api :: types/TestRecursiveTypes.py (2117 of 2356) PASS: lldb-unit :: Platform/Android/./AdbClientTests/AdbClientTest.CreateByDeviceId (2118 of 2356) PASS: lldb-unit :: ScriptInterpreter/Python/./ScriptInterpreterPythonTests/PythonDataObjectsTest.TestGlobalNameResolutionWithDot (2119 of 2356) UNSUPPORTED: lldb-api :: commands/gui/viewlarge/TestGuiViewLarge.py (2120 of 2356) PASS: lldb-unit :: Utility/./UtilityTests/ArgsTest.ReplaceArgumentAtIndexLonger (2121 of 2356) UNSUPPORTED: lldb-api :: commands/trace/multiple-threads/TestTraceStartStopMultipleThreads.py (2122 of 2356) PASS: lldb-api :: functionalities/thread/concurrent_events/TestConcurrentWatchBreakDelay.py (2123 of 2356) PASS: lldb-unit :: UnwindAssembly/x86/./UnwindAssemblyx86Tests/Testx86AssemblyInspectionEngine.TestPushRBP (2124 of 2356) PASS: lldb-unit :: Process/gdb-remote/./ProcessGdbRemoteTests/GDBRemoteClientBaseTest.SendContinueAndInterrupt2PacketBug (2125 of 2356) PASS: lldb-unit :: Utility/./UtilityTests/StringExtractorTest.DecodeHexU8_Extra (2126 of 2356) PASS: lldb-api :: macosx/universal/TestUniversal.py (2127 of 2356) UNSUPPORTED: lldb-shell :: SymbolFile/PDB/function-level-linking.test (2128 of 2356) PASS: lldb-unit :: Expression/./ExpressionTests/DWARFExpression.DW_OP_unknown (2129 of 2356) PASS: lldb-unit :: Utility/./UtilityTests/ScalarTest.SetValueFromCString (2130 of 2356) PASS: lldb-unit :: Utility/./UtilityTests/SerializationRountripTest.SerializeDeserializeObjectReference (2131 of 2356) PASS: lldb-unit :: Editline/./EditlineTests/EditlineTestFixture.EditlineReceivesMultiLineText (2132 of 2356) PASS: lldb-unit :: Symbol/./SymbolTests/TestTypeSystemClang.TestNotDeletingUserCopyCstrDueToMoveCStr (2133 of 2356) PASS: lldb-shell :: Breakpoint/split-dwarf5-debug-stroffsets.test (2134 of 2356) PASS: lldb-api :: lang/objc/foundation/TestObjCMethods.py (2135 of 2356) PASS: lldb-unit :: Utility/./UtilityTests/ConstStringTest.YAML (2136 of 2356) PASS: lldb-unit :: Utility/./UtilityTests/GeneratorTest.Create (2137 of 2356) PASS: lldb-api :: commands/statistics/basic/TestStats.py (2138 of 2356) PASS: lldb-unit :: Process/gdb-remote/./ProcessGdbRemoteTests/GDBRemoteClientBaseTest.SendContinueAndInterrupt (2139 of 2356) PASS: lldb-unit :: Utility/./UtilityTests/TildeExpressionResolver.ResolveFullPath (2140 of 2356) PASS: lldb-api :: lang/objc/objc-static-method/TestObjCStaticMethod.py (2141 of 2356) UNSUPPORTED: lldb-api :: commands/platform/connect/TestPlatformConnect.py (2142 of 2356) PASS: lldb-unit :: Language/Highlighting/./HighlighterTests/HighlighterTest.Colons (2143 of 2356) PASS: lldb-shell :: SymbolFile/Breakpad/unwind-via-raSearch.test (2144 of 2356) UNSUPPORTED: lldb-shell :: SymbolFile/DWARF/debug-types-expressions.test (2145 of 2356) PASS: lldb-api :: functionalities/data-formatter/data-formatter-script/TestDataFormatterScript.py (2146 of 2356) PASS: lldb-unit :: Utility/./UtilityTests/FileSpecTest.Match (2147 of 2356) UNSUPPORTED: lldb-api :: commands/expression/import-std-module/pair/TestPairFromStdModule.py (2148 of 2356) PASS: lldb-api :: functionalities/breakpoint/cpp_exception/TestCPPExceptionBreakpoint.py (2149 of 2356) PASS: lldb-shell :: SymbolFile/DWARF/x86/debug_line-tombstone.s (2150 of 2356) PASS: lldb-unit :: Host/./HostTests/FileSystemTest.EmptyTest (2151 of 2356) PASS: lldb-unit :: Utility/./UtilityTests/StringExtractorTest.GetHexBytes_FullString (2152 of 2356) PASS: lldb-shell :: SymbolFile/DWARF/x86/find-inline-method.s (2153 of 2356) PASS: lldb-api :: types/TestLongTypesExpr.py (2154 of 2356) PASS: lldb-api :: api/listeners/TestListener.py (2155 of 2356) PASS: lldb-unit :: Symbol/./SymbolTests/DWARFCallFrameInfoTest.Basic_dwarf4 (2156 of 2356) PASS: lldb-shell :: SymbolFile/DWARF/x86/find-basic-function.cpp (2157 of 2356) PASS: lldb-api :: commands/target/stop-hook/enable/TestTargetStopHookEnable.py (2158 of 2356) PASS: lldb-shell :: Register/Core/x86-64-netbsd-addr.test (2159 of 2356) PASS: lldb-unit :: Utility/./UtilityTests/RegularExpression.Match (2160 of 2356) PASS: lldb-api :: functionalities/data-formatter/synthupdate/TestSyntheticFilterRecompute.py (2161 of 2356) PASS: lldb-api :: lang/cpp/virtual-functions/TestCppVirtualFunctions.py (2162 of 2356) PASS: lldb-unit :: Expression/./ExpressionTests/DiagnosticManagerTest.AppendMessageAttachToLastDiag (2163 of 2356) PASS: lldb-unit :: SymbolFile/NativePDB/./SymbolFileNativePDBTests/PDBFPOProgramToDWARFExpressionTests.MissingTargetRegister (2164 of 2356) PASS: lldb-unit :: Utility/./UtilityTests/ScalarTest.CastOperations (2165 of 2356) PASS: lldb-unit :: ScriptInterpreter/Python/./ScriptInterpreterPythonTests/PythonDataObjectsTest.TestExceptions (2166 of 2356) UNSUPPORTED: lldb-api :: functionalities/data-formatter/data-formatter-stl/libstdcpp/unique_ptr/TestDataFormatterStdUniquePtr.py (2167 of 2356) PASS: lldb-shell :: Quit/TestQuitExitCodeImplicit0.test (2168 of 2356) PASS: lldb-api :: lang/c/register_variables/TestRegisterVariables.py (2169 of 2356) PASS: lldb-api :: functionalities/plugins/python_os_plugin/TestPythonOSPlugin.py (2170 of 2356) UNSUPPORTED: lldb-api :: functionalities/gdb_remote_client/TestAArch64XMLRegOffsets.py (2171 of 2356) PASS: lldb-unit :: Utility/./UtilityTests/StringExtractorTest.GetHexBytes_Partial (2172 of 2356) PASS: lldb-api :: python_api/frame/inlines/TestInlinedFrame.py (2173 of 2356) PASS: lldb-unit :: Host/./HostTests/SocketTests/SocketTest.TCPListen0GetPort/ipv4 (2174 of 2356) PASS: lldb-unit :: UnwindAssembly/x86/./UnwindAssemblyx86Tests/Testx86AssemblyInspectionEngine.TestPopESI (2175 of 2356) PASS: lldb-unit :: Utility/./UtilityTests/AnsiTerminal.AtEnd (2176 of 2356) PASS: lldb-api :: lang/cpp/exceptions/TestCPPExceptionBreakpoints.py (2177 of 2356) PASS: lldb-shell :: SymbolFile/DWARF/x86/debug_aranges-empty-section.s (2178 of 2356) PASS: lldb-api :: lang/cpp/default-template-args/TestDefaultTemplateArgs.py (2179 of 2356) UNSUPPORTED: lldb-api :: lang/objc/modules-update/TestClangModulesUpdate.py (2180 of 2356) PASS: lldb-unit :: Utility/./UtilityTests/StringExtractorGDBRemoteTest.GetPidTid (2181 of 2356) PASS: lldb-api :: lang/objc/unicode-string/TestUnicodeString.py (2182 of 2356) PASS: lldb-shell :: ObjectFile/ELF/basic-info.yaml (2183 of 2356) PASS: lldb-unit :: Utility/./UtilityTests/SerializationRountripTest.SerializeDeserializeCStringArrayNullptr (2184 of 2356) PASS: lldb-api :: functionalities/breakpoint/hardware_breakpoints/require_hw_breakpoints/TestRequireHWBreakpoints.py (2185 of 2356) UNSUPPORTED: lldb-api :: functionalities/unwind/ehframe/TestEhFrameUnwind.py (2186 of 2356) PASS: lldb-unit :: Process/minidump/./LLDBMinidumpTests/MinidumpParserTest.GetMemoryRegionInfoFromMemory64List (2187 of 2356) PASS: lldb-shell :: ObjectFile/ELF/netbsd-core-amd64.test (2188 of 2356) PASS: lldb-unit :: Expression/./ExpressionTests/DiagnosticManagerTest.FixedExpression (2189 of 2356) PASS: lldb-api :: lang/objc/foundation/TestObjectDescriptionAPI.py (2190 of 2356) PASS: lldb-api :: python_api/exprpath_synthetic/TestExprPathSynthetic.py (2191 of 2356) PASS: lldb-api :: functionalities/data-formatter/data-formatter-caching/TestDataFormatterCaching.py (2192 of 2356) UNSUPPORTED: lldb-shell :: Subprocess/clone-follow-parent-wp.test (2193 of 2356) PASS: lldb-unit :: Language/Highlighting/./HighlighterTests/HighlighterTest.ClangCursorPosAfterOtherToken (2194 of 2356) UNSUPPORTED: lldb-shell :: SymbolFile/PDB/compilands.test (2195 of 2356) PASS: lldb-unit :: Utility/./UtilityTests/VMRange.ContainsAddr (2196 of 2356) PASS: lldb-unit :: Utility/./UtilityTests/StreamTest.AddressPrefixAndSuffix (2197 of 2356) PASS: lldb-unit :: Utility/./UtilityTests/StreamTeeTest.SetStreamAtIndexOverwrite (2198 of 2356) PASS: lldb-api :: commands/frame/select/TestFrameSelect.py (2199 of 2356) PASS: lldb-api :: python_api/signals/TestSignalsAPI.py (2200 of 2356) PASS: lldb-unit :: Utility/./UtilityTests/StreamTeeTest.Flush (2201 of 2356) PASS: lldb-unit :: Utility/./UtilityTests/FileSpecTest.Yaml (2202 of 2356) PASS: lldb-shell :: BuildScript/toolchain-clang.test (2203 of 2356) PASS: lldb-api :: python_api/symbol-context/TestSymbolContext.py (2204 of 2356) PASS: lldb-shell :: ScriptInterpreter/Python/Crashlog/text.test (2205 of 2356) PASS: lldb-unit :: Process/./ProcessEventDataTests/ProcessEventDataTest.ShouldStop (2206 of 2356) PASS: lldb-shell :: Minidump/no-process-id.yaml (2207 of 2356) PASS: lldb-unit :: Utility/./UtilityTests/UriParserTest.PortOverflow (2208 of 2356) PASS: lldb-unit :: ScriptInterpreter/Python/./ScriptInterpreterPythonTests/PythonDataObjectsTest.TestPythonInteger (2209 of 2356) PASS: lldb-unit :: Utility/./UtilityTests/OptionsWithRawTest.SingleWhitespaceInput (2210 of 2356) PASS: lldb-unit :: Host/./HostTests/Host.WaitStatusFormat (2211 of 2356) PASS: lldb-api :: lang/objc/modules-auto-import/TestModulesAutoImport.py (2212 of 2356) PASS: lldb-api :: commands/breakpoint/set/func-regex/TestBreakpointRegexError.py (2213 of 2356) PASS: lldb-unit :: Symbol/./SymbolTests/TestClangASTImporter.ImportInvalidType (2214 of 2356) UNSUPPORTED: lldb-shell :: Register/arm-gp-read.test (2215 of 2356) PASS: lldb-api :: commands/frame/diagnose/array/TestArray.py (2216 of 2356) PASS: lldb-shell :: ObjectFile/ELF/PT_LOAD-overlap-section.yaml (2217 of 2356) PASS: lldb-unit :: Process/Utility/./ProcessUtilityTests/ProcMapTests/LinuxProcMapsTestFixture.ParseMapRegions/0 (2218 of 2356) PASS: lldb-unit :: Symbol/./SymbolTests/TestTypeSystemClang.TestGetEnumIntegerTypeBasicTypes (2219 of 2356) PASS: lldb-shell :: ObjectFile/ELF/avr-basic-info.yaml (2220 of 2356) PASS: lldb-unit :: Symbol/./SymbolTests/TestCreateClassTemplateDecl.FindExistingTemplates (2221 of 2356) PASS: lldb-unit :: Core/./LLDBCoreTests/UniqueCStringMap.NoDefaultConstructor (2222 of 2356) PASS: lldb-unit :: Target/./TargetTests/ModuleCacheTest.GetAndPut (2223 of 2356) PASS: lldb-unit :: Utility/./UtilityTests/Flags.AnyClear (2224 of 2356) PASS: lldb-api :: lang/cpp/wchar_t/TestCxxWCharT.py (2225 of 2356) PASS: lldb-shell :: Reproducer/Functionalities/TestStepping.test (2226 of 2356) PASS: lldb-shell :: ObjectFile/ELF/PT_LOAD-empty.yaml (2227 of 2356) PASS: lldb-api :: functionalities/inferior-assert/TestInferiorAssert.py (2228 of 2356) PASS: lldb-unit :: Utility/./UtilityTests/ProcessInstanceInfoList.Yaml (2229 of 2356) PASS: lldb-unit :: Utility/./UtilityTests/DataExtractorTest.GetULEB128_bit63 (2230 of 2356) PASS: lldb-unit :: Host/./HostTests/FileSystemTest.EnumerateDirectory (2231 of 2356) PASS: lldb-unit :: Platform/./LLDBPlatformTests/PlatformAppleSimulatorTest.TestHostPlatformToSim (2232 of 2356) PASS: lldb-api :: functionalities/thread/concurrent_events/TestConcurrentTwoWatchpointsOneDelayBreakpoint.py (2233 of 2356) PASS: lldb-api :: commands/expression/completion-crash-incomplete-record/TestCompletionCrashIncompleteRecord.py (2234 of 2356) PASS: lldb-api :: python_api/sbdata/TestSBData.py (2235 of 2356) PASS: lldb-unit :: Utility/./UtilityTests/StringListTest.LongestCommonPrefixSingleElement (2236 of 2356) PASS: lldb-unit :: Target/./TargetTests/PathMappingListTest.RemapRoot (2237 of 2356) PASS: lldb-api :: functionalities/memory/find/TestMemoryFind.py (2238 of 2356) PASS: lldb-shell :: SymbolFile/DWARF/x86/DW_TAG_variable-invalid_location.s (2239 of 2356) PASS: lldb-unit :: Symbol/./SymbolTests/LineEntryTest.GetSameLineContiguousAddressRangeNoInlines (2240 of 2356) PASS: lldb-shell :: Register/x86-64-read.test (2241 of 2356) PASS: lldb-api :: lang/objc/orderedset/TestOrderedSet.py (2242 of 2356) PASS: lldb-unit :: Utility/./UtilityTests/SerializationRountripTest.SerializeDeserializeCStringArrayNullptrElem (2243 of 2356) PASS: lldb-api :: functionalities/tail_call_frames/sbapi_support/TestTailCallFrameSBAPI.py (2244 of 2356) PASS: lldb-shell :: Register/Core/x86-64-netbsd-fp.test (2245 of 2356) PASS: lldb-api :: commands/disassemble/basic/TestDisassembleBreakpoint.py (2246 of 2356) PASS: lldb-unit :: ObjectFile/PECOFF/./ObjectFilePECOFFTests/PECallFrameInfoTest.Frame_reg_eh (2247 of 2356) PASS: lldb-unit :: Utility/./UtilityTests/StreamTeeTest.CopyConstructor (2248 of 2356) UNSUPPORTED: lldb-shell :: Register/x86-64-zmm-read.test (2249 of 2356) PASS: lldb-shell :: Quit/TestQuitExitCode30.test (2250 of 2356) PASS: lldb-api :: functionalities/unwind/noreturn/module-end/TestNoReturnModuleEnd.py (2251 of 2356) PASS: lldb-api :: commands/expression/import-std-module/unique_ptr-dbg-info-content/TestUniquePtrDbgInfoContent.py (2252 of 2356) PASS: lldb-unit :: Utility/./UtilityTests/StreamTest.PutHex64ByteOrderLittle (2253 of 2356) PASS: lldb-unit :: Host/./HostTests/SocketTests/SocketTest.TCPGetConnectURI/ipv6 (2254 of 2356) UNSUPPORTED: lldb-api :: commands/register/register/intel_xtended_registers/mpx_bound_violation/TestBoundViolation.py (2255 of 2356) UNSUPPORTED: lldb-api :: functionalities/ubsan/user-expression/TestUbsanUserExpression.py (2256 of 2356) PASS: lldb-api :: functionalities/data-formatter/data-formatter-stl/libcxx/unordered/TestDataFormatterUnordered.py (2257 of 2356) UNSUPPORTED: lldb-api :: functionalities/thread/multi_break/TestMultipleBreakpoints.py (2258 of 2356) PASS: lldb-api :: commands/frame/diagnose/bad-reference/TestBadReference.py (2259 of 2356) PASS: lldb-api :: linux/builtin_trap/TestBuiltinTrap.py (2260 of 2356) PASS: lldb-api :: commands/expression/weak_symbols/TestWeakSymbols.py (2261 of 2356) PASS: lldb-api :: lang/cpp/rvalue-references/TestRvalueReferences.py (2262 of 2356) PASS: lldb-api :: commands/watchpoints/watchpoint_disable/TestWatchpointDisable.py (2263 of 2356) PASS: lldb-api :: lang/c/function_types/TestFunctionTypes.py (2264 of 2356) PASS: lldb-unit :: Utility/./UtilityTests/UriParserTest.MinimalPortPath (2265 of 2356) PASS: lldb-unit :: Utility/./UtilityTests/EnvironmentTest.EnvpConstruction (2266 of 2356) PASS: lldb-api :: commands/expression/import-std-module/queue/TestQueueFromStdModule.py (2267 of 2356) PASS: lldb-api :: functionalities/thread/concurrent_events/TestConcurrentDelaySignalBreak.py (2268 of 2356) PASS: lldb-api :: lang/cpp/class_types/TestClassTypesDisassembly.py (2269 of 2356) PASS: lldb-shell :: Commands/command-regex-delete.test (2270 of 2356) UNSUPPORTED: lldb-shell :: SymbolFile/target-symbols-add-unwind.test (2271 of 2356) PASS: lldb-api :: functionalities/thread/state_after_expression/TestStateAfterExpression.py (2272 of 2356) PASS: lldb-shell :: Breakpoint/debug_addrx.test (2273 of 2356) PASS: lldb-api :: functionalities/data-formatter/dump_dynamic/TestDumpDynamic.py (2274 of 2356) PASS: lldb-api :: python_api/function_symbol/TestSymbolAPI.py (2275 of 2356) PASS: lldb-api :: commands/expression/po_verbosity/TestPoVerbosity.py (2276 of 2356) PASS: lldb-api :: tools/lldb-server/TestGdbRemoteAttachWait.py (2277 of 2356) PASS: lldb-unit :: DataFormatter/./LLDBFormatterTests/TypeMatcherTests.CreatedBySameMatchStringExactNamePrefixes (2278 of 2356) UNSUPPORTED: lldb-api :: lang/objc/rdar-12408181/TestRdar12408181.py (2279 of 2356) PASS: lldb-unit :: Utility/./UtilityTests/StreamTeeTest.AppendStream (2280 of 2356) PASS: lldb-unit :: Utility/./UtilityTests/RangeTest.Copy (2281 of 2356) PASS: lldb-api :: commands/expression/import-std-module/deque-basic/TestDequeFromStdModule.py (2282 of 2356) PASS: lldb-unit :: Utility/./UtilityTests/Flags.AllClear (2283 of 2356) PASS: lldb-unit :: Utility/./UtilityTests/BinaryStreamTest.PutSLEB128FiveBytes (2284 of 2356) PASS: lldb-api :: commands/expression/import-std-module/deque-dbg-info-content/TestDbgInfoContentDequeFromStdModule.py (2285 of 2356) PASS: lldb-unit :: Utility/./UtilityTests/StringListTest.CopyListEmpty (2286 of 2356) PASS: lldb-unit :: Utility/./UtilityTests/FileSpecTest.RemoveLastPathComponent (2287 of 2356) PASS: lldb-unit :: Utility/./UtilityTests/UriParserTest.SchemeHostSeparator (2288 of 2356) PASS: lldb-unit :: UnwindAssembly/x86/./UnwindAssemblyx86Tests/Testx86AssemblyInspectionEngine.TestAddESP (2289 of 2356) PASS: lldb-api :: functionalities/thread/concurrent_events/TestConcurrentDelayWatchBreak.py (2290 of 2356) PASS: lldb-unit :: Utility/./UtilityTests/StringListTest.JoinThree (2291 of 2356) PASS: lldb-shell :: ObjectFile/wasm/stripped-debug-sections.yaml (2292 of 2356) PASS: lldb-api :: functionalities/tail_call_frames/cross_object/TestCrossObjectTailCalls.py (2293 of 2356) PASS: lldb-api :: types/TestFloatTypesExpr.py (2294 of 2356) PASS: lldb-shell :: SymbolFile/DWARF/x86/dwarf5_locations.s (2295 of 2356) PASS: lldb-api :: functionalities/breakpoint/breakpoint_set_restart/TestBreakpointSetRestart.py (2296 of 2356) PASS: lldb-api :: lang/cpp/virtual-overload/TestVirtualOverload.py (2297 of 2356) PASS: lldb-unit :: Utility/./UtilityTests/ArchSpecTest.TestParseMachCPUDashSubtypeTripleSimple (2298 of 2356) PASS: lldb-unit :: Utility/./UtilityTests/ArgsTest.ReplaceArgumentAtIndexEqual (2299 of 2356) PASS: lldb-unit :: Process/Utility/./ProcessUtilityTests/MemoryTagManagerAArch64MTETest.ExpandToGranule (2300 of 2356) UNSUPPORTED: lldb-api :: linux/thread/create_during_instruction_step/TestCreateDuringInstructionStep.py (2301 of 2356) PASS: lldb-api :: commands/expression/import-std-module/conflicts/TestStdModuleWithConflicts.py (2302 of 2356) PASS: lldb-api :: commands/gui/invalid-args/TestInvalidArgsGui.py (2303 of 2356) PASS: lldb-api :: commands/watchpoints/watchpoint_commands/command/TestWatchpointCommandPython.py (2304 of 2356) PASS: lldb-shell :: SymbolFile/DWARF/x86/dir-separator-no-comp-dir-relative-name.s (2305 of 2356) PASS: lldb-api :: lang/c/struct_types/TestStructTypes.py (2306 of 2356) PASS: lldb-api :: commands/watchpoints/watchpoint_commands/condition/TestWatchpointConditionCmd.py (2307 of 2356) PASS: lldb-unit :: Expression/./ExpressionTests/DiagnosticManagerTest.AddDiagnostic (2308 of 2356) PASS: lldb-unit :: Utility/./UtilityTests/UUIDTest.Validity (2309 of 2356) PASS: lldb-unit :: Process/gdb-remote/./ProcessGdbRemoteTests/GDBRemoteCommunicationClientTest.SyncThreadState (2310 of 2356) PASS: lldb-shell :: SymbolFile/DWARF/x86/DW_AT_location-DW_AT_const_value.s (2311 of 2356) PASS: lldb-unit :: Utility/./UtilityTests/StreamTest.PutCString (2312 of 2356) PASS: lldb-shell :: SymbolFile/Breakpad/line-table.test (2313 of 2356) PASS: lldb-unit :: UnwindAssembly/x86/./UnwindAssemblyx86Tests/Testx86AssemblyInspectionEngine.TestAddRSP (2314 of 2356) UNSUPPORTED: lldb-shell :: Reproducer/TestLuaImport.test (2315 of 2356) PASS: lldb-api :: python_api/watchpoint/TestWatchpointIter.py (2316 of 2356) PASS: lldb-shell :: Settings/TestSettingsWrite.test (2317 of 2356) PASS: lldb-api :: functionalities/data-formatter/data-formatter-stl/libcxx/set/TestDataFormatterLibcxxSet.py (2318 of 2356) PASS: lldb-api :: lang/objc/conflicting-definition/TestConflictingDefinition.py (2319 of 2356) PASS: lldb-unit :: Utility/./UtilityTests/ArchSpecTest.OperatorBool (2320 of 2356) PASS: lldb-api :: iohandler/resize/TestIOHandlerResizeNoEditline.py (2321 of 2356) PASS: lldb-api :: functionalities/breakpoint/breakpoint_ids/TestBreakpointIDs.py (2322 of 2356) PASS: lldb-shell :: ScriptInterpreter/None/none.test (2323 of 2356) PASS: lldb-unit :: Signals/./SignalsTests/UnixSignalsTest.VersionChange (2324 of 2356) PASS: lldb-unit :: Utility/./UtilityTests/StreamTest.PutRawBytesToLittleEndian (2325 of 2356) PASS: lldb-api :: python_api/sbplatform/TestSBPlatform.py (2326 of 2356) PASS: lldb-unit :: Utility/./UtilityTests/ArgsTest.AppendArguments (2327 of 2356) PASS: lldb-unit :: Core/./LLDBCoreTests/MangledTest.NameIndexes_FindFunctionSymbols (2328 of 2356) PASS: lldb-api :: functionalities/thread/exit_during_expression/TestExitDuringExpression.py (2329 of 2356) PASS: lldb-api :: functionalities/data-formatter/data-formatter-synth/TestDataFormatterSynth.py (2330 of 2356) PASS: lldb-unit :: UnwindAssembly/x86/./UnwindAssemblyx86Tests/Testx86AssemblyInspectionEngine.TestSubRSP (2331 of 2356) UNSUPPORTED: lldb-shell :: Register/x86-zmm-write.test (2332 of 2356) UNSUPPORTED: lldb-shell :: ObjectFile/ELF/minidebuginfo-no-lzma.yaml (2333 of 2356) PASS: lldb-api :: lang/cpp/bitfields/TestCppBitfields.py (2334 of 2356) PASS: lldb-api :: types/TestCharType.py (2335 of 2356) PASS: lldb-api :: functionalities/multiword-commands/TestMultiWordCommands.py (2336 of 2356) PASS: lldb-api :: lang/c/step_over_no_deadlock/TestStepOverDoesntBlock.py (2337 of 2356) PASS: lldb-api :: functionalities/return-value/TestReturnValue.py (2338 of 2356) PASS: lldb-api :: functionalities/plugins/python_os_plugin/stepping_plugin_threads/TestOSPluginStepping.py (2339 of 2356) UNSUPPORTED: lldb-api :: commands/expression/multiline-navigation/TestMultilineNavigation.py (2340 of 2356) PASS: lldb-unit :: Utility/./UtilityTests/StringExtractorTest.GetHexBytesAvail_FullString (2341 of 2356) PASS: lldb-unit :: Utility/./UtilityTests/LogChannelEnabledTest.LogGetLogThread (2342 of 2356) PASS: lldb-unit :: ScriptInterpreter/Python/./ScriptInterpreterPythonTests/PythonDataObjectsTest.TestObjectAttributes (2343 of 2356) PASS: lldb-api :: commands/expression/function_template_specialization_temp_args/TestFunctionTemplateSpecializationTempArgs.py (2344 of 2356) PASS: lldb-unit :: Process/gdb-remote/./ProcessGdbRemoteTests/PortMapTest.FreePortForProcess (2345 of 2356) PASS: lldb-api :: functionalities/breakpoint/breakpoint_by_file_colon_line/TestBreakpointByFileColonLine.py (2346 of 2356) PASS: lldb-unit :: UnwindAssembly/x86/./UnwindAssemblyx86Tests/Testx86AssemblyInspectionEngine.TestReturnDetect (2347 of 2356) PASS: lldb-unit :: Utility/./UtilityTests/RegularExpression.Empty (2348 of 2356) PASS: lldb-api :: lang/c/bitfields/TestBitfields.py (2349 of 2356) PASS: lldb-unit :: Utility/./UtilityTests/ConstStringTest.UpdateMangledCounterpart (2350 of 2356) UNSUPPORTED: lldb-shell :: Register/aarch64-fp-read.test (2351 of 2356) PASS: lldb-api :: tools/lldb-server/TestGdbRemoteAttach.py (2352 of 2356) PASS: lldb-api :: commands/breakpoint/command/list/TestBreakpointCommandList.py (2353 of 2356) PASS: lldb-api :: tools/lldb-server/TestGdbRemote_qThreadStopInfo.py (2354 of 2356) PASS: lldb-api :: types/TestDoubleTypesExpr.py (2355 of 2356) PASS: lldb-api :: lang/c/anonymous/TestAnonymous.py (2356 of 2356) Slowest Tests: -------------------------------------------------------------------------- 280.51s: lldb-api :: tools/lldb-server/TestLldbGdbServer.py 204.31s: lldb-api :: functionalities/memory-region/TestMemoryRegion.py 185.27s: lldb-api :: api/multithreaded/TestMultithreaded.py 170.83s: lldb-api :: macosx/skinny-corefile/TestSkinnyCorefile.py 113.56s: lldb-api :: types/TestLongTypesExpr.py 105.32s: lldb-api :: commands/expression/import-std-module/queue/TestQueueFromStdModule.py 104.94s: lldb-api :: commands/expression/import-std-module/stack/TestStackFromStdModule.py 96.31s: lldb-api :: lang/objc/exceptions/TestObjCExceptions.py 92.15s: lldb-api :: lang/objc/objc-new-syntax/TestObjCNewSyntaxLiteral.py 92.00s: lldb-api :: functionalities/gdb_remote_client/TestWasm.py 91.03s: lldb-api :: lang/cpp/namespace/TestNamespaceLookup.py 86.99s: lldb-api :: commands/expression/import-std-module/vector/TestVectorFromStdModule.py 85.91s: lldb-api :: lang/objc/hidden-ivars/TestHiddenIvars.py 84.47s: lldb-api :: lang/objc/foundation/TestObjCMethods.py 76.83s: lldb-api :: types/TestIntegerTypeExpr.py 75.52s: lldb-api :: commands/expression/import-std-module/deque-basic/TestDequeFromStdModule.py 71.56s: lldb-api :: lang/objc/objc-new-syntax/TestObjCNewSyntaxDictionary.py 71.55s: lldb-api :: lang/objc/objc-new-syntax/TestObjCNewSyntaxArray.py 70.62s: lldb-api :: commands/expression/import-std-module/vector-dbg-info-content/TestDbgInfoContentVectorFromStdModule.py 66.45s: lldb-api :: commands/expression/import-std-module/deque-dbg-info-content/TestDbgInfoContentDequeFromStdModule.py

Hide Details

Tests Times: -------------------------------------------------------------------------- [ Range ] :: [ Percentage ] :: [ Count ] -------------------------------------------------------------------------- [280s,300s) :: [ ] :: [ 1/2356] [260s,280s) :: [ ] :: [ 0/2356] [240s,260s) :: [ ] :: [ 0/2356] [220s,240s) :: [ ] :: [ 0/2356] [200s,220s) :: [ ] :: [ 1/2356] [180s,200s) :: [ ] :: [ 2/2356] [160s,180s) :: [ ] :: [ 0/2356] [140s,160s) :: [ ] :: [ 0/2356] [120s,140s) :: [ ] :: [ 1/2356] [100s,120s) :: [ ] :: [ 3/2356] [ 80s,100s) :: [ ] :: [ 8/2356] [ 60s, 80s) :: [ ] :: [ 9/2356] [ 40s, 60s) :: [ ] :: [ 26/2356] [ 20s, 40s) :: [** ] :: [ 131/2356] [ 0s, 20s) :: [************************************ ] :: [2174/2356] -------------------------------------------------------------------------- ******************** Failed Tests (3): lldb-api :: tools/lldb-vscode/breakpoint/TestVSCode_setBreakpoints.py lldb-api :: tools/lldb-vscode/breakpoint/TestVSCode_setFunctionBreakpoints.py lldb-api :: tools/lldb-vscode/evaluate/TestVSCode_evaluate.py

Hide Details

Hide Details

Testing Time: 3347.30s Unsupported : 212 Passed : 2131 Expectedly Failed: 10 Failed : 3 FAILED: tools/lldb/test/CMakeFiles/check-lldb cd /Users/buildslave/jenkins/workspace/lldb-cmake-sanitized/lldb-build/tools/lldb/test && /usr/local/Frameworks/Python.framework/Versions/3.7/bin/python3.7 /Users/buildslave/jenkins/workspace/lldb-cmake-sanitized/lldb-build/./bin/llvm-lit -v --time-tests --shuffle --xunit-xml-output=/Users/buildslave/jenkins/workspace/lldb-cmake-sanitized/test/results.xml -v -j 4 --timeout 1200 /Users/buildslave/jenkins/workspace/lldb-cmake-sanitized/lldb-build/tools/lldb/test ninja: build stopped: subcommand failed. Command failed: Command '['/usr/bin/env', 'TERM=vt100', '/usr/local/bin/ninja', '-v', 'check-lldb']' returned non-zero exit status 1. Command: ['/usr/bin/env', 'TERM=vt100', '/usr/local/bin/ninja', '-v', 'check-lldb'] [Pipeline] } [Pipeline] // timeout [Pipeline] } [Pipeline] // stage [Pipeline] stage [Pipeline] { (Declarative: Post Actions) [Pipeline] scanForIssues [Clang (LLVM based)] Sleeping for 5 seconds due to JENKINS-32191... [Clang (LLVM based)] Parsing console log (workspace: '/Users/buildslave/jenkins/workspace/lldb-cmake-sanitized') [Clang (LLVM based)] Successfully parsed console log [Clang (LLVM based)] -> found 5 issues (skipped 3 duplicates) [Clang (LLVM based)] [-ERROR-] Can't create fingerprints for some files: [Clang (LLVM based)] [-ERROR-] - '/Users/buildslave/jenkins/workspace/lldb-cmake-sanitized/lldb-build/{"body":{"category":"console","output":"/Users/buildslave/jenkins/workspace/lldb-cmake-sanitized/llvm-project/lldb/tools/lldb-vscode/ProgressEvent.cpp', IO exception has been thrown: java.nio.file.NoSuchFileException: /Users/buildslave/jenkins/workspace/lldb-cmake-sanitized/lldb-build/{"body":{"category":"console","output":"/Users/buildslave/jenkins/workspace/lldb-cmake-sanitized/llvm-project/lldb/tools/lldb-vscode/ProgressEvent.cpp [Clang (LLVM based)] [-ERROR-] - '/Users/buildslave/jenkins/workspace/lldb-cmake-sanitized/lldb-build/{"body":{"category":"console","output":"/Users/buildslave/jenkins/workspace/lldb-cmake-sanitized/llvm-project/lldb/tools/lldb-vscode/ProgressEvent.cpp', IO exception has been thrown: java.nio.file.NoSuchFileException: /Users/buildslave/jenkins/workspace/lldb-cmake-sanitized/lldb-build/{"body":{"category":"console","output":"/Users/buildslave/jenkins/workspace/lldb-cmake-sanitized/llvm-project/lldb/tools/lldb-vscode/ProgressEvent.cpp [Clang (LLVM based)] Post processing issues on 'green-dragon-23' with source code encoding 'UTF-8' [Clang (LLVM based)] Creating SCM blamer to obtain author and commit information for affected files [Clang (LLVM based)] -> No blamer installed yet. You need to install the 'git-forensics' plugin to enable blaming for Git. [Clang (LLVM based)] Resolving file names for all issues in source directory '/Users/buildslave/jenkins/workspace/lldb-cmake-sanitized' [Clang (LLVM based)] -> resolved paths in source directory (3 found, 1 not found) [Clang (LLVM based)] Resolving module names from module definitions (build.xml, pom.xml, or Manifest.mf files) [Clang (LLVM based)] -> resolved module names for 5 issues [Clang (LLVM based)] Resolving package names (or namespaces) by parsing the affected files [Clang (LLVM based)] -> resolved package names of 4 affected files [Clang (LLVM based)] No filter has been set, publishing all 5 issues [Clang (LLVM based)] Creating fingerprints for all affected code blocks to track issues over different builds [Clang (LLVM based)] -> created fingerprints for 3 issues (skipped 2 issues) [Clang (LLVM based)] Copying affected files to Jenkins' build folder '/Users/Shared/Jenkins/Home/jobs/lldb-cmake-sanitized/builds/1908/files-with-issues' [Clang (LLVM based)] -> 3 copied, 0 not in workspace, 2 not-found, 0 with I/O error [Clang (LLVM based)] Repository miner is not configured, skipping repository mining [Pipeline] junit Recording test results [Checks API] No suitable checks publisher found. [Pipeline] } [Pipeline] // stage [Pipeline] } [Pipeline] // withEnv [Pipeline] } [Pipeline] // node [Pipeline] End of Pipeline ERROR: script returned exit code 1 Finished: FAILURE