Console Output

Skipping 9,591 KB.. Full Log
output: 

Hide Details

runCmd: settings set use-color false output:

Hide Details

runCmd: setting set target.prefer-dynamic-value no-dynamic-values output:

Hide Details

runCmd: settings set target.env-vars ASAN_OPTIONS=detect_stack_use_after_return=1 DYLD_INSERT_LIBRARIES=/Users/buildslave/jenkins/workspace/lldb-cmake-sanitized/host-compiler/lib/clang/13.0.99/lib/darwin/libclang_rt.asan_osx_dynamic.dylib output:

Hide Details

runCmd: settings set target.env-vars ASAN_OPTIONS=detect_stack_use_after_return=1 DYLD_INSERT_LIBRARIES=/Users/buildslave/jenkins/workspace/lldb-cmake-sanitized/host-compiler/lib/clang/13.0.99/lib/darwin/libclang_rt.asan_osx_dynamic.dylib output:

Hide Details

FAIL: LLDB (/Users/buildslave/jenkins/workspace/lldb-cmake-sanitized/host-compiler/bin/clang-x86_64) :: test_step_single_thread_dwarf (TestThreadStepOut.ThreadStepOutTestCase) <bound method SBProcess.Kill of <lldb.SBProcess; proxy of <Swig Object of type 'lldb::SBProcess *' at 0x10fdbc9f0> >>: success

Hide Details

UNSUPPORTED: LLDB (/Users/buildslave/jenkins/workspace/lldb-cmake-sanitized/host-compiler/bin/clang-x86_64) :: test_step_single_thread_dwo (TestThreadStepOut.ThreadStepOutTestCase) (test case does not fall in any category of interest for this run) runCmd: settings clear -all output:

Hide Details

runCmd: settings set symbols.enable-external-lookup false output:

Hide Details

runCmd: settings set target.inherit-tcc true output:

Hide Details

runCmd: settings set target.detach-on-error false output:

Hide Details

runCmd: settings set target.auto-apply-fixits false output:

Hide Details

runCmd: settings set plugin.process.gdb-remote.packet-timeout 60 output:

Hide Details

runCmd: settings set symbols.clang-modules-cache-path "/Users/buildslave/jenkins/workspace/lldb-cmake-sanitized/lldb-build/lldb-test-build.noindex/module-cache-lldb/lldb-api" output:

Hide Details

runCmd: settings set use-color false output:

Hide Details

runCmd: setting set target.prefer-dynamic-value no-dynamic-values output:

Hide Details

runCmd: settings set target.env-vars ASAN_OPTIONS=detect_stack_use_after_return=1 DYLD_INSERT_LIBRARIES=/Users/buildslave/jenkins/workspace/lldb-cmake-sanitized/host-compiler/lib/clang/13.0.99/lib/darwin/libclang_rt.asan_osx_dynamic.dylib output:

Hide Details

runCmd: settings set target.env-vars ASAN_OPTIONS=detect_stack_use_after_return=1 DYLD_INSERT_LIBRARIES=/Users/buildslave/jenkins/workspace/lldb-cmake-sanitized/host-compiler/lib/clang/13.0.99/lib/darwin/libclang_rt.asan_osx_dynamic.dylib output:

Hide Details

runCmd: thread select 2 output:

Hide Details

runCmd: thread step-out -m this-thread output: Process 72524 stopped * thread #2, stop reason = step out frame #0: 0x0000000100000bfe a.out`thread_func() at main.cpp:25:5 22 step_out_of_here(); // But we might still be here 23 24 // Return -> 25 return NULL; // Expect to stop here after step-out. ^ 26 } 27 28 int main () thread #3, stop reason = breakpoint 1.1 frame #0: 0x0000000100000ba4 a.out`step_out_of_here() at main.cpp:12:10 9 volatile int g_test = 0; 10 11 void step_out_of_here() { -> 12 g_test += 5; // Set breakpoint here ^ 13 } 14 15 void *

Hide Details

Hide Details

runCmd: process status output: Process 72524 stopped * thread #2, stop reason = step out frame #0: 0x0000000100000bfe a.out`thread_func() at main.cpp:25:5 22 step_out_of_here(); // But we might still be here 23 24 // Return -> 25 return NULL; // Expect to stop here after step-out. ^ 26 } 27 28 int main () thread #3, stop reason = breakpoint 1.1 frame #0: 0x0000000100000ba4 a.out`step_out_of_here() at main.cpp:12:10 9 volatile int g_test = 0; 10 11 void step_out_of_here() { -> 12 g_test += 5; // Set breakpoint here ^ 13 } 14 15 void *

Hide Details

Hide Details

Ran command: "process status"

Hide Details

Got output: Process 72524 stopped * thread #2, stop reason = step out frame #0: 0x0000000100000bfe a.out`thread_func() at main.cpp:25:5 22 step_out_of_here(); // But we might still be here 23 24 // Return -> 25 return NULL; // Expect to stop here after step-out. ^ 26 } 27 28 int main () thread #3, stop reason = breakpoint 1.1 frame #0: 0x0000000100000ba4 a.out`step_out_of_here() at main.cpp:12:10 9 volatile int g_test = 0; 10 11 void step_out_of_here() { -> 12 g_test += 5; // Set breakpoint here ^ 13 } 14 15 void *

Hide Details

Expecting sub string: "stop reason = step out" (was found)

Hide Details

<bound method SBProcess.Kill of <lldb.SBProcess; proxy of <Swig Object of type 'lldb::SBProcess *' at 0x1103c1e40> >>: success

Hide Details

PASS: LLDB (/Users/buildslave/jenkins/workspace/lldb-cmake-sanitized/host-compiler/bin/clang-x86_64) :: test_step_single_thread_gmodules (TestThreadStepOut.ThreadStepOutTestCase) Restore dir to: /Users/buildslave/jenkins/workspace/lldb-cmake-sanitized/lldb-build/tools/lldb/test ====================================================================== FAIL: test_step_single_thread_dwarf (TestThreadStepOut.ThreadStepOutTestCase) Test thread step out on one thread via command interpreter. ---------------------------------------------------------------------- Traceback (most recent call last): File "/Users/buildslave/jenkins/workspace/lldb-cmake-sanitized/llvm-project/lldb/packages/Python/lldbsuite/test/lldbtest.py", line 1830, in test_method return attrvalue(self) File "/Users/buildslave/jenkins/workspace/lldb-cmake-sanitized/llvm-project/lldb/packages/Python/lldbsuite/test/decorators.py", line 119, in wrapper func(*args, **kwargs) File "/Users/buildslave/jenkins/workspace/lldb-cmake-sanitized/llvm-project/lldb/packages/Python/lldbsuite/test/decorators.py", line 119, in wrapper func(*args, **kwargs) File "/Users/buildslave/jenkins/workspace/lldb-cmake-sanitized/llvm-project/lldb/packages/Python/lldbsuite/test/decorators.py", line 119, in wrapper func(*args, **kwargs) File "/Users/buildslave/jenkins/workspace/lldb-cmake-sanitized/llvm-project/lldb/test/API/functionalities/thread/step_out/TestThreadStepOut.py", line 31, in test_step_single_thread self.step_out_test(self.step_out_single_thread_with_cmd) File "/Users/buildslave/jenkins/workspace/lldb-cmake-sanitized/llvm-project/lldb/test/API/functionalities/thread/step_out/TestThreadStepOut.py", line 148, in step_out_test self.assertEqual(len(bkpt_threads), 1, "Second thread stopped") AssertionError: 2 != 1 : Second thread stopped Config=x86_64-/Users/buildslave/jenkins/workspace/lldb-cmake-sanitized/host-compiler/bin/clang ---------------------------------------------------------------------- Ran 12 tests in 20.884s

Hide Details

RESULT: FAILED (8 passes, 1 failures, 0 errors, 3 skipped, 0 expected failures, 0 unexpected successes)

Hide Details

--

Hide Details

******************** PASS: lldb-unit :: Utility/./UtilityTests/ArgsTest.TestQuotedTrailingBackslash (1168 of 2356) PASS: lldb-api :: types/TestFloatTypesExpr.py (1169 of 2356) PASS: lldb-unit :: Utility/./UtilityTests/StringListTest.JoinThree (1170 of 2356) PASS: lldb-unit :: ObjectFile/PECOFF/./ObjectFilePECOFFTests/PECallFrameInfoTest.Chained_eh (1171 of 2356) UNSUPPORTED: lldb-api :: functionalities/data-formatter/data-formatter-stl/libstdcpp/unique_ptr/TestDataFormatterStdUniquePtr.py (1172 of 2356) PASS: lldb-shell :: SymbolFile/DWARF/x86/childless-compile-unit.s (1173 of 2356) PASS: lldb-api :: lang/cpp/global_operators/TestCppGlobalOperators.py (1174 of 2356) PASS: lldb-unit :: Symbol/./SymbolTests/TestTypeSystemClang.TestDeletingImplicitCopyCstrDueToMoveCStr (1175 of 2356) PASS: lldb-api :: macosx/nslog/TestDarwinNSLogOutput.py (1176 of 2356) PASS: lldb-api :: commands/frame/select/TestFrameSelect.py (1177 of 2356) PASS: lldb-unit :: Expression/./ExpressionTests/DiagnosticManagerTest.GetStringNoDiags (1178 of 2356) PASS: lldb-api :: functionalities/data-formatter/data-formatter-smart-array/TestDataFormatterSmartArray.py (1179 of 2356) PASS: lldb-api :: functionalities/data-formatter/format-propagation/TestFormatPropagation.py (1180 of 2356) PASS: lldb-unit :: Utility/./UtilityTests/SerializationRountripTest.SerializeDeserializeCStringNull (1181 of 2356) PASS: lldb-api :: python_api/value/change_values/TestChangeValueAPI.py (1182 of 2356) PASS: lldb-api :: commands/expression/import-std-module/unique_ptr-dbg-info-content/TestUniquePtrDbgInfoContent.py (1183 of 2356) PASS: lldb-api :: functionalities/breakpoint/breakpoint_set_restart/TestBreakpointSetRestart.py (1184 of 2356) PASS: lldb-unit :: Utility/./UtilityTests/StatusTest.Formatv (1185 of 2356) UNSUPPORTED: lldb-api :: functionalities/darwin_log/filter/regex/subsystem/TestDarwinLogFilterRegexSubsystem.py (1186 of 2356) PASS: lldb-unit :: Language/CLanguages/./LanguageCLanguagesTests/CLanguages.LookupCLanguagesByLanguageType (1187 of 2356) PASS: lldb-shell :: ObjectFile/ELF/PT_TLS-overlap-PT_LOAD.yaml (1188 of 2356) PASS: lldb-unit :: Utility/./UtilityTests/UriParserTest.SchemeHostSeparator2 (1189 of 2356) PASS: lldb-api :: linux/builtin_trap/TestBuiltinTrap.py (1190 of 2356) PASS: lldb-unit :: Expression/./ExpressionTests/ClangHostTest.ComputeClangResourceDirectory (1191 of 2356) PASS: lldb-shell :: SymbolFile/DWARF/x86/find-function-regex.cpp (1192 of 2356) PASS: lldb-unit :: UnwindAssembly/x86/./UnwindAssemblyx86Tests/Testx86AssemblyInspectionEngine.TestPushR14 (1193 of 2356) PASS: lldb-unit :: Utility/./UtilityTests/UriParserTest.BracketedHostnamePort (1194 of 2356) PASS: lldb-api :: lang/objc/foundation/TestObjCMethods.py (1195 of 2356) PASS: lldb-api :: commands/expression/import_base_class_when_class_has_derived_member/TestImportBaseClassWhenClassHasDerivedMember.py (1196 of 2356) PASS: lldb-unit :: Utility/./UtilityTests/Predicate.WaitForValueEqualTo (1197 of 2356) UNSUPPORTED: lldb-shell :: ScriptInterpreter/Lua/command_script_import.test (1198 of 2356) PASS: lldb-api :: lang/cpp/class-template-non-type-parameter-pack/TestClassTemplateNonTypeParameterPack.py (1199 of 2356) PASS: lldb-unit :: Interpreter/./InterpreterTests/OptionValueString.DeepCopy (1200 of 2356) UNSUPPORTED: lldb-api :: functionalities/darwin_log/basic/TestDarwinLogBasic.py (1201 of 2356) PASS: lldb-api :: functionalities/value_md5_crash/TestValueMD5Crash.py (1202 of 2356) UNSUPPORTED: lldb-api :: android/platform/TestDefaultCacheLineSize.py (1203 of 2356) PASS: lldb-unit :: Utility/./UtilityTests/StringExtractorTest.DecodeHexU8_Underflow (1204 of 2356) XFAIL: lldb-shell :: Register/x86-fp-write.test (1205 of 2356) PASS: lldb-api :: macosx/DBGSourcePathRemapping/TestDSYMSourcePathRemapping.py (1206 of 2356) PASS: lldb-api :: functionalities/data-formatter/data-formatter-skip-summary/TestDataFormatterSkipSummary.py (1207 of 2356) PASS: lldb-api :: commands/expression/anonymous-struct/TestCallUserAnonTypedef.py (1208 of 2356) PASS: lldb-api :: lang/c/shared_lib_stripped_symbols/TestSharedLibStrippedSymbols.py (1209 of 2356) PASS: lldb-api :: commands/target/dump-symtab-demangle/TestDumpSymtabDemangle.py (1210 of 2356) PASS: lldb-api :: functionalities/data-formatter/data-formatter-stl/libcxx/unique_ptr/TestDataFormatterLibcxxUniquePtr.py (1211 of 2356) PASS: lldb-api :: functionalities/tail_call_frames/thread_step_out_message/TestArtificialFrameStepOutMessage.py (1212 of 2356) PASS: lldb-shell :: Breakpoint/jit-loader_jitlink_elf.test (1213 of 2356) PASS: lldb-api :: commands/expression/import-std-module/deque-dbg-info-content/TestDbgInfoContentDequeFromStdModule.py (1214 of 2356) PASS: lldb-unit :: Utility/./UtilityTests/StreamTeeTest.AppendStream (1215 of 2356) UNSUPPORTED: lldb-api :: commands/watchpoints/variable_out_of_scope/TestWatchedVarHitWhenInScope.py (1216 of 2356) PASS: lldb-api :: lang/objcxx/cxx-bridged-po/TestObjCXXBridgedPO.py (1217 of 2356) PASS: lldb-unit :: Host/./HostTests/SocketTests/SocketTest.TCPGetConnectURI/ipv4 (1218 of 2356) PASS: lldb-unit :: Utility/./UtilityTests/RegularExpression.CopyAssignment (1219 of 2356) PASS: lldb-api :: commands/expression/import-std-module/list-dbg-info-content/TestDbgInfoContentListFromStdModule.py (1220 of 2356) PASS: lldb-unit :: Utility/./UtilityTests/RangeTest.DoesAdjoinOrIntersect (1221 of 2356) PASS: lldb-unit :: Language/Highlighting/./HighlighterTests/HighlighterTest.HighlighterSelectionType (1222 of 2356) PASS: lldb-api :: functionalities/data-formatter/poarray/TestPrintObjectArray.py (1223 of 2356) PASS: lldb-unit :: Host/./HostTests/MainLoopTest.Signal (1224 of 2356) PASS: lldb-api :: commands/target/stop-hooks/TestStopHookScripted.py (1225 of 2356) PASS: lldb-api :: lang/cpp/modules-import/TestCXXModulesImport.py (1226 of 2356) PASS: lldb-unit :: UnwindAssembly/x86/./UnwindAssemblyx86Tests/Testx86AssemblyInspectionEngine.TestSimple32bitFrameFunction (1227 of 2356) UNSUPPORTED: lldb-shell :: Subprocess/vfork-follow-parent-wp.test (1228 of 2356) PASS: lldb-api :: tools/lldb-server/TestGdbRemoteExitCode.py (1229 of 2356) UNSUPPORTED: lldb-api :: functionalities/darwin_log/filter/regex/message/TestDarwinLogFilterRegexMessage.py (1230 of 2356) PASS: lldb-unit :: Process/minidump/./LLDBMinidumpTests/MinidumpParserTest.MinidumpDuplicateModuleMappedFirst (1231 of 2356) PASS: lldb-api :: functionalities/limit-debug-info/TestLimitDebugInfo.py (1232 of 2356) PASS: lldb-api :: types/TestDoubleTypes.py (1233 of 2356) PASS: lldb-shell :: SymbolFile/DWARF/x86/dwarf5-index-is-used.cpp (1234 of 2356) PASS: lldb-unit :: Core/./LLDBCoreTests/DumpDataExtractorTest.StartOffset (1235 of 2356) PASS: lldb-api :: commands/platform/basic/TestPlatformCommand.py (1236 of 2356) PASS: lldb-unit :: Utility/./UtilityTests/StringExtractorTest.DecodeHexU8_InvalidHex (1237 of 2356) PASS: lldb-api :: functionalities/gdb_remote_client/TestArmRegisterDefinition.py (1238 of 2356) PASS: lldb-unit :: Utility/./UtilityTests/ConstStringTest.CompareStringRef (1239 of 2356) PASS: lldb-unit :: DataFormatter/./LLDBFormatterTests/TypeMatcherTests.RegexMatchPart (1240 of 2356) PASS: lldb-api :: commands/watchpoints/watchpoint_commands/command/TestWatchpointCommandPython.py (1241 of 2356) PASS: lldb-api :: test_utils/TestPExpectTest.py (1242 of 2356) PASS: lldb-unit :: Utility/./UtilityTests/BinaryStreamTest.PutSLEB128One (1243 of 2356) PASS: lldb-unit :: Utility/./UtilityTests/StringListTest.Clear (1244 of 2356) PASS: lldb-unit :: Utility/./UtilityTests/Flags.AnyClear (1245 of 2356) PASS: lldb-api :: functionalities/reproducers/attach/TestReproducerAttach.py (1246 of 2356) PASS: lldb-api :: functionalities/gdb_remote_client/TestNoGPacketSupported.py (1247 of 2356) UNSUPPORTED: lldb-api :: functionalities/data-formatter/data-formatter-stl/libstdcpp/string/TestDataFormatterStdString.py (1248 of 2356) PASS: lldb-api :: lang/objc/conflicting-definition/TestConflictingDefinition.py (1249 of 2356) UNSUPPORTED: lldb-api :: lang/objc/foundation/TestFoundationDisassembly.py (1250 of 2356) PASS: lldb-api :: api/multiple-targets/TestMultipleTargets.py (1251 of 2356) PASS: lldb-api :: macosx/add-dsym/TestAddDsymMidExecutionCommand.py (1252 of 2356) PASS: lldb-api :: lang/cpp/diamond/TestDiamond.py (1253 of 2356) PASS: lldb-api :: functionalities/data-formatter/data-formatter-stl/libcxx/iterator/TestDataFormatterLibccIterator.py (1254 of 2356) PASS: lldb-shell :: Reproducer/TestGDBRemoteRepro.test (1255 of 2356) PASS: lldb-shell :: SymbolFile/DWARF/x86/DW_TAG_variable-invalid_location.s (1256 of 2356) PASS: lldb-unit :: Utility/./UtilityTests/RangeTest.SetRangeBase (1257 of 2356) PASS: lldb-api :: functionalities/unwind/zeroth_frame/TestZerothFrame.py (1258 of 2356) PASS: lldb-shell :: Register/Core/x86-64-freebsd-gp.test (1259 of 2356) PASS: lldb-api :: functionalities/set-data/TestSetData.py (1260 of 2356) PASS: lldb-unit :: UnwindAssembly/x86/./UnwindAssemblyx86Tests/Testx86AssemblyInspectionEngine.TestPushESI (1261 of 2356) PASS: lldb-shell :: Driver/TestRepl.test (1262 of 2356) UNSUPPORTED: lldb-api :: tools/lldb-server/TestGdbRemoteAuxvSupport.py (1263 of 2356) PASS: lldb-unit :: Interpreter/./InterpreterTests/CompletionTest.FileCompletionAbsolute (1264 of 2356) PASS: lldb-shell :: SymbolFile/NativePDB/locate-pdb.cpp (1265 of 2356) PASS: lldb-api :: lang/objc/objc-new-syntax/TestObjCNewSyntaxLiteral.py (1266 of 2356) UNSUPPORTED: lldb-api :: benchmarks/stepping/TestSteppingSpeed.py (1267 of 2356) PASS: lldb-api :: commands/expression/dollar-in-variable/TestDollarInVariable.py (1268 of 2356) PASS: lldb-unit :: Utility/./UtilityTests/StringLexerTest.GetUnlexed (1269 of 2356) PASS: lldb-unit :: UnwindAssembly/x86/./UnwindAssemblyx86Tests/Testx86AssemblyInspectionEngine.TestSubESP (1270 of 2356) PASS: lldb-unit :: Process/Utility/./ProcessUtilityTests/ProcSMapTests/LinuxProcSMapsTestFixture.ParseSMapRegions/6 (1271 of 2356) PASS: lldb-unit :: Utility/./UtilityTests/ReproducerTest.SetCapture (1272 of 2356) PASS: lldb-unit :: Utility/./UtilityTests/StringLexerTest.NextIf (1273 of 2356) PASS: lldb-unit :: Process/gdb-remote/./ProcessGdbRemoteTests/GDBRemoteClientBaseTest.SendPacketAndReceiveResponseWithOutputSupport (1274 of 2356) PASS: lldb-unit :: Symbol/./SymbolTests/DWARFCallFrameInfoTest.Basic_dwarf4 (1275 of 2356) UNSUPPORTED: lldb-shell :: SymbolFile/DWARF/x86/DW_TAG_variable-DW_AT_decl_file-DW_AT_abstract_origin-crosscu1.s (1276 of 2356) PASS: lldb-shell :: SymbolFile/DWARF/x86/find-variable-dwo.cpp (1277 of 2356) PASS: lldb-shell :: Quit/TestQuitExitCode30.test (1278 of 2356) PASS: lldb-shell :: ObjectFile/ELF/build-id-case.yaml (1279 of 2356) PASS: lldb-api :: commands/expression/import-std-module/array/TestArrayFromStdModule.py (1280 of 2356) PASS: lldb-unit :: ScriptInterpreter/Python/./ScriptInterpreterPythonTests/PythonDataObjectsTest.TestRun (1281 of 2356) PASS: lldb-unit :: Utility/./UtilityTests/Flags.Clear (1282 of 2356) PASS: lldb-api :: lang/cpp/virtual-functions/TestCppVirtualFunctions.py (1283 of 2356) UNSUPPORTED: lldb-shell :: SymbolFile/PDB/function-level-linking.test (1284 of 2356) PASS: lldb-unit :: Interpreter/./InterpreterTests/OptionValueArgs.DeepCopy (1285 of 2356) PASS: lldb-api :: functionalities/data-formatter/type_summary_list_script/TestTypeSummaryListScript.py (1286 of 2356) PASS: lldb-unit :: Utility/./UtilityTests/StringLexerTest.Next (1287 of 2356) PASS: lldb-unit :: SymbolFile/NativePDB/./SymbolFileNativePDBTests/PDBFPOProgramToDWARFExpressionTests.DependencyChain (1288 of 2356) PASS: lldb-unit :: Utility/./UtilityTests/StringListTest.AppendListCStringArrayEmpty (1289 of 2356) PASS: lldb-unit :: Core/./LLDBCoreTests/DumpDataExtractorTest.FormatCharArray (1290 of 2356) PASS: lldb-unit :: Utility/./UtilityTests/BinaryStreamTest.PutULEB128NineBytes (1291 of 2356) PASS: lldb-shell :: ScriptInterpreter/Python/eof.test (1292 of 2356) PASS: lldb-api :: macosx/debugserver-exit-code/TestDebugServerExitCode.py (1293 of 2356) PASS: lldb-unit :: Utility/./UtilityTests/StatusTest.ErrorConversion (1294 of 2356) PASS: lldb-api :: functionalities/memory-region/TestMemoryRegion.py (1295 of 2356) PASS: lldb-unit :: SymbolFile/NativePDB/./SymbolFileNativePDBTests/PDBFPOProgramToDWARFExpressionTests.InvalidAssignmentSingle (1296 of 2356) PASS: lldb-api :: functionalities/tail_call_frames/sbapi_support/TestTailCallFrameSBAPI.py (1297 of 2356) PASS: lldb-unit :: Utility/./UtilityTests/RegisterValueTest.GetSet8 (1298 of 2356) PASS: lldb-api :: functionalities/data-formatter/data-formatter-stl/libcxx/multimap/TestDataFormatterLibccMultiMap.py (1299 of 2356) UNSUPPORTED: lldb-api :: functionalities/ubsan/user-expression/TestUbsanUserExpression.py (1300 of 2356) PASS: lldb-api :: lang/cpp/member-and-local-vars-with-same-name/TestMembersAndLocalsWithSameName.py (1301 of 2356) PASS: lldb-api :: functionalities/load_using_paths/TestLoadUsingPaths.py (1302 of 2356) PASS: lldb-api :: types/TestCharType.py (1303 of 2356) PASS: lldb-shell :: Register/x86-multithread-read.test (1304 of 2356) PASS: lldb-api :: functionalities/gdb_remote_client/TestNoWatchpointSupportInfo.py (1305 of 2356) PASS: lldb-shell :: SymbolFile/DWARF/x86/DW_AT_data_bit_offset-DW_OP_stack_value.s (1306 of 2356) PASS: lldb-api :: lang/objc/modules-hash-mismatch/TestClangModulesHashMismatch.py (1307 of 2356) PASS: lldb-unit :: Utility/./UtilityTests/StringExtractorTest.DecodeHexU8_Extra (1308 of 2356) PASS: lldb-api :: commands/settings/use_source_cache/TestUseSourceCache.py (1309 of 2356) PASS: lldb-unit :: SymbolFile/DWARF/./SymbolFileDWARFTests/SymbolFileDWARFTests.TestAbilitiesForDWARF (1310 of 2356) PASS: lldb-unit :: Process/minidump/./LLDBMinidumpTests/MinidumpParserTest.GetThreadContext_x86_32 (1311 of 2356) PASS: lldb-api :: lang/objc/foundation/TestSymbolTable.py (1312 of 2356) PASS: lldb-unit :: Utility/./UtilityTests/UriParserTest.TypicalPortPathIPv6 (1313 of 2356) PASS: lldb-api :: commands/expression/import-std-module/shared_ptr-dbg-info-content/TestSharedPtrDbgInfoContentFromStdModule.py (1314 of 2356) PASS: lldb-unit :: ScriptInterpreter/Python/./ScriptInterpreterPythonTests/PythonDataObjectsTest.TestPythonStringToStr (1315 of 2356) PASS: lldb-unit :: Process/Utility/./ProcessUtilityTests/ProcMapTests/LinuxProcMapsTestFixture.ParseMapRegions/6 (1316 of 2356) PASS: lldb-api :: commands/expression/import-std-module/retry-with-std-module/TestRetryWithStdModule.py (1317 of 2356) PASS: lldb-unit :: Host/./HostTests/HostInfoTestInitialization.InitTwice (1318 of 2356) PASS: lldb-api :: lang/cpp/gmodules/TestWithModuleDebugging.py (1319 of 2356) PASS: lldb-api :: functionalities/postmortem/elf-core/thread_crash/TestLinuxCoreThreads.py (1320 of 2356) PASS: lldb-unit :: Utility/./UtilityTests/OptionsWithRawTest.EmptyInput (1321 of 2356) PASS: lldb-shell :: Register/Core/x86-64-freebsd-fp.test (1322 of 2356) PASS: lldb-unit :: Expression/./ExpressionTests/DiagnosticManagerTest.AppendMessageNoDiag (1323 of 2356) PASS: lldb-api :: python_api/function_symbol/TestSymbolAPI.py (1324 of 2356) PASS: lldb-api :: lang/cpp/limit-debug-info/TestWithLimitDebugInfo.py (1325 of 2356) PASS: lldb-api :: functionalities/thread/concurrent_events/TestConcurrentCrashWithWatchpointBreakpointSignal.py (1326 of 2356) UNSUPPORTED: lldb-shell :: Register/x86-64-ymm16-read.test (1327 of 2356) PASS: lldb-unit :: Utility/./UtilityTests/UriParserTest.BadPort (1328 of 2356) PASS: lldb-unit :: Symbol/./SymbolTests/TestTypeSystemClang.TestConvertAccessTypeToAccessSpecifier (1329 of 2356) PASS: lldb-shell :: SymbolFile/DWARF/x86/dwarf5-implicit-const.s (1330 of 2356) PASS: lldb-api :: lang/c/stepping/TestThreadStepInAvoidRegexp.py (1331 of 2356) PASS: lldb-shell :: ObjectFile/MachO/lc_build_version.yaml (1332 of 2356) PASS: lldb-api :: functionalities/data-formatter/data-formatter-stl/libstdcpp/unique_ptr/invalid/TestDataFormatterInvalidStdUniquePtr.py (1333 of 2356) PASS: lldb-api :: commands/settings/TestSettings.py (1334 of 2356) PASS: lldb-unit :: Utility/./UtilityTests/VMRange.Ordering (1335 of 2356) PASS: lldb-unit :: Core/./LLDBCoreTests/MangledTest.EmptyForInvalidName (1336 of 2356) PASS: lldb-shell :: ObjectFile/Breakpad/discontiguous-sections.test (1337 of 2356) PASS: lldb-api :: commands/expression/invalid-args/TestInvalidArgsExpression.py (1338 of 2356) PASS: lldb-api :: functionalities/data-formatter/builtin-formats/TestBuiltinFormats.py (1339 of 2356) PASS: lldb-unit :: Utility/./UtilityTests/StringListTest.AppendStringCString (1340 of 2356) PASS: lldb-unit :: Utility/./UtilityTests/ScalarTest.Promotion (1341 of 2356) PASS: lldb-unit :: Utility/./UtilityTests/RangeTest.ContainsAddrInvalid (1342 of 2356) PASS: lldb-unit :: Utility/./UtilityTests/StreamTest.PutRawBytesToLittleEndian (1343 of 2356) PASS: lldb-unit :: Utility/./UtilityTests/ConstStringTest.MangledCounterpart (1344 of 2356) PASS: lldb-unit :: Language/Highlighting/./HighlighterTests/HighlighterTest.ClangTrailingBackslashMissingNewLine (1345 of 2356) PASS: lldb-unit :: Utility/./UtilityTests/XcodeSDKTest.ParseTest (1346 of 2356) PASS: lldb-api :: functionalities/thread/concurrent_events/TestConcurrentDelaySignalBreak.py (1347 of 2356) PASS: lldb-api :: functionalities/postmortem/elf-core/gcore/TestGCore.py (1348 of 2356) PASS: lldb-api :: lang/cpp/pointer_to_member_type_depending_on_parent_size/TestPointerToMemberTypeDependingOnParentSize.py (1349 of 2356) PASS: lldb-api :: functionalities/breakpoint/debugbreak/TestDebugBreak.py (1350 of 2356) UNSUPPORTED: lldb-shell :: ScriptInterpreter/Lua/lua-python.test (1351 of 2356) PASS: lldb-api :: lang/cpp/class_types/TestClassTypes.py (1352 of 2356) PASS: lldb-api :: functionalities/thread/concurrent_events/TestConcurrentSignalWatchBreak.py (1353 of 2356) PASS: lldb-unit :: Utility/./UtilityTests/ProcessInstanceInfoMatch.Name (1354 of 2356) PASS: lldb-unit :: SymbolFile/DWARF/./SymbolFileDWARFTests/SymbolFileDWARFTests.ParseAranges (1355 of 2356) PASS: lldb-api :: python_api/file_handle/TestFileHandle.py (1356 of 2356) PASS: lldb-unit :: Utility/./UtilityTests/StringListTest.SplitIntoLinesEmpty (1357 of 2356) PASS: lldb-unit :: Utility/./UtilityTests/Flags.AllSet (1358 of 2356) PASS: lldb-unit :: UnwindAssembly/x86/./UnwindAssemblyx86Tests/Testx86AssemblyInspectionEngine.TestSimple64bitFrameFunction (1359 of 2356) PASS: lldb-unit :: Utility/./UtilityTests/AnsiTerminal.AtEnd (1360 of 2356) PASS: lldb-shell :: Unwind/trap_frame_sym_ctx.test (1361 of 2356) PASS: lldb-api :: functionalities/gdb_remote_client/TestGDBRemoteLoad.py (1362 of 2356) PASS: lldb-unit :: SymbolFile/NativePDB/./SymbolFileNativePDBTests/PDBFPOProgramToDWARFExpressionTests.UnresolvedDependentCyclicRegisterAssignmentReference (1363 of 2356) PASS: lldb-shell :: SymbolFile/DWARF/x86/DW_TAG_variable-DW_AT_const_value.s (1364 of 2356) PASS: lldb-shell :: SymbolFile/NativePDB/globals-fundamental.cpp (1365 of 2356) PASS: lldb-unit :: Process/minidump/./LLDBMinidumpTests/MinidumpParserTest.GetArchitectureWindows (1366 of 2356) PASS: lldb-api :: commands/command/script/import/rdar-12586188/TestRdar12586188.py (1367 of 2356) PASS: lldb-api :: functionalities/postmortem/elf-core/TestLinuxCore.py (1368 of 2356) PASS: lldb-shell :: Minidump/fb-dump.test (1369 of 2356) PASS: lldb-api :: lang/c/struct_types/TestStructTypes.py (1370 of 2356) PASS: lldb-api :: functionalities/thread/thread_specific_break/TestThreadSpecificBreakpoint.py (1371 of 2356) UNSUPPORTED: lldb-api :: iohandler/autosuggestion/TestAutosuggestion.py (1372 of 2356) PASS: lldb-unit :: Utility/./UtilityTests/LogChannelEnabledTest.LogThread (1373 of 2356) PASS: lldb-unit :: ScriptInterpreter/Python/./ScriptInterpreterPythonTests/PythonDataObjectsTest.TestPythonTupleInitializerList (1374 of 2356) PASS: lldb-shell :: Minidump/breakpad-symbols.test (1375 of 2356) PASS: lldb-api :: commands/command/source/TestCommandSource.py (1376 of 2356) PASS: lldb-api :: lang/objc/warnings-in-expr-parser/TestObjCWarningsInExprParser.py (1377 of 2356) PASS: lldb-api :: functionalities/type_completion/TestTypeCompletion.py (1378 of 2356) PASS: lldb-shell :: Commands/command-backtrace-parser-1.test (1379 of 2356) PASS: lldb-unit :: UnwindAssembly/x86/./UnwindAssemblyx86Tests/Testx86AssemblyInspectionEngine.TestPopESI (1380 of 2356) PASS: lldb-unit :: Utility/./UtilityTests/IndexToObjectTest.ObjectForIndex (1381 of 2356) PASS: lldb-unit :: Utility/./UtilityTests/BinaryStreamTest.PutULEB128MaxValue (1382 of 2356) PASS: lldb-unit :: Utility/./UtilityTests/AnsiTerminal.AtStart (1383 of 2356) PASS: lldb-unit :: Utility/./UtilityTests/StringListTest.JoinMultiCharSeparator (1384 of 2356) PASS: lldb-unit :: Utility/./UtilityTests/DataExtractorTest.GetFloat (1385 of 2356) PASS: lldb-unit :: Utility/./UtilityTests/StreamTeeTest.Flush (1386 of 2356) PASS: lldb-api :: commands/expression/persistent_types/TestPersistentTypes.py (1387 of 2356) PASS: lldb-unit :: Utility/./UtilityTests/StreamTest.PutChar (1388 of 2356) PASS: lldb-unit :: Utility/./UtilityTests/StringListTest.JoinSingle (1389 of 2356) PASS: lldb-api :: functionalities/source-map/TestTargetSourceMap.py (1390 of 2356) PASS: lldb-api :: functionalities/abbreviation/TestAbbreviations.py (1391 of 2356) PASS: lldb-api :: lang/objcxx/objcxx-ivar-vector/TestIvarVector.py (1392 of 2356) PASS: lldb-unit :: Utility/./UtilityTests/GeneratorTest.Get (1393 of 2356) PASS: lldb-unit :: Interpreter/./InterpreterTests/CompletionTest.DirCompletionUsername (1394 of 2356) PASS: lldb-api :: python_api/frame/inlines/TestInlinedFrame.py (1395 of 2356) PASS: lldb-unit :: Utility/./UtilityTests/StringListTest.GetMaxStringLengthEmpty (1396 of 2356) PASS: lldb-unit :: Utility/./UtilityTests/StreamTest.PutHex32ByteOrderLittle (1397 of 2356) PASS: lldb-unit :: SymbolFile/NativePDB/./SymbolFileNativePDBTests/PDBFPOProgramToDWARFExpressionTests.UnresolvedCyclicRegisterAssignmentReference (1398 of 2356) PASS: lldb-api :: lang/cpp/keywords_enabled/TestCppKeywordsEnabled.py (1399 of 2356) PASS: lldb-unit :: ScriptInterpreter/Python/./ScriptInterpreterPythonTests/PythonDataObjectsTest.TestPythonTupleToStructuredList (1400 of 2356) PASS: lldb-unit :: ScriptInterpreter/Python/./ScriptInterpreterPythonTests/PythonDataObjectsTest.TestPythonByteArray (1401 of 2356) UNSUPPORTED: lldb-api :: tools/lldb-server/TestGdbRemoteModuleInfo.py (1402 of 2356) PASS: lldb-api :: functionalities/breakpoint/step_over_breakpoint/TestStepOverBreakpoint.py (1403 of 2356) PASS: lldb-api :: lang/objc/variadic_methods/TestVariadicMethods.py (1404 of 2356) PASS: lldb-unit :: ObjectFile/Breakpad/./ObjectFileBreakpadTests/StackCFIRecord.parse (1405 of 2356) PASS: lldb-unit :: UnwindAssembly/x86/./UnwindAssemblyx86Tests/Testx86AssemblyInspectionEngine.TestPopR13 (1406 of 2356) PASS: lldb-api :: lang/objc/foundation/TestObjCMethodsString.py (1407 of 2356) PASS: lldb-shell :: SymbolFile/DWARF/x86/dwarf5_locations.s (1408 of 2356) PASS: lldb-unit :: Language/Highlighting/./HighlighterTests/HighlighterTest.DefaultHighlighterWithCursorOutOfBounds (1409 of 2356) PASS: lldb-api :: lang/cpp/std-function-step-into-callable/TestStdFunctionStepIntoCallable.py (1410 of 2356) PASS: lldb-api :: python_api/value_var_update/TestValueVarUpdate.py (1411 of 2356) PASS: lldb-shell :: ScriptInterpreter/Python/Crashlog/json.test (1412 of 2356) UNSUPPORTED: lldb-api :: functionalities/tsan/global_location/TestTsanGlobalLocation.py (1413 of 2356) PASS: lldb-unit :: Utility/./UtilityTests/RegularExpression.Empty (1414 of 2356) PASS: lldb-api :: commands/command/invalid-args/TestInvalidArgsCommand.py (1415 of 2356) PASS: lldb-api :: lang/c/stepping/TestThreadStepping.py (1416 of 2356) PASS: lldb-unit :: Utility/./UtilityTests/RangeDataVector.FindEntryThatContains (1417 of 2356) PASS: lldb-api :: functionalities/thread/crash_during_step/TestCrashDuringStep.py (1418 of 2356) PASS: lldb-unit :: Utility/./UtilityTests/UriParserTest.BracketedHostname (1419 of 2356) UNSUPPORTED: lldb-shell :: BuildScript/toolchain-clang-cl.test (1420 of 2356) PASS: lldb-unit :: Language/CPlusPlus/./LanguageCPlusPlusTests/CPlusPlusLanguage.ExtractContextAndIdentifier (1421 of 2356) PASS: lldb-api :: lang/cpp/auto/TestCPPAuto.py (1422 of 2356) PASS: lldb-api :: functionalities/thread/concurrent_events/TestConcurrentCrashWithWatchpoint.py (1423 of 2356) PASS: lldb-unit :: Utility/./UtilityTests/FileSpecTest.FormatFileSpec (1424 of 2356) PASS: lldb-unit :: Utility/./UtilityTests/StringExtractorTest.GetHexBytesAvail_Partial (1425 of 2356) PASS: lldb-unit :: Process/minidump/./LLDBMinidumpTests/MinidumpParserTest.GetLinuxProcStatus (1426 of 2356) PASS: lldb-api :: commands/frame/diagnose/dereference-function-return/TestDiagnoseDereferenceFunctionReturn.py (1427 of 2356) UNSUPPORTED: lldb-shell :: Register/x86-64-xmm16-write.test (1428 of 2356) PASS: lldb-unit :: ObjectFile/Breakpad/./ObjectFileBreakpadTests/FileRecord.parse (1429 of 2356) UNSUPPORTED: lldb-api :: functionalities/thread/break_after_join/TestBreakAfterJoin.py (1430 of 2356) PASS: lldb-unit :: Expression/./ExpressionTests/CppModuleConfigurationTest.Sysroot (1431 of 2356) PASS: lldb-api :: functionalities/breakpoint/breakpoint_ids/TestBreakpointIDs.py (1432 of 2356) PASS: lldb-api :: lang/objc/objc++/TestObjCXX.py (1433 of 2356) PASS: lldb-api :: lang/cpp/offsetof/TestOffsetofCpp.py (1434 of 2356) PASS: lldb-shell :: SymbolFile/DWARF/x86/dwarf5-debug_line-file-index.s (1435 of 2356) PASS: lldb-api :: lang/objc/forward-decl/TestForwardDecl.py (1436 of 2356) PASS: lldb-shell :: SymbolFile/DWARF/x86/DW_TAG_basic_type_DW_ATE_UTF_nonC.ll (1437 of 2356) PASS: lldb-unit :: Process/minidump/./LLDBMinidumpTests/MinidumpParserTest.GetFilteredModuleList (1438 of 2356) PASS: lldb-unit :: Utility/./UtilityTests/BinaryStreamTest.PutSLEB128SixBytes (1439 of 2356) PASS: lldb-unit :: Utility/./UtilityTests/ConstStringTest.UpdateMangledCounterpart (1440 of 2356) PASS: lldb-unit :: Core/./LLDBCoreTests/RichManglingContextTest.IPDRealloc (1441 of 2356) PASS: lldb-unit :: Editline/./EditlineTests/EditlineTestFixture.EditlineReceivesMultiLineText (1442 of 2356) PASS: lldb-unit :: ScriptInterpreter/Python/./ScriptInterpreterPythonTests/PythonDataObjectsTest.TestPythonInteger (1443 of 2356) UNSUPPORTED: lldb-api :: commands/register/register/intel_xtended_registers/mpx_offset_intersection/TestMPXOffsetIntersection.py (1444 of 2356) PASS: lldb-api :: api/check_public_api_headers/TestPublicAPIHeaders.py (1445 of 2356) UNSUPPORTED: lldb-shell :: Register/x86-zmm-read.test (1446 of 2356) PASS: lldb-api :: lang/cpp/template-specialization-type/TestTemplateSpecializationType.py (1447 of 2356) UNSUPPORTED: lldb-shell :: ObjectFile/PECOFF/disassemble-thumb.yaml (1448 of 2356) PASS: lldb-unit :: Process/minidump/./LLDBMinidumpTests/MinidumpParserTest.MinidumpDuplicateModuleMappedSecond (1449 of 2356) PASS: lldb-api :: functionalities/breakpoint/breakpoint_conditions/TestBreakpointConditions.py (1450 of 2356) PASS: lldb-api :: lang/objc/modules-cache/TestClangModulesCache.py (1451 of 2356) PASS: lldb-unit :: Expression/./ExpressionTests/DWARFExpressionMockProcessTest.DW_OP_deref (1452 of 2356) PASS: lldb-api :: commands/reproducer/invalid-args/TestInvalidArgsReproducer.py (1453 of 2356) PASS: lldb-shell :: Unwind/thread-step-out-ret-addr-check.test (1454 of 2356) PASS: lldb-unit :: Utility/./UtilityTests/FileSpecTest.CopyByAppendingPathComponent (1455 of 2356) PASS: lldb-api :: functionalities/breakpoint/cpp_exception/TestCPPExceptionBreakpoint.py (1456 of 2356) PASS: lldb-unit :: Core/./LLDBCoreTests/UniqueCStringMap.NoDefaultConstructor (1457 of 2356) UNSUPPORTED: lldb-shell :: ScriptInterpreter/Lua/convenience_variables.test (1458 of 2356) PASS: lldb-api :: functionalities/mtc/simple/TestMTCSimple.py (1459 of 2356) PASS: lldb-unit :: Utility/./UtilityTests/ArgsTest.TestTrailingBackslash (1460 of 2356) PASS: lldb-api :: functionalities/breakpoint/global_constructor/TestBreakpointInGlobalConstructor.py (1461 of 2356) PASS: lldb-api :: functionalities/breakpoint/dummy_target_breakpoints/TestBreakpointsWithNoTargets.py (1462 of 2356) PASS: lldb-shell :: SymbolFile/DWARF/x86/array-sizes.s (1463 of 2356) PASS: lldb-shell :: ScriptInterpreter/None/import_module.test (1464 of 2356) PASS: lldb-unit :: Utility/./UtilityTests/StreamTest.PutBytesAsRawHex8ToMixedEndian (1465 of 2356) PASS: lldb-shell :: SymbolFile/NativePDB/function-types-classes.cpp (1466 of 2356) UNSUPPORTED: lldb-shell :: SymbolFile/DWARF/x86/dwarf5-line-strp.s (1467 of 2356) UNSUPPORTED: lldb-api :: lang/cpp/printf/TestPrintf.py (1468 of 2356) PASS: lldb-unit :: Utility/./UtilityTests/Flags.AnySet (1469 of 2356) PASS: lldb-api :: commands/platform/process/list/TestProcessList.py (1470 of 2356) PASS: lldb-unit :: Utility/./UtilityTests/OptionsWithRawTest.UnterminatedQuote (1471 of 2356) PASS: lldb-unit :: UnwindAssembly/x86/./UnwindAssemblyx86Tests/Testx86AssemblyInspectionEngine.TestPushRBPWithREX (1472 of 2356) PASS: lldb-unit :: Process/Utility/./ProcessUtilityTests/MemoryTagManagerAArch64MTETest.RemoveNonAddressBits (1473 of 2356) PASS: lldb-api :: python_api/section/TestSectionAPI.py (1474 of 2356) PASS: lldb-shell :: SymbolFile/NativePDB/source-list.cpp (1475 of 2356) PASS: lldb-unit :: Host/./HostTests/HostInfoTest.GetXcodeSDK (1476 of 2356) PASS: lldb-shell :: ObjectFile/ELF/section-addresses.yaml (1477 of 2356) PASS: lldb-unit :: Utility/./UtilityTests/VMRange.Reset (1478 of 2356) PASS: lldb-shell :: Reproducer/TestMultipleTargets.test (1479 of 2356) PASS: lldb-unit :: Thread/./ThreadTests/ThreadTest.SetStopInfo (1480 of 2356) PASS: lldb-unit :: Utility/./UtilityTests/UriParserTest.TypicalPortPathIPv4 (1481 of 2356) PASS: lldb-shell :: SymbolFile/DWARF/x86/debug_line-relative_path.s (1482 of 2356) PASS: lldb-api :: commands/expression/two-files/TestObjCTypeQueryFromOtherCompileUnit.py (1483 of 2356) PASS: lldb-unit :: tools/lldb-server/tests/./LLDBServerTests/TestBase.DebugserverEnv (1484 of 2356) PASS: lldb-unit :: Symbol/./SymbolTests/TestClangASTImporter.CompleteFwdDeclWithOtherOrigin (1485 of 2356) PASS: lldb-api :: commands/command/script/import/TestImport.py (1486 of 2356) PASS: lldb-api :: tools/lldb-server/inferior-crash/TestGdbRemoteAbort.py (1487 of 2356) PASS: lldb-unit :: ScriptInterpreter/Python/./ScriptInterpreterPythonTests/PythonDataObjectsTest.TestExceptions (1488 of 2356) PASS: lldb-unit :: Process/minidump/./LLDBMinidumpTests/RegisterContextMinidump.ConvertMinidumpContext_x86_32 (1489 of 2356) PASS: lldb-unit :: UnwindAssembly/x86/./UnwindAssemblyx86Tests/Testx86AssemblyInspectionEngine.TestPopEBP (1490 of 2356) PASS: lldb-api :: sanity/TestSettingSkipping.py (1491 of 2356) PASS: lldb-unit :: Interpreter/./InterpreterTests/OptionArgParserTest.toScriptLanguage (1492 of 2356) PASS: lldb-unit :: UnwindAssembly/x86/./UnwindAssemblyx86Tests/Testx86AssemblyInspectionEngine.TestPushECX (1493 of 2356) PASS: lldb-unit :: Utility/./UtilityTests/StringExtractorTest.GetHexU8_Underflow_NoEof (1494 of 2356) PASS: lldb-unit :: Process/Utility/./ProcessUtilityTests/MemoryTagManagerAArch64MTETest.GetLogicalTag (1495 of 2356) PASS: lldb-api :: commands/expression/import-std-module/unique_ptr/TestUniquePtrFromStdModule.py (1496 of 2356) PASS: lldb-api :: tools/lldb-vscode/breakpoint/TestVSCode_setExceptionBreakpoints.py (1497 of 2356) PASS: lldb-unit :: Utility/./UtilityTests/StringListTest.SplitIntoLines (1498 of 2356) PASS: lldb-unit :: Utility/./UtilityTests/VMRange.IsValid (1499 of 2356) PASS: lldb-api :: functionalities/jitloader_gdb/TestJITLoaderGDB.py (1500 of 2356) PASS: lldb-unit :: Core/./LLDBCoreTests/CommunicationTest.SynchronizeWhileClosing (1501 of 2356) PASS: lldb-api :: functionalities/data-formatter/vector-types/TestVectorTypesFormatting.py (1502 of 2356) PASS: lldb-unit :: Utility/./UtilityTests/StringListTest.LongestCommonPrefixDuplicateElement (1503 of 2356) PASS: lldb-unit :: Expression/./ExpressionTests/CppModuleConfigurationTest.LinuxLocalLibCpp (1504 of 2356) PASS: lldb-unit :: Process/gdb-remote/./ProcessGdbRemoteTests/GDBRemoteCommunicationClientTest.SendSignalsToIgnore (1505 of 2356) PASS: lldb-api :: functionalities/breakpoint/inlined_breakpoints/TestInlinedBreakpoints.py (1506 of 2356) PASS: lldb-api :: python_api/process/read-mem-cstring/TestReadMemCString.py (1507 of 2356) PASS: lldb-api :: functionalities/tail_call_frames/unambiguous_sequence/TestUnambiguousTailCalls.py (1508 of 2356) PASS: lldb-unit :: Process/Utility/./ProcessUtilityTests/ProcSMapTests/LinuxProcSMapsTestFixture.ParseSMapRegions/3 (1509 of 2356) UNSUPPORTED: lldb-api :: commands/trace/multiple-threads/TestTraceStartStopMultipleThreads.py (1510 of 2356) PASS: lldb-api :: functionalities/pre_run_dylibs/TestPreRunDylibs.py (1511 of 2356) PASS: lldb-api :: functionalities/data-formatter/data-formatter-synth/TestDataFormatterSynth.py (1512 of 2356) PASS: lldb-api :: functionalities/data-formatter/synthcapping/TestSyntheticCapping.py (1513 of 2356) PASS: lldb-api :: lang/cpp/stl/TestStdCXXDisassembly.py (1514 of 2356) PASS: lldb-unit :: Utility/./UtilityTests/PassiveReplayTest.InstrumentedBarPtr (1515 of 2356) PASS: lldb-shell :: Driver/TestHelp.test (1516 of 2356) PASS: lldb-unit :: Utility/./UtilityTests/DataExtractorTest.GetSLEB128_bit63 (1517 of 2356) PASS: lldb-shell :: SymbolFile/DWARF/x86/debug_loc.s (1518 of 2356) PASS: lldb-api :: python_api/process/io/TestProcessIO.py (1519 of 2356) PASS: lldb-unit :: ObjectFile/MachO/./ObjectFileMachOTests/ObjectFileMachOTest.ModuleFromSharedCacheInfo (1520 of 2356) PASS: lldb-unit :: Utility/./UtilityTests/ArgsTest.ReplaceArgumentAtIndexFarOutOfRange (1521 of 2356) PASS: lldb-unit :: Symbol/./SymbolTests/TestClangASTImporter.RecordLayout (1522 of 2356) PASS: lldb-api :: lang/cpp/gmodules-templates/TestGModules.py (1523 of 2356) PASS: lldb-api :: commands/expression/import-std-module/forward_list-dbg-info-content/TestDbgInfoContentForwardListFromStdModule.py (1524 of 2356) PASS: lldb-api :: commands/target/auto-install-main-executable/TestAutoInstallMainExecutable.py (1525 of 2356) PASS: lldb-api :: lang/objc/objc-class-method/TestObjCClassMethod.py (1526 of 2356) PASS: lldb-unit :: Utility/./UtilityTests/BroadcasterTest.EventTypeHasListeners (1527 of 2356) PASS: lldb-api :: functionalities/stop-on-sharedlibrary-load/TestStopOnSharedlibraryEvents.py (1528 of 2356) PASS: lldb-api :: lang/objc/objc-property/TestObjCProperty.py (1529 of 2356) PASS: lldb-unit :: Utility/./UtilityTests/StreamTest.PutCStringWithStringRef (1530 of 2356) PASS: lldb-unit :: UnwindAssembly/x86/./UnwindAssemblyx86Tests/Testx86AssemblyInspectionEngine.TestSpillRegToStackViaMOVx86_64 (1531 of 2356) PASS: lldb-unit :: Target/./TargetTests/ModuleCacheTest.GetAndPutUuidExists (1532 of 2356) PASS: lldb-unit :: DataFormatter/./LLDBFormatterTests/StringPrinterTests.CxxUTF8 (1533 of 2356) PASS: lldb-api :: commands/expression/import-std-module/no-std-module/TestMissingStdModule.py (1534 of 2356) PASS: lldb-shell :: SymbolFile/DWARF/x86/DW_AT_const_value.s (1535 of 2356) PASS: lldb-unit :: Utility/./UtilityTests/RangeDataVector.FindEntryThatContains_Overlap (1536 of 2356) PASS: lldb-shell :: Settings/TestDisableColor.test (1537 of 2356) XFAIL: lldb-shell :: Register/x86-64-fp-write.test (1538 of 2356) PASS: lldb-api :: lang/c/offsetof/TestOffsetof.py (1539 of 2356) PASS: lldb-unit :: debugserver/./debugserverTests/RNBSocket.LoopBackConnectIPv4 (1540 of 2356) UNSUPPORTED: lldb-api :: functionalities/asan/TestReportData.py (1541 of 2356) PASS: lldb-unit :: Symbol/./SymbolTests/TestTypeSystemClang.TestGetBasicTypeFromName (1542 of 2356) PASS: lldb-unit :: Process/gdb-remote/./ProcessGdbRemoteTests/GDBRemoteCommunicationClientTest.GetMemoryRegionInfoInvalidResponse (1543 of 2356) UNSUPPORTED: lldb-shell :: Register/arm-gp-read.test (1544 of 2356) PASS: lldb-unit :: Expression/./ExpressionTests/CppModuleConfigurationTest.UnknownLibCppFile (1545 of 2356) PASS: lldb-unit :: Process/gdb-remote/./ProcessGdbRemoteTests/GDBRemoteClientBaseTest.SendContinueDelegateStructuredDataReceipt (1546 of 2356) UNSUPPORTED: lldb-shell :: Register/x86-ymm-write.test (1547 of 2356) PASS: lldb-unit :: Process/Utility/./ProcessUtilityTests/ProcMapTests/LinuxProcMapsTestFixture.ParseMapRegions/0 (1548 of 2356) PASS: lldb-unit :: Host/./HostTests/SocketTests/SocketTest.TCPGetAddress/ipv4 (1549 of 2356) UNSUPPORTED: lldb-api :: functionalities/darwin_log/filter/regex/activity/TestDarwinLogFilterRegexActivity.py (1550 of 2356) PASS: lldb-unit :: Utility/./UtilityTests/StringListTest.DefaultConstructor (1551 of 2356) PASS: lldb-unit :: Utility/./UtilityTests/OptionsWithRawTest.TerminatedQuote (1552 of 2356) PASS: lldb-api :: functionalities/data-formatter/var-in-aggregate-misuse/TestVarInAggregateMisuse.py (1553 of 2356) PASS: lldb-api :: functionalities/data-formatter/data-formatter-objc/TestDataFormatterObjCNSContainer.py (1554 of 2356) PASS: lldb-unit :: Utility/./UtilityTests/RangeDataVector.FindEntryIndexesThatContain (1555 of 2356) PASS: lldb-unit :: Expression/./ExpressionTests/DiagnosticManagerTest.AppendMessageSubsequentDiags (1556 of 2356) PASS: lldb-api :: functionalities/data-formatter/data-formatter-enum-format/TestDataFormatterEnumFormat.py (1557 of 2356) PASS: lldb-api :: functionalities/thread/concurrent_events/TestConcurrentSignalDelayBreak.py (1558 of 2356) PASS: lldb-unit :: Utility/./UtilityTests/UUIDTest.RelationalOperators (1559 of 2356) PASS: lldb-unit :: Host/./HostTests/NativeProcessProtocolTest.SetBreakpointFailRead (1560 of 2356) PASS: lldb-unit :: Utility/./UtilityTests/AnsiTerminal.KnownPrefix (1561 of 2356) PASS: lldb-shell :: Driver/TestSingleQuote.test (1562 of 2356) PASS: lldb-api :: functionalities/breakpoint/breakpoint_names/TestBreakpointNames.py (1563 of 2356) PASS: lldb-api :: lang/c/inlines/TestRedefinitionsInInlines.py (1564 of 2356) PASS: lldb-shell :: Settings/TestLineMarkerColor.test (1565 of 2356) PASS: lldb-unit :: Language/Highlighting/./HighlighterTests/HighlighterTest.DefaultHighlighter (1566 of 2356) PASS: lldb-api :: commands/command/nested_alias/TestNestedAlias.py (1567 of 2356) PASS: lldb-unit :: Utility/./UtilityTests/RangeTest.ContainsAddr (1568 of 2356) PASS: lldb-unit :: Utility/./UtilityTests/FileSpecTest.GetPath (1569 of 2356) PASS: lldb-unit :: Utility/./UtilityTests/ScalarTest.APIntConstructor (1570 of 2356) PASS: lldb-unit :: Utility/./UtilityTests/ArgsTest.TestAppendArg (1571 of 2356) PASS: lldb-api :: functionalities/thread/concurrent_events/TestConcurrentWatchBreak.py (1572 of 2356) PASS: lldb-unit :: UnwindAssembly/x86/./UnwindAssemblyx86Tests/Testx86AssemblyInspectionEngine.TestPushRBP (1573 of 2356) PASS: lldb-unit :: Expression/./ExpressionTests/DWARFExpression.DW_OP_pick (1574 of 2356) PASS: lldb-shell :: ScriptInterpreter/Python/command_import.test (1575 of 2356) PASS: lldb-unit :: Utility/./UtilityTests/StreamTest.AddressPrefixAndSuffix (1576 of 2356) PASS: lldb-api :: functionalities/thread/concurrent_events/TestConcurrentTwoBreakpointsOneSignal.py (1577 of 2356) PASS: lldb-unit :: Utility/./UtilityTests/UriParserTest.MinimalPort (1578 of 2356) PASS: lldb-unit :: Language/Highlighting/./HighlighterTests/HighlighterTest.ClangIdentifiers (1579 of 2356) PASS: lldb-api :: lang/cpp/typedef/TestCppTypedef.py (1580 of 2356) PASS: lldb-unit :: Core/./LLDBCoreTests/RichManglingContextTest.Basic (1581 of 2356) PASS: lldb-unit :: Utility/./UtilityTests/ScalarTest.Comparison (1582 of 2356) PASS: lldb-api :: commands/expression/unwind_expression/TestUnwindExpression.py (1583 of 2356) PASS: lldb-unit :: Utility/./UtilityTests/NameMatchesTest.StartsWith (1584 of 2356) PASS: lldb-api :: python_api/exprpath_synthetic/TestExprPathSynthetic.py (1585 of 2356) UNSUPPORTED: lldb-shell :: Subprocess/clone-follow-parent.test (1586 of 2356) PASS: lldb-api :: commands/watchpoints/watchpoint_set_command/TestWatchLocationWithWatchSet.py (1587 of 2356) PASS: lldb-api :: commands/watchpoints/watchpoint_events/TestWatchpointEvents.py (1588 of 2356) PASS: lldb-api :: commands/frame/diagnose/array/TestArray.py (1589 of 2356) PASS: lldb-api :: commands/expression/timeout/TestCallWithTimeout.py (1590 of 2356) PASS: lldb-unit :: Host/./HostTests/SocketTests/SocketTest.TCPListen0ConnectAccept/ipv6 (1591 of 2356) PASS: lldb-unit :: Utility/./UtilityTests/StatusTest.ErrorCodeConstructor (1592 of 2356) PASS: lldb-unit :: Expression/./ExpressionTests/CppModuleConfigurationTest.AmbiguousLibCpp (1593 of 2356) PASS: lldb-api :: commands/expression/call-function/TestCallUserDefinedFunction.py (1594 of 2356) PASS: lldb-unit :: Utility/./UtilityTests/SerializationRountripTest.SerializeDeserializeCStringArrayNullptr (1595 of 2356) PASS: lldb-shell :: SymbolFile/DWARF/x86/debug-types-address-ranges.s (1596 of 2356) PASS: lldb-unit :: Utility/./UtilityTests/FileSpecTest.FileAndDirectoryComponents (1597 of 2356) PASS: lldb-shell :: Reproducer/TestRelativePath.test (1598 of 2356) PASS: lldb-unit :: Utility/./UtilityTests/DataExtractorTest.GetMaxS64 (1599 of 2356) PASS: lldb-unit :: Utility/./UtilityTests/AnsiTerminal.Twice (1600 of 2356) PASS: lldb-unit :: Language/Highlighting/./HighlighterTests/HighlighterTest.ClangTrailingBackslashBeforeNewline (1601 of 2356) PASS: lldb-api :: commands/expression/result_numbering/TestResultNumbering.py (1602 of 2356) PASS: lldb-api :: functionalities/thread/concurrent_events/TestConcurrentDelayedCrashWithBreakpointSignal.py (1603 of 2356) PASS: lldb-unit :: Utility/./UtilityTests/RangeTest.Equal (1604 of 2356) PASS: lldb-unit :: Host/./HostTests/File.GetStreamFromDescriptor (1605 of 2356) PASS: lldb-api :: commands/expression/vector_of_enums/TestVectorOfEnums.py (1606 of 2356) PASS: lldb-unit :: Utility/./UtilityTests/DataExtractorTest.GetDouble (1607 of 2356) PASS: lldb-unit :: Utility/./UtilityTests/StreamTest.AddressPrefix (1608 of 2356) PASS: lldb-unit :: Process/Utility/./ProcessUtilityTests/ProcSMapTests/LinuxProcSMapsTestFixture.ParseSMapRegions/8 (1609 of 2356) PASS: lldb-unit :: Utility/./UtilityTests/StreamTest.AddressSize (1610 of 2356) PASS: lldb-unit :: Expression/./ExpressionTests/CppModuleConfigurationTest.IgnoreLibStdCpp (1611 of 2356) PASS: lldb-unit :: Core/./LLDBCoreTests/ModuleSpecTest.TestELFFile (1612 of 2356) PASS: lldb-api :: python_api/lldbutil/frame/TestFrameUtils.py (1613 of 2356) PASS: lldb-api :: functionalities/data-formatter/data-formatter-stl/libcxx/list/TestDataFormatterLibcxxList.py (1614 of 2356) PASS: lldb-unit :: Utility/./UtilityTests/StringListTest.InsertStringAtIndexOutOfBounds (1615 of 2356) PASS: lldb-unit :: Expression/./ExpressionTests/CppModuleConfigurationTest.MissingLibCpp (1616 of 2356) PASS: lldb-unit :: Expression/./ExpressionTests/DiagnosticManagerTest.GetStringBasic (1617 of 2356) UNSUPPORTED: lldb-api :: lang/objc/rdar-12408181/TestRdar12408181.py (1618 of 2356) PASS: lldb-api :: commands/expression/formatters/TestFormatters.py (1619 of 2356) PASS: lldb-unit :: Utility/./UtilityTests/StreamTest.PutCString (1620 of 2356) PASS: lldb-unit :: Core/./LLDBCoreTests/FormatEntity.LookupAllEntriesInTree (1621 of 2356) PASS: lldb-unit :: ScriptInterpreter/Python/./ScriptInterpreterPythonTests/PythonDataObjectsTest.TestBorrowedReferences (1622 of 2356) PASS: lldb-unit :: SymbolFile/NativePDB/./SymbolFileNativePDBTests/PDBFPOProgramToDWARFExpressionTests.UnknownOp (1623 of 2356) PASS: lldb-api :: lang/objc/ivar-IMP/TestObjCiVarIMP.py (1624 of 2356) PASS: lldb-unit :: Utility/./UtilityTests/CompletionRequest.Constructor (1625 of 2356) PASS: lldb-api :: functionalities/data-formatter/data-formatter-stl/libcxx/list/loop/TestDataFormatterLibcxxListLoop.py (1626 of 2356) PASS: lldb-api :: functionalities/data-formatter/data-formatter-synthtype/TestDataFormatterSynthType.py (1627 of 2356) PASS: lldb-unit :: SymbolFile/DWARF/./SymbolFileDWARFTests/SymbolFileDWARFTests.TestAbbrevValidAttrNullForm (1628 of 2356) PASS: lldb-api :: types/TestRecursiveTypes.py (1629 of 2356) PASS: lldb-unit :: Host/./HostTests/HostInfoTest.GetHostname (1630 of 2356) PASS: lldb-api :: macosx/lc-note/firmware-corefile/TestFirmwareCorefiles.py (1631 of 2356) PASS: lldb-unit :: DataFormatter/./LLDBFormatterTests/TypeMatcherTests.CreatedBySameMatchStringExactNamePrefixes (1632 of 2356) PASS: lldb-api :: lang/objc/objc-runtime-ivars/TestRuntimeIvars.py (1633 of 2356) PASS: lldb-unit :: Language/Highlighting/./HighlighterTests/HighlighterTest.ClangUnterminatedString (1634 of 2356) PASS: lldb-unit :: Utility/./UtilityTests/StringListTest.GetMaxStringLengthDecreasingSize (1635 of 2356) PASS: lldb-unit :: Utility/./UtilityTests/StreamTest.AddressRange (1636 of 2356) PASS: lldb-shell :: ObjectFile/ELF/section-overlap.yaml (1637 of 2356) PASS: lldb-unit :: Host/./HostTests/SocketTests/SocketTest.TCPListen0ConnectAccept/ipv4 (1638 of 2356) PASS: lldb-unit :: Language/Highlighting/./HighlighterTests/HighlighterTest.ClangCursorPosAfterOtherToken (1639 of 2356) PASS: lldb-unit :: Process/gdb-remote/./ProcessGdbRemoteTests/PortMapTest.Constructors (1640 of 2356) PASS: lldb-api :: functionalities/data-formatter/data-formatter-stl/libcxx/function/TestLibCxxFunction.py (1641 of 2356) PASS: lldb-api :: functionalities/breakpoint/auto_continue/TestBreakpointAutoContinue.py (1642 of 2356) PASS: lldb-unit :: Utility/./UtilityTests/RangeTest.Union (1643 of 2356) PASS: lldb-unit :: Utility/./UtilityTests/UriParserTest.MinimalPortPath (1644 of 2356) XFAIL: lldb-shell :: Register/x86-mm-xmm-write.test (1645 of 2356) PASS: lldb-shell :: Reproducer/TestReuseDirectory.test (1646 of 2356) PASS: lldb-shell :: Quit/TestQuitExitCodeImplicit0.test (1647 of 2356) PASS: lldb-shell :: SymbolFile/DWARF/x86/inline-function-address.ll (1648 of 2356) PASS: lldb-api :: commands/frame/recognizer/TestFrameRecognizer.py (1649 of 2356) PASS: lldb-unit :: Utility/./UtilityTests/StringListTest.GetMaxStringLengthMixed (1650 of 2356) PASS: lldb-unit :: Utility/./UtilityTests/UserIDResolver.GetUserName (1651 of 2356) PASS: lldb-api :: functionalities/thread/concurrent_events/TestConcurrentDelayWatchBreak.py (1652 of 2356) PASS: lldb-api :: functionalities/signal/TestSendSignal.py (1653 of 2356) PASS: lldb-unit :: Utility/./UtilityTests/GeneratorTest.GetOrCreate (1654 of 2356) UNSUPPORTED: lldb-api :: commands/trace/TestTraceStartStop.py (1655 of 2356) PASS: lldb-unit :: Utility/./UtilityTests/BinaryStreamTest.PutSLEB128FourBytes (1656 of 2356) PASS: lldb-api :: functionalities/paths/TestPaths.py (1657 of 2356) PASS: lldb-api :: lang/objc/objc-ivar-protocols/TestIvarProtocols.py (1658 of 2356) PASS: lldb-api :: python_api/hello_world/TestHelloWorld.py (1659 of 2356) PASS: lldb-api :: python_api/formatters/TestFormattersSBAPI.py (1660 of 2356) PASS: lldb-unit :: Host/./HostTests/FileSystemTest.EmptyTest (1661 of 2356) PASS: lldb-api :: lang/objc/objc-optimized/TestObjcOptimized.py (1662 of 2356) PASS: lldb-unit :: Expression/./ExpressionTests/DWARFExpression.DW_OP_implicit_value (1663 of 2356) PASS: lldb-api :: lang/c/step_over_no_deadlock/TestStepOverDoesntBlock.py (1664 of 2356) PASS: lldb-unit :: Core/./LLDBCoreTests/SourceLocationSpecTest.Equal (1665 of 2356) PASS: lldb-api :: python_api/findvalue_duplist/TestSBFrameFindValue.py (1666 of 2356) PASS: lldb-api :: functionalities/multidebugger_commands/TestMultipleDebuggersCommands.py (1667 of 2356) UNSUPPORTED: lldb-api :: macosx/posix_spawn/TestLaunchProcessPosixSpawn.py (1668 of 2356) UNSUPPORTED: lldb-api :: functionalities/darwin_log/source/info/TestDarwinLogSourceInfo.py (1669 of 2356) PASS: lldb-unit :: Utility/./UtilityTests/GeneratorTest.Create (1670 of 2356) PASS: lldb-api :: commands/expression/codegen-crash-import-def-arraytype-element/TestImportDefinitionArrayType.py (1671 of 2356) PASS: lldb-unit :: Utility/./UtilityTests/PassiveReplayTest.InstrumentedFoo (1672 of 2356) PASS: lldb-shell :: Breakpoint/debug_rnglist_basic.test (1673 of 2356) PASS: lldb-unit :: Language/Highlighting/./HighlighterTests/HighlighterTest.ClangCursorPosInOtherToken (1674 of 2356) PASS: lldb-shell :: SymbolFile/DWARF/x86/find-qualified-variable.cpp (1675 of 2356) PASS: lldb-api :: commands/expression/class_template_specialization_empty_pack/TestClassTemplateSpecializationParametersHandling.py (1676 of 2356) PASS: lldb-unit :: Utility/./UtilityTests/StringExtractorTest.GetHexU8_Exact (1677 of 2356) PASS: lldb-shell :: Heap/heap-cstr.test (1678 of 2356) PASS: lldb-unit :: debugserver/./debugserverTests/RNBSocket.LoopBackConnectIPv6 (1679 of 2356) UNSUPPORTED: lldb-shell :: SymbolFile/PDB/variables-locations.test (1680 of 2356) PASS: lldb-api :: python_api/interpreter/TestRunCommandInterpreterAPI.py (1681 of 2356) PASS: lldb-shell :: SymbolFile/DWARF/x86/dwarf5-debug_line.s (1682 of 2356) PASS: lldb-unit :: Host/./HostTests/PipeTest.CreateWithUniqueName (1683 of 2356) PASS: lldb-shell :: ObjectFile/ELF/null-jmprel.yaml (1684 of 2356) PASS: lldb-unit :: Utility/./UtilityTests/FileSpecTest.PrependPathComponent (1685 of 2356) PASS: lldb-unit :: Target/./TargetTests/PathMappingListTest.RemapRoot (1686 of 2356) PASS: lldb-unit :: Process/minidump/./LLDBMinidumpTests/MinidumpParserTest.GetMemoryRegionInfo (1687 of 2356) PASS: lldb-api :: functionalities/gdb_remote_client/TestHaltFails.py (1688 of 2356) PASS: lldb-api :: commands/expression/import-std-module/basic/TestImportStdModule.py (1689 of 2356) PASS: lldb-unit :: Process/gdb-remote/./ProcessGdbRemoteTests/GDBRemoteClientBaseTest.SendContinueAndInterrupt (1690 of 2356) PASS: lldb-unit :: ScriptInterpreter/Python/./ScriptInterpreterPythonTests/PythonDataObjectsTest.TestPythonDictionaryToStructuredDictionary (1691 of 2356) PASS: lldb-shell :: ScriptInterpreter/Python/python.test (1692 of 2356) PASS: lldb-api :: tools/lldb-server/TestGdbRemote_qThreadStopInfo.py (1693 of 2356) PASS: lldb-unit :: Utility/./UtilityTests/EventTest.DumpEventDataBytes (1694 of 2356) PASS: lldb-unit :: Utility/./UtilityTests/BroadcasterTest.BroadcastEvent (1695 of 2356) PASS: lldb-unit :: Host/./HostTests/SocketTests/SocketTest.TCPListen0GetPort/ipv4 (1696 of 2356) PASS: lldb-unit :: Utility/./UtilityTests/DataExtractorTest.GetCStrAtEnd (1697 of 2356) PASS: lldb-api :: functionalities/postmortem/netbsd-core/TestNetBSDCore.py (1698 of 2356) PASS: lldb-shell :: SymbolFile/DWARF/x86/DW_AT_decl_file-DW_AT_specification-crosscu.s (1699 of 2356) PASS: lldb-api :: commands/expression/xvalue/TestXValuePrinting.py (1700 of 2356) PASS: lldb-unit :: Process/minidump/./LLDBMinidumpTests/MinidumpParserTest.GetPidWow64 (1701 of 2356) PASS: lldb-shell :: SymbolFile/DWARF/x86/DW_AT_declaration-with-children.s (1702 of 2356) PASS: lldb-api :: lang/objc/objc-new-syntax/TestObjCNewSyntaxArray.py (1703 of 2356) PASS: lldb-api :: functionalities/thread/jump/TestThreadJump.py (1704 of 2356) PASS: lldb-api :: python_api/watchpoint/condition/TestWatchpointConditionAPI.py (1705 of 2356) PASS: lldb-unit :: Utility/./UtilityTests/StringExtractorTest.DecodeHexU8_Underflow2 (1706 of 2356) UNSUPPORTED: lldb-shell :: ScriptInterpreter/Lua/bindings.test (1707 of 2356) PASS: lldb-unit :: Utility/./UtilityTests/StreamTest.AddressEmptyPrefix (1708 of 2356) PASS: lldb-unit :: Core/./LLDBCoreTests/FormatEntityTest.DefinitionConstructionNameTypeData (1709 of 2356) PASS: lldb-unit :: API/./APITests/SBCommandInterpreterTest.SingleWordCommand (1710 of 2356) PASS: lldb-unit :: Symbol/./SymbolTests/TestClangASTImporter.CanImportInvalidType (1711 of 2356) PASS: lldb-unit :: Host/./HostTests/MainLoopTest.TwoSignalCallbacks (1712 of 2356) PASS: lldb-unit :: Expression/./ExpressionTests/ClangExpressionDeclMapTest.TestPersistentDeclLookup (1713 of 2356) PASS: lldb-unit :: Symbol/./SymbolTests/TestTypeSystemClang.TestGetEnumIntegerTypeBasicTypes (1714 of 2356) PASS: lldb-api :: commands/watchpoints/multiple_threads/TestWatchpointMultipleThreads.py (1715 of 2356) PASS: lldb-unit :: Utility/./UtilityTests/DataExtractorTest.GetCStrUnterminated (1716 of 2356) PASS: lldb-unit :: Utility/./UtilityTests/StringListTest.ShiftCString (1717 of 2356) PASS: lldb-unit :: Utility/./UtilityTests/ListenerTest.GetEventWait (1718 of 2356) PASS: lldb-unit :: Utility/./UtilityTests/ArchSpecTest.OperatorBool (1719 of 2356) PASS: lldb-api :: functionalities/data-formatter/data-formatter-cpp/TestDataFormatterCpp.py (1720 of 2356) PASS: lldb-unit :: Process/minidump/./LLDBMinidumpTests/MinidumpParserTest.GetThreadContext_x86_64 (1721 of 2356) PASS: lldb-api :: lang/c/shared_lib/TestSharedLib.py (1722 of 2356) PASS: lldb-unit :: ScriptInterpreter/Python/./ScriptInterpreterPythonTests/PythonDataObjectsTest.TestPythonIntegerToStructuredInteger (1723 of 2356) UNSUPPORTED: lldb-shell :: SymbolFile/PDB/typedefs.test (1724 of 2356) PASS: lldb-unit :: Expression/./ExpressionTests/DWARFExpression.DW_OP_const (1725 of 2356) PASS: lldb-api :: lang/objc/unicode-string/TestUnicodeString.py (1726 of 2356) PASS: lldb-unit :: Utility/./UtilityTests/ArgsTest.TestMultipleArgs (1727 of 2356) PASS: lldb-api :: lang/objc/modules-auto-import/TestModulesAutoImport.py (1728 of 2356) PASS: lldb-api :: commands/expression/context-object/TestContextObject.py (1729 of 2356) XFAIL: lldb-shell :: Register/x86-64-write.test (1730 of 2356) PASS: lldb-unit :: Utility/./UtilityTests/StructuredDataTest.StringDump (1731 of 2356) PASS: lldb-shell :: SymbolFile/DWARF/x86/find-basic-namespace.cpp (1732 of 2356) PASS: lldb-api :: lang/cpp/operator-overload/TestOperatorOverload.py (1733 of 2356) PASS: lldb-api :: lang/cpp/reference-to-outer-type/TestCppReferenceToOuterClass.py (1734 of 2356) PASS: lldb-unit :: Utility/./UtilityTests/ConstStringTest.format_provider (1735 of 2356) PASS: lldb-unit :: Utility/./UtilityTests/UriParserTest.BracketedHostnameWithPortIPv6 (1736 of 2356) PASS: lldb-unit :: UnwindAssembly/x86/./UnwindAssemblyx86Tests/Testx86AssemblyInspectionEngine.TestPushEBP (1737 of 2356) PASS: lldb-api :: lang/cpp/dereferencing_references/TestCPPDereferencingReferences.py (1738 of 2356) PASS: lldb-unit :: Utility/./UtilityTests/StringListTest.RemoveBlankLines (1739 of 2356) UNSUPPORTED: lldb-api :: functionalities/data-formatter/data-formatter-stl/libstdcpp/smart_ptr/TestDataFormatterStdSmartPtr.py (1740 of 2356) PASS: lldb-api :: functionalities/inferior-assert/TestInferiorAssert.py (1741 of 2356) UNSUPPORTED: lldb-api :: python_api/event/TestEvents.py (1742 of 2356) PASS: lldb-api :: functionalities/gdb_remote_client/TestPlatformClient.py (1743 of 2356) PASS: lldb-shell :: SymbolFile/DWARF/x86/DW_OP_piece-smaller-than-struct.s (1744 of 2356) PASS: lldb-api :: types/TestLongTypes.py (1745 of 2356) PASS: lldb-unit :: ObjectFile/Breakpad/./ObjectFileBreakpadTests/LineRecord.parse (1746 of 2356) PASS: lldb-shell :: Commands/command-backtrace-parser-2.test (1747 of 2356) PASS: lldb-api :: functionalities/memory/cache/TestMemoryCache.py (1748 of 2356) PASS: lldb-shell :: ObjectFile/Breakpad/uuid-matching-mac.test (1749 of 2356) PASS: lldb-unit :: ScriptInterpreter/Python/./ScriptInterpreterPythonTests/PythonDataObjectsTest.TestCallable (1750 of 2356) PASS: lldb-api :: functionalities/gdb_remote_client/TestGDBRemoteDiskFileCompletion.py (1751 of 2356) PASS: lldb-api :: commands/expression/no-deadlock/TestExprDoesntBlock.py (1752 of 2356) PASS: lldb-unit :: UnwindAssembly/x86/./UnwindAssemblyx86Tests/Testx86AssemblyInspectionEngine.TestPush0 (1753 of 2356) PASS: lldb-shell :: SymbolFile/NativePDB/globals-bss.cpp (1754 of 2356) PASS: lldb-api :: commands/expression/calculator_mode/TestCalculatorMode.py (1755 of 2356) PASS: lldb-shell :: SymbolFile/DWARF/x86/dir-separator-windows.s (1756 of 2356) PASS: lldb-shell :: SymbolFile/NativePDB/global-classes.cpp (1757 of 2356) UNSUPPORTED: lldb-shell :: ScriptInterpreter/Lua/fail_breakpoint_oneline.test (1758 of 2356) PASS: lldb-unit :: Utility/./UtilityTests/RangeTest.DefaultConstructor (1759 of 2356) PASS: lldb-shell :: Commands/command-stop-hook-output.test (1760 of 2356) PASS: lldb-shell :: ScriptInterpreter/Python/scripted_breakpoint_lua.test (1761 of 2356) PASS: lldb-api :: functionalities/thread_plan/TestThreadPlanCommands.py (1762 of 2356) PASS: lldb-unit :: Editline/./EditlineTests/EditlineTestFixture.EditlineReceivesSingleLineText (1763 of 2356) PASS: lldb-unit :: UnwindAssembly/x86/./UnwindAssemblyx86Tests/Testx86AssemblyInspectionEngine.TestMovRSPtoRBP (1764 of 2356) PASS: lldb-api :: functionalities/data-formatter/data-formatter-objc/TestDataFormatterObjCNSDate.py (1765 of 2356) PASS: lldb-unit :: Signals/./SignalsTests/UnixSignalsTest.Iteration (1766 of 2356) PASS: lldb-api :: commands/target/stop-hooks/TestStopHooks.py (1767 of 2356) PASS: lldb-api :: python_api/lldbutil/iter/TestLLDBIterator.py (1768 of 2356) PASS: lldb-unit :: UnwindAssembly/x86/./UnwindAssemblyx86Tests/Testx86AssemblyInspectionEngine.TestPushR13 (1769 of 2356) PASS: lldb-api :: macosx/version_zero/TestGetVersionZeroVersion.py (1770 of 2356) PASS: lldb-unit :: Utility/./UtilityTests/ArgsTest.TestQuotedUnknownEscape (1771 of 2356) UNSUPPORTED: lldb-shell :: SymbolFile/NativePDB/ast-functions-msvc.cpp (1772 of 2356) PASS: lldb-api :: lang/cpp/namespace_definitions/TestNamespaceDefinitions.py (1773 of 2356) PASS: lldb-unit :: Utility/./UtilityTests/StringExtractorTest.GetHexBytes_OddPair (1774 of 2356) PASS: lldb-api :: macosx/find-dsym/deep-bundle/TestDeepBundle.py (1775 of 2356) PASS: lldb-api :: tools/lldb-vscode/variables/TestVSCode_variables.py (1776 of 2356) PASS: lldb-unit :: Target/./TargetTests/ExecutionContextTest.GetByteOrderTarget (1777 of 2356) PASS: lldb-unit :: Expression/./ExpressionTests/CppModuleConfigurationTest.Linux (1778 of 2356) PASS: lldb-unit :: Process/Utility/./ProcessUtilityTests/RegisterContext_x86Test.FullToAbridgedTagWord (1779 of 2356) PASS: lldb-unit :: Host/./HostTests/ConnectionFileDescriptorTest.TCPGetURIv4 (1780 of 2356) PASS: lldb-api :: functionalities/inferior-crashing/TestInferiorCrashingStep.py (1781 of 2356) PASS: lldb-shell :: Reproducer/Functionalities/TestStepping.test (1782 of 2356) PASS: lldb-unit :: UnwindAssembly/x86/./UnwindAssemblyx86Tests/Testx86AssemblyInspectionEngine.TestReturnDetect (1783 of 2356) PASS: lldb-unit :: ObjectFile/Breakpad/./ObjectFileBreakpadTests/PublicRecord.parse (1784 of 2356) PASS: lldb-shell :: SymbolFile/Breakpad/unwind-via-stack-win-no-memory-info.yaml (1785 of 2356) PASS: lldb-shell :: Register/Core/x86-32-freebsd-fp.test (1786 of 2356) PASS: lldb-api :: commands/help/TestHelp.py (1787 of 2356) UNSUPPORTED: lldb-api :: functionalities/data-formatter/data-formatter-stl/libstdcpp/list/TestDataFormatterStdList.py (1788 of 2356) PASS: lldb-shell :: Breakpoint/split-dwarf-5-addrbase.test (1789 of 2356) PASS: lldb-shell :: VSCode/TestOptions.test (1790 of 2356) PASS: lldb-api :: functionalities/thread/concurrent_events/TestConcurrentTwoWatchpointsOneBreakpoint.py (1791 of 2356) UNSUPPORTED: lldb-shell :: ScriptInterpreter/Lua/nested_sessions.test (1792 of 2356) PASS: lldb-unit :: Host/./HostTests/FileSystemTest.Exists (1793 of 2356) PASS: lldb-api :: functionalities/multiword-commands/TestMultiWordCommands.py (1794 of 2356) PASS: lldb-unit :: Host/./HostTests/SocketTests/SocketTest.DomainGetConnectURI/ipv6 (1795 of 2356) PASS: lldb-api :: commands/expression/pr35310/TestExprsBug35310.py (1796 of 2356) PASS: lldb-unit :: Utility/./UtilityTests/StreamTest.ShiftOperatorStrings (1797 of 2356) PASS: lldb-api :: commands/expression/call-throws/TestCallThatThrows.py (1798 of 2356) UNSUPPORTED: lldb-api :: functionalities/darwin_log/filter/exact_match/activity-chain/TestDarwinLogFilterMatchActivityChain.py (1799 of 2356) PASS: lldb-shell :: SymbolFile/Breakpad/unwind-via-stack-cfi.test (1800 of 2356) PASS: lldb-shell :: Register/Core/x86-64-linux-fp.test (1801 of 2356) PASS: lldb-api :: lang/objc/blocks/TestObjCIvarsInBlocks.py (1802 of 2356) PASS: lldb-api :: macosx/skinny-corefile/TestSkinnyCorefile.py (1803 of 2356) PASS: lldb-api :: lang/cpp/this_class_type_mixing/TestThisClassTypeMixing.py (1804 of 2356) PASS: lldb-api :: commands/expression/import-std-module/non-module-type-separation/TestNonModuleTypeSeparation.py (1805 of 2356) PASS: lldb-api :: lang/objc/foundation/TestRuntimeTypes.py (1806 of 2356) PASS: lldb-unit :: Host/./HostTests/SocketTests/SocketTest.TCPGetConnectURI/ipv6 (1807 of 2356) PASS: lldb-shell :: Minidump/no-process-id.yaml (1808 of 2356) PASS: lldb-unit :: ScriptInterpreter/Python/./ScriptInterpreterPythonTests/PythonDataObjectsTest.TestPythonIntegerToStr (1809 of 2356) PASS: lldb-unit :: Utility/./UtilityTests/StringListTest.ShiftStdString (1810 of 2356) PASS: lldb-api :: tools/lldb-server/TestGdbRemoteHostInfo.py (1811 of 2356) PASS: lldb-api :: functionalities/thread/concurrent_events/TestConcurrentTwoWatchpointsOneDelayBreakpoint.py (1812 of 2356) PASS: lldb-unit :: Interpreter/./InterpreterTests/CompletionTest.DirCompletionAbsolute (1813 of 2356) PASS: lldb-api :: tools/lldb-vscode/step/TestVSCode_step.py (1814 of 2356) PASS: lldb-shell :: Reproducer/TestCrash.test (1815 of 2356) UNSUPPORTED: lldb-shell :: SymbolFile/target-symbols-add-unwind.test (1816 of 2356) PASS: lldb-unit :: Process/Utility/./ProcessUtilityTests/ProcSMapTests/LinuxProcSMapsTestFixture.ParseSMapRegions/1 (1817 of 2356) PASS: lldb-api :: lang/objc/objc-static-method/TestObjCStaticMethod.py (1818 of 2356) PASS: lldb-shell :: Settings/TestModuleCacheSanity.test (1819 of 2356) PASS: lldb-api :: commands/expression/completion-in-lambda-and-unnamed-class/TestCompletionInLambdaAndUnnamedClass.py (1820 of 2356) PASS: lldb-unit :: UnwindAssembly/x86/./UnwindAssemblyx86Tests/Testx86AssemblyInspectionEngine.TestPushEAX (1821 of 2356) PASS: lldb-api :: functionalities/dead-strip/TestDeadStrip.py (1822 of 2356) PASS: lldb-api :: lang/cpp/breakpoint_in_member_func_w_non_primitive_params/TestBreakpointInMemberFuncWNonPrimitiveParams.py (1823 of 2356) PASS: lldb-api :: commands/version/TestVersion.py (1824 of 2356) PASS: lldb-api :: lang/c/anonymous/TestAnonymous.py (1825 of 2356) PASS: lldb-api :: functionalities/thread/concurrent_events/TestConcurrentNWatchNBreak.py (1826 of 2356) UNSUPPORTED: lldb-shell :: Register/x86-gp-write.test (1827 of 2356) UNSUPPORTED: lldb-shell :: ScriptInterpreter/Lua/quit.test (1828 of 2356) PASS: lldb-unit :: tools/lldb-server/tests/./LLDBServerTests/TestBase.LaunchModePreservesEnvironment (1829 of 2356) PASS: lldb-api :: functionalities/object-file/TestImageListMultiArchitecture.py (1830 of 2356) PASS: lldb-unit :: Language/Highlighting/./HighlighterTests/HighlighterTest.Keywords (1831 of 2356) PASS: lldb-shell :: SymbolFile/NativePDB/function-types-builtins.cpp (1832 of 2356) PASS: lldb-shell :: Breakpoint/breakpoint-command.test (1833 of 2356) PASS: lldb-unit :: Process/gdb-remote/./ProcessGdbRemoteTests/GDBRemoteCommunicationClientTest.GetMemoryRegionInfo (1834 of 2356) PASS: lldb-shell :: Reproducer/TestWorkingDir.test (1835 of 2356) PASS: lldb-api :: lang/cpp/static_members/TestCPPStaticMembers.py (1836 of 2356) PASS: lldb-unit :: Core/./LLDBCoreTests/DumpDataExtractorTest.MultiLine (1837 of 2356) PASS: lldb-unit :: Utility/./UtilityTests/StreamTeeTest.Assignment (1838 of 2356) PASS: lldb-unit :: Utility/./UtilityTests/StreamTest.ShiftOperatorChars (1839 of 2356) PASS: lldb-api :: lang/cpp/exceptions/TestCPPExceptionBreakpoints.py (1840 of 2356) PASS: lldb-api :: functionalities/breakpoint/breakpoint_by_line_and_column/TestBreakpointByLineAndColumn.py (1841 of 2356) PASS: lldb-shell :: Register/Core/x86-32-linux-addr.test (1842 of 2356) PASS: lldb-shell :: ObjectFile/ELF/netbsd-core-amd64.test (1843 of 2356) PASS: lldb-shell :: ObjectFile/ELF/netbsd-exec-8.99.30-amd64.yaml (1844 of 2356) PASS: lldb-shell :: SymbolFile/DWARF/x86/gnu-style-compression.cpp (1845 of 2356) PASS: lldb-shell :: Commands/command-target-modules-dump-sections.yaml (1846 of 2356) UNSUPPORTED: lldb-api :: functionalities/unwind/ehframe/TestEhFrameUnwind.py (1847 of 2356) PASS: lldb-unit :: Utility/./UtilityTests/OptionsWithRawTest.QuotedSuffix (1848 of 2356) PASS: lldb-shell :: Commands/command-thread-select.test (1849 of 2356) PASS: lldb-api :: functionalities/breakpoint/move_nearest/TestMoveNearest.py (1850 of 2356) PASS: lldb-shell :: ObjectFile/ELF/PT_LOAD-overlap-section.yaml (1851 of 2356) UNSUPPORTED: lldb-shell :: SymbolFile/PDB/vbases.test (1852 of 2356) PASS: lldb-api :: lang/c/enum_types/TestEnumTypes.py (1853 of 2356) PASS: lldb-shell :: Settings/TestFrameFormatNoColor.test (1854 of 2356) PASS: lldb-api :: lang/c/global_variables/TestGlobalVariables.py (1855 of 2356) PASS: lldb-api :: commands/settings/quoting/TestQuoting.py (1856 of 2356) PASS: lldb-shell :: ObjectFile/ELF/compressed-sections.yaml (1857 of 2356) PASS: lldb-unit :: Process/minidump/./LLDBMinidumpTests/MinidumpParserTest.GetPid (1858 of 2356) PASS: lldb-api :: commands/process/signal/TestProcessSignal.py (1859 of 2356) PASS: lldb-api :: lang/cpp/static_member_type_depending_on_parent_size/TestStaticMemberTypeDependingOnParentSize.py (1860 of 2356) PASS: lldb-unit :: Utility/./UtilityTests/XcodeSDKTest.GetSDKTypeForTriple (1861 of 2356) FAIL: lldb-api :: tools/lldb-vscode/breakpoint/TestVSCode_setFunctionBreakpoints.py (1862 of 2356) ******************** TEST 'lldb-api :: tools/lldb-vscode/breakpoint/TestVSCode_setFunctionBreakpoints.py' FAILED ******************** Script: -- /Users/buildslave/jenkins/workspace/lldb-cmake-sanitized/lldb-build/lldb-test-build.noindex/copied-python /Users/buildslave/jenkins/workspace/lldb-cmake-sanitized/llvm-project/lldb/test/API/dotest.py -u CXXFLAGS -u CFLAGS --codesign-identity lldb_codesign --arch x86_64 --build-dir /Users/buildslave/jenkins/workspace/lldb-cmake-sanitized/lldb-build/lldb-test-build.noindex -t --env TERM=vt100 --env LLVM_LIBS_DIR=/Users/buildslave/jenkins/workspace/lldb-cmake-sanitized/lldb-build/./lib --inferior-env ASAN_OPTIONS=detect_stack_use_after_return=1 --inferior-env DYLD_INSERT_LIBRARIES=/Users/buildslave/jenkins/workspace/lldb-cmake-sanitized/host-compiler/lib/clang/13.0.99/lib/darwin/libclang_rt.asan_osx_dynamic.dylib --arch x86_64 --build-dir /Users/buildslave/jenkins/workspace/lldb-cmake-sanitized/lldb-build/lldb-test-build.noindex --lldb-module-cache-dir /Users/buildslave/jenkins/workspace/lldb-cmake-sanitized/lldb-build/lldb-test-build.noindex/module-cache-lldb/lldb-api --clang-module-cache-dir /Users/buildslave/jenkins/workspace/lldb-cmake-sanitized/lldb-build/lldb-test-build.noindex/module-cache-clang/lldb-api --executable /Users/buildslave/jenkins/workspace/lldb-cmake-sanitized/lldb-build/./bin/lldb --compiler /Users/buildslave/jenkins/workspace/lldb-cmake-sanitized/host-compiler/bin/clang --dsymutil /Users/buildslave/jenkins/workspace/lldb-cmake-sanitized/lldb-build/./bin/dsymutil --llvm-tools-dir /Users/buildslave/jenkins/workspace/lldb-cmake-sanitized/lldb-build/./bin --lldb-libs-dir /Users/buildslave/jenkins/workspace/lldb-cmake-sanitized/lldb-build/./lib /Users/buildslave/jenkins/workspace/lldb-cmake-sanitized/llvm-project/lldb/test/API/tools/lldb-vscode/breakpoint -p TestVSCode_setFunctionBreakpoints.py -- Exit Code: 1

Hide Details

Command Output (stdout): -- lldb version 13.0.99 (http://labmaster3.local/git/llvm-project.git revision d5c0b9c84886aea65d7148f403b08799bec9186e) clang revision d5c0b9c84886aea65d7148f403b08799bec9186e llvm revision d5c0b9c84886aea65d7148f403b08799bec9186e Skipping the following test categories: ['darwin-log', 'libstdcxx', 'dwo', 'llgs', 'fork'] ========= DEBUG ADAPTER PROTOCOL LOGS ========= --> Content-Length: 284

Hide Details

{"command":"initialize","type":"request","arguments":{"adapterID":"lldb-native","clientID":"vscode","columnsStartAt1":true,"linesStartAt1":true,"locale":"en-us","pathFormat":"path","supportsRunInTerminalRequest":true,"supportsVariablePaging":true,"supportsVariableType":true},"seq":1} <-- Content-Length: 1222

Hide Details

{"body":{"exceptionBreakpointFilters":[{"default":false,"filter":"cpp_catch","label":"C++ Catch"},{"default":false,"filter":"cpp_throw","label":"C++ Throw"},{"default":false,"filter":"objc_catch","label":"Objective C Catch"},{"default":false,"filter":"objc_throw","label":"Objective C Throw"},{"default":false,"filter":"swift_catch","label":"Swift Catch"},{"default":false,"filter":"swift_throw","label":"Swift Throw"}],"supportTerminateDebuggee":true,"supportsCompletionsRequest":false,"supportsConditionalBreakpoints":true,"supportsConfigurationDoneRequest":true,"supportsDelayedStackTraceLoading":true,"supportsEvaluateForHovers":true,"supportsExceptionInfoRequest":true,"supportsExceptionOptions":true,"supportsFunctionBreakpoints":true,"supportsGotoTargetsRequest":false,"supportsHitConditionalBreakpoints":true,"supportsLoadedSourcesRequest":false,"supportsModulesRequest":false,"supportsProgressReporting":true,"supportsRestartFrame":false,"supportsRestartRequest":false,"supportsRunInTerminalRequest":true,"supportsSetVariable":true,"supportsStepBack":false,"supportsStepInTargetsRequest":false,"supportsValueFormattingOptions":true},"command":"initialize","request_seq":1,"seq":0,"success":true,"type":"response"} --> Content-Length: 1044

Hide Details

{"command":"launch","type":"request","arguments":{"program":"/Users/buildslave/jenkins/workspace/lldb-cmake-sanitized/lldb-build/lldb-test-build.noindex/tools/lldb-vscode/breakpoint/TestVSCode_setFunctionBreakpoints.test_functionality/a.out","disableASLR":true,"initCommands":["settings clear -all","settings set symbols.enable-external-lookup false","settings set target.inherit-tcc true","settings set target.detach-on-error false","settings set target.auto-apply-fixits false","settings set plugin.process.gdb-remote.packet-timeout 60","settings set symbols.clang-modules-cache-path \"/Users/buildslave/jenkins/workspace/lldb-cmake-sanitized/lldb-build/lldb-test-build.noindex/module-cache-lldb/lldb-api\"","settings set use-color false","setting set target.prefer-dynamic-value no-dynamic-values","settings set target.env-vars ASAN_OPTIONS=detect_stack_use_after_return=1 DYLD_INSERT_LIBRARIES=/Users/buildslave/jenkins/workspace/lldb-cmake-sanitized/host-compiler/lib/clang/13.0.99/lib/darwin/libclang_rt.asan_osx_dynamic.dylib"]},"seq":2} <-- Content-Length: 923

Hide Details

{"body":{"category":"console","output":"Running initCommands:\n(lldb) settings clear -all\n(lldb) settings set symbols.enable-external-lookup false\n(lldb) settings set target.inherit-tcc true\n(lldb) settings set target.detach-on-error false\n(lldb) settings set target.auto-apply-fixits false\n(lldb) settings set plugin.process.gdb-remote.packet-timeout 60\n(lldb) settings set symbols.clang-modules-cache-path \"/Users/buildslave/jenkins/workspace/lldb-cmake-sanitized/lldb-build/lldb-test-build.noindex/module-cache-lldb/lldb-api\"\n(lldb) settings set use-color false\n(lldb) setting set target.prefer-dynamic-value no-dynamic-values\n(lldb) settings set target.env-vars ASAN_OPTIONS=detect_stack_use_after_return=1 DYLD_INSERT_LIBRARIES=/Users/buildslave/jenkins/workspace/lldb-cmake-sanitized/host-compiler/lib/clang/13.0.99/lib/darwin/libclang_rt.asan_osx_dynamic.dylib\n"},"event":"output","seq":0,"type":"event"} <-- Content-Length: 77

Hide Details

{"command":"launch","request_seq":2,"seq":0,"success":true,"type":"response"} <-- Content-Length: 309

Hide Details

{"body":{"isLocalProcess":true,"name":"/Users/buildslave/jenkins/workspace/lldb-cmake-sanitized/lldb-build/lldb-test-build.noindex/tools/lldb-vscode/breakpoint/TestVSCode_setFunctionBreakpoints.test_functionality/a.out","startMethod":"launch","systemProcessId":88114},"event":"process","seq":0,"type":"event"} <-- Content-Length: 46

Hide Details

{"event":"initialized","seq":0,"type":"event"} --> Content-Length: 109

Hide Details

{"command":"setFunctionBreakpoints","type":"request","arguments":{"breakpoints":[{"name":"twelve"}]},"seq":3} <-- Content-Length: 383

Hide Details

{"body":{"breakpoints":[{"id":1,"line":6,"source":{"name":"main-copy.cpp","path":"/Users/buildslave/jenkins/workspace/lldb-cmake-sanitized/lldb-build/lldb-test-build.noindex/tools/lldb-vscode/breakpoint/TestVSCode_setFunctionBreakpoints.test_functionality/main-copy.cpp"},"verified":true}]},"command":"setFunctionBreakpoints","request_seq":3,"seq":0,"success":true,"type":"response"} --> Content-Length: 71

Hide Details

{"command":"configurationDone","type":"request","arguments":{},"seq":4} <-- Content-Length: 88

Hide Details

{"command":"configurationDone","request_seq":4,"seq":0,"success":true,"type":"response"} <-- Content-Length: 200

Hide Details

{"body":{"allThreadsStopped":true,"description":"breakpoint 1.1","preserveFocusHint":false,"reason":"breakpoint","threadCausedFocus":true,"threadId":15652064},"event":"stopped","seq":0,"type":"event"} --> Content-Length: 61

Hide Details

{"command":"threads","type":"request","arguments":{},"seq":5} <-- Content-Length: 134

Hide Details

{"body":{"threads":[{"id":15652064,"name":"Thread #1"}]},"command":"threads","request_seq":5,"seq":0,"success":true,"type":"response"} --> Content-Length: 109

Hide Details

{"command":"stackTrace","type":"request","arguments":{"threadId":15652064,"startFrame":0,"levels":1},"seq":6} <-- Content-Length: 409

Hide Details

{"body":{"stackFrames":[{"column":15,"id":524288,"line":6,"name":"twelve(int)","source":{"name":"main-copy.cpp","path":"/Users/buildslave/jenkins/workspace/lldb-cmake-sanitized/lldb-build/lldb-test-build.noindex/tools/lldb-vscode/breakpoint/TestVSCode_setFunctionBreakpoints.test_functionality/main-copy.cpp"}}],"totalFrames":4},"command":"stackTrace","request_seq":6,"seq":0,"success":true,"type":"response"} --> Content-Length: 76

Hide Details

{"command":"scopes","type":"request","arguments":{"frameId":524288},"seq":7} <-- Content-Length: 335

Hide Details

{"body":{"scopes":[{"expensive":false,"name":"Locals","namedVariables":1,"variablesReference":1},{"expensive":false,"name":"Globals","namedVariables":0,"variablesReference":2},{"expensive":false,"name":"Registers","namedVariables":3,"variablesReference":3}]},"command":"scopes","request_seq":7,"seq":0,"success":true,"type":"response"} --> Content-Length: 85

Hide Details

{"command":"variables","type":"request","arguments":{"variablesReference":1},"seq":8} <-- Content-Length: 190

Hide Details

{"body":{"variables":[{"evaluateName":"i","id":0,"name":"i","type":"int","value":"0","variablesReference":0}]},"command":"variables","request_seq":8,"seq":0,"success":true,"type":"response"} --> Content-Length: 128

Hide Details

{"command":"setFunctionBreakpoints","type":"request","arguments":{"breakpoints":[{"name":"twelve","condition":"i==4"}]},"seq":9} <-- Content-Length: 383

Hide Details

{"body":{"breakpoints":[{"id":1,"line":6,"source":{"name":"main-copy.cpp","path":"/Users/buildslave/jenkins/workspace/lldb-cmake-sanitized/lldb-build/lldb-test-build.noindex/tools/lldb-vscode/breakpoint/TestVSCode_setFunctionBreakpoints.test_functionality/main-copy.cpp"},"verified":true}]},"command":"setFunctionBreakpoints","request_seq":9,"seq":0,"success":true,"type":"response"} --> Content-Length: 82

Hide Details

{"command":"continue","type":"request","arguments":{"threadId":15652064},"seq":10} <-- Content-Length: 116

Hide Details

{"body":{"allThreadsContinued":true},"command":"continue","request_seq":10,"seq":0,"success":true,"type":"response"} <-- Content-Length: 311

Hide Details

{"body":{"category":"console","output":"/Users/buildslave/jenkins/workspace/lldb-cmake-sanitized/llvm-project/lldb/tools/lldb-vscode/ProgressEvent.cpp:89:64: runtime error: load of value 808464432, which is not a valid value for type 'lldb_vscode::ProgressEventType'\n"},"event":"output","seq":0,"type":"event"} <-- Content-Length: 261

Hide Details

{"body":{"category":"console","output":"SUMMARY: UndefinedBehaviorSanitizer: undefined-behavior /Users/buildslave/jenkins/workspace/lldb-cmake-sanitized/llvm-project/lldb/tools/lldb-vscode/ProgressEvent.cpp:89:64 in \n"},"event":"output","seq":0,"type":"event"} <-- Content-Length: 170

Hide Details

{"body":{"category":"console","output":"PLEASE submit a bug report to https://bugs.llvm.org/ and include the crash backtrace.\n"},"event":"output","seq":0,"type":"event"}

Hide Details

========= END ========= ========= DEBUG ADAPTER PROTOCOL LOGS ========= --> Content-Length: 284

Hide Details

{"command":"initialize","type":"request","arguments":{"adapterID":"lldb-native","clientID":"vscode","columnsStartAt1":true,"linesStartAt1":true,"locale":"en-us","pathFormat":"path","supportsRunInTerminalRequest":true,"supportsVariablePaging":true,"supportsVariableType":true},"seq":1} <-- Content-Length: 1222

Hide Details

{"body":{"exceptionBreakpointFilters":[{"default":false,"filter":"cpp_catch","label":"C++ Catch"},{"default":false,"filter":"cpp_throw","label":"C++ Throw"},{"default":false,"filter":"objc_catch","label":"Objective C Catch"},{"default":false,"filter":"objc_throw","label":"Objective C Throw"},{"default":false,"filter":"swift_catch","label":"Swift Catch"},{"default":false,"filter":"swift_throw","label":"Swift Throw"}],"supportTerminateDebuggee":true,"supportsCompletionsRequest":false,"supportsConditionalBreakpoints":true,"supportsConfigurationDoneRequest":true,"supportsDelayedStackTraceLoading":true,"supportsEvaluateForHovers":true,"supportsExceptionInfoRequest":true,"supportsExceptionOptions":true,"supportsFunctionBreakpoints":true,"supportsGotoTargetsRequest":false,"supportsHitConditionalBreakpoints":true,"supportsLoadedSourcesRequest":false,"supportsModulesRequest":false,"supportsProgressReporting":true,"supportsRestartFrame":false,"supportsRestartRequest":false,"supportsRunInTerminalRequest":true,"supportsSetVariable":true,"supportsStepBack":false,"supportsStepInTargetsRequest":false,"supportsValueFormattingOptions":true},"command":"initialize","request_seq":1,"seq":0,"success":true,"type":"response"} --> Content-Length: 1044

Hide Details

{"command":"launch","type":"request","arguments":{"program":"/Users/buildslave/jenkins/workspace/lldb-cmake-sanitized/lldb-build/lldb-test-build.noindex/tools/lldb-vscode/breakpoint/TestVSCode_setFunctionBreakpoints.test_set_and_clear/a.out","disableASLR":true,"initCommands":["settings clear -all","settings set symbols.enable-external-lookup false","settings set target.inherit-tcc true","settings set target.detach-on-error false","settings set target.auto-apply-fixits false","settings set plugin.process.gdb-remote.packet-timeout 60","settings set symbols.clang-modules-cache-path \"/Users/buildslave/jenkins/workspace/lldb-cmake-sanitized/lldb-build/lldb-test-build.noindex/module-cache-lldb/lldb-api\"","settings set use-color false","setting set target.prefer-dynamic-value no-dynamic-values","settings set target.env-vars ASAN_OPTIONS=detect_stack_use_after_return=1 DYLD_INSERT_LIBRARIES=/Users/buildslave/jenkins/workspace/lldb-cmake-sanitized/host-compiler/lib/clang/13.0.99/lib/darwin/libclang_rt.asan_osx_dynamic.dylib"]},"seq":2} <-- Content-Length: 923

Hide Details

{"body":{"category":"console","output":"Running initCommands:\n(lldb) settings clear -all\n(lldb) settings set symbols.enable-external-lookup false\n(lldb) settings set target.inherit-tcc true\n(lldb) settings set target.detach-on-error false\n(lldb) settings set target.auto-apply-fixits false\n(lldb) settings set plugin.process.gdb-remote.packet-timeout 60\n(lldb) settings set symbols.clang-modules-cache-path \"/Users/buildslave/jenkins/workspace/lldb-cmake-sanitized/lldb-build/lldb-test-build.noindex/module-cache-lldb/lldb-api\"\n(lldb) settings set use-color false\n(lldb) setting set target.prefer-dynamic-value no-dynamic-values\n(lldb) settings set target.env-vars ASAN_OPTIONS=detect_stack_use_after_return=1 DYLD_INSERT_LIBRARIES=/Users/buildslave/jenkins/workspace/lldb-cmake-sanitized/host-compiler/lib/clang/13.0.99/lib/darwin/libclang_rt.asan_osx_dynamic.dylib\n"},"event":"output","seq":0,"type":"event"} <-- Content-Length: 77

Hide Details

{"command":"launch","request_seq":2,"seq":0,"success":true,"type":"response"} <-- Content-Length: 309

Hide Details

{"body":{"isLocalProcess":true,"name":"/Users/buildslave/jenkins/workspace/lldb-cmake-sanitized/lldb-build/lldb-test-build.noindex/tools/lldb-vscode/breakpoint/TestVSCode_setFunctionBreakpoints.test_set_and_clear/a.out","startMethod":"launch","systemProcessId":88216},"event":"process","seq":0,"type":"event"} <-- Content-Length: 46

Hide Details

{"event":"initialized","seq":0,"type":"event"} --> Content-Length: 109

Hide Details

{"command":"setFunctionBreakpoints","type":"request","arguments":{"breakpoints":[{"name":"twelve"}]},"seq":3} <-- Content-Length: 383

Hide Details

{"body":{"breakpoints":[{"id":1,"line":6,"source":{"name":"main-copy.cpp","path":"/Users/buildslave/jenkins/workspace/lldb-cmake-sanitized/lldb-build/lldb-test-build.noindex/tools/lldb-vscode/breakpoint/TestVSCode_setFunctionBreakpoints.test_set_and_clear/main-copy.cpp"},"verified":true}]},"command":"setFunctionBreakpoints","request_seq":3,"seq":0,"success":true,"type":"response"} --> Content-Length: 129

Hide Details

{"command":"setFunctionBreakpoints","type":"request","arguments":{"breakpoints":[{"name":"twelve"},{"name":"thirteen"}]},"seq":4} <-- Content-Length: 649

Hide Details

{"body":{"breakpoints":[{"id":1,"line":6,"source":{"name":"main-copy.cpp","path":"/Users/buildslave/jenkins/workspace/lldb-cmake-sanitized/lldb-build/lldb-test-build.noindex/tools/lldb-vscode/breakpoint/TestVSCode_setFunctionBreakpoints.test_set_and_clear/main-copy.cpp"},"verified":true},{"id":2,"line":10,"source":{"name":"main-copy.cpp","path":"/Users/buildslave/jenkins/workspace/lldb-cmake-sanitized/lldb-build/lldb-test-build.noindex/tools/lldb-vscode/breakpoint/TestVSCode_setFunctionBreakpoints.test_set_and_clear/main-copy.cpp"},"verified":true}]},"command":"setFunctionBreakpoints","request_seq":4,"seq":0,"success":true,"type":"response"} --> Content-Length: 109

Hide Details

{"command":"setFunctionBreakpoints","type":"request","arguments":{"breakpoints":[{"name":"twelve"}]},"seq":5} <-- Content-Length: 383

Hide Details

{"body":{"breakpoints":[{"id":1,"line":6,"source":{"name":"main-copy.cpp","path":"/Users/buildslave/jenkins/workspace/lldb-cmake-sanitized/lldb-build/lldb-test-build.noindex/tools/lldb-vscode/breakpoint/TestVSCode_setFunctionBreakpoints.test_set_and_clear/main-copy.cpp"},"verified":true}]},"command":"setFunctionBreakpoints","request_seq":5,"seq":0,"success":true,"type":"response"} --> Content-Length: 79

Hide Details

{"command":"_testGetTargetBreakpoints","type":"request","arguments":{},"seq":6} <-- Content-Length: 386

Hide Details

{"body":{"breakpoints":[{"id":1,"line":6,"source":{"name":"main-copy.cpp","path":"/Users/buildslave/jenkins/workspace/lldb-cmake-sanitized/lldb-build/lldb-test-build.noindex/tools/lldb-vscode/breakpoint/TestVSCode_setFunctionBreakpoints.test_set_and_clear/main-copy.cpp"},"verified":true}]},"command":"_testGetTargetBreakpoints","request_seq":6,"seq":0,"success":true,"type":"response"} --> Content-Length: 92

Hide Details

{"command":"setFunctionBreakpoints","type":"request","arguments":{"breakpoints":[]},"seq":7} <-- Content-Length: 119

Hide Details

{"body":{"breakpoints":[]},"command":"setFunctionBreakpoints","request_seq":7,"seq":0,"success":true,"type":"response"} --> Content-Length: 79

Hide Details

{"command":"_testGetTargetBreakpoints","type":"request","arguments":{},"seq":8} <-- Content-Length: 122

Hide Details

{"body":{"breakpoints":[]},"command":"_testGetTargetBreakpoints","request_seq":8,"seq":0,"success":true,"type":"response"} --> Content-Length: 88

Hide Details

{"command":"disconnect","type":"request","arguments":{"terminateDebuggee":true},"seq":9} <-- Content-Length: 45

Hide Details

{"event":"terminated","seq":0,"type":"event"} <-- Content-Length: 63

Hide Details

{"body":{"exitCode":9},"event":"exited","seq":0,"type":"event"} <-- Content-Length: 81

Hide Details

{"command":"disconnect","request_seq":9,"seq":0,"success":true,"type":"response"}

Hide Details

========= END =========

Hide Details

-- Command Output (stderr): -- Change dir to: /Users/buildslave/jenkins/workspace/lldb-cmake-sanitized/llvm-project/lldb/test/API/tools/lldb-vscode/breakpoint runCmd: settings clear -all output:

Hide Details

runCmd: settings set symbols.enable-external-lookup false output:

Hide Details

runCmd: settings set target.inherit-tcc true output:

Hide Details

runCmd: settings set target.detach-on-error false output:

Hide Details

runCmd: settings set target.auto-apply-fixits false output:

Hide Details

runCmd: settings set plugin.process.gdb-remote.packet-timeout 60 output:

Hide Details

runCmd: settings set symbols.clang-modules-cache-path "/Users/buildslave/jenkins/workspace/lldb-cmake-sanitized/lldb-build/lldb-test-build.noindex/module-cache-lldb/lldb-api" output:

Hide Details

runCmd: settings set use-color false output:

Hide Details

runCmd: setting set target.prefer-dynamic-value no-dynamic-values output:

Hide Details

runCmd: settings set target.env-vars ASAN_OPTIONS=detect_stack_use_after_return=1 DYLD_INSERT_LIBRARIES=/Users/buildslave/jenkins/workspace/lldb-cmake-sanitized/host-compiler/lib/clang/13.0.99/lib/darwin/libclang_rt.asan_osx_dynamic.dylib output:

Hide Details

Adding tearDown hook: def cleanup(): if disconnectAutomatically: self.vscode.request_disconnect(terminateDebuggee=True) self.vscode.terminate()

Hide Details

Hide Details

FAIL: LLDB (/Users/buildslave/jenkins/workspace/lldb-cmake-sanitized/host-compiler/bin/clang-x86_64) :: test_functionality (TestVSCode_setFunctionBreakpoints.TestVSCode_setFunctionBreakpoints) Executing tearDown hook: def cleanup(): if disconnectAutomatically: self.vscode.request_disconnect(terminateDebuggee=True) self.vscode.terminate()

Hide Details

Hide Details

CLEANUP ERROR: LLDB (/Users/buildslave/jenkins/workspace/lldb-cmake-sanitized/host-compiler/bin/clang-x86_64) :: test_functionality (TestVSCode_setFunctionBreakpoints.TestVSCode_setFunctionBreakpoints) Traceback (most recent call last): File "/Users/buildslave/jenkins/workspace/lldb-cmake-sanitized/llvm-project/lldb/third_party/Python/module/unittest2/unittest2/case.py", line 386, in run self.tearDown() File "/Users/buildslave/jenkins/workspace/lldb-cmake-sanitized/llvm-project/lldb/packages/Python/lldbsuite/test/lldbtest.py", line 2095, in tearDown Base.tearDown(self) File "/Users/buildslave/jenkins/workspace/lldb-cmake-sanitized/llvm-project/lldb/packages/Python/lldbsuite/test/lldbtest.py", line 1065, in tearDown hook() # try the plain call and hope it works File "/Users/buildslave/jenkins/workspace/lldb-cmake-sanitized/llvm-project/lldb/packages/Python/lldbsuite/test/tools/lldb-vscode/lldbvscode_testcase.py", line 294, in cleanup self.vscode.request_disconnect(terminateDebuggee=True) File "/Users/buildslave/jenkins/workspace/lldb-cmake-sanitized/llvm-project/lldb/packages/Python/lldbsuite/test/tools/lldb-vscode/vscode.py", line 590, in request_disconnect return self.send_recv(command_dict) File "/Users/buildslave/jenkins/workspace/lldb-cmake-sanitized/llvm-project/lldb/packages/Python/lldbsuite/test/tools/lldb-vscode/vscode.py", line 315, in send_recv self.send_packet(command) File "/Users/buildslave/jenkins/workspace/lldb-cmake-sanitized/llvm-project/lldb/packages/Python/lldbsuite/test/tools/lldb-vscode/vscode.py", line 271, in send_packet self.send.flush() BrokenPipeError: [Errno 32] Broken pipe

Hide Details

runCmd: settings clear -all output:

Hide Details

runCmd: settings set symbols.enable-external-lookup false output:

Hide Details

runCmd: settings set target.inherit-tcc true output:

Hide Details

runCmd: settings set target.detach-on-error false output:

Hide Details

runCmd: settings set target.auto-apply-fixits false output:

Hide Details

runCmd: settings set plugin.process.gdb-remote.packet-timeout 60 output:

Hide Details

runCmd: settings set symbols.clang-modules-cache-path "/Users/buildslave/jenkins/workspace/lldb-cmake-sanitized/lldb-build/lldb-test-build.noindex/module-cache-lldb/lldb-api" output:

Hide Details

runCmd: settings set use-color false output:

Hide Details

runCmd: setting set target.prefer-dynamic-value no-dynamic-values output:

Hide Details

runCmd: settings set target.env-vars ASAN_OPTIONS=detect_stack_use_after_return=1 DYLD_INSERT_LIBRARIES=/Users/buildslave/jenkins/workspace/lldb-cmake-sanitized/host-compiler/lib/clang/13.0.99/lib/darwin/libclang_rt.asan_osx_dynamic.dylib output:

Hide Details

Adding tearDown hook: def cleanup(): if disconnectAutomatically: self.vscode.request_disconnect(terminateDebuggee=True) self.vscode.terminate()

Hide Details

Hide Details

Executing tearDown hook: def cleanup(): if disconnectAutomatically: self.vscode.request_disconnect(terminateDebuggee=True) self.vscode.terminate()

Hide Details

Hide Details

PASS: LLDB (/Users/buildslave/jenkins/workspace/lldb-cmake-sanitized/host-compiler/bin/clang-x86_64) :: test_set_and_clear (TestVSCode_setFunctionBreakpoints.TestVSCode_setFunctionBreakpoints) Restore dir to: /Users/buildslave/jenkins/workspace/lldb-cmake-sanitized/lldb-build/tools/lldb/test ====================================================================== FAIL: test_functionality (TestVSCode_setFunctionBreakpoints.TestVSCode_setFunctionBreakpoints) Tests hitting breakpoints and the functionality of a single ---------------------------------------------------------------------- Traceback (most recent call last): File "/Users/buildslave/jenkins/workspace/lldb-cmake-sanitized/llvm-project/lldb/test/API/tools/lldb-vscode/breakpoint/TestVSCode_setFunctionBreakpoints.py", line 139, in test_functionality self.continue_to_breakpoints(breakpoint_ids) File "/Users/buildslave/jenkins/workspace/lldb-cmake-sanitized/llvm-project/lldb/packages/Python/lldbsuite/test/tools/lldb-vscode/lldbvscode_testcase.py", line 233, in continue_to_breakpoints self.verify_breakpoint_hit(breakpoint_ids) File "/Users/buildslave/jenkins/workspace/lldb-cmake-sanitized/llvm-project/lldb/packages/Python/lldbsuite/test/tools/lldb-vscode/lldbvscode_testcase.py", line 92, in verify_breakpoint_hit self.assertTrue(False, "breakpoint not hit") AssertionError: False is not True : breakpoint not hit Config=x86_64-/Users/buildslave/jenkins/workspace/lldb-cmake-sanitized/host-compiler/bin/clang ---------------------------------------------------------------------- Ran 2 tests in 6.127s

Hide Details

RESULT: FAILED (1 passes, 1 failures, 0 errors, 0 skipped, 0 expected failures, 0 unexpected successes)

Hide Details

--

Hide Details

******************** PASS: lldb-api :: functionalities/data-formatter/data-formatter-stl/libcxx/bitset/TestDataFormatterLibcxxBitset.py (1863 of 2356) UNSUPPORTED: lldb-shell :: Register/x86-64-zmm-write.test (1864 of 2356) PASS: lldb-shell :: SymbolFile/DWARF/x86/split-dwarf-inlining.cpp (1865 of 2356) PASS: lldb-api :: lang/c/blocks/TestBlocks.py (1866 of 2356) UNSUPPORTED: lldb-shell :: ExecControl/StopHook/stop-hook-threads.test (1867 of 2356) PASS: lldb-unit :: SymbolFile/DWARF/./SymbolFileDWARFTests/SymbolFileDWARFTests.ParseArangesWithMultipleTerminators (1868 of 2356) PASS: lldb-unit :: Utility/./UtilityTests/StreamTest.SetIndentLevel (1869 of 2356) PASS: lldb-api :: lang/c/find_struct_type/TestFindStructTypes.py (1870 of 2356) PASS: lldb-unit :: Utility/./UtilityTests/ArgsTest.GetArgumentArrayRef (1871 of 2356) PASS: lldb-api :: python_api/value/empty_class/TestValueAPIEmptyClass.py (1872 of 2356) PASS: lldb-shell :: ObjectFile/ELF/section-types.yaml (1873 of 2356) PASS: lldb-shell :: SymbolFile/NativePDB/ast-methods.cpp (1874 of 2356) PASS: lldb-api :: functionalities/tail_call_frames/inlining_and_tail_calls/TestInliningAndTailCalls.py (1875 of 2356) UNSUPPORTED: lldb-shell :: Register/x86-64-zmm-read.test (1876 of 2356) PASS: lldb-unit :: Expression/./ExpressionTests/CppModuleConfigurationTest.LibCppV2 (1877 of 2356) PASS: lldb-api :: functionalities/thread/concurrent_events/TestConcurrentWatchpointWithDelayWatchpointThreads.py (1878 of 2356) PASS: lldb-api :: python_api/function_symbol/TestDisasmAPI.py (1879 of 2356) PASS: lldb-api :: lang/cpp/stl/TestSTL.py (1880 of 2356) PASS: lldb-api :: macosx/safe-to-func-call/TestSafeFuncCalls.py (1881 of 2356) PASS: lldb-unit :: Utility/./UtilityTests/StringExtractorTest.GetHexU8_Underflow (1882 of 2356) PASS: lldb-unit :: Utility/./UtilityTests/StreamTest.PutCharNull (1883 of 2356) PASS: lldb-unit :: Utility/./UtilityTests/StreamTest.AddressSuffix (1884 of 2356) PASS: lldb-api :: functionalities/data-formatter/data-formatter-stl/libcxx/vbool/TestDataFormatterLibcxxVBool.py (1885 of 2356) PASS: lldb-unit :: Utility/./UtilityTests/TildeExpressionResolver.ResolveFullPath (1886 of 2356) PASS: lldb-api :: commands/expression/import-std-module/weak_ptr-dbg-info-content/TestDbgInfoContentWeakPtrFromStdModule.py (1887 of 2356) PASS: lldb-api :: lang/objc/objc-struct-return/TestObjCStructReturn.py (1888 of 2356) PASS: lldb-api :: functionalities/gdb_remote_client/TestRecognizeBreakpoint.py (1889 of 2356) PASS: lldb-shell :: Driver/TestConvenienceVariables.test (1890 of 2356) PASS: lldb-unit :: Utility/./UtilityTests/RangeTest.NotEqualInvalid (1891 of 2356) PASS: lldb-api :: driver/batch_mode/TestBatchMode.py (1892 of 2356) PASS: lldb-unit :: UnwindAssembly/x86/./UnwindAssemblyx86Tests/Testx86AssemblyInspectionEngine.Test32bitFramelessSmallStackFrame (1893 of 2356) PASS: lldb-api :: python_api/lldbutil/TestSwigVersion.py (1894 of 2356) PASS: lldb-unit :: Utility/./UtilityTests/FileSpecTest.EqualDotsWindows (1895 of 2356) PASS: lldb-api :: lang/objc/objc-ivar-stripped/TestObjCIvarStripped.py (1896 of 2356) PASS: lldb-api :: functionalities/data-formatter/stringprinter/TestStringPrinter.py (1897 of 2356) PASS: lldb-unit :: Utility/./UtilityTests/StringExtractorTest.GetU32BigEndian (1898 of 2356) PASS: lldb-shell :: SymbolFile/Breakpad/symtab.test (1899 of 2356) PASS: lldb-api :: lang/objc/print-obj/TestPrintObj.py (1900 of 2356) PASS: lldb-shell :: SymbolFile/DWARF/x86/dwarf5-atomic.s (1901 of 2356) PASS: lldb-shell :: Minidump/memory-region.yaml (1902 of 2356) PASS: lldb-api :: commands/platform/file/close/TestPlatformFileClose.py (1903 of 2356) PASS: lldb-shell :: ObjectFile/PECOFF/basic-info-arm.yaml (1904 of 2356) PASS: lldb-unit :: Utility/./UtilityTests/ScalarTest.RightShiftOperator (1905 of 2356) PASS: lldb-unit :: SymbolFile/DWARF/./SymbolFileDWARFTests/SymbolFileDWARFTests.TestAbbrevNullAttrValidForm (1906 of 2356) PASS: lldb-unit :: Core/./LLDBCoreTests/MangledTest.ResultForValidRustV0Name (1907 of 2356) PASS: lldb-unit :: Symbol/./SymbolTests/TestTypeSystemClang.TestNotDeletingUserCopyCstrDueToMoveCStr (1908 of 2356) PASS: lldb-unit :: Utility/./UtilityTests/TimerTest.CategoryTimes2 (1909 of 2356) PASS: lldb-unit :: DataFormatter/./LLDBFormatterTests/TypeMatcherTests.GetMatchStringExactName (1910 of 2356) PASS: lldb-unit :: Target/./TargetTests/ExecutionContextTest.GetByteOrderProcess (1911 of 2356) PASS: lldb-unit :: Host/./HostTests/NativeProcessProtocolTest.SetBreakpoint (1912 of 2356) UNSUPPORTED: lldb-shell :: SymbolFile/PDB/type-quals.test (1913 of 2356) UNSUPPORTED: lldb-api :: benchmarks/expression/TestExpressionCmd.py (1914 of 2356) PASS: lldb-api :: functionalities/plugins/python_os_plugin/stepping_plugin_threads/TestOSPluginStepping.py (1915 of 2356) PASS: lldb-unit :: Utility/./UtilityTests/StringExtractorTest.GetU64LittleEndian (1916 of 2356) PASS: lldb-api :: lang/objc/hidden-ivars/TestHiddenIvars.py (1917 of 2356) PASS: lldb-shell :: SymbolFile/DWARF/x86/dwp-separate-debug-file.cpp (1918 of 2356) PASS: lldb-unit :: Utility/./UtilityTests/LogTest.LLDB_LOG_nullptr (1919 of 2356) PASS: lldb-unit :: Utility/./UtilityTests/StringListTest.Assignment (1920 of 2356) PASS: lldb-unit :: Process/./ProcessEventDataTests/ProcessEventDataTest.ShouldStop (1921 of 2356) PASS: lldb-unit :: Utility/./UtilityTests/SerializationRountripTest.SerializeDeserializeObjectPointer (1922 of 2356) PASS: lldb-unit :: Utility/./UtilityTests/StringListTest.ShiftMove (1923 of 2356) PASS: lldb-api :: functionalities/data-formatter/data-formatter-objc/TestDataFormatterObjCExpr.py (1924 of 2356) PASS: lldb-unit :: Utility/./UtilityTests/RecordReplayTest.InstrumentedBar (1925 of 2356) PASS: lldb-api :: commands/expression/persist_objc_pointeetype/TestPersistObjCPointeeType.py (1926 of 2356) PASS: lldb-api :: functionalities/breakpoint/breakpoint_command/TestBreakpointCommand.py (1927 of 2356) PASS: lldb-api :: commands/expression/import-std-module/stack/TestStackFromStdModule.py (1928 of 2356) PASS: lldb-unit :: Utility/./UtilityTests/OptionsWithRawTest.ArgsButNoDelimiter (1929 of 2356) PASS: lldb-api :: commands/watchpoints/step_over_watchpoint/TestStepOverWatchpoint.py (1930 of 2356) PASS: lldb-unit :: Expression/./ExpressionTests/CppModuleConfigurationTest.AmbiguousCLib (1931 of 2356) PASS: lldb-shell :: ObjectFile/MachO/lc_build_version_notools.yaml (1932 of 2356) PASS: lldb-api :: python_api/sbenvironment/TestSBEnvironment.py (1933 of 2356) PASS: lldb-unit :: Utility/./UtilityTests/FileSpecTest.Equal (1934 of 2356) PASS: lldb-api :: commands/expression/deleting-implicit-copy-constructor/TestDeletingImplicitCopyConstructor.py (1935 of 2356) PASS: lldb-api :: sample_test/TestSampleTest.py (1936 of 2356) UNSUPPORTED: lldb-api :: functionalities/thread/thread_specific_break_plus_condition/TestThreadSpecificBpPlusCondition.py (1937 of 2356) PASS: lldb-api :: functionalities/gdb_remote_client/TestRegDefinitionInParts.py (1938 of 2356) PASS: lldb-unit :: Utility/./UtilityTests/DataExtractorTest.GetBitfield (1939 of 2356) PASS: lldb-api :: lang/cpp/global_variables/TestCPPGlobalVariables.py (1940 of 2356) PASS: lldb-shell :: Minidump/dump-all.test (1941 of 2356) PASS: lldb-unit :: Utility/./UtilityTests/VMRange.ContainsAddr (1942 of 2356) PASS: lldb-api :: functionalities/breakpoint/breakpoint_language/TestBreakpointLanguage.py (1943 of 2356) PASS: lldb-unit :: Symbol/./SymbolTests/TestClangASTImporter.CopyTypeTagDecl (1944 of 2356) PASS: lldb-unit :: Utility/./UtilityTests/StringLexerTest.AdvanceIf (1945 of 2356) PASS: lldb-api :: commands/expression/options/TestExprOptions.py (1946 of 2356) PASS: lldb-shell :: Register/Core/x86-32-netbsd-gp.test (1947 of 2356) PASS: lldb-unit :: Host/./HostTests/MainLoopTest.DetectsEOF (1948 of 2356) PASS: lldb-shell :: Process/UnsupportedLanguage.test (1949 of 2356) PASS: lldb-unit :: Process/minidump/./LLDBMinidumpTests/MinidumpParserTest.GetMiscInfo_no_stream (1950 of 2356) PASS: lldb-api :: lang/cpp/subst_template_type_param/TestSubstTemplateTypeParam.py (1951 of 2356) PASS: lldb-api :: functionalities/inferior-crashing/TestInferiorCrashing.py (1952 of 2356) PASS: lldb-api :: functionalities/inferior-crashing/recursive-inferior/TestRecursiveInferiorStep.py (1953 of 2356) PASS: lldb-unit :: Core/./LLDBCoreTests/SourceLocationSpecTest.OperatorBool (1954 of 2356) PASS: lldb-unit :: ObjectFile/ELF/./ObjectFileELFTests/ObjectFileELFTest.GetSymtab_NoSymEntryPointArmThumbAddressClass (1955 of 2356) UNSUPPORTED: lldb-api :: functionalities/data-formatter/data-formatter-stl/libstdcpp/iterator/TestDataFormatterStdIterator.py (1956 of 2356) PASS: lldb-unit :: Process/gdb-remote/./ProcessGdbRemoteTests/GDBRemoteClientBaseTest.SendContinueAndLateInterrupt (1957 of 2356) PASS: lldb-api :: macosx/macCatalyst/TestMacCatalyst.py (1958 of 2356) PASS: lldb-unit :: Process/minidump/./LLDBMinidumpTests/MinidumpParserTest.GetThreadContext_x86_32_wow64 (1959 of 2356) PASS: lldb-shell :: Reproducer/Functionalities/TestExpressionEvaluation.test (1960 of 2356) PASS: lldb-api :: tools/lldb-server/commandline/TestGdbRemoteConnection.py (1961 of 2356) PASS: lldb-shell :: ObjectFile/PECOFF/basic-info-arm64.yaml (1962 of 2356) PASS: lldb-api :: functionalities/data-formatter/data-formatter-stl/libcxx/unordered/TestDataFormatterUnordered.py (1963 of 2356) PASS: lldb-unit :: Core/./LLDBCoreTests/MangledTest.NameIndexes_FindFunctionSymbols (1964 of 2356) PASS: lldb-unit :: Symbol/./SymbolTests/PostfixExpression.ParseFPOProgram (1965 of 2356) PASS: lldb-shell :: Commands/CommandScriptImmediateOutput/CommandScriptImmediateOutputFile.test (1966 of 2356) PASS: lldb-api :: tools/lldb-server/thread-name/TestGdbRemoteThreadName.py (1967 of 2356) PASS: lldb-shell :: ObjectFile/PDB/object.test (1968 of 2356) PASS: lldb-api :: python_api/process/TestProcessAPI.py (1969 of 2356) PASS: lldb-unit :: Utility/./UtilityTests/StreamTest.PutCharWhitespace (1970 of 2356) PASS: lldb-shell :: ObjectFile/PECOFF/export-dllfunc.yaml (1971 of 2356) PASS: lldb-api :: python_api/sberror/TestSBError.py (1972 of 2356) PASS: lldb-unit :: Process/minidump/./LLDBMinidumpTests/MinidumpParserTest.GetLinuxProcStatus_no_stream (1973 of 2356) PASS: lldb-unit :: Utility/./UtilityTests/FileSpecTest.IsRelative (1974 of 2356) PASS: lldb-unit :: Utility/./UtilityTests/SubsystemRAIITest.SubsystemWithErrorFailure (1975 of 2356) PASS: lldb-unit :: Interpreter/./InterpreterTests/TestProperties.DeepCopy (1976 of 2356) PASS: lldb-api :: sample_test/TestSampleInlineTest.py (1977 of 2356) PASS: lldb-api :: functionalities/data-formatter/data-formatter-objc/TestDataFormatterObjCNSURL.py (1978 of 2356) PASS: lldb-unit :: Utility/./UtilityTests/RegularExpression.Valid (1979 of 2356) PASS: lldb-unit :: Utility/./UtilityTests/StreamTeeTest.Constructor1Stream (1980 of 2356) UNSUPPORTED: lldb-api :: commands/expression/macros/TestMacros.py (1981 of 2356) PASS: lldb-unit :: Host/./HostTests/SocketTests/SocketTest.UDPGetConnectURI/ipv6 (1982 of 2356) PASS: lldb-unit :: Target/./TargetTests/RemoteAwarePlatformTest.TestResolveExecutabelOnClientByPlatform (1983 of 2356) PASS: lldb-unit :: Utility/./UtilityTests/UUIDTest.SetFromStringRef (1984 of 2356) PASS: lldb-api :: commands/session/history/TestSessionHistory.py (1985 of 2356) PASS: lldb-shell :: Driver/TestError.test (1986 of 2356) PASS: lldb-shell :: Reproducer/TestFileRepro.test (1987 of 2356) PASS: lldb-unit :: Utility/./UtilityTests/StreamTeeTest.GetStreamAtIndexOutOfBoundsEmpty (1988 of 2356) PASS: lldb-api :: functionalities/thread/concurrent_events/TestConcurrentDelayedCrashWithBreakpointWatchpoint.py (1989 of 2356) PASS: lldb-unit :: Utility/./UtilityTests/FileSpecTest.GuessPathStyle (1990 of 2356) PASS: lldb-unit :: Language/CPlusPlus/./LanguageCPlusPlusTests/CPlusPlusLanguage.MethodNameParsing (1991 of 2356) PASS: lldb-api :: commands/disassemble/basic/TestFrameDisassemble.py (1992 of 2356) PASS: lldb-unit :: Symbol/./SymbolTests/TestClangASTImporter.CopyDeclTagDecl (1993 of 2356) PASS: lldb-unit :: Utility/./UtilityTests/Flags.Test (1994 of 2356) PASS: lldb-api :: lang/objc/objc_direct-methods/TestObjCDirectMethods.py (1995 of 2356) UNSUPPORTED: lldb-api :: functionalities/darwin_log/format/TestDarwinLogMessageFormat.py (1996 of 2356) PASS: lldb-api :: tools/lldb-server/TestGdbRemoteRegisterState.py (1997 of 2356) PASS: lldb-shell :: ObjectFile/ELF/aarch64-relocations.yaml (1998 of 2356) PASS: lldb-api :: lang/mixed/TestMixedLanguages.py (1999 of 2356) PASS: lldb-unit :: Utility/./UtilityTests/StringExtractorGDBRemoteTest.GetPidTid (2000 of 2356) PASS: lldb-shell :: Register/x86-64-gp-read.test (2001 of 2356) PASS: lldb-api :: lang/cpp/operators/TestCppOperators.py (2002 of 2356) PASS: lldb-unit :: Host/./HostTests/FileSystemTest.Readable (2003 of 2356) PASS: lldb-shell :: Reproducer/Functionalities/TestDataFormatter.test (2004 of 2356) PASS: lldb-unit :: Process/gdb-remote/./ProcessGdbRemoteTests/GDBRemoteCommunicationClientTest.GetModulesInfoInvalidResponse (2005 of 2356) PASS: lldb-shell :: Settings/TestStopCommandSourceOnError.test (2006 of 2356) UNSUPPORTED: lldb-api :: functionalities/thread/multi_break/TestMultipleBreakpoints.py (2007 of 2356) PASS: lldb-api :: lang/c/unicode/TestUnicodeSymbols.py (2008 of 2356) PASS: lldb-shell :: SymbolFile/Breakpad/symtab-macho.test (2009 of 2356) UNSUPPORTED: lldb-api :: functionalities/darwin_log/filter/regex/category/TestDarwinLogFilterRegexCategory.py (2010 of 2356) UNSUPPORTED: lldb-shell :: SymbolFile/PDB/class-layout.test (2011 of 2356) PASS: lldb-unit :: Utility/./UtilityTests/StreamTest.PutHex16ByteOrderLittle (2012 of 2356) PASS: lldb-api :: lang/objc/bitfield_ivars/TestBitfieldIvars.py (2013 of 2356) PASS: lldb-api :: commands/session/save/TestSessionSave.py (2014 of 2356) PASS: lldb-api :: tools/lldb-vscode/module/TestVSCode_module.py (2015 of 2356) PASS: lldb-api :: lang/cpp/bool/TestCPPBool.py (2016 of 2356) PASS: lldb-unit :: Utility/./UtilityTests/ArchSpecTest.Compatibility (2017 of 2356) PASS: lldb-unit :: UnwindAssembly/x86/./UnwindAssemblyx86Tests/Testx86AssemblyInspectionEngine.TestAddESP (2018 of 2356) PASS: lldb-unit :: Utility/./UtilityTests/RangeDataVector.CustomSort (2019 of 2356) PASS: lldb-unit :: Symbol/./SymbolTests/TestTypeSystemClang.AddMethodToObjCObjectType (2020 of 2356) UNSUPPORTED: lldb-api :: functionalities/signal/handle-segv/TestHandleSegv.py (2021 of 2356) PASS: lldb-unit :: Utility/./UtilityTests/StreamTeeTest.CopyConstructor (2022 of 2356) PASS: lldb-unit :: Utility/./UtilityTests/StringListTest.GetMaxStringLengthEqualSize (2023 of 2356) PASS: lldb-shell :: Subprocess/fork-follow-parent.test (2024 of 2356) PASS: lldb-unit :: Utility/./UtilityTests/LogTest.Unregister (2025 of 2356) PASS: lldb-api :: commands/expression/static-initializers/TestStaticInitializers.py (2026 of 2356) PASS: lldb-api :: commands/statistics/basic/TestStats.py (2027 of 2356) PASS: lldb-unit :: Utility/./UtilityTests/RangeTest.Clear (2028 of 2356) PASS: lldb-unit :: DataFormatter/./LLDBFormatterTests/StringPrinterTests.SwiftUTF8 (2029 of 2356) PASS: lldb-unit :: Utility/./UtilityTests/ScalarTest.GetBytes (2030 of 2356) PASS: lldb-unit :: Process/Utility/./ProcessUtilityTests/ProcSMapTests/LinuxProcSMapsTestFixture.ParseSMapRegions/7 (2031 of 2356) PASS: lldb-unit :: Utility/./UtilityTests/UriParserTest.SchemeHostSeparator (2032 of 2356) PASS: lldb-unit :: tools/lldb-server/tests/./LLDBServerTests/StandardStartupTest.TestStopReplyContainsThreadPcs (2033 of 2356) PASS: lldb-unit :: UnwindAssembly/x86/./UnwindAssemblyx86Tests/Testx86AssemblyInspectionEngine.TestPopRBPWithREX (2034 of 2356) PASS: lldb-unit :: Utility/./UtilityTests/FileSpecTest.Match (2035 of 2356) PASS: lldb-unit :: SymbolFile/DWARF/./SymbolFileDWARFTests/SymbolFileDWARFTests.TestAbbrevOutOfOrder (2036 of 2356) PASS: lldb-api :: lang/cpp/char8_t/TestCxxChar8_t.py (2037 of 2356) PASS: lldb-api :: functionalities/dlopen_other_executable/TestDlopenOtherExecutable.py (2038 of 2356) UNSUPPORTED: lldb-api :: linux/sepdebugsymlink/TestTargetSymbolsSepDebugSymlink.py (2039 of 2356) PASS: lldb-unit :: Symbol/./SymbolTests/SymbolsTest.LocateExecutableSymbolFileForUnknownExecutableAndMissingSymbolFile (2040 of 2356) PASS: lldb-api :: functionalities/step_scripted/TestStepScripted.py (2041 of 2356) XFAIL: lldb-shell :: SymbolFile/DWARF/find-type-in-function.cpp (2042 of 2356) PASS: lldb-unit :: Process/Utility/./ProcessUtilityTests/ProcSMapTests/LinuxProcSMapsTestFixture.ParseSMapRegions/4 (2043 of 2356) PASS: lldb-api :: lang/c/tls_globals/TestTlsGlobals.py (2044 of 2356) PASS: lldb-api :: commands/expression/top-level/TestTopLevelExprs.py (2045 of 2356) UNSUPPORTED: lldb-api :: functionalities/tsan/multiple/TestTsanMultiple.py (2046 of 2356) PASS: lldb-unit :: Process/gdb-remote/./ProcessGdbRemoteTests/GDBRemoteCommunicationClientTest.SaveRestoreRegistersNoSuffix (2047 of 2356) PASS: lldb-api :: api/multithreaded/TestMultithreaded.py (2048 of 2356) PASS: lldb-unit :: Process/gdb-remote/./ProcessGdbRemoteTests/GDBRemoteCommunicationServerTest.SendErrorResponse_UnimplementedError (2049 of 2356) PASS: lldb-shell :: Expr/TestMultilineExpr.test (2050 of 2356) PASS: lldb-shell :: ScriptInterpreter/None/none.test (2051 of 2356) PASS: lldb-api :: lang/cpp/enum_types/TestCPP11EnumTypes.py (2052 of 2356) PASS: lldb-api :: python_api/sblaunchinfo/TestSBLaunchInfo.py (2053 of 2356) PASS: lldb-unit :: Host/./HostTests/SocketTests/SocketTest.TCPListen0GetPort/ipv6 (2054 of 2356) PASS: lldb-unit :: API/./APITests/SBStructuredDataTest.NullImpl (2055 of 2356) PASS: lldb-unit :: Expression/./ExpressionTests/ClangExpressionDeclMapTest.TestUnknownIdentifierLookup (2056 of 2356) PASS: lldb-unit :: Utility/./UtilityTests/StringExtractorTest.GetHexBytes (2057 of 2356) PASS: lldb-api :: macosx/save_crashlog/TestSaveCrashlog.py (2058 of 2356) PASS: lldb-unit :: Core/./LLDBCoreTests/MangledTest.ResultForValidName (2059 of 2356) UNSUPPORTED: lldb-shell :: SymbolFile/PDB/udt-layout.test (2060 of 2356) PASS: lldb-unit :: Utility/./UtilityTests/XcodeSDKTest.GetCanonicalNameAndConstruct (2061 of 2356) UNSUPPORTED: lldb-api :: functionalities/darwin_log/filter/exact_match/message/TestDarwinLogFilterMatchMessage.py (2062 of 2356) PASS: lldb-shell :: ScriptInterpreter/Python/Crashlog/text.test (2063 of 2356) PASS: lldb-shell :: ObjectFile/ELF/riscv-arch.yaml (2064 of 2356) PASS: lldb-api :: lang/objc/exceptions/TestObjCExceptions.py (2065 of 2356) PASS: lldb-unit :: Expression/./ExpressionTests/CppModuleConfigurationTest.MissingUsrInclude (2066 of 2356) PASS: lldb-shell :: SymbolFile/DWARF/x86/DW_AT_location-DW_AT_const_value.s (2067 of 2356) PASS: lldb-unit :: Utility/./UtilityTests/FileSpecTest.Yaml (2068 of 2356) PASS: lldb-api :: tools/lldb-server/TestGdbRemoteSingleStep.py (2069 of 2356) PASS: lldb-unit :: Utility/./UtilityTests/SerializationRountripTest.SerializeDeserializePod (2070 of 2356) PASS: lldb-api :: functionalities/gdb_remote_client/TestProcessConnect.py (2071 of 2356) PASS: lldb-unit :: Utility/./UtilityTests/LogChannelTest.EnableOptions (2072 of 2356) PASS: lldb-unit :: Utility/./UtilityTests/ArchSpecTest.TestParseMachCPUDashSubtypeTripleSimple (2073 of 2356) PASS: lldb-unit :: Utility/./UtilityTests/StringLexerTest.Peek (2074 of 2356) PASS: lldb-api :: functionalities/thread/backtrace_limit/TestBacktraceLimit.py (2075 of 2356) PASS: lldb-unit :: SymbolFile/DWARF/./SymbolFileDWARFTests/DWARFASTParserClangTests.EnsureAllDIEsInDeclContextHaveBeenParsedParsesOnlyMatchingEntries (2076 of 2356) PASS: lldb-shell :: SymbolFile/DWARF/x86/win-i386-line-table.s (2077 of 2356) PASS: lldb-unit :: Core/./LLDBCoreTests/DumpDataExtractorTest.Formats (2078 of 2356) PASS: lldb-api :: functionalities/thread/concurrent_events/TestConcurrentSignalNWatchNBreak.py (2079 of 2356) PASS: lldb-unit :: Expression/./ExpressionTests/DiagnosticManagerTest.GetStringMultiline (2080 of 2356) PASS: lldb-api :: functionalities/thread/concurrent_events/TestConcurrentSignalWatch.py (2081 of 2356) PASS: lldb-unit :: Utility/./UtilityTests/ScalarTest.CastOperations (2082 of 2356) PASS: lldb-unit :: Expression/./ExpressionTests/DWARFExpression.DW_OP_unknown (2083 of 2356) PASS: lldb-unit :: Utility/./UtilityTests/StringListTest.SplitIntoLinesSingleTrailingCR (2084 of 2356) PASS: lldb-api :: lang/objc/orderedset/TestOrderedSet.py (2085 of 2356) PASS: lldb-shell :: ObjectFile/Breakpad/breakpad-identification.test (2086 of 2356) PASS: lldb-api :: functionalities/rerun/TestRerun.py (2087 of 2356) PASS: lldb-unit :: Target/./TargetTests/PathMappingListTest.AbsoluteTests (2088 of 2356) PASS: lldb-api :: lang/cpp/rvalue-references/TestRvalueReferences.py (2089 of 2356) PASS: lldb-api :: commands/expression/error-limit/TestExprErrorLimit.py (2090 of 2356) PASS: lldb-unit :: Symbol/./SymbolTests/TestTypeSystemClang.TestFunctionTemplateConstruction (2091 of 2356) PASS: lldb-api :: commands/quit/TestQuit.py (2092 of 2356) PASS: lldb-shell :: Register/Core/x86-32-netbsd-addr.test (2093 of 2356) PASS: lldb-api :: functionalities/data-formatter/data-formatter-stl/libcxx/initializerlist/TestInitializerList.py (2094 of 2356) PASS: lldb-shell :: Driver/TestFile.test (2095 of 2356) PASS: lldb-unit :: Utility/./UtilityTests/StreamTeeTest.Constructor2Streams (2096 of 2356) PASS: lldb-shell :: Reproducer/TestPythonImport.test (2097 of 2356) PASS: lldb-unit :: Utility/./UtilityTests/ScalarTest.Equality (2098 of 2356) PASS: lldb-unit :: Utility/./UtilityTests/StringListTest.CopyListSingle (2099 of 2356) UNSUPPORTED: lldb-shell :: ScriptInterpreter/Lua/io.test (2100 of 2356) PASS: lldb-unit :: Utility/./UtilityTests/Flags.IsClear (2101 of 2356) PASS: lldb-api :: commands/expression/import-std-module/vector-of-vectors/TestVectorOfVectorsFromStdModule.py (2102 of 2356) PASS: lldb-unit :: Utility/./UtilityTests/StringListTest.AppendStringStdString (2103 of 2356) PASS: lldb-unit :: Host/./HostTests/FileSystemTest.OpenErrno (2104 of 2356) PASS: lldb-unit :: Core/./LLDBCoreTests/FormatEntityTest.DefinitionConstructionNameAndType (2105 of 2356) PASS: lldb-shell :: SymbolFile/DWARF/x86/debug_line-tombstone.s (2106 of 2356) PASS: lldb-unit :: Utility/./UtilityTests/ArgsTest.StringListConstructor (2107 of 2356) PASS: lldb-unit :: Symbol/./SymbolTests/TestClangASTImporter.DeportTypeTagDecl (2108 of 2356) PASS: lldb-unit :: Utility/./UtilityTests/StreamTest.PutBytesAsRawHex8ToBigEndian (2109 of 2356) PASS: lldb-unit :: Utility/./UtilityTests/StringExtractorTest.GetU32LittleEndian (2110 of 2356) PASS: lldb-api :: commands/target/basic/TestTargetCommand.py (2111 of 2356) PASS: lldb-api :: lang/cpp/namespace/TestNamespaceLookup.py (2112 of 2356) PASS: lldb-unit :: Utility/./UtilityTests/PassiveReplayTest.InstrumentedBarRef (2113 of 2356) PASS: lldb-api :: lang/cpp/unicode-literals/TestUnicodeLiterals.py (2114 of 2356) UNSUPPORTED: lldb-api :: benchmarks/expression/TestRepeatedExprs.py (2115 of 2356) PASS: lldb-unit :: Utility/./UtilityTests/LogChannelEnabledTest.LogGetLogThread (2116 of 2356) PASS: lldb-api :: tools/lldb-server/signal-filtering/TestGdbRemote_QPassSignals.py (2117 of 2356) PASS: lldb-shell :: SymbolFile/DWARF/x86/parallel-indexing-stress.s (2118 of 2356) PASS: lldb-api :: tools/lldb-vscode/attach/TestVSCode_attach.py (2119 of 2356) PASS: lldb-unit :: debugserver/./debugserverTests/RNBSocket.LoopBackListenIPv6 (2120 of 2356) PASS: lldb-api :: python_api/lldbutil/iter/TestRegistersIterator.py (2121 of 2356) UNSUPPORTED: lldb-api :: functionalities/exec/TestExec.py (2122 of 2356) PASS: lldb-api :: macosx/indirect_symbol/TestIndirectSymbols.py (2123 of 2356) PASS: lldb-unit :: Host/./HostTests/SocketAddressTest.GetAddressInfo (2124 of 2356) PASS: lldb-unit :: Utility/./UtilityTests/TimerTest.CategoryTimes (2125 of 2356) PASS: lldb-unit :: Utility/./UtilityTests/TimerTest.CategoryTimesStats (2126 of 2356) PASS: lldb-unit :: UnwindAssembly/x86/./UnwindAssemblyx86Tests/Testx86AssemblyInspectionEngine.TestPopEDI (2127 of 2356) PASS: lldb-api :: commands/expression/completion-crash-incomplete-record/TestCompletionCrashIncompleteRecord.py (2128 of 2356) PASS: lldb-shell :: Register/Core/x86-32-linux-fp.test (2129 of 2356) PASS: lldb-unit :: Utility/./UtilityTests/StringListTest.LongestCommonPrefixSingleElement (2130 of 2356) PASS: lldb-unit :: Utility/./UtilityTests/StringExtractorTest.InitMisc (2131 of 2356) PASS: lldb-shell :: Breakpoint/debug_rnglist_rlestartend.test (2132 of 2356) PASS: lldb-unit :: Process/minidump/./LLDBMinidumpTests/MinidumpParserTest.InvalidMinidump (2133 of 2356) PASS: lldb-api :: functionalities/type_lookup/TestTypeLookup.py (2134 of 2356) PASS: lldb-unit :: Platform/./LLDBPlatformTests/PlatformAppleSimulatorTest.TestSimHasSimEnvionament (2135 of 2356) PASS: lldb-unit :: Utility/./UtilityTests/BinaryStreamTest.PutSLEB128SevenBytes (2136 of 2356) PASS: lldb-api :: commands/platform/basic/TestPlatformPython.py (2137 of 2356) PASS: lldb-api :: tools/lldb-server/TestGdbRemoteAttach.py (2138 of 2356) PASS: lldb-unit :: ScriptInterpreter/Python/./ScriptInterpreterPythonTests/PythonDataObjectsTest.TestModuleNameResolutionNoDot (2139 of 2356) PASS: lldb-unit :: Utility/./UtilityTests/FileSpecTest.OperatorBool (2140 of 2356) UNSUPPORTED: lldb-api :: tools/lldb-server/TestGdbRemoteFork.py (2141 of 2356) PASS: lldb-api :: functionalities/data-formatter/nsdictionarysynth/TestNSDictionarySynthetic.py (2142 of 2356) PASS: lldb-unit :: UnwindAssembly/x86/./UnwindAssemblyx86Tests/Testx86AssemblyInspectionEngine.Test32BitOnlyInstruction (2143 of 2356) UNSUPPORTED: lldb-api :: functionalities/thread/create_during_step/TestCreateDuringStep.py (2144 of 2356) PASS: lldb-api :: lang/objc/rdar-10967107/TestRdar10967107.py (2145 of 2356) UNSUPPORTED: lldb-api :: functionalities/thread/concurrent_events/TestConcurrentManySignals.py (2146 of 2356) PASS: lldb-unit :: Utility/./UtilityTests/StreamTest.AddressNoSuffix (2147 of 2356) PASS: lldb-unit :: Host/./HostTests/Host.GetEnvironment (2148 of 2356) PASS: lldb-unit :: Host/./HostTests/ProcessLaunchInfoTest.Constructor (2149 of 2356) PASS: lldb-shell :: Commands/CommandScriptImmediateOutput/CommandScriptImmediateOutputConsole.test (2150 of 2356) PASS: lldb-shell :: SymbolFile/DWARF/x86/find-basic-type.cpp (2151 of 2356) PASS: lldb-unit :: Utility/./UtilityTests/StringExtractorTest.GetHexU8_Underflow2_NoEof (2152 of 2356) UNSUPPORTED: lldb-shell :: SymbolFile/NativePDB/typedefs.cpp (2153 of 2356) PASS: lldb-api :: lang/cpp/covariant-return-types/TestCovariantReturnTypes.py (2154 of 2356) PASS: lldb-api :: functionalities/data-formatter/data-formatter-stl/libcxx/atomic/TestLibCxxAtomic.py (2155 of 2356) PASS: lldb-api :: lang/objc/objc-struct-argument/TestObjCStructArgument.py (2156 of 2356) PASS: lldb-unit :: Host/./HostTests/SocketTests/SocketTest.UDPConnect/ipv6 (2157 of 2356) PASS: lldb-unit :: Process/minidump/./LLDBMinidumpTests/MinidumpParserTest.MinidumpDuplicateModuleSeparateCode (2158 of 2356) PASS: lldb-unit :: ScriptInterpreter/Python/./ScriptInterpreterPythonTests/PythonDataObjectsTest.TestGlobalNameResolutionWithDot (2159 of 2356) PASS: lldb-unit :: Utility/./UtilityTests/CompletionRequest.TestCompletionOwnership (2160 of 2356) PASS: lldb-api :: lang/objc/single-entry-dictionary/TestObjCSingleEntryDictionary.py (2161 of 2356) PASS: lldb-api :: functionalities/data-formatter/data-formatter-caching/TestDataFormatterCaching.py (2162 of 2356) PASS: lldb-api :: functionalities/thread/concurrent_events/TestConcurrentCrashWithSignal.py (2163 of 2356) UNSUPPORTED: lldb-api :: commands/watchpoints/multi_watchpoint_slots/TestWatchpointMultipleSlots.py (2164 of 2356) PASS: lldb-unit :: Utility/./UtilityTests/FileSpecTest.RemoveLastPathComponent (2165 of 2356) PASS: lldb-unit :: Utility/./UtilityTests/ArgsTest.EscapeLLDBCommandArgument (2166 of 2356) PASS: lldb-api :: commands/watchpoints/watchpoint_disable/TestWatchpointDisable.py (2167 of 2356) PASS: lldb-api :: commands/watchpoints/watchpoint_size/TestWatchpointSizes.py (2168 of 2356) UNSUPPORTED: lldb-shell :: SymbolFile/PDB/compilands.test (2169 of 2356) PASS: lldb-api :: functionalities/inline-stepping/TestInlineStepping.py (2170 of 2356) PASS: lldb-unit :: Process/minidump/./LLDBMinidumpTests/MinidumpParserTest.MinidumpModuleOrder (2171 of 2356) PASS: lldb-unit :: Utility/./UtilityTests/BinaryStreamTest.PutSLEB128ThreeBytes (2172 of 2356) PASS: lldb-shell :: SymbolFile/DWARF/DW_AT_range-DW_FORM_sec_offset.s (2173 of 2356) PASS: lldb-unit :: Utility/./UtilityTests/ArgsTest.ReplaceArgumentAtIndexLonger (2174 of 2356) PASS: lldb-api :: lang/objc/foundation/TestObjCMethodsNSArray.py (2175 of 2356) PASS: lldb-unit :: Symbol/./SymbolTests/TestTypeSystemClang.TestGetBasicTypeFromEnum (2176 of 2356) UNSUPPORTED: lldb-api :: lang/c/typedef/Testtypedef.py (2177 of 2356) PASS: lldb-unit :: Utility/./UtilityTests/ScalarTest.SetValueFromCString (2178 of 2356) PASS: lldb-unit :: Language/Highlighting/./HighlighterTests/HighlighterTest.ClangCursorPosBeforeOtherToken (2179 of 2356) PASS: lldb-api :: functionalities/target_var/TestTargetVar.py (2180 of 2356) PASS: lldb-unit :: Process/Utility/./ProcessUtilityTests/ProcMapTests/LinuxProcMapsTestFixture.ParseMapRegions/4 (2181 of 2356) PASS: lldb-shell :: lldb-server/TestGdbserverPort.test (2182 of 2356) PASS: lldb-api :: functionalities/thread/concurrent_events/TestConcurrentSignalDelayWatch.py (2183 of 2356) PASS: lldb-shell :: SymbolFile/DWARF/x86/subprogram_ranges.test (2184 of 2356) PASS: lldb-shell :: Settings/TestDisassemblyFormat.test (2185 of 2356) PASS: lldb-api :: commands/frame/var-scope/TestFrameVariableScope.py (2186 of 2356) PASS: lldb-shell :: Commands/command-disassemble.s (2187 of 2356) PASS: lldb-api :: functionalities/breakpoint/cpp/TestCPPBreakpointLocations.py (2188 of 2356) PASS: lldb-unit :: Utility/./UtilityTests/StringListTest.SetSize (2189 of 2356) PASS: lldb-unit :: Utility/./UtilityTests/VMRange.ContainsRange (2190 of 2356) PASS: lldb-unit :: Language/CPlusPlus/./LanguageCPlusPlusTests/CPlusPlusLanguage.FindAlternateFunctionManglings (2191 of 2356) UNSUPPORTED: lldb-api :: commands/trace/TestTraceLoad.py (2192 of 2356) PASS: lldb-shell :: SymbolFile/DWARF/dwo-relative-path.s (2193 of 2356) PASS: lldb-api :: functionalities/breakpoint/consecutive_breakpoints/TestConsecutiveBreakpoints.py (2194 of 2356) PASS: lldb-unit :: Symbol/./SymbolTests/TestCreateClassTemplateDecl.FindExistingTemplates (2195 of 2356) PASS: lldb-unit :: ScriptInterpreter/Python/./ScriptInterpreterPythonTests/PythonDataObjectsTest.TestPythonBoolean (2196 of 2356) PASS: lldb-api :: functionalities/thread/ignore_suspended/TestIgnoreSuspendedThread.py (2197 of 2356) PASS: lldb-api :: lang/cpp/dynamic-value-same-basename/TestDynamicValueSameBase.py (2198 of 2356) PASS: lldb-unit :: ScriptInterpreter/Python/./ScriptInterpreterPythonTests/PythonDataObjectsTest.TestPythonTupleInitializerList2 (2199 of 2356) PASS: lldb-api :: assert_messages_test/TestAssertMessages.py (2200 of 2356) UNSUPPORTED: lldb-shell :: SymbolFile/PDB/expressions.test (2201 of 2356) PASS: lldb-unit :: Utility/./UtilityTests/PassiveReplayTest.InstrumentedFooInvalid (2202 of 2356) PASS: lldb-api :: lang/cpp/template-arguments/TestCppTemplateArguments.py (2203 of 2356) PASS: lldb-api :: functionalities/tail_call_frames/disambiguate_tail_call_seq/TestDisambiguateTailCallSeq.py (2204 of 2356) PASS: lldb-api :: python_api/disassemble-raw-data/TestDisassembleRawData.py (2205 of 2356) PASS: lldb-shell :: Expr/TestIRMemoryMap.test (2206 of 2356) PASS: lldb-api :: lang/c/stepping/TestStepAndBreakpoints.py (2207 of 2356) PASS: lldb-api :: lang/c/local_types/TestUseClosestType.py (2208 of 2356) PASS: lldb-unit :: Utility/./UtilityTests/RecordReplayTest.InstrumentedBarPtr (2209 of 2356) PASS: lldb-unit :: Utility/./UtilityTests/RangeTest.ContainsEndInclusiveInvalid (2210 of 2356) PASS: lldb-api :: commands/expression/argument_passing_restrictions/TestArgumentPassingRestrictions.py (2211 of 2356) PASS: lldb-unit :: Utility/./UtilityTests/ArgsTest.DoubleQuotedItem (2212 of 2356) PASS: lldb-unit :: Process/gdb-remote/./ProcessGdbRemoteTests/PortMapTest.FreePortForProcess (2213 of 2356) PASS: lldb-api :: commands/frame/diagnose/bad-reference/TestBadReference.py (2214 of 2356) PASS: lldb-unit :: Symbol/./SymbolTests/TestTypeSystemClang.TestDisplayNameEmpty (2215 of 2356) PASS: lldb-api :: functionalities/gdb_remote_client/TestRestartBug.py (2216 of 2356) PASS: lldb-unit :: Utility/./UtilityTests/StringExtractorTest.GetHexBytesAvail (2217 of 2356) PASS: lldb-shell :: SymbolFile/DWARF/x86/apple-index-is-used.cpp (2218 of 2356) PASS: lldb-shell :: ObjectFile/ELF/PT_LOAD.yaml (2219 of 2356) PASS: lldb-unit :: Interpreter/./InterpreterTests/OptionValueFileColonLine.setFromString (2220 of 2356) PASS: lldb-api :: functionalities/gdb_remote_client/TestqOffsets.py (2221 of 2356) PASS: lldb-api :: functionalities/data-formatter/data-formatter-advanced/TestDataFormatterAdv.py (2222 of 2356) PASS: lldb-api :: lang/cpp/static_methods/TestCPPStaticMethods.py (2223 of 2356) PASS: lldb-unit :: Utility/./UtilityTests/ArgsTest.TestArgv (2224 of 2356) PASS: lldb-api :: lang/objc/modules/TestObjCModules.py (2225 of 2356) PASS: lldb-shell :: Commands/command-script-import.test (2226 of 2356) UNSUPPORTED: lldb-shell :: BuildScript/toolchain-msvc.test (2227 of 2356) PASS: lldb-unit :: DataFormatter/./LLDBFormatterTests/TypeMatcherTests.GetMatchStringRegex (2228 of 2356) PASS: lldb-shell :: Error/assert.test (2229 of 2356) PASS: lldb-api :: lang/c/function_types/TestFunctionTypes.py (2230 of 2356) PASS: lldb-api :: functionalities/data-formatter/typedef_array/TestTypedefArray.py (2231 of 2356) PASS: lldb-api :: lang/objc/rdar-11355592/TestRdar11355592.py (2232 of 2356) UNSUPPORTED: lldb-api :: tools/lldb-server/registers-target-xml-reading/TestGdbRemoteTargetXmlPacket.py (2233 of 2356) PASS: lldb-api :: commands/log/invalid-args/TestInvalidArgsLog.py (2234 of 2356) PASS: lldb-unit :: Symbol/./SymbolTests/Type.GetTypeScopeAndBasename (2235 of 2356) PASS: lldb-unit :: UnwindAssembly/x86/./UnwindAssemblyx86Tests/Testx86AssemblyInspectionEngine.TestPopRBP (2236 of 2356) PASS: lldb-unit :: Host/./HostTests/FileSystemTest.EnumerateDirectory (2237 of 2356) PASS: lldb-api :: macosx/profile_vrs_detach/TestDetachVrsProfile.py (2238 of 2356) PASS: lldb-api :: lang/cpp/call-function/TestCallCPPFunction.py (2239 of 2356) PASS: lldb-shell :: SymbolFile/DWARF/x86/debug-types-line-tables.s (2240 of 2356) PASS: lldb-unit :: UnwindAssembly/x86/./UnwindAssemblyx86Tests/Testx86AssemblyInspectionEngine.TestCALLNextInsn (2241 of 2356) PASS: lldb-shell :: Register/x86-multithread-write.test (2242 of 2356) PASS: lldb-api :: arm/emulation/TestEmulations.py (2243 of 2356) PASS: lldb-api :: functionalities/load_unload/TestLoadUnload.py (2244 of 2356) PASS: lldb-api :: tools/lldb-server/TestGdbRemoteThreadsInStopReply.py (2245 of 2356) PASS: lldb-api :: lang/cpp/llvm-style/TestLLVMStyle.py (2246 of 2356) PASS: lldb-unit :: Utility/./UtilityTests/StringExtractorTest.DecodeHexU8_InvalidHex2 (2247 of 2356) PASS: lldb-unit :: Utility/./UtilityTests/SerializationRountripTest.SerializeDeserializeCStringArrayNullptrElem (2248 of 2356) PASS: lldb-api :: functionalities/data-formatter/pyobjsynthprovider/TestPyObjSynthProvider.py (2249 of 2356) PASS: lldb-unit :: DataFormatter/./LLDBFormatterTests/TypeMatcherTests.CreatedBySameMatchString (2250 of 2356) PASS: lldb-api :: functionalities/data-formatter/user-format-vs-summary/TestUserFormatVsSummary.py (2251 of 2356) PASS: lldb-api :: types/TestIntegerTypeExpr.py (2252 of 2356) PASS: lldb-api :: functionalities/data-formatter/nssetsynth/TestNSSetSynthetic.py (2253 of 2356) PASS: lldb-api :: functionalities/tail_call_frames/ambiguous_tail_call_seq1/TestAmbiguousTailCallSeq1.py (2254 of 2356) PASS: lldb-unit :: Utility/./UtilityTests/StringExtractorTest.GetNameColonValueContainsColon (2255 of 2356) PASS: lldb-api :: functionalities/inferior-changed/TestInferiorChanged.py (2256 of 2356) PASS: lldb-shell :: SymbolFile/DWARF/x86/debug-line-basic.s (2257 of 2356) PASS: lldb-unit :: Utility/./UtilityTests/FileSpecTest.EqualDotsPosixRoot (2258 of 2356) PASS: lldb-unit :: Utility/./UtilityTests/ProcessInstanceInfo.DumpTable (2259 of 2356) PASS: lldb-unit :: ScriptInterpreter/Python/./ScriptInterpreterPythonTests/PythonDataObjectsTest.TestPythonListManipulation (2260 of 2356) PASS: lldb-api :: functionalities/plugins/python_os_plugin/TestPythonOSPlugin.py (2261 of 2356) PASS: lldb-api :: types/TestDoubleTypesExpr.py (2262 of 2356) PASS: lldb-unit :: Utility/./UtilityTests/ArgsTest.GetQuotedCommandString (2263 of 2356) PASS: lldb-unit :: UnwindAssembly/x86/./UnwindAssemblyx86Tests/Testx86AssemblyInspectionEngine.TestPushImm (2264 of 2356) PASS: lldb-api :: python_api/value/linked_list/TestValueAPILinkedList.py (2265 of 2356) PASS: lldb-unit :: Process/minidump/./LLDBMinidumpTests/MinidumpParserTest.GetArchitecture (2266 of 2356) PASS: lldb-unit :: Utility/./UtilityTests/ArgsTest.TestSingleQuotedArgWithSpace (2267 of 2356) PASS: lldb-unit :: ObjectFile/PECOFF/./ObjectFilePECOFFTests/PECallFrameInfoTest.Frame_reg_eh (2268 of 2356) PASS: lldb-shell :: SymbolFile/Breakpad/line-table-missing-file.test (2269 of 2356) PASS: lldb-shell :: Register/Core/x86-64-netbsd-fp.test (2270 of 2356) PASS: lldb-shell :: Reproducer/TestDSYM.test (2271 of 2356) PASS: lldb-unit :: Utility/./UtilityTests/StringExtractorTest.GetHexBytesAvail_FullString (2272 of 2356) UNSUPPORTED: lldb-shell :: ScriptInterpreter/Lua/watchpoint_callback.test (2273 of 2356) PASS: lldb-unit :: UnwindAssembly/x86/./UnwindAssemblyx86Tests/Testx86AssemblyInspectionEngine.Test32bitFramelessBigStackFrame (2274 of 2356) UNSUPPORTED: lldb-api :: functionalities/data-formatter/data-formatter-stl/libstdcpp/vector/TestDataFormatterStdVector.py (2275 of 2356) PASS: lldb-unit :: Utility/./UtilityTests/Flags.AllClear (2276 of 2356) XFAIL: lldb-shell :: Register/x86-64-fp-read.test (2277 of 2356) UNSUPPORTED: lldb-api :: commands/expression/multiline-completion/TestMultilineCompletion.py (2278 of 2356) UNSUPPORTED: lldb-api :: functionalities/tsan/basic/TestTsanBasic.py (2279 of 2356) PASS: lldb-unit :: Utility/./UtilityTests/XcodeSDKTest.MergeTest (2280 of 2356) PASS: lldb-unit :: UnwindAssembly/x86/./UnwindAssemblyx86Tests/Testx86AssemblyInspectionEngine.TestPushExtended (2281 of 2356) PASS: lldb-shell :: ObjectFile/wasm/embedded-debug-sections.yaml (2282 of 2356) PASS: lldb-unit :: Host/./HostTests/PipeTest.OpenAsReader (2283 of 2356) PASS: lldb-unit :: Symbol/./SymbolTests/TestClangASTImporter.DeportDeclTagDecl (2284 of 2356) PASS: lldb-api :: lang/c/forward/TestForwardDeclaration.py (2285 of 2356) PASS: lldb-shell :: SymbolFile/NativePDB/function-types-calling-conv.cpp (2286 of 2356) PASS: lldb-api :: api/log/TestAPILog.py (2287 of 2356) PASS: lldb-shell :: SymbolFile/DWARF/x86/debug-names-compressed.cpp (2288 of 2356) PASS: lldb-unit :: Symbol/./SymbolTests/TestTypeSystemClang.TestOwningModule (2289 of 2356) PASS: lldb-shell :: SymbolFile/DWARF/x86/DW_AT_const_value-bitfields.s (2290 of 2356) PASS: lldb-unit :: Utility/./UtilityTests/ConstStringTest.YAML (2291 of 2356) PASS: lldb-shell :: ObjectFile/PECOFF/invalid-export-table.yaml (2292 of 2356) PASS: lldb-unit :: ObjectFile/Breakpad/./ObjectFileBreakpadTests/ModuleRecord.parse (2293 of 2356) PASS: lldb-unit :: ScriptInterpreter/Python/./ScriptInterpreterPythonTests/PythonDataObjectsTest.TestPythonStringToStructuredString (2294 of 2356) PASS: lldb-api :: tools/lldb-vscode/coreFile/TestVSCode_coreFile.py (2295 of 2356) PASS: lldb-api :: functionalities/breakpoint/address_breakpoints/TestAddressBreakpoints.py (2296 of 2356) PASS: lldb-api :: functionalities/data-formatter/data-formatter-python-synth/TestDataFormatterPythonSynth.py (2297 of 2356) PASS: lldb-shell :: SymbolFile/DWARF/x86/find-basic-variable.cpp (2298 of 2356) UNSUPPORTED: lldb-api :: linux/aarch64/mte_tag_read/TestAArch64LinuxMTEMemoryTagRead.py (2299 of 2356) PASS: lldb-unit :: UnwindAssembly/x86/./UnwindAssemblyx86Tests/Testx86AssemblyInspectionEngine.TestStackRealign32BitDisp_x86_64 (2300 of 2356) UNSUPPORTED: lldb-api :: commands/watchpoints/hello_watchlocation/TestWatchLocation.py (2301 of 2356) UNSUPPORTED: lldb-api :: functionalities/darwin_log/filter/regex/activity-chain/TestDarwinLogFilterRegexActivityChain.py (2302 of 2356) PASS: lldb-unit :: Process/gdb-remote/./ProcessGdbRemoteTests/GDBRemoteCommunicationClientTest.GetModulesInfo_UUID20 (2303 of 2356) PASS: lldb-shell :: Settings/TestSettingsWrite.test (2304 of 2356) UNSUPPORTED: lldb-api :: benchmarks/continue/TestBenchmarkContinue.py (2305 of 2356) UNSUPPORTED: lldb-shell :: Register/arm-fp-read.test (2306 of 2356) PASS: lldb-unit :: Utility/./UtilityTests/UriParserTest.LongPath (2307 of 2356) PASS: lldb-unit :: Process/gdb-remote/./ProcessGdbRemoteTests/GDBRemoteCommunicationClientTest.SendTraceSupportedPacket (2308 of 2356) PASS: lldb-shell :: ObjectFile/MachO/symtab.yaml (2309 of 2356) PASS: lldb-shell :: SymbolFile/NativePDB/break-by-function.cpp (2310 of 2356) PASS: lldb-shell :: ObjectFile/ELF/gnu-debuglink.yaml (2311 of 2356) PASS: lldb-shell :: SymbolFile/DWARF/x86/find-variable-file.cpp (2312 of 2356) PASS: lldb-api :: lang/c/complex/TestComplexC99.py (2313 of 2356) PASS: lldb-api :: macosx/lc-note/kern-ver-str/TestKernVerStrLCNOTE.py (2314 of 2356) PASS: lldb-api :: terminal/TestSTTYBeforeAndAfter.py (2315 of 2356) PASS: lldb-shell :: Quit/TestQuitExitCode0.test (2316 of 2356) PASS: lldb-api :: commands/frame/var/TestFrameVar.py (2317 of 2356) PASS: lldb-shell :: SymbolFile/NativePDB/disassembly.cpp (2318 of 2356) PASS: lldb-unit :: Utility/./UtilityTests/UriParserTest.BracketedHostnameWithColon (2319 of 2356) PASS: lldb-api :: lang/c/bitfields/TestBitfields.py (2320 of 2356) PASS: lldb-api :: functionalities/data-formatter/data-formatter-objc/TestDataFormatterObjCNSError.py (2321 of 2356) PASS: lldb-api :: commands/disassemble/basic/TestDisassembleBreakpoint.py (2322 of 2356) PASS: lldb-unit :: Utility/./UtilityTests/RecordReplayTest.InvalidSequence (2323 of 2356) PASS: lldb-api :: functionalities/data-formatter/array_typedef/TestArrayTypedef.py (2324 of 2356) PASS: lldb-api :: functionalities/memory/find/TestMemoryFind.py (2325 of 2356) PASS: lldb-unit :: Breakpoint/./LLDBBreakpointTests/BreakpointIDTest.StringIsBreakpointName (2326 of 2356) PASS: lldb-shell :: Driver/TestCommands.test (2327 of 2356) PASS: lldb-shell :: SymbolFile/DWARF/x86/dwp-debug-types.s (2328 of 2356) PASS: lldb-api :: functionalities/data-formatter/dump_dynamic/TestDumpDynamic.py (2329 of 2356) PASS: lldb-api :: python_api/sbstructureddata/TestStructuredDataAPI.py (2330 of 2356) PASS: lldb-unit :: Language/Highlighting/./HighlighterTests/HighlighterTest.ClangPreserveNewLine (2331 of 2356) PASS: lldb-unit :: Utility/./UtilityTests/RangeTest.SlideZero (2332 of 2356) PASS: lldb-unit :: Utility/./UtilityTests/CompletionRequest.DuplicateFilteringWithComments (2333 of 2356) PASS: lldb-shell :: BuildScript/toolchain-clang.test (2334 of 2356) PASS: lldb-api :: functionalities/data-formatter/data-formatter-objc/nsindexpath/TestDataFormatterNSIndexPath.py (2335 of 2356) PASS: lldb-api :: functionalities/data-formatter/ostypeformatting/TestFormattersOsType.py (2336 of 2356) PASS: lldb-unit :: Process/Utility/./ProcessUtilityTests/ProcSMapTests/LinuxProcSMapsTestFixture.ParseSMapRegions/5 (2337 of 2356) PASS: lldb-unit :: Utility/./UtilityTests/StringExtractorTest.GetHexU8_Underflow2 (2338 of 2356) PASS: lldb-unit :: Utility/./UtilityTests/RangeTest.ClearWithStarAddress (2339 of 2356) UNSUPPORTED: lldb-shell :: Unwind/basic-block-sections.test (2340 of 2356) PASS: lldb-api :: functionalities/data-formatter/data-formatter-proper-plurals/TestFormattersOneIsSingular.py (2341 of 2356) PASS: lldb-unit :: Utility/./UtilityTests/FileSpecTest.EqualDotsPosix (2342 of 2356) PASS: lldb-api :: functionalities/breakpoint/serialize/TestBreakpointSerialization.py (2343 of 2356) PASS: lldb-unit :: Process/gdb-remote/./ProcessGdbRemoteTests/GDBRemoteCommunicationClientTest.ReadRegister (2344 of 2356) PASS: lldb-unit :: ObjectFile/Breakpad/./ObjectFileBreakpadTests/FuncRecord.parse (2345 of 2356) PASS: lldb-shell :: ObjectFile/ELF/PT_LOAD-empty.yaml (2346 of 2356) PASS: lldb-unit :: Symbol/./SymbolTests/TestTypeSystemClang.TestRemoveFastQualifiers (2347 of 2356) PASS: lldb-unit :: Utility/./UtilityTests/ArgsTest.Yaml (2348 of 2356) PASS: lldb-shell :: SymbolFile/DWARF/x86/DW_AT_loclists_base.s (2349 of 2356) PASS: lldb-shell :: SymbolFile/DWARF/x86/find-inline-method.s (2350 of 2356) PASS: lldb-api :: functionalities/gdb_remote_client/TestPartialGPacket.py (2351 of 2356) PASS: lldb-unit :: SymbolFile/DWARF/./SymbolFileDWARFTests/SymbolFileDWARFTests.TestAbbrevOrder1Start5 (2352 of 2356) PASS: lldb-shell :: SymbolFile/DWARF/x86/debug_rnglists.s (2353 of 2356) PASS: lldb-api :: tools/lldb-vscode/console/TestVSCode_redirection_to_console.py (2354 of 2356) PASS: lldb-api :: commands/expression/import-std-module/empty-module/TestEmptyStdModule.py (2355 of 2356) PASS: lldb-api :: functionalities/breakpoint/objc/TestObjCBreakpoints.py (2356 of 2356) Slowest Tests: -------------------------------------------------------------------------- 281.27s: lldb-api :: tools/lldb-server/TestLldbGdbServer.py 206.50s: lldb-api :: functionalities/memory-region/TestMemoryRegion.py 184.52s: lldb-api :: api/multithreaded/TestMultithreaded.py 170.63s: lldb-api :: macosx/skinny-corefile/TestSkinnyCorefile.py 121.73s: lldb-api :: types/TestLongTypesExpr.py 106.27s: lldb-api :: commands/expression/import-std-module/queue/TestQueueFromStdModule.py 104.18s: lldb-api :: commands/expression/import-std-module/stack/TestStackFromStdModule.py 103.91s: lldb-api :: commands/expression/import-std-module/deque-basic/TestDequeFromStdModule.py 95.89s: lldb-api :: lang/objc/exceptions/TestObjCExceptions.py 94.86s: lldb-api :: lang/objc/objc-new-syntax/TestObjCNewSyntaxLiteral.py 92.13s: lldb-api :: functionalities/gdb_remote_client/TestWasm.py 91.34s: lldb-api :: lang/cpp/namespace/TestNamespaceLookup.py 91.19s: lldb-api :: lang/objc/hidden-ivars/TestHiddenIvars.py 86.63s: lldb-api :: lang/objc/foundation/TestObjCMethods.py 85.55s: lldb-api :: commands/expression/import-std-module/vector/TestVectorFromStdModule.py 75.79s: lldb-api :: lang/objc/objc-new-syntax/TestObjCNewSyntaxDictionary.py 70.94s: lldb-api :: types/TestIntegerTypeExpr.py 69.40s: lldb-api :: commands/expression/import-std-module/vector-dbg-info-content/TestDbgInfoContentVectorFromStdModule.py 68.34s: lldb-api :: lang/objc/objc-new-syntax/TestObjCNewSyntaxArray.py 67.49s: lldb-api :: functionalities/data-formatter/boolreference/TestFormattersBoolRefPtr.py

Hide Details

Tests Times: -------------------------------------------------------------------------- [ Range ] :: [ Percentage ] :: [ Count ] -------------------------------------------------------------------------- [280s,300s) :: [ ] :: [ 1/2356] [260s,280s) :: [ ] :: [ 0/2356] [240s,260s) :: [ ] :: [ 0/2356] [220s,240s) :: [ ] :: [ 1/2356] [200s,220s) :: [ ] :: [ 0/2356] [180s,200s) :: [ ] :: [ 2/2356] [160s,180s) :: [ ] :: [ 0/2356] [140s,160s) :: [ ] :: [ 0/2356] [120s,140s) :: [ ] :: [ 1/2356] [100s,120s) :: [ ] :: [ 5/2356] [ 80s,100s) :: [ ] :: [ 6/2356] [ 60s, 80s) :: [ ] :: [ 11/2356] [ 40s, 60s) :: [ ] :: [ 22/2356] [ 20s, 40s) :: [** ] :: [ 132/2356] [ 0s, 20s) :: [************************************ ] :: [2175/2356] -------------------------------------------------------------------------- ******************** Failed Tests (4): lldb-api :: functionalities/thread/step_out/TestThreadStepOut.py lldb-api :: tools/lldb-vscode/breakpoint/TestVSCode_setBreakpoints.py lldb-api :: tools/lldb-vscode/breakpoint/TestVSCode_setFunctionBreakpoints.py lldb-api :: tools/lldb-vscode/evaluate/TestVSCode_evaluate.py

Hide Details

Hide Details

Testing Time: 3336.16s Unsupported : 212 Passed : 2130 Expectedly Failed: 10 Failed : 4 FAILED: tools/lldb/test/CMakeFiles/check-lldb cd /Users/buildslave/jenkins/workspace/lldb-cmake-sanitized/lldb-build/tools/lldb/test && /usr/local/Frameworks/Python.framework/Versions/3.7/bin/python3.7 /Users/buildslave/jenkins/workspace/lldb-cmake-sanitized/lldb-build/./bin/llvm-lit -v --time-tests --shuffle --xunit-xml-output=/Users/buildslave/jenkins/workspace/lldb-cmake-sanitized/test/results.xml -v -j 4 --timeout 1200 /Users/buildslave/jenkins/workspace/lldb-cmake-sanitized/lldb-build/tools/lldb/test ninja: build stopped: subcommand failed. Command failed: Command '['/usr/bin/env', 'TERM=vt100', '/usr/local/bin/ninja', '-v', 'check-lldb']' returned non-zero exit status 1. Command: ['/usr/bin/env', 'TERM=vt100', '/usr/local/bin/ninja', '-v', 'check-lldb'] [Pipeline] } [Pipeline] // timeout [Pipeline] } [Pipeline] // stage [Pipeline] stage [Pipeline] { (Declarative: Post Actions) [Pipeline] scanForIssues [Clang (LLVM based)] Sleeping for 5 seconds due to JENKINS-32191... [Clang (LLVM based)] Parsing console log (workspace: '/Users/buildslave/jenkins/workspace/lldb-cmake-sanitized') [Clang (LLVM based)] Successfully parsed console log [Clang (LLVM based)] -> found 5 issues (skipped 3 duplicates) [Clang (LLVM based)] [-ERROR-] Can't create fingerprints for some files: [Clang (LLVM based)] [-ERROR-] - '/Users/buildslave/jenkins/workspace/lldb-cmake-sanitized/lldb-build/{"body":{"category":"console","output":"/Users/buildslave/jenkins/workspace/lldb-cmake-sanitized/llvm-project/lldb/tools/lldb-vscode/ProgressEvent.cpp', IO exception has been thrown: java.nio.file.NoSuchFileException: /Users/buildslave/jenkins/workspace/lldb-cmake-sanitized/lldb-build/{"body":{"category":"console","output":"/Users/buildslave/jenkins/workspace/lldb-cmake-sanitized/llvm-project/lldb/tools/lldb-vscode/ProgressEvent.cpp [Clang (LLVM based)] [-ERROR-] - '/Users/buildslave/jenkins/workspace/lldb-cmake-sanitized/lldb-build/{"body":{"category":"console","output":"/Users/buildslave/jenkins/workspace/lldb-cmake-sanitized/llvm-project/lldb/tools/lldb-vscode/ProgressEvent.cpp', IO exception has been thrown: java.nio.file.NoSuchFileException: /Users/buildslave/jenkins/workspace/lldb-cmake-sanitized/lldb-build/{"body":{"category":"console","output":"/Users/buildslave/jenkins/workspace/lldb-cmake-sanitized/llvm-project/lldb/tools/lldb-vscode/ProgressEvent.cpp [Clang (LLVM based)] Post processing issues on 'green-dragon-23' with source code encoding 'UTF-8' [Clang (LLVM based)] Creating SCM blamer to obtain author and commit information for affected files [Clang (LLVM based)] -> No blamer installed yet. You need to install the 'git-forensics' plugin to enable blaming for Git. [Clang (LLVM based)] Resolving file names for all issues in source directory '/Users/buildslave/jenkins/workspace/lldb-cmake-sanitized' [Clang (LLVM based)] -> resolved paths in source directory (3 found, 1 not found) [Clang (LLVM based)] Resolving module names from module definitions (build.xml, pom.xml, or Manifest.mf files) [Clang (LLVM based)] -> resolved module names for 5 issues [Clang (LLVM based)] Resolving package names (or namespaces) by parsing the affected files [Clang (LLVM based)] -> resolved package names of 4 affected files [Clang (LLVM based)] No filter has been set, publishing all 5 issues [Clang (LLVM based)] Creating fingerprints for all affected code blocks to track issues over different builds [Clang (LLVM based)] -> created fingerprints for 3 issues (skipped 2 issues) [Clang (LLVM based)] Copying affected files to Jenkins' build folder '/Users/Shared/Jenkins/Home/jobs/lldb-cmake-sanitized/builds/1909/files-with-issues' [Clang (LLVM based)] -> 3 copied, 0 not in workspace, 2 not-found, 0 with I/O error [Clang (LLVM based)] Repository miner is not configured, skipping repository mining [Pipeline] junit Recording test results [Checks API] No suitable checks publisher found. [Pipeline] } [Pipeline] // stage [Pipeline] } [Pipeline] // withEnv [Pipeline] } [Pipeline] // node [Pipeline] End of Pipeline ERROR: script returned exit code 1 Finished: FAILURE