Console Output

Skipping 9,565 KB.. Full Log

Hide Details

========= END ========= ========= DEBUG ADAPTER PROTOCOL LOGS ========= --> Content-Length: 284

Hide Details

{"command":"initialize","type":"request","arguments":{"adapterID":"lldb-native","clientID":"vscode","columnsStartAt1":true,"linesStartAt1":true,"locale":"en-us","pathFormat":"path","supportsRunInTerminalRequest":true,"supportsVariablePaging":true,"supportsVariableType":true},"seq":1} <-- Content-Length: 1222

Hide Details

{"body":{"exceptionBreakpointFilters":[{"default":false,"filter":"cpp_catch","label":"C++ Catch"},{"default":false,"filter":"cpp_throw","label":"C++ Throw"},{"default":false,"filter":"objc_catch","label":"Objective C Catch"},{"default":false,"filter":"objc_throw","label":"Objective C Throw"},{"default":false,"filter":"swift_catch","label":"Swift Catch"},{"default":false,"filter":"swift_throw","label":"Swift Throw"}],"supportTerminateDebuggee":true,"supportsCompletionsRequest":false,"supportsConditionalBreakpoints":true,"supportsConfigurationDoneRequest":true,"supportsDelayedStackTraceLoading":true,"supportsEvaluateForHovers":true,"supportsExceptionInfoRequest":true,"supportsExceptionOptions":true,"supportsFunctionBreakpoints":true,"supportsGotoTargetsRequest":false,"supportsHitConditionalBreakpoints":true,"supportsLoadedSourcesRequest":false,"supportsModulesRequest":false,"supportsProgressReporting":true,"supportsRestartFrame":false,"supportsRestartRequest":false,"supportsRunInTerminalRequest":true,"supportsSetVariable":true,"supportsStepBack":false,"supportsStepInTargetsRequest":false,"supportsValueFormattingOptions":true},"command":"initialize","request_seq":1,"seq":0,"success":true,"type":"response"} --> Content-Length: 1036

Hide Details

{"command":"launch","type":"request","arguments":{"program":"/Users/buildslave/jenkins/workspace/lldb-cmake-sanitized/lldb-build/lldb-test-build.noindex/tools/lldb-vscode/breakpoint/TestVSCode_setBreakpoints.test_functionality/a.out","disableASLR":true,"initCommands":["settings clear -all","settings set symbols.enable-external-lookup false","settings set target.inherit-tcc true","settings set target.detach-on-error false","settings set target.auto-apply-fixits false","settings set plugin.process.gdb-remote.packet-timeout 60","settings set symbols.clang-modules-cache-path \"/Users/buildslave/jenkins/workspace/lldb-cmake-sanitized/lldb-build/lldb-test-build.noindex/module-cache-lldb/lldb-api\"","settings set use-color false","setting set target.prefer-dynamic-value no-dynamic-values","settings set target.env-vars ASAN_OPTIONS=detect_stack_use_after_return=1 DYLD_INSERT_LIBRARIES=/Users/buildslave/jenkins/workspace/lldb-cmake-sanitized/host-compiler/lib/clang/13.0.99/lib/darwin/libclang_rt.asan_osx_dynamic.dylib"]},"seq":2} <-- Content-Length: 923

Hide Details

{"body":{"category":"console","output":"Running initCommands:\n(lldb) settings clear -all\n(lldb) settings set symbols.enable-external-lookup false\n(lldb) settings set target.inherit-tcc true\n(lldb) settings set target.detach-on-error false\n(lldb) settings set target.auto-apply-fixits false\n(lldb) settings set plugin.process.gdb-remote.packet-timeout 60\n(lldb) settings set symbols.clang-modules-cache-path \"/Users/buildslave/jenkins/workspace/lldb-cmake-sanitized/lldb-build/lldb-test-build.noindex/module-cache-lldb/lldb-api\"\n(lldb) settings set use-color false\n(lldb) setting set target.prefer-dynamic-value no-dynamic-values\n(lldb) settings set target.env-vars ASAN_OPTIONS=detect_stack_use_after_return=1 DYLD_INSERT_LIBRARIES=/Users/buildslave/jenkins/workspace/lldb-cmake-sanitized/host-compiler/lib/clang/13.0.99/lib/darwin/libclang_rt.asan_osx_dynamic.dylib\n"},"event":"output","seq":0,"type":"event"} <-- Content-Length: 77

Hide Details

{"command":"launch","request_seq":2,"seq":0,"success":true,"type":"response"} <-- Content-Length: 301

Hide Details

{"body":{"isLocalProcess":true,"name":"/Users/buildslave/jenkins/workspace/lldb-cmake-sanitized/lldb-build/lldb-test-build.noindex/tools/lldb-vscode/breakpoint/TestVSCode_setBreakpoints.test_functionality/a.out","startMethod":"launch","systemProcessId":62792},"event":"process","seq":0,"type":"event"} <-- Content-Length: 46

Hide Details

{"event":"initialized","seq":0,"type":"event"} --> Content-Length: 356

Hide Details

{"command":"setBreakpoints","type":"request","arguments":{"source":{"name":"main-copy.cpp","path":"/Users/buildslave/jenkins/workspace/lldb-cmake-sanitized/lldb-build/lldb-test-build.noindex/tools/lldb-vscode/breakpoint/TestVSCode_setBreakpoints.test_functionality/main-copy.cpp"},"sourceModified":false,"lines":"[39]","breakpoints":[{"line":39}]},"seq":3} <-- Content-Length: 368

Hide Details

{"body":{"breakpoints":[{"id":1,"line":39,"source":{"name":"main-copy.cpp","path":"/Users/buildslave/jenkins/workspace/lldb-cmake-sanitized/lldb-build/lldb-test-build.noindex/tools/lldb-vscode/breakpoint/TestVSCode_setBreakpoints.test_functionality/main-copy.cpp"},"verified":true}]},"command":"setBreakpoints","request_seq":3,"seq":0,"success":true,"type":"response"} --> Content-Length: 71

Hide Details

{"command":"configurationDone","type":"request","arguments":{},"seq":4} <-- Content-Length: 88

Hide Details

{"command":"configurationDone","request_seq":4,"seq":0,"success":true,"type":"response"} <-- Content-Length: 200

Hide Details

{"body":{"allThreadsStopped":true,"description":"breakpoint 1.1","preserveFocusHint":false,"reason":"breakpoint","threadCausedFocus":true,"threadId":22334265},"event":"stopped","seq":0,"type":"event"} --> Content-Length: 61

Hide Details

{"command":"threads","type":"request","arguments":{},"seq":5} <-- Content-Length: 134

Hide Details

{"body":{"threads":[{"id":22334265,"name":"Thread #1"}]},"command":"threads","request_seq":5,"seq":0,"success":true,"type":"response"} --> Content-Length: 109

Hide Details

{"command":"stackTrace","type":"request","arguments":{"threadId":22334265,"startFrame":0,"levels":1},"seq":6} <-- Content-Length: 395

Hide Details

{"body":{"stackFrames":[{"column":20,"id":524288,"line":39,"name":"main","source":{"name":"main-copy.cpp","path":"/Users/buildslave/jenkins/workspace/lldb-cmake-sanitized/lldb-build/lldb-test-build.noindex/tools/lldb-vscode/breakpoint/TestVSCode_setBreakpoints.test_functionality/main-copy.cpp"}}],"totalFrames":2},"command":"stackTrace","request_seq":6,"seq":0,"success":true,"type":"response"} --> Content-Length: 76

Hide Details

{"command":"scopes","type":"request","arguments":{"frameId":524288},"seq":7} <-- Content-Length: 335

Hide Details

{"body":{"scopes":[{"expensive":false,"name":"Locals","namedVariables":7,"variablesReference":1},{"expensive":false,"name":"Globals","namedVariables":0,"variablesReference":2},{"expensive":false,"name":"Registers","namedVariables":3,"variablesReference":3}]},"command":"scopes","request_seq":7,"seq":0,"success":true,"type":"response"} --> Content-Length: 85

Hide Details

{"command":"variables","type":"request","arguments":{"variablesReference":1},"seq":8} <-- Content-Length: 919

Hide Details

{"body":{"variables":[{"evaluateName":"argc","id":0,"name":"argc","type":"int","value":"1","variablesReference":0},{"evaluateName":"argv","id":1,"name":"argv","type":"const char **","value":"0x00007ffeefbff810","variablesReference":5},{"evaluateName":"libother_name","id":2,"name":"libother_name","type":"const char *","value":"0x0000000100000f44 \"libother.dylib\"","variablesReference":6},{"evaluateName":"handle","id":3,"name":"handle","type":"void *","value":"0x000060f0000007c0","variablesReference":7},{"evaluateName":"foo","id":4,"name":"foo","type":"int (*)(int)","value":"0x000000010224bf90 (libother.dylib`foo at other-copy.c:1)","variablesReference":8},{"evaluateName":"i","id":5,"name":"i","type":"int","value":"0","variablesReference":0},{"evaluateName":"x","id":6,"name":"x","type":"int","value":"0","variablesReference":0}]},"command":"variables","request_seq":8,"seq":0,"success":true,"type":"response"} --> Content-Length: 375

Hide Details

{"command":"setBreakpoints","type":"request","arguments":{"source":{"name":"main-copy.cpp","path":"/Users/buildslave/jenkins/workspace/lldb-cmake-sanitized/lldb-build/lldb-test-build.noindex/tools/lldb-vscode/breakpoint/TestVSCode_setBreakpoints.test_functionality/main-copy.cpp"},"sourceModified":false,"lines":"[39]","breakpoints":[{"line":39,"condition":"i==4"}]},"seq":9} <-- Content-Length: 368

Hide Details

{"body":{"breakpoints":[{"id":1,"line":39,"source":{"name":"main-copy.cpp","path":"/Users/buildslave/jenkins/workspace/lldb-cmake-sanitized/lldb-build/lldb-test-build.noindex/tools/lldb-vscode/breakpoint/TestVSCode_setBreakpoints.test_functionality/main-copy.cpp"},"verified":true}]},"command":"setBreakpoints","request_seq":9,"seq":0,"success":true,"type":"response"} --> Content-Length: 82

Hide Details

{"command":"continue","type":"request","arguments":{"threadId":22334265},"seq":10} <-- Content-Length: 116

Hide Details

{"body":{"allThreadsContinued":true},"command":"continue","request_seq":10,"seq":0,"success":true,"type":"response"} <-- Content-Length: 311

Hide Details

{"body":{"category":"console","output":"/Users/buildslave/jenkins/workspace/lldb-cmake-sanitized/llvm-project/lldb/tools/lldb-vscode/ProgressEvent.cpp:89:64: runtime error: load of value 829960214, which is not a valid value for type 'lldb_vscode::ProgressEventType'\n"},"event":"output","seq":0,"type":"event"} <-- Content-Length: 261

Hide Details

{"body":{"category":"console","output":"SUMMARY: UndefinedBehaviorSanitizer: undefined-behavior /Users/buildslave/jenkins/workspace/lldb-cmake-sanitized/llvm-project/lldb/tools/lldb-vscode/ProgressEvent.cpp:89:64 in \n"},"event":"output","seq":0,"type":"event"} <-- Content-Length: 170

Hide Details

{"body":{"category":"console","output":"PLEASE submit a bug report to https://bugs.llvm.org/ and include the crash backtrace.\n"},"event":"output","seq":0,"type":"event"}

Hide Details

========= END ========= ========= DEBUG ADAPTER PROTOCOL LOGS ========= --> Content-Length: 284

Hide Details

{"command":"initialize","type":"request","arguments":{"adapterID":"lldb-native","clientID":"vscode","columnsStartAt1":true,"linesStartAt1":true,"locale":"en-us","pathFormat":"path","supportsRunInTerminalRequest":true,"supportsVariablePaging":true,"supportsVariableType":true},"seq":1} <-- Content-Length: 1222

Hide Details

{"body":{"exceptionBreakpointFilters":[{"default":false,"filter":"cpp_catch","label":"C++ Catch"},{"default":false,"filter":"cpp_throw","label":"C++ Throw"},{"default":false,"filter":"objc_catch","label":"Objective C Catch"},{"default":false,"filter":"objc_throw","label":"Objective C Throw"},{"default":false,"filter":"swift_catch","label":"Swift Catch"},{"default":false,"filter":"swift_throw","label":"Swift Throw"}],"supportTerminateDebuggee":true,"supportsCompletionsRequest":false,"supportsConditionalBreakpoints":true,"supportsConfigurationDoneRequest":true,"supportsDelayedStackTraceLoading":true,"supportsEvaluateForHovers":true,"supportsExceptionInfoRequest":true,"supportsExceptionOptions":true,"supportsFunctionBreakpoints":true,"supportsGotoTargetsRequest":false,"supportsHitConditionalBreakpoints":true,"supportsLoadedSourcesRequest":false,"supportsModulesRequest":false,"supportsProgressReporting":true,"supportsRestartFrame":false,"supportsRestartRequest":false,"supportsRunInTerminalRequest":true,"supportsSetVariable":true,"supportsStepBack":false,"supportsStepInTargetsRequest":false,"supportsValueFormattingOptions":true},"command":"initialize","request_seq":1,"seq":0,"success":true,"type":"response"} --> Content-Length: 1036

Hide Details

{"command":"launch","type":"request","arguments":{"program":"/Users/buildslave/jenkins/workspace/lldb-cmake-sanitized/lldb-build/lldb-test-build.noindex/tools/lldb-vscode/breakpoint/TestVSCode_setBreakpoints.test_set_and_clear/a.out","disableASLR":true,"initCommands":["settings clear -all","settings set symbols.enable-external-lookup false","settings set target.inherit-tcc true","settings set target.detach-on-error false","settings set target.auto-apply-fixits false","settings set plugin.process.gdb-remote.packet-timeout 60","settings set symbols.clang-modules-cache-path \"/Users/buildslave/jenkins/workspace/lldb-cmake-sanitized/lldb-build/lldb-test-build.noindex/module-cache-lldb/lldb-api\"","settings set use-color false","setting set target.prefer-dynamic-value no-dynamic-values","settings set target.env-vars ASAN_OPTIONS=detect_stack_use_after_return=1 DYLD_INSERT_LIBRARIES=/Users/buildslave/jenkins/workspace/lldb-cmake-sanitized/host-compiler/lib/clang/13.0.99/lib/darwin/libclang_rt.asan_osx_dynamic.dylib"]},"seq":2} <-- Content-Length: 923

Hide Details

{"body":{"category":"console","output":"Running initCommands:\n(lldb) settings clear -all\n(lldb) settings set symbols.enable-external-lookup false\n(lldb) settings set target.inherit-tcc true\n(lldb) settings set target.detach-on-error false\n(lldb) settings set target.auto-apply-fixits false\n(lldb) settings set plugin.process.gdb-remote.packet-timeout 60\n(lldb) settings set symbols.clang-modules-cache-path \"/Users/buildslave/jenkins/workspace/lldb-cmake-sanitized/lldb-build/lldb-test-build.noindex/module-cache-lldb/lldb-api\"\n(lldb) settings set use-color false\n(lldb) setting set target.prefer-dynamic-value no-dynamic-values\n(lldb) settings set target.env-vars ASAN_OPTIONS=detect_stack_use_after_return=1 DYLD_INSERT_LIBRARIES=/Users/buildslave/jenkins/workspace/lldb-cmake-sanitized/host-compiler/lib/clang/13.0.99/lib/darwin/libclang_rt.asan_osx_dynamic.dylib\n"},"event":"output","seq":0,"type":"event"} <-- Content-Length: 77

Hide Details

{"command":"launch","request_seq":2,"seq":0,"success":true,"type":"response"} <-- Content-Length: 301

Hide Details

{"body":{"isLocalProcess":true,"name":"/Users/buildslave/jenkins/workspace/lldb-cmake-sanitized/lldb-build/lldb-test-build.noindex/tools/lldb-vscode/breakpoint/TestVSCode_setBreakpoints.test_set_and_clear/a.out","startMethod":"launch","systemProcessId":62864},"event":"process","seq":0,"type":"event"} <-- Content-Length: 46

Hide Details

{"event":"initialized","seq":0,"type":"event"} --> Content-Length: 386

Hide Details

{"command":"setBreakpoints","type":"request","arguments":{"source":{"name":"main-copy.cpp","path":"/Users/buildslave/jenkins/workspace/lldb-cmake-sanitized/lldb-build/lldb-test-build.noindex/tools/lldb-vscode/breakpoint/TestVSCode_setBreakpoints.test_set_and_clear/main-copy.cpp"},"sourceModified":false,"lines":"[6, 15, 10]","breakpoints":[{"line":6},{"line":15},{"line":10}]},"seq":3} <-- Content-Length: 883

Hide Details

{"body":{"breakpoints":[{"id":1,"line":6,"source":{"name":"main-copy.cpp","path":"/Users/buildslave/jenkins/workspace/lldb-cmake-sanitized/lldb-build/lldb-test-build.noindex/tools/lldb-vscode/breakpoint/TestVSCode_setBreakpoints.test_set_and_clear/main-copy.cpp"},"verified":true},{"id":2,"line":15,"source":{"name":"main-copy.cpp","path":"/Users/buildslave/jenkins/workspace/lldb-cmake-sanitized/lldb-build/lldb-test-build.noindex/tools/lldb-vscode/breakpoint/TestVSCode_setBreakpoints.test_set_and_clear/main-copy.cpp"},"verified":true},{"id":3,"line":10,"source":{"name":"main-copy.cpp","path":"/Users/buildslave/jenkins/workspace/lldb-cmake-sanitized/lldb-build/lldb-test-build.noindex/tools/lldb-vscode/breakpoint/TestVSCode_setBreakpoints.test_set_and_clear/main-copy.cpp"},"verified":true}]},"command":"setBreakpoints","request_seq":3,"seq":0,"success":true,"type":"response"} --> Content-Length: 370

Hide Details

{"command":"setBreakpoints","type":"request","arguments":{"source":{"name":"main-copy.cpp","path":"/Users/buildslave/jenkins/workspace/lldb-cmake-sanitized/lldb-build/lldb-test-build.noindex/tools/lldb-vscode/breakpoint/TestVSCode_setBreakpoints.test_set_and_clear/main-copy.cpp"},"sourceModified":false,"lines":"[6, 15]","breakpoints":[{"line":6},{"line":15}]},"seq":4} <-- Content-Length: 625

Hide Details

{"body":{"breakpoints":[{"id":1,"line":6,"source":{"name":"main-copy.cpp","path":"/Users/buildslave/jenkins/workspace/lldb-cmake-sanitized/lldb-build/lldb-test-build.noindex/tools/lldb-vscode/breakpoint/TestVSCode_setBreakpoints.test_set_and_clear/main-copy.cpp"},"verified":true},{"id":2,"line":15,"source":{"name":"main-copy.cpp","path":"/Users/buildslave/jenkins/workspace/lldb-cmake-sanitized/lldb-build/lldb-test-build.noindex/tools/lldb-vscode/breakpoint/TestVSCode_setBreakpoints.test_set_and_clear/main-copy.cpp"},"verified":true}]},"command":"setBreakpoints","request_seq":4,"seq":0,"success":true,"type":"response"} --> Content-Length: 79

Hide Details

{"command":"_testGetTargetBreakpoints","type":"request","arguments":{},"seq":5} <-- Content-Length: 636

Hide Details

{"body":{"breakpoints":[{"id":1,"line":6,"source":{"name":"main-copy.cpp","path":"/Users/buildslave/jenkins/workspace/lldb-cmake-sanitized/lldb-build/lldb-test-build.noindex/tools/lldb-vscode/breakpoint/TestVSCode_setBreakpoints.test_set_and_clear/main-copy.cpp"},"verified":true},{"id":2,"line":15,"source":{"name":"main-copy.cpp","path":"/Users/buildslave/jenkins/workspace/lldb-cmake-sanitized/lldb-build/lldb-test-build.noindex/tools/lldb-vscode/breakpoint/TestVSCode_setBreakpoints.test_set_and_clear/main-copy.cpp"},"verified":true}]},"command":"_testGetTargetBreakpoints","request_seq":5,"seq":0,"success":true,"type":"response"} --> Content-Length: 343

Hide Details

{"command":"setBreakpoints","type":"request","arguments":{"source":{"name":"main-copy.cpp","path":"/Users/buildslave/jenkins/workspace/lldb-cmake-sanitized/lldb-build/lldb-test-build.noindex/tools/lldb-vscode/breakpoint/TestVSCode_setBreakpoints.test_set_and_clear/main-copy.cpp"},"sourceModified":false,"lines":"[]","breakpoints":[]},"seq":6} <-- Content-Length: 111

Hide Details

{"body":{"breakpoints":[]},"command":"setBreakpoints","request_seq":6,"seq":0,"success":true,"type":"response"} --> Content-Length: 79

Hide Details

{"command":"_testGetTargetBreakpoints","type":"request","arguments":{},"seq":7} <-- Content-Length: 122

Hide Details

{"body":{"breakpoints":[]},"command":"_testGetTargetBreakpoints","request_seq":7,"seq":0,"success":true,"type":"response"} --> Content-Length: 356

Hide Details

{"command":"setBreakpoints","type":"request","arguments":{"source":{"name":"main-copy.cpp","path":"/Users/buildslave/jenkins/workspace/lldb-cmake-sanitized/lldb-build/lldb-test-build.noindex/tools/lldb-vscode/breakpoint/TestVSCode_setBreakpoints.test_set_and_clear/main-copy.cpp"},"sourceModified":false,"lines":"[10]","breakpoints":[{"line":10}]},"seq":8} <-- Content-Length: 368

Hide Details

{"body":{"breakpoints":[{"id":4,"line":10,"source":{"name":"main-copy.cpp","path":"/Users/buildslave/jenkins/workspace/lldb-cmake-sanitized/lldb-build/lldb-test-build.noindex/tools/lldb-vscode/breakpoint/TestVSCode_setBreakpoints.test_set_and_clear/main-copy.cpp"},"verified":true}]},"command":"setBreakpoints","request_seq":8,"seq":0,"success":true,"type":"response"} --> Content-Length: 79

Hide Details

{"command":"_testGetTargetBreakpoints","type":"request","arguments":{},"seq":9} <-- Content-Length: 379

Hide Details

{"body":{"breakpoints":[{"id":4,"line":10,"source":{"name":"main-copy.cpp","path":"/Users/buildslave/jenkins/workspace/lldb-cmake-sanitized/lldb-build/lldb-test-build.noindex/tools/lldb-vscode/breakpoint/TestVSCode_setBreakpoints.test_set_and_clear/main-copy.cpp"},"verified":true}]},"command":"_testGetTargetBreakpoints","request_seq":9,"seq":0,"success":true,"type":"response"} --> Content-Length: 89

Hide Details

{"command":"disconnect","type":"request","arguments":{"terminateDebuggee":true},"seq":10} <-- Content-Length: 45

Hide Details

{"event":"terminated","seq":0,"type":"event"} <-- Content-Length: 63

Hide Details

{"body":{"exitCode":9},"event":"exited","seq":0,"type":"event"} <-- Content-Length: 82

Hide Details

{"command":"disconnect","request_seq":10,"seq":0,"success":true,"type":"response"}

Hide Details

========= END ========= ========= DEBUG ADAPTER PROTOCOL LOGS ========= --> Content-Length: 284

Hide Details

{"command":"initialize","type":"request","arguments":{"adapterID":"lldb-native","clientID":"vscode","columnsStartAt1":true,"linesStartAt1":true,"locale":"en-us","pathFormat":"path","supportsRunInTerminalRequest":true,"supportsVariablePaging":true,"supportsVariableType":true},"seq":1} <-- Content-Length: 1222

Hide Details

{"body":{"exceptionBreakpointFilters":[{"default":false,"filter":"cpp_catch","label":"C++ Catch"},{"default":false,"filter":"cpp_throw","label":"C++ Throw"},{"default":false,"filter":"objc_catch","label":"Objective C Catch"},{"default":false,"filter":"objc_throw","label":"Objective C Throw"},{"default":false,"filter":"swift_catch","label":"Swift Catch"},{"default":false,"filter":"swift_throw","label":"Swift Throw"}],"supportTerminateDebuggee":true,"supportsCompletionsRequest":false,"supportsConditionalBreakpoints":true,"supportsConfigurationDoneRequest":true,"supportsDelayedStackTraceLoading":true,"supportsEvaluateForHovers":true,"supportsExceptionInfoRequest":true,"supportsExceptionOptions":true,"supportsFunctionBreakpoints":true,"supportsGotoTargetsRequest":false,"supportsHitConditionalBreakpoints":true,"supportsLoadedSourcesRequest":false,"supportsModulesRequest":false,"supportsProgressReporting":true,"supportsRestartFrame":false,"supportsRestartRequest":false,"supportsRunInTerminalRequest":true,"supportsSetVariable":true,"supportsStepBack":false,"supportsStepInTargetsRequest":false,"supportsValueFormattingOptions":true},"command":"initialize","request_seq":1,"seq":0,"success":true,"type":"response"} --> Content-Length: 1734

Hide Details

{"command":"launch","type":"request","arguments":{"program":"/Users/buildslave/jenkins/workspace/lldb-cmake-sanitized/lldb-build/lldb-test-build.noindex/tools/lldb-vscode/breakpoint/TestVSCode_setBreakpoints.test_source_map/a.out","disableASLR":true,"initCommands":["settings clear -all","settings set symbols.enable-external-lookup false","settings set target.inherit-tcc true","settings set target.detach-on-error false","settings set target.auto-apply-fixits false","settings set plugin.process.gdb-remote.packet-timeout 60","settings set symbols.clang-modules-cache-path \"/Users/buildslave/jenkins/workspace/lldb-cmake-sanitized/lldb-build/lldb-test-build.noindex/module-cache-lldb/lldb-api\"","settings set use-color false","setting set target.prefer-dynamic-value no-dynamic-values","settings set target.env-vars ASAN_OPTIONS=detect_stack_use_after_return=1 DYLD_INSERT_LIBRARIES=/Users/buildslave/jenkins/workspace/lldb-cmake-sanitized/host-compiler/lib/clang/13.0.99/lib/darwin/libclang_rt.asan_osx_dynamic.dylib"],"sourceMap":[["/Users/buildslave/jenkins/workspace/lldb-cmake-sanitized/lldb-build/lldb-test-build.noindex/tools/lldb-vscode/breakpoint/TestVSCode_setBreakpoints.test_source_map","/Users/buildslave/jenkins/workspace/lldb-cmake-sanitized/lldb-build/lldb-test-build.noindex/tools/lldb-vscode/breakpoint/TestVSCode_setBreakpoints.test_source_map/moved_main"],["/Users/buildslave/jenkins/workspace/lldb-cmake-sanitized/lldb-build/lldb-test-build.noindex/tools/lldb-vscode/breakpoint/TestVSCode_setBreakpoints.test_source_map","/Users/buildslave/jenkins/workspace/lldb-cmake-sanitized/lldb-build/lldb-test-build.noindex/tools/lldb-vscode/breakpoint/TestVSCode_setBreakpoints.test_source_map/moved_other"]]},"seq":2} <-- Content-Length: 923

Hide Details

{"body":{"category":"console","output":"Running initCommands:\n(lldb) settings clear -all\n(lldb) settings set symbols.enable-external-lookup false\n(lldb) settings set target.inherit-tcc true\n(lldb) settings set target.detach-on-error false\n(lldb) settings set target.auto-apply-fixits false\n(lldb) settings set plugin.process.gdb-remote.packet-timeout 60\n(lldb) settings set symbols.clang-modules-cache-path \"/Users/buildslave/jenkins/workspace/lldb-cmake-sanitized/lldb-build/lldb-test-build.noindex/module-cache-lldb/lldb-api\"\n(lldb) settings set use-color false\n(lldb) setting set target.prefer-dynamic-value no-dynamic-values\n(lldb) settings set target.env-vars ASAN_OPTIONS=detect_stack_use_after_return=1 DYLD_INSERT_LIBRARIES=/Users/buildslave/jenkins/workspace/lldb-cmake-sanitized/host-compiler/lib/clang/13.0.99/lib/darwin/libclang_rt.asan_osx_dynamic.dylib\n"},"event":"output","seq":0,"type":"event"} <-- Content-Length: 835

Hide Details

{"body":{"category":"console","output":"Setting source map:\n(lldb) settings set target.source-map \"/Users/buildslave/jenkins/workspace/lldb-cmake-sanitized/lldb-build/lldb-test-build.noindex/tools/lldb-vscode/breakpoint/TestVSCode_setBreakpoints.test_source_map\" \"/Users/buildslave/jenkins/workspace/lldb-cmake-sanitized/lldb-build/lldb-test-build.noindex/tools/lldb-vscode/breakpoint/TestVSCode_setBreakpoints.test_source_map/moved_main\" \"/Users/buildslave/jenkins/workspace/lldb-cmake-sanitized/lldb-build/lldb-test-build.noindex/tools/lldb-vscode/breakpoint/TestVSCode_setBreakpoints.test_source_map\" \"/Users/buildslave/jenkins/workspace/lldb-cmake-sanitized/lldb-build/lldb-test-build.noindex/tools/lldb-vscode/breakpoint/TestVSCode_setBreakpoints.test_source_map/moved_other\" \n"},"event":"output","seq":0,"type":"event"} <-- Content-Length: 77

Hide Details

{"command":"launch","request_seq":2,"seq":0,"success":true,"type":"response"} <-- Content-Length: 298

Hide Details

{"body":{"isLocalProcess":true,"name":"/Users/buildslave/jenkins/workspace/lldb-cmake-sanitized/lldb-build/lldb-test-build.noindex/tools/lldb-vscode/breakpoint/TestVSCode_setBreakpoints.test_source_map/a.out","startMethod":"launch","systemProcessId":62930},"event":"process","seq":0,"type":"event"} <-- Content-Length: 46

Hide Details

{"event":"initialized","seq":0,"type":"event"} --> Content-Length: 362

Hide Details

{"command":"setBreakpoints","type":"request","arguments":{"source":{"name":"main-copy.cpp","path":"/Users/buildslave/jenkins/workspace/lldb-cmake-sanitized/lldb-build/lldb-test-build.noindex/tools/lldb-vscode/breakpoint/TestVSCode_setBreakpoints.test_source_map/moved_main/main-copy.cpp"},"sourceModified":false,"lines":"[6]","breakpoints":[{"line":6}]},"seq":3} <-- Content-Length: 375

Hide Details

{"body":{"breakpoints":[{"id":1,"line":6,"source":{"name":"main-copy.cpp","path":"/Users/buildslave/jenkins/workspace/lldb-cmake-sanitized/lldb-build/lldb-test-build.noindex/tools/lldb-vscode/breakpoint/TestVSCode_setBreakpoints.test_source_map/moved_main/main-copy.cpp"},"verified":true}]},"command":"setBreakpoints","request_seq":3,"seq":0,"success":true,"type":"response"} --> Content-Length: 361

Hide Details

{"command":"setBreakpoints","type":"request","arguments":{"source":{"name":"other-copy.c","path":"/Users/buildslave/jenkins/workspace/lldb-cmake-sanitized/lldb-build/lldb-test-build.noindex/tools/lldb-vscode/breakpoint/TestVSCode_setBreakpoints.test_source_map/moved_other/other-copy.c"},"sourceModified":false,"lines":"[2]","breakpoints":[{"line":2}]},"seq":4} <-- Content-Length: 375

Hide Details

{"body":{"breakpoints":[{"id":2,"line":2,"source":{"name":"other-copy.c","path":"/Users/buildslave/jenkins/workspace/lldb-cmake-sanitized/lldb-build/lldb-test-build.noindex/tools/lldb-vscode/breakpoint/TestVSCode_setBreakpoints.test_source_map/moved_other/other-copy.c"},"verified":false}]},"command":"setBreakpoints","request_seq":4,"seq":0,"success":true,"type":"response"} --> Content-Length: 71

Hide Details

{"command":"configurationDone","type":"request","arguments":{},"seq":5} <-- Content-Length: 88

Hide Details

{"command":"configurationDone","request_seq":5,"seq":0,"success":true,"type":"response"} <-- Content-Length: 120

Hide Details

{"body":{"breakpoint":{"id":2,"line":2,"verified":true},"reason":"changed"},"event":"breakpoint","seq":0,"type":"event"} <-- Content-Length: 200

Hide Details

{"body":{"allThreadsStopped":true,"description":"breakpoint 2.1","preserveFocusHint":false,"reason":"breakpoint","threadCausedFocus":true,"threadId":22334779},"event":"stopped","seq":0,"type":"event"} --> Content-Length: 361

Hide Details

{"command":"setBreakpoints","type":"request","arguments":{"source":{"name":"other-copy.c","path":"/Users/buildslave/jenkins/workspace/lldb-cmake-sanitized/lldb-build/lldb-test-build.noindex/tools/lldb-vscode/breakpoint/TestVSCode_setBreakpoints.test_source_map/moved_other/other-copy.c"},"sourceModified":false,"lines":"[2]","breakpoints":[{"line":2}]},"seq":6} <-- Content-Length: 374

Hide Details

{"body":{"breakpoints":[{"id":2,"line":2,"source":{"name":"other-copy.c","path":"/Users/buildslave/jenkins/workspace/lldb-cmake-sanitized/lldb-build/lldb-test-build.noindex/tools/lldb-vscode/breakpoint/TestVSCode_setBreakpoints.test_source_map/moved_other/other-copy.c"},"verified":true}]},"command":"setBreakpoints","request_seq":6,"seq":0,"success":true,"type":"response"} --> Content-Length: 88

Hide Details

{"command":"disconnect","type":"request","arguments":{"terminateDebuggee":true},"seq":7} <-- Content-Length: 45

Hide Details

{"event":"terminated","seq":0,"type":"event"} <-- Content-Length: 63

Hide Details

{"body":{"exitCode":9},"event":"exited","seq":0,"type":"event"} <-- Content-Length: 81

Hide Details

{"command":"disconnect","request_seq":7,"seq":0,"success":true,"type":"response"}

Hide Details

========= END =========

Hide Details

-- Command Output (stderr): -- Change dir to: /Users/buildslave/jenkins/workspace/lldb-cmake-sanitized/llvm-project/lldb/test/API/tools/lldb-vscode/breakpoint runCmd: settings clear -all output:

Hide Details

runCmd: settings set symbols.enable-external-lookup false output:

Hide Details

runCmd: settings set target.inherit-tcc true output:

Hide Details

runCmd: settings set target.detach-on-error false output:

Hide Details

runCmd: settings set target.auto-apply-fixits false output:

Hide Details

runCmd: settings set plugin.process.gdb-remote.packet-timeout 60 output:

Hide Details

runCmd: settings set symbols.clang-modules-cache-path "/Users/buildslave/jenkins/workspace/lldb-cmake-sanitized/lldb-build/lldb-test-build.noindex/module-cache-lldb/lldb-api" output:

Hide Details

runCmd: settings set use-color false output:

Hide Details

runCmd: setting set target.prefer-dynamic-value no-dynamic-values output:

Hide Details

runCmd: settings set target.env-vars ASAN_OPTIONS=detect_stack_use_after_return=1 DYLD_INSERT_LIBRARIES=/Users/buildslave/jenkins/workspace/lldb-cmake-sanitized/host-compiler/lib/clang/13.0.99/lib/darwin/libclang_rt.asan_osx_dynamic.dylib output:

Hide Details

Adding tearDown hook: def cleanup(): if disconnectAutomatically: self.vscode.request_disconnect(terminateDebuggee=True) self.vscode.terminate()

Hide Details

Hide Details

Executing tearDown hook: def cleanup(): if disconnectAutomatically: self.vscode.request_disconnect(terminateDebuggee=True) self.vscode.terminate()

Hide Details

Hide Details

PASS: LLDB (/Users/buildslave/jenkins/workspace/lldb-cmake-sanitized/host-compiler/bin/clang-x86_64) :: test_clear_breakpoints_unset_breakpoints (TestVSCode_setBreakpoints.TestVSCode_setBreakpoints) runCmd: settings clear -all output:

Hide Details

runCmd: settings set symbols.enable-external-lookup false output:

Hide Details

runCmd: settings set target.inherit-tcc true output:

Hide Details

runCmd: settings set target.detach-on-error false output:

Hide Details

runCmd: settings set target.auto-apply-fixits false output:

Hide Details

runCmd: settings set plugin.process.gdb-remote.packet-timeout 60 output:

Hide Details

runCmd: settings set symbols.clang-modules-cache-path "/Users/buildslave/jenkins/workspace/lldb-cmake-sanitized/lldb-build/lldb-test-build.noindex/module-cache-lldb/lldb-api" output:

Hide Details

runCmd: settings set use-color false output:

Hide Details

runCmd: setting set target.prefer-dynamic-value no-dynamic-values output:

Hide Details

runCmd: settings set target.env-vars ASAN_OPTIONS=detect_stack_use_after_return=1 DYLD_INSERT_LIBRARIES=/Users/buildslave/jenkins/workspace/lldb-cmake-sanitized/host-compiler/lib/clang/13.0.99/lib/darwin/libclang_rt.asan_osx_dynamic.dylib output:

Hide Details

Adding tearDown hook: def cleanup(): if disconnectAutomatically: self.vscode.request_disconnect(terminateDebuggee=True) self.vscode.terminate()

Hide Details

Hide Details

FAIL: LLDB (/Users/buildslave/jenkins/workspace/lldb-cmake-sanitized/host-compiler/bin/clang-x86_64) :: test_functionality (TestVSCode_setBreakpoints.TestVSCode_setBreakpoints) Executing tearDown hook: def cleanup(): if disconnectAutomatically: self.vscode.request_disconnect(terminateDebuggee=True) self.vscode.terminate()

Hide Details

Hide Details

CLEANUP ERROR: LLDB (/Users/buildslave/jenkins/workspace/lldb-cmake-sanitized/host-compiler/bin/clang-x86_64) :: test_functionality (TestVSCode_setBreakpoints.TestVSCode_setBreakpoints) Traceback (most recent call last): File "/Users/buildslave/jenkins/workspace/lldb-cmake-sanitized/llvm-project/lldb/third_party/Python/module/unittest2/unittest2/case.py", line 386, in run self.tearDown() File "/Users/buildslave/jenkins/workspace/lldb-cmake-sanitized/llvm-project/lldb/packages/Python/lldbsuite/test/lldbtest.py", line 2095, in tearDown Base.tearDown(self) File "/Users/buildslave/jenkins/workspace/lldb-cmake-sanitized/llvm-project/lldb/packages/Python/lldbsuite/test/lldbtest.py", line 1065, in tearDown hook() # try the plain call and hope it works File "/Users/buildslave/jenkins/workspace/lldb-cmake-sanitized/llvm-project/lldb/packages/Python/lldbsuite/test/tools/lldb-vscode/lldbvscode_testcase.py", line 294, in cleanup self.vscode.request_disconnect(terminateDebuggee=True) File "/Users/buildslave/jenkins/workspace/lldb-cmake-sanitized/llvm-project/lldb/packages/Python/lldbsuite/test/tools/lldb-vscode/vscode.py", line 590, in request_disconnect return self.send_recv(command_dict) File "/Users/buildslave/jenkins/workspace/lldb-cmake-sanitized/llvm-project/lldb/packages/Python/lldbsuite/test/tools/lldb-vscode/vscode.py", line 315, in send_recv self.send_packet(command) File "/Users/buildslave/jenkins/workspace/lldb-cmake-sanitized/llvm-project/lldb/packages/Python/lldbsuite/test/tools/lldb-vscode/vscode.py", line 271, in send_packet self.send.flush() BrokenPipeError: [Errno 32] Broken pipe

Hide Details

runCmd: settings clear -all output:

Hide Details

runCmd: settings set symbols.enable-external-lookup false output:

Hide Details

runCmd: settings set target.inherit-tcc true output:

Hide Details

runCmd: settings set target.detach-on-error false output:

Hide Details

runCmd: settings set target.auto-apply-fixits false output:

Hide Details

runCmd: settings set plugin.process.gdb-remote.packet-timeout 60 output:

Hide Details

runCmd: settings set symbols.clang-modules-cache-path "/Users/buildslave/jenkins/workspace/lldb-cmake-sanitized/lldb-build/lldb-test-build.noindex/module-cache-lldb/lldb-api" output:

Hide Details

runCmd: settings set use-color false output:

Hide Details

runCmd: setting set target.prefer-dynamic-value no-dynamic-values output:

Hide Details

runCmd: settings set target.env-vars ASAN_OPTIONS=detect_stack_use_after_return=1 DYLD_INSERT_LIBRARIES=/Users/buildslave/jenkins/workspace/lldb-cmake-sanitized/host-compiler/lib/clang/13.0.99/lib/darwin/libclang_rt.asan_osx_dynamic.dylib output:

Hide Details

Adding tearDown hook: def cleanup(): if disconnectAutomatically: self.vscode.request_disconnect(terminateDebuggee=True) self.vscode.terminate()

Hide Details

Hide Details

Executing tearDown hook: def cleanup(): if disconnectAutomatically: self.vscode.request_disconnect(terminateDebuggee=True) self.vscode.terminate()

Hide Details

Hide Details

PASS: LLDB (/Users/buildslave/jenkins/workspace/lldb-cmake-sanitized/host-compiler/bin/clang-x86_64) :: test_set_and_clear (TestVSCode_setBreakpoints.TestVSCode_setBreakpoints) runCmd: settings clear -all output:

Hide Details

runCmd: settings set symbols.enable-external-lookup false output:

Hide Details

runCmd: settings set target.inherit-tcc true output:

Hide Details

runCmd: settings set target.detach-on-error false output:

Hide Details

runCmd: settings set target.auto-apply-fixits false output:

Hide Details

runCmd: settings set plugin.process.gdb-remote.packet-timeout 60 output:

Hide Details

runCmd: settings set symbols.clang-modules-cache-path "/Users/buildslave/jenkins/workspace/lldb-cmake-sanitized/lldb-build/lldb-test-build.noindex/module-cache-lldb/lldb-api" output:

Hide Details

runCmd: settings set use-color false output:

Hide Details

runCmd: setting set target.prefer-dynamic-value no-dynamic-values output:

Hide Details

runCmd: settings set target.env-vars ASAN_OPTIONS=detect_stack_use_after_return=1 DYLD_INSERT_LIBRARIES=/Users/buildslave/jenkins/workspace/lldb-cmake-sanitized/host-compiler/lib/clang/13.0.99/lib/darwin/libclang_rt.asan_osx_dynamic.dylib output:

Hide Details

Adding tearDown hook: def cleanup(): if disconnectAutomatically: self.vscode.request_disconnect(terminateDebuggee=True) self.vscode.terminate()

Hide Details

Hide Details

Executing tearDown hook: def cleanup(): if disconnectAutomatically: self.vscode.request_disconnect(terminateDebuggee=True) self.vscode.terminate()

Hide Details

Hide Details

PASS: LLDB (/Users/buildslave/jenkins/workspace/lldb-cmake-sanitized/host-compiler/bin/clang-x86_64) :: test_source_map (TestVSCode_setBreakpoints.TestVSCode_setBreakpoints) Restore dir to: /Users/buildslave/jenkins/workspace/lldb-cmake-sanitized/lldb-build/tools/lldb/test ====================================================================== FAIL: test_functionality (TestVSCode_setBreakpoints.TestVSCode_setBreakpoints) Tests hitting breakpoints and the functionality of a single ---------------------------------------------------------------------- Traceback (most recent call last): File "/Users/buildslave/jenkins/workspace/lldb-cmake-sanitized/llvm-project/lldb/test/API/tools/lldb-vscode/breakpoint/TestVSCode_setBreakpoints.py", line 294, in test_functionality self.continue_to_breakpoints(breakpoint_ids) File "/Users/buildslave/jenkins/workspace/lldb-cmake-sanitized/llvm-project/lldb/packages/Python/lldbsuite/test/tools/lldb-vscode/lldbvscode_testcase.py", line 233, in continue_to_breakpoints self.verify_breakpoint_hit(breakpoint_ids) File "/Users/buildslave/jenkins/workspace/lldb-cmake-sanitized/llvm-project/lldb/packages/Python/lldbsuite/test/tools/lldb-vscode/lldbvscode_testcase.py", line 92, in verify_breakpoint_hit self.assertTrue(False, "breakpoint not hit") AssertionError: False is not True : breakpoint not hit Config=x86_64-/Users/buildslave/jenkins/workspace/lldb-cmake-sanitized/host-compiler/bin/clang ---------------------------------------------------------------------- Ran 4 tests in 12.285s

Hide Details

RESULT: FAILED (3 passes, 1 failures, 0 errors, 0 skipped, 0 expected failures, 0 unexpected successes)

Hide Details

--

Hide Details

******************** PASS: lldb-unit :: Utility/./UtilityTests/UriParserTest.MinimalPort (1236 of 2357) PASS: lldb-unit :: SymbolFile/DWARF/./SymbolFileDWARFTests/SymbolFileDWARFTests.TestAbbrevOutOfOrder (1237 of 2357) PASS: lldb-unit :: ObjectFile/Breakpad/./ObjectFileBreakpadTests/InfoRecord.parse (1238 of 2357) PASS: lldb-unit :: Expression/./ExpressionTests/DiagnosticManagerTest.AppendMessageNoDiag (1239 of 2357) UNSUPPORTED: lldb-api :: benchmarks/stepping/TestSteppingSpeed.py (1240 of 2357) PASS: lldb-api :: commands/watchpoints/watchpoint_size/TestWatchpointSizes.py (1241 of 2357) PASS: lldb-api :: python_api/sbvalue_persist/TestSBValuePersist.py (1242 of 2357) PASS: lldb-unit :: Utility/./UtilityTests/EnvironmentTest.EnvpConversion (1243 of 2357) PASS: lldb-api :: lang/c/shared_lib/TestSharedLib.py (1244 of 2357) PASS: lldb-unit :: SymbolFile/DWARF/./SymbolFileDWARFTests/SymbolFileDWARFTests.TestAbbrevOrder1Start1 (1245 of 2357) PASS: lldb-unit :: UnwindAssembly/x86/./UnwindAssemblyx86Tests/Testx86AssemblyInspectionEngine.TestPushRBPWithREX (1246 of 2357) UNSUPPORTED: lldb-shell :: SymbolFile/DWARF/x86/DW_TAG_GNU_call_site-DW_AT_low_pc.s (1247 of 2357) PASS: lldb-unit :: DataFormatter/./LLDBFormatterTests/TypeMatcherTests.GetMatchStringExactName (1248 of 2357) PASS: lldb-api :: commands/target/stop-hook/delete/TestTargetStopHookDelete.py (1249 of 2357) PASS: lldb-api :: lang/cpp/stl/TestStdCXXDisassembly.py (1250 of 2357) PASS: lldb-unit :: Process/minidump/./LLDBMinidumpTests/MinidumpParserTest.GetPidWindows (1251 of 2357) PASS: lldb-unit :: Utility/./UtilityTests/StringListTest.ShiftStdString (1252 of 2357) PASS: lldb-unit :: UnwindAssembly/x86/./UnwindAssemblyx86Tests/Testx86AssemblyInspectionEngine.TestPushEAX (1253 of 2357) PASS: lldb-api :: commands/command/invalid-args/TestInvalidArgsCommand.py (1254 of 2357) PASS: lldb-unit :: Process/Utility/./ProcessUtilityTests/ProcMapTests/LinuxProcMapsTestFixture.ParseMapRegions/0 (1255 of 2357) PASS: lldb-api :: lang/cpp/inlines/TestInlines.py (1256 of 2357) PASS: lldb-unit :: Core/./LLDBCoreTests/FormatEntity.LookupAllEntriesInTree (1257 of 2357) PASS: lldb-api :: functionalities/thread/concurrent_events/TestConcurrentSignalWatchBreak.py (1258 of 2357) PASS: lldb-shell :: ObjectFile/ELF/aarch64-relocations.yaml (1259 of 2357) PASS: lldb-shell :: SymbolFile/NativePDB/ast-methods.cpp (1260 of 2357) PASS: lldb-unit :: Host/./HostTests/MainLoopTest.DetectsEOF (1261 of 2357) PASS: lldb-api :: functionalities/breakpoint/move_nearest/TestMoveNearest.py (1262 of 2357) PASS: lldb-unit :: Utility/./UtilityTests/BinaryStreamTest.PutSLEB128SixBytes (1263 of 2357) PASS: lldb-unit :: Utility/./UtilityTests/VASprintfTest.EncodingError (1264 of 2357) PASS: lldb-unit :: Process/minidump/./LLDBMinidumpTests/MinidumpParserTest.GetExceptionStream (1265 of 2357) PASS: lldb-api :: functionalities/data-formatter/synthupdate/TestSyntheticFilterRecompute.py (1266 of 2357) PASS: lldb-unit :: UnwindAssembly/x86/./UnwindAssemblyx86Tests/Testx86AssemblyInspectionEngine.Test32BitOnlyInstruction (1267 of 2357) PASS: lldb-unit :: Utility/./UtilityTests/SerializationRountripTest.SerializeDeserializeCStringArray (1268 of 2357) PASS: lldb-shell :: Driver/TestProcessAttach.test (1269 of 2357) PASS: lldb-unit :: Utility/./UtilityTests/OptionsWithRawTest.EmptyInput (1270 of 2357) PASS: lldb-api :: functionalities/thread/concurrent_events/TestConcurrentTwoBreakpointsOneDelaySignal.py (1271 of 2357) PASS: lldb-shell :: ScriptInterpreter/Python/scripted_breakpoint_lua.test (1272 of 2357) PASS: lldb-unit :: Utility/./UtilityTests/StringListTest.GetMaxStringLengthIncreasingSize (1273 of 2357) PASS: lldb-api :: commands/expression/test/TestExprs.py (1274 of 2357) UNSUPPORTED: lldb-api :: macosx/posix_spawn/TestLaunchProcessPosixSpawn.py (1275 of 2357) PASS: lldb-unit :: UnwindAssembly/x86/./UnwindAssemblyx86Tests/Testx86AssemblyInspectionEngine.TestPopRBPWithREX (1276 of 2357) PASS: lldb-unit :: UnwindAssembly/x86/./UnwindAssemblyx86Tests/Testx86AssemblyInspectionEngine.TestPushR15 (1277 of 2357) PASS: lldb-unit :: Utility/./UtilityTests/UriParserTest.SchemeHostSeparator2 (1278 of 2357) PASS: lldb-api :: commands/frame/recognizer/TestFrameRecognizer.py (1279 of 2357) PASS: lldb-api :: terminal/TestSTTYBeforeAndAfter.py (1280 of 2357) PASS: lldb-unit :: UnwindAssembly/x86/./UnwindAssemblyx86Tests/Testx86AssemblyInspectionEngine.TestDisassemblyJunkBytes (1281 of 2357) PASS: lldb-unit :: Utility/./UtilityTests/RangeDataVector.FindEntryIndexesThatContain (1282 of 2357) PASS: lldb-api :: functionalities/value_md5_crash/TestValueMD5Crash.py (1283 of 2357) PASS: lldb-shell :: Driver/TestHelp.test (1284 of 2357) PASS: lldb-api :: functionalities/gdb_remote_client/TestGDBRemoteClient.py (1285 of 2357) PASS: lldb-unit :: Expression/./ExpressionTests/DiagnosticManagerTest.GetStringMultiline (1286 of 2357) PASS: lldb-unit :: Utility/./UtilityTests/StringListTest.AppendListCStringArray (1287 of 2357) PASS: lldb-api :: tools/lldb-server/TestAppleSimulatorOSType.py (1288 of 2357) PASS: lldb-unit :: Utility/./UtilityTests/StreamTest.AddressRangeSize (1289 of 2357) PASS: lldb-unit :: Expression/./ExpressionTests/ClangExpressionDeclMapTest.TestPersistentDeclLookup (1290 of 2357) PASS: lldb-api :: commands/platform/basic/TestPlatformCommand.py (1291 of 2357) PASS: lldb-unit :: SymbolFile/DWARF/./SymbolFileDWARFTests/SymbolFileDWARFTests.TestAbbrevValidAttrNullForm (1292 of 2357) PASS: lldb-api :: tools/lldb-vscode/attach/TestVSCode_attach.py (1293 of 2357) PASS: lldb-shell :: Expr/TestIRMemoryMap.test (1294 of 2357) PASS: lldb-unit :: Utility/./UtilityTests/StringExtractorGDBRemoteTest.GetPidTidMultipleValues (1295 of 2357) PASS: lldb-unit :: Utility/./UtilityTests/StringExtractorTest.GetHexBytes_OddPair (1296 of 2357) UNSUPPORTED: lldb-shell :: BuildScript/toolchain-clang-cl.test (1297 of 2357) PASS: lldb-unit :: Utility/./UtilityTests/OptionsWithRawTest.EmptyArgsOnlySuffix (1298 of 2357) PASS: lldb-shell :: Register/x86-multithread-read.test (1299 of 2357) UNSUPPORTED: lldb-api :: commands/expression/macros/TestMacros.py (1300 of 2357) PASS: lldb-shell :: ScriptInterpreter/Python/sb_address_exception.test (1301 of 2357) PASS: lldb-shell :: ObjectFile/MachO/symtab.yaml (1302 of 2357) PASS: lldb-unit :: ScriptInterpreter/Python/./ScriptInterpreterPythonTests/PythonDataObjectsTest.TestScript (1303 of 2357) PASS: lldb-unit :: Utility/./UtilityTests/StringExtractorTest.DecodeHexU8_Extra (1304 of 2357) PASS: lldb-unit :: Utility/./UtilityTests/StreamTest.SetIndentLevel (1305 of 2357) PASS: lldb-api :: functionalities/load_lazy/TestLoadUsingLazyBind.py (1306 of 2357) PASS: lldb-unit :: Utility/./UtilityTests/StatusTest.ErrorConversion (1307 of 2357) PASS: lldb-api :: python_api/name_lookup/TestNameLookup.py (1308 of 2357) UNSUPPORTED: lldb-api :: functionalities/breakpoint/breakpoint_callback_command_source/TestBreakpointCallbackCommandSource.py (1309 of 2357) PASS: lldb-unit :: UnwindAssembly/x86/./UnwindAssemblyx86Tests/Testx86AssemblyInspectionEngine.TestPopEBX (1310 of 2357) PASS: lldb-shell :: SymbolFile/DWARF/x86/debug_loc.s (1311 of 2357) PASS: lldb-unit :: Utility/./UtilityTests/StringListTest.InsertStringAtIndexEnd (1312 of 2357) PASS: lldb-unit :: ScriptInterpreter/Python/./ScriptInterpreterPythonTests/PythonDataObjectsTest.TestGlobalNameResolutionNoDot (1313 of 2357) PASS: lldb-unit :: Language/Highlighting/./HighlighterTests/HighlighterTest.ClangTrailingBackslashWithWhitespace (1314 of 2357) PASS: lldb-shell :: SymbolFile/Breakpad/line-table-discontinuous-file-ids.test (1315 of 2357) PASS: lldb-shell :: SymbolFile/DWARF/x86/dir-separator-windows.s (1316 of 2357) PASS: lldb-api :: python_api/signals/TestSignalsAPI.py (1317 of 2357) PASS: lldb-api :: macosx/save_crashlog/TestSaveCrashlog.py (1318 of 2357) PASS: lldb-api :: tools/lldb-vscode/runInTerminal/TestVSCode_runInTerminal.py (1319 of 2357) PASS: lldb-unit :: Utility/./UtilityTests/RegisterValueTest.GetSet8 (1320 of 2357) PASS: lldb-api :: types/TestRecursiveTypes.py (1321 of 2357) PASS: lldb-unit :: Utility/./UtilityTests/UserIDResolver.GetUserName (1322 of 2357) PASS: lldb-unit :: Utility/./UtilityTests/LogTest.Unregister (1323 of 2357) PASS: lldb-unit :: Process/minidump/./LLDBMinidumpTests/RegisterContextMinidump.ConvertMinidumpContext_x86_32 (1324 of 2357) PASS: lldb-unit :: UnwindAssembly/x86/./UnwindAssemblyx86Tests/Testx86AssemblyInspectionEngine.TestStackRealign8BitDisp_i386 (1325 of 2357) PASS: lldb-unit :: Utility/./UtilityTests/StreamTest.AddressSuffix (1326 of 2357) PASS: lldb-shell :: SymbolFile/DWARF/x86/DW_TAG_variable-invalid_location.s (1327 of 2357) PASS: lldb-unit :: Editline/./EditlineTests/EditlineTestFixture.EditlineReceivesMultiLineText (1328 of 2357) PASS: lldb-api :: commands/platform/sdk/TestPlatformSDK.py (1329 of 2357) UNSUPPORTED: lldb-shell :: ScriptInterpreter/Lua/independent_state.test (1330 of 2357) PASS: lldb-unit :: Symbol/./SymbolTests/DWARFCallFrameInfoTest.Basic_dwarf3 (1331 of 2357) PASS: lldb-shell :: Minidump/Windows/broken-unwind.test (1332 of 2357) PASS: lldb-unit :: Host/./HostTests/FileSystemTest.EnumerateDirectory (1333 of 2357) PASS: lldb-unit :: Utility/./UtilityTests/ConstStringTest.NullAndEmptyStates (1334 of 2357) PASS: lldb-unit :: Language/Highlighting/./HighlighterTests/HighlighterTest.ClangCursorPosInOtherToken (1335 of 2357) PASS: lldb-shell :: Commands/command-source.test (1336 of 2357) PASS: lldb-api :: functionalities/breakpoint/objc/TestObjCBreakpoints.py (1337 of 2357) PASS: lldb-unit :: Process/Utility/./ProcessUtilityTests/RegisterContext_x86Test.AbridgedToFullTagWord (1338 of 2357) PASS: lldb-unit :: DataFormatter/./LLDBFormatterTests/StringPrinterTests.CxxUTF8 (1339 of 2357) PASS: lldb-shell :: Expr/TestMultilineExpr.test (1340 of 2357) PASS: lldb-unit :: Utility/./UtilityTests/UriParserTest.Minimal (1341 of 2357) PASS: lldb-shell :: ObjectFile/ELF/netbsd-core-amd64.test (1342 of 2357) PASS: lldb-api :: commands/expression/radar_8638051/Test8638051.py (1343 of 2357) PASS: lldb-api :: types/TestIntegerType.py (1344 of 2357) PASS: lldb-unit :: ScriptInterpreter/Python/./ScriptInterpreterPythonTests/PythonDataObjectsTest.TestGlobalNameResolutionWithDot (1345 of 2357) PASS: lldb-api :: types/TestShortTypeExpr.py (1346 of 2357) PASS: lldb-api :: commands/expression/rdar44436068/Test128BitsInteger.py (1347 of 2357) PASS: lldb-unit :: Utility/./UtilityTests/ScalarTest.Equality (1348 of 2357) PASS: lldb-unit :: Process/Utility/./ProcessUtilityTests/ProcMapTests/LinuxProcMapsTestFixture.ParseMapRegions/6 (1349 of 2357) PASS: lldb-api :: commands/settings/TestSettings.py (1350 of 2357) PASS: lldb-api :: lang/cpp/static_members/TestCPPStaticMembers.py (1351 of 2357) UNSUPPORTED: lldb-shell :: SymbolFile/PDB/vbases.test (1352 of 2357) PASS: lldb-unit :: Utility/./UtilityTests/AnsiTerminal.Unknown (1353 of 2357) PASS: lldb-api :: macosx/order/TestOrderFile.py (1354 of 2357) PASS: lldb-unit :: UnwindAssembly/x86/./UnwindAssemblyx86Tests/Testx86AssemblyInspectionEngine.Testi386IgnoredRegisters (1355 of 2357) PASS: lldb-shell :: ObjectFile/ELF/eh_frame-symbols.yaml (1356 of 2357) PASS: lldb-api :: commands/command/script/import/rdar-12586188/TestRdar12586188.py (1357 of 2357) PASS: lldb-api :: functionalities/thread/concurrent_events/TestConcurrentDelayedCrashWithBreakpointWatchpoint.py (1358 of 2357) PASS: lldb-unit :: ScriptInterpreter/Python/./ScriptInterpreterPythonTests/PythonDataObjectsTest.TestPythonTupleSize (1359 of 2357) PASS: lldb-unit :: Target/./TargetTests/StackFrameRecognizerTest.NullModuleRegex (1360 of 2357) PASS: lldb-api :: lang/c/record_decl_in_expr/TestRecordDeclInExpr.py (1361 of 2357) UNSUPPORTED: lldb-shell :: SymbolFile/DWARF/x86/dwarf5-line-strp.s (1362 of 2357) PASS: lldb-api :: functionalities/breakpoint/auto_continue/TestBreakpointAutoContinue.py (1363 of 2357) PASS: lldb-unit :: Utility/./UtilityTests/ProcessInstanceInfo.DumpTable_invalidUID (1364 of 2357) PASS: lldb-api :: commands/watchpoints/multiple_threads/TestWatchpointMultipleThreads.py (1365 of 2357) PASS: lldb-api :: functionalities/data-formatter/var-in-aggregate-misuse/TestVarInAggregateMisuse.py (1366 of 2357) PASS: lldb-shell :: SymbolFile/NativePDB/load-pdb.cpp (1367 of 2357) PASS: lldb-unit :: ScriptInterpreter/Python/./ScriptInterpreterPythonTests/PythonDataObjectsTest.TestPythonString (1368 of 2357) PASS: lldb-unit :: Process/minidump/./LLDBMinidumpTests/RegisterContextMinidump.ConvertMinidumpContext_x86_64 (1369 of 2357) UNSUPPORTED: lldb-shell :: Breakpoint/case-insensitive.test (1370 of 2357) PASS: lldb-unit :: Utility/./UtilityTests/OptionsWithRawTest.EmptySuffixSingleWhitespace (1371 of 2357) PASS: lldb-api :: functionalities/tail_call_frames/cross_dso/TestCrossDSOTailCalls.py (1372 of 2357) PASS: lldb-api :: python_api/type/TestTypeList.py (1373 of 2357) PASS: lldb-shell :: ObjectFile/PECOFF/sections.yaml (1374 of 2357) PASS: lldb-shell :: Minidump/breakpad-symbols.test (1375 of 2357) PASS: lldb-api :: functionalities/postmortem/minidump-new/TestMiniDumpNew.py (1376 of 2357) PASS: lldb-unit :: Utility/./UtilityTests/StringListTest.LongestCommonPrefixEmpty (1377 of 2357) PASS: lldb-unit :: Utility/./UtilityTests/NameMatchesTest.Contains (1378 of 2357) PASS: lldb-api :: lang/cpp/namespace/TestNamespace.py (1379 of 2357) PASS: lldb-api :: python_api/findvalue_duplist/TestSBFrameFindValue.py (1380 of 2357) PASS: lldb-api :: functionalities/target-new-solib-notifications/TestModuleLoadedNotifys.py (1381 of 2357) PASS: lldb-shell :: Minidump/fb-dump.test (1382 of 2357) PASS: lldb-api :: lang/cpp/class-template-parameter-pack/TestClassTemplateParameterPack.py (1383 of 2357) PASS: lldb-api :: lang/cpp/alignas_base_class/TestAlignAsBaseClass.py (1384 of 2357) PASS: lldb-api :: lang/c/bitfields/TestBitfields.py (1385 of 2357) PASS: lldb-api :: commands/expression/ir-interpreter/TestIRInterpreter.py (1386 of 2357) PASS: lldb-api :: functionalities/gdb_remote_client/TestqOffsets.py (1387 of 2357) PASS: lldb-api :: lang/c/stepping/TestStepAndBreakpoints.py (1388 of 2357) PASS: lldb-api :: commands/process/signal/TestProcessSignal.py (1389 of 2357) PASS: lldb-api :: api/multiple-targets/TestMultipleTargets.py (1390 of 2357) PASS: lldb-shell :: ObjectFile/Breakpad/sections-trailing-func.test (1391 of 2357) PASS: lldb-api :: macosx/DBGSourcePathRemapping/TestDSYMSourcePathRemapping.py (1392 of 2357) PASS: lldb-api :: functionalities/gdb_remote_client/TestPartialGPacket.py (1393 of 2357) PASS: lldb-unit :: Utility/./UtilityTests/FileSpecTest.IsRelative (1394 of 2357) PASS: lldb-api :: commands/expression/formatters/TestFormatters.py (1395 of 2357) PASS: lldb-api :: tools/lldb-server/TestGdbRemoteProcessInfo.py (1396 of 2357) PASS: lldb-api :: functionalities/history/TestHistoryRecall.py (1397 of 2357) PASS: lldb-unit :: ScriptInterpreter/Python/./ScriptInterpreterPythonTests/PythonDataObjectsTest.TestPythonFile (1398 of 2357) PASS: lldb-api :: commands/frame/diagnose/virtual-method-call/TestDiagnoseDereferenceVirtualMethodCall.py (1399 of 2357) PASS: lldb-unit :: Utility/./UtilityTests/SharedCluster.ClusterManager (1400 of 2357) PASS: lldb-unit :: Expression/./ExpressionTests/CppModuleConfigurationTest.UnknownLibCppFile (1401 of 2357) PASS: lldb-unit :: Utility/./UtilityTests/TildeExpressionResolver.ResolveFullPath (1402 of 2357) UNSUPPORTED: lldb-shell :: SymbolFile/target-symbols-add-unwind.test (1403 of 2357) PASS: lldb-api :: commands/version/TestVersion.py (1404 of 2357) PASS: lldb-shell :: Quit/TestQuitExitCodeTooManyArgs.test (1405 of 2357) PASS: lldb-api :: functionalities/stop-on-sharedlibrary-load/TestStopOnSharedlibraryEvents.py (1406 of 2357) PASS: lldb-api :: functionalities/data-formatter/data-formatter-skip-summary/TestDataFormatterSkipSummary.py (1407 of 2357) UNSUPPORTED: lldb-api :: functionalities/signal/handle-segv/TestHandleSegv.py (1408 of 2357) PASS: lldb-api :: functionalities/data-formatter/data-formatter-objc/TestDataFormatterObjCNSError.py (1409 of 2357) PASS: lldb-api :: lang/c/array_types/TestArrayTypes.py (1410 of 2357) PASS: lldb-api :: functionalities/thread/concurrent_events/TestConcurrentCrashWithWatchpoint.py (1411 of 2357) PASS: lldb-unit :: Utility/./UtilityTests/VMRange.CollectionContains (1412 of 2357) PASS: lldb-unit :: Utility/./UtilityTests/ArgsTest.ReplaceArgumentAtIndexFarOutOfRange (1413 of 2357) PASS: lldb-unit :: Language/Highlighting/./HighlighterTests/HighlighterTest.ClangCursorPosBeforeOtherToken (1414 of 2357) UNSUPPORTED: lldb-api :: commands/register/register/aarch64_dynamic_regset/TestArm64DynamicRegsets.py (1415 of 2357) PASS: lldb-unit :: Symbol/./SymbolTests/LineEntryTest.GetSameLineContiguousAddressRangeNestedInline (1416 of 2357) PASS: lldb-unit :: Utility/./UtilityTests/DataExtractorTest.GetCStrAtEnd (1417 of 2357) PASS: lldb-api :: functionalities/breakpoint/consecutive_breakpoints/TestConsecutiveBreakpoints.py (1418 of 2357) PASS: lldb-api :: lang/cpp/gmodules/TestWithModuleDebugging.py (1419 of 2357) PASS: lldb-unit :: Utility/./UtilityTests/StreamTeeTest.SetStreamAtIndexOutOfBounds (1420 of 2357) PASS: lldb-unit :: Utility/./UtilityTests/OptionsWithRawTest.MultiWordSuffix (1421 of 2357) PASS: lldb-unit :: Utility/./UtilityTests/ArgsTest.ReplaceArgumentAtIndexEqual (1422 of 2357) PASS: lldb-shell :: Breakpoint/breakpoint-command.test (1423 of 2357) UNSUPPORTED: lldb-shell :: Register/x86-fp-read.test (1424 of 2357) PASS: lldb-unit :: Utility/./UtilityTests/DataExtractorTest.GetCStrAtNullOffset (1425 of 2357) PASS: lldb-api :: functionalities/data-formatter/data-formatter-objc/nsstring/TestDataFormatterNSString.py (1426 of 2357) PASS: lldb-api :: types/TestLongTypes.py (1427 of 2357) PASS: lldb-api :: lang/objc/single-entry-dictionary/TestObjCSingleEntryDictionary.py (1428 of 2357) PASS: lldb-unit :: Process/Utility/./ProcessUtilityTests/ProcMapTests/LinuxProcMapsTestFixture.ParseMapRegions/2 (1429 of 2357) PASS: lldb-unit :: Symbol/./SymbolTests/TestTypeSystemClang.TestConvertAccessTypeToAccessSpecifier (1430 of 2357) PASS: lldb-unit :: Target/./TargetTests/RemoteAwarePlatformTest.TestResolveExecutabelOnClientByPlatform (1431 of 2357) PASS: lldb-api :: functionalities/scripted_process/TestScriptedProcess.py (1432 of 2357) PASS: lldb-unit :: Utility/./UtilityTests/StreamTest.PutHex64ByteOrderBig (1433 of 2357) PASS: lldb-unit :: Process/minidump/./LLDBMinidumpTests/MinidumpParserTest.GetMemoryRegionInfo (1434 of 2357) PASS: lldb-api :: commands/watchpoints/watchpoint_commands/TestWatchpointCommands.py (1435 of 2357) PASS: lldb-unit :: Utility/./UtilityTests/SubsystemRAIITest.SubsystemWithErrorFailure (1436 of 2357) PASS: lldb-api :: functionalities/gdb_remote_client/TestRestartBug.py (1437 of 2357) PASS: lldb-unit :: Symbol/./SymbolTests/TestTypeSystemClang.TestDeletingImplicitCopyCstrDueToMoveCStr (1438 of 2357) UNSUPPORTED: lldb-api :: functionalities/tsan/global_location/TestTsanGlobalLocation.py (1439 of 2357) PASS: lldb-unit :: Utility/./UtilityTests/ProcessInfoTest.Constructor (1440 of 2357) PASS: lldb-api :: commands/target/basic/TestTargetCommand.py (1441 of 2357) UNSUPPORTED: lldb-api :: benchmarks/startup/TestStartupDelays.py (1442 of 2357) PASS: lldb-unit :: Utility/./UtilityTests/FileSpecTest.FileAndDirectoryComponents (1443 of 2357) PASS: lldb-api :: lang/objc/objc-ivar-offsets/TestObjCIvarOffsets.py (1444 of 2357) UNSUPPORTED: lldb-api :: functionalities/darwin_log/source/debug/TestDarwinLogSourceDebug.py (1445 of 2357) PASS: lldb-shell :: Watchpoint/SetErrorCases.test (1446 of 2357) PASS: lldb-api :: tools/lldb-server/TestGdbRemoteSingleStep.py (1447 of 2357) PASS: lldb-unit :: Platform/./LLDBPlatformTests/PlatformDarwinTest.TestParseVersionBuildDir (1448 of 2357) UNSUPPORTED: lldb-api :: lang/objc/ptr_refs/TestPtrRefsObjC.py (1449 of 2357) PASS: lldb-shell :: ObjectFile/wasm/embedded-debug-sections.yaml (1450 of 2357) PASS: lldb-unit :: Utility/./UtilityTests/AnsiTerminal.Basic (1451 of 2357) PASS: lldb-unit :: Host/./HostTests/HostInfoTest.GetAugmentedArchSpec (1452 of 2357) PASS: lldb-unit :: Utility/./UtilityTests/ArchSpecTest.MergeFromMachOUnknown (1453 of 2357) PASS: lldb-api :: functionalities/breakpoint/breakpoint_command/TestRegexpBreakCommand.py (1454 of 2357) PASS: lldb-shell :: SymbolFile/DWARF/x86/DW_AT_declaration-with-children.s (1455 of 2357) PASS: lldb-unit :: Symbol/./SymbolTests/TestTypeSystemClang.TestGetTypeClassNested (1456 of 2357) PASS: lldb-api :: functionalities/float-display/TestFloatDisplay.py (1457 of 2357) PASS: lldb-unit :: Utility/./UtilityTests/RegularExpression.Match (1458 of 2357) PASS: lldb-unit :: Utility/./UtilityTests/StringListTest.JoinNonSpace (1459 of 2357) PASS: lldb-api :: functionalities/data-formatter/data-formatter-stl/libcxx/vbool/TestDataFormatterLibcxxVBool.py (1460 of 2357) PASS: lldb-unit :: Utility/./UtilityTests/BinaryStreamTest.PutULEB128TwoBytes (1461 of 2357) UNSUPPORTED: lldb-shell :: ScriptInterpreter/Lua/breakpoint_function_callback.test (1462 of 2357) PASS: lldb-unit :: Utility/./UtilityTests/OptionsWithRawTest.LeadingSpaceArgs (1463 of 2357) PASS: lldb-shell :: SymbolFile/Breakpad/unwind-via-raSearch.test (1464 of 2357) PASS: lldb-api :: lang/cpp/forward-declared-template-specialization/TestCppForwardDeclaredTemplateSpecialization.py (1465 of 2357) PASS: lldb-api :: functionalities/data-formatter/dump_dynamic/TestDumpDynamic.py (1466 of 2357) PASS: lldb-unit :: ScriptInterpreter/Python/./ScriptInterpreterPythonTests/PythonDataObjectsTest.TestInstanceNameResolutionNoDot (1467 of 2357) PASS: lldb-unit :: Core/./LLDBCoreTests/SourceLocationSpecTest.FileLineColumnComponents (1468 of 2357) UNSUPPORTED: lldb-api :: linux/sepdebugsymlink/TestTargetSymbolsSepDebugSymlink.py (1469 of 2357) PASS: lldb-api :: lang/c/offsetof/TestOffsetof.py (1470 of 2357) PASS: lldb-shell :: ObjectFile/ELF/compressed-sections.yaml (1471 of 2357) PASS: lldb-api :: commands/target/auto-install-main-executable/TestAutoInstallMainExecutable.py (1472 of 2357) PASS: lldb-unit :: Core/./LLDBCoreTests/SourceFileCache.FindSourceFileFound (1473 of 2357) PASS: lldb-unit :: ObjectFile/ELF/./ObjectFileELFTests/ObjectFileELFTest.SectionsResolveConsistently (1474 of 2357) PASS: lldb-unit :: Interpreter/./InterpreterTests/OptionArgParserTest.toScriptLanguage (1475 of 2357) PASS: lldb-api :: lang/c/conflicting-symbol/TestConflictingSymbol.py (1476 of 2357) PASS: lldb-api :: commands/expression/import-std-module/array/TestArrayFromStdModule.py (1477 of 2357) PASS: lldb-unit :: Symbol/./SymbolTests/TestCreateClassTemplateDecl.FindExistingTemplates (1478 of 2357) PASS: lldb-api :: functionalities/gdb_remote_client/TestRecognizeBreakpoint.py (1479 of 2357) PASS: lldb-api :: lang/cpp/limit-debug-info/TestWithLimitDebugInfo.py (1480 of 2357) UNSUPPORTED: lldb-shell :: SymbolFile/PDB/udt-layout.test (1481 of 2357) PASS: lldb-api :: functionalities/gdb_remote_client/TestPlatformClient.py (1482 of 2357) PASS: lldb-unit :: Utility/./UtilityTests/FileSpecTest.FormatFileSpec (1483 of 2357) PASS: lldb-unit :: Process/Utility/./ProcessUtilityTests/ProcSMapTests/LinuxProcSMapsTestFixture.ParseSMapRegions/2 (1484 of 2357) PASS: lldb-shell :: Subprocess/vfork-follow-parent.test (1485 of 2357) PASS: lldb-unit :: Core/./LLDBCoreTests/ModuleSpecTest.TestELFFile (1486 of 2357) PASS: lldb-unit :: Utility/./UtilityTests/ArgsTest.ReplaceArgumentAtIndexLonger (1487 of 2357) PASS: lldb-unit :: ObjectFile/Breakpad/./ObjectFileBreakpadTests/StackCFIRecord.parse (1488 of 2357) PASS: lldb-api :: lang/cpp/template-arguments/TestCppTemplateArguments.py (1489 of 2357) PASS: lldb-unit :: Utility/./UtilityTests/RangeTest.Union (1490 of 2357) PASS: lldb-unit :: Utility/./UtilityTests/ConstStringTest.CompareStringRef (1491 of 2357) PASS: lldb-unit :: UnwindAssembly/x86/./UnwindAssemblyx86Tests/Testx86AssemblyInspectionEngine.TestSimple32bitFrameFunction (1492 of 2357) PASS: lldb-api :: functionalities/memory/tag/TestMemoryTag.py (1493 of 2357) PASS: lldb-unit :: Process/gdb-remote/./ProcessGdbRemoteTests/GDBRemoteCommunicationClientTest.SendTraceSupportedPacket (1494 of 2357) UNSUPPORTED: lldb-api :: functionalities/tsan/multiple/TestTsanMultiple.py (1495 of 2357) UNSUPPORTED: lldb-shell :: Unwind/eh-frame-augment-noop.test (1496 of 2357) PASS: lldb-unit :: Core/./LLDBCoreTests/ModuleSpecTest.TestMachOFile (1497 of 2357) PASS: lldb-api :: functionalities/gdb_remote_client/TestNestedRegDefinitions.py (1498 of 2357) PASS: lldb-unit :: Utility/./UtilityTests/BinaryStreamTest.PutSLEB128EightBytes (1499 of 2357) PASS: lldb-api :: functionalities/data-formatter/data-formatter-caching/TestDataFormatterCaching.py (1500 of 2357) PASS: lldb-api :: functionalities/data-formatter/data-formatter-stl/libcxx/initializerlist/TestInitializerList.py (1501 of 2357) PASS: lldb-unit :: Utility/./UtilityTests/StreamTest.ShiftOperatorStrings (1502 of 2357) PASS: lldb-shell :: Register/Core/x86-32-freebsd-fp.test (1503 of 2357) PASS: lldb-unit :: Interpreter/./InterpreterTests/CompletionTest.FileCompletionAbsolute (1504 of 2357) PASS: lldb-unit :: DataFormatter/./LLDBFormatterTests/TypeMatcherTests.ExactName (1505 of 2357) PASS: lldb-api :: functionalities/show_location/TestShowLocationDwarf5.py (1506 of 2357) PASS: lldb-api :: functionalities/data-formatter/data-formatter-objc/TestDataFormatterObjCPlain.py (1507 of 2357) PASS: lldb-api :: lang/objc/objc++/TestObjCXX.py (1508 of 2357) PASS: lldb-shell :: SymbolFile/DWARF/x86/static_scope.s (1509 of 2357) PASS: lldb-unit :: Symbol/./SymbolTests/Type.CompilerContextPattern (1510 of 2357) PASS: lldb-api :: commands/frame/diagnose/array/TestArray.py (1511 of 2357) PASS: lldb-unit :: Utility/./UtilityTests/StreamTest.AddressRangeInvalidRange (1512 of 2357) PASS: lldb-shell :: Heap/heap-cstr.test (1513 of 2357) PASS: lldb-api :: functionalities/gdb_remote_client/TestMemoryRegionDirtyPages.py (1514 of 2357) PASS: lldb-api :: api/log/TestAPILog.py (1515 of 2357) PASS: lldb-unit :: Utility/./UtilityTests/StreamTest.PutNHex8 (1516 of 2357) PASS: lldb-shell :: SymbolFile/DWARF/x86/debug-types-line-tables.s (1517 of 2357) PASS: lldb-unit :: Process/Utility/./ProcessUtilityTests/ProcMapTests/LinuxProcMapsTestFixture.ParseMapRegions/1 (1518 of 2357) PASS: lldb-unit :: Signals/./SignalsTests/UnixSignalsTest.GetInfo (1519 of 2357) PASS: lldb-unit :: Utility/./UtilityTests/AnsiTerminal.Twice (1520 of 2357) PASS: lldb-shell :: Driver/TestCore.test (1521 of 2357) PASS: lldb-unit :: Utility/./UtilityTests/GeneratorTest.Create (1522 of 2357) PASS: lldb-unit :: Utility/./UtilityTests/Flags.AllClear (1523 of 2357) PASS: lldb-shell :: Breakpoint/debug_rnglist_rlestartend.test (1524 of 2357) PASS: lldb-unit :: ObjectFile/ELF/./ObjectFileELFTests/ObjectFileELFTest.GetModuleSpecifications_EarlySectionHeaders (1525 of 2357) PASS: lldb-api :: macosx/load-kext/TestLoadKext.py (1526 of 2357) UNSUPPORTED: lldb-shell :: SymbolFile/DWARF/debug-types-expressions.test (1527 of 2357) PASS: lldb-unit :: Utility/./UtilityTests/RangeTest.NotEqual (1528 of 2357) PASS: lldb-api :: functionalities/data-formatter/data-formatter-stl/libcxx/variant/TestDataFormatterLibcxxVariant.py (1529 of 2357) UNSUPPORTED: lldb-api :: functionalities/data-formatter/data-formatter-stl/libstdcpp/string/TestDataFormatterStdString.py (1530 of 2357) PASS: lldb-unit :: Utility/./UtilityTests/StringListTest.InsertStringAtIndexStart (1531 of 2357) PASS: lldb-api :: commands/source/info/TestSourceInfo.py (1532 of 2357) PASS: lldb-api :: python_api/file_handle/TestFileHandle.py (1533 of 2357) PASS: lldb-unit :: Symbol/./SymbolTests/TestClangASTImporter.DeportDeclTagDecl (1534 of 2357) UNSUPPORTED: lldb-api :: benchmarks/continue/TestBenchmarkContinue.py (1535 of 2357) PASS: lldb-api :: python_api/objc_type/TestObjCType.py (1536 of 2357) UNSUPPORTED: lldb-shell :: Register/x86-64-zmm-read.test (1537 of 2357) PASS: lldb-api :: functionalities/testid/TestTestId.py (1538 of 2357) PASS: lldb-shell :: Reproducer/TestRelativePath.test (1539 of 2357) PASS: lldb-unit :: Core/./LLDBCoreTests/MangledTest.ResultForValidName (1540 of 2357) PASS: lldb-unit :: Core/./LLDBCoreTests/FormatEntityTest.DefinitionConstructionNameAndString (1541 of 2357) PASS: lldb-api :: functionalities/breakpoint/cpp/TestCPPBreakpointLocations.py (1542 of 2357) UNSUPPORTED: lldb-api :: lang/cpp/function-template-parameter-pack/TestFunctionTemplateParameterPack.py (1543 of 2357) PASS: lldb-unit :: SymbolFile/NativePDB/./SymbolFileNativePDBTests/PDBFPOProgramToDWARFExpressionTests.MissingTargetRegister (1544 of 2357) PASS: lldb-unit :: Utility/./UtilityTests/TimerTest.CategoryTimes (1545 of 2357) PASS: lldb-api :: lang/objcxx/cxx-bridged-po/TestObjCXXBridgedPO.py (1546 of 2357) PASS: lldb-shell :: Register/Core/x86-64-netbsd-gp.test (1547 of 2357) PASS: lldb-unit :: Utility/./UtilityTests/UriParserTest.LongPath (1548 of 2357) PASS: lldb-api :: commands/apropos/basic/TestApropos.py (1549 of 2357) PASS: lldb-unit :: Process/gdb-remote/./ProcessGdbRemoteTests/GDBRemoteClientBaseTest.SendContinueAndInterrupt (1550 of 2357) PASS: lldb-api :: lang/cpp/template/TestTemplateArgs.py (1551 of 2357) PASS: lldb-unit :: Utility/./UtilityTests/ArchSpecTest.TripleComponentsWereSpecified (1552 of 2357) PASS: lldb-unit :: Utility/./UtilityTests/GeneratorTest.GetOrCreate (1553 of 2357) PASS: lldb-unit :: Host/./HostTests/MainLoopTest.ReadObject (1554 of 2357) PASS: lldb-unit :: Utility/./UtilityTests/OptionsWithRawTest.EmptySuffix (1555 of 2357) PASS: lldb-api :: lang/cpp/global_variables/TestCPPGlobalVariables.py (1556 of 2357) PASS: lldb-unit :: Host/./HostTests/SocketTests/SocketTest.TCPListen0ConnectAccept/ipv6 (1557 of 2357) PASS: lldb-api :: commands/command/delete/TestCommandDelete.py (1558 of 2357) PASS: lldb-api :: lang/cpp/symbols/TestSymbols.py (1559 of 2357) UNSUPPORTED: lldb-api :: functionalities/darwin_log/filter/regex/activity-chain/TestDarwinLogFilterRegexActivityChain.py (1560 of 2357) PASS: lldb-shell :: SymbolFile/DWARF/x86/dwp-separate-debug-file.cpp (1561 of 2357) PASS: lldb-shell :: Reproducer/TestMultipleTargets.test (1562 of 2357) PASS: lldb-unit :: Utility/./UtilityTests/TimeoutTest.Construction (1563 of 2357) PASS: lldb-unit :: Host/./HostTests/Host.GetEnvironment (1564 of 2357) PASS: lldb-shell :: SymbolFile/Breakpad/line-table-edgecases.test (1565 of 2357) UNSUPPORTED: lldb-api :: commands/expression/multiline-navigation/TestMultilineNavigation.py (1566 of 2357) PASS: lldb-api :: lang/objc/objc-property/TestObjCProperty.py (1567 of 2357) PASS: lldb-api :: commands/watchpoints/hello_watchpoint/TestMyFirstWatchpoint.py (1568 of 2357) PASS: lldb-api :: lang/c/enum_types/TestEnumTypes.py (1569 of 2357) UNSUPPORTED: lldb-shell :: ScriptInterpreter/Lua/lua-python.test (1570 of 2357) PASS: lldb-unit :: Symbol/./SymbolTests/TestClangASTImporter.DeportTypeTagDecl (1571 of 2357) PASS: lldb-api :: functionalities/data-formatter/data-formatter-stl/libcxx/queue/TestDataFormatterLibcxxQueue.py (1572 of 2357) PASS: lldb-api :: functionalities/data-formatter/frameformat_smallstruct/TestFrameFormatSmallStruct.py (1573 of 2357) PASS: lldb-api :: python_api/watchpoint/TestWatchpointIgnoreCount.py (1574 of 2357) PASS: lldb-shell :: SymbolFile/NativePDB/break-by-line.cpp (1575 of 2357) PASS: lldb-unit :: SymbolFile/DWARF/./SymbolFileDWARFTests/SymbolFileDWARFTests.TestAbbrevOrder1Start5 (1576 of 2357) PASS: lldb-api :: lang/c/vla/TestVLA.py (1577 of 2357) PASS: lldb-api :: python_api/watchpoint/watchlocation/TestSetWatchlocation.py (1578 of 2357) PASS: lldb-unit :: Target/./TargetTests/MemoryRegionInfoTest.Formatv (1579 of 2357) PASS: lldb-unit :: ScriptInterpreter/Python/./ScriptInterpreterPythonTests/PythonDataObjectsTest.TestBorrowedReferences (1580 of 2357) PASS: lldb-api :: functionalities/breakpoint/breakpoint_conditions/TestBreakpointConditions.py (1581 of 2357) PASS: lldb-unit :: Utility/./UtilityTests/StreamTest.AddressRangeEmptyRange (1582 of 2357) PASS: lldb-unit :: Utility/./UtilityTests/RangeDataVector.FindEntryThatContains_Overlap (1583 of 2357) PASS: lldb-unit :: Utility/./UtilityTests/RangeTest.ContainsAddr (1584 of 2357) PASS: lldb-shell :: Commands/CommandScriptImmediateOutput/CommandScriptImmediateOutputConsole.test (1585 of 2357) PASS: lldb-api :: functionalities/gdb_remote_client/TestHaltFails.py (1586 of 2357) PASS: lldb-unit :: Symbol/./SymbolTests/TestTypeSystemClang.TestDisplayNameEmpty (1587 of 2357) UNSUPPORTED: lldb-api :: commands/register/register/intel_xtended_registers/mpx_bound_violation/TestBoundViolation.py (1588 of 2357) PASS: lldb-unit :: Utility/./UtilityTests/ListenerTest.GetEventImmediate (1589 of 2357) PASS: lldb-api :: commands/expression/import-std-module/sysroot/TestStdModuleSysroot.py (1590 of 2357) PASS: lldb-api :: commands/expression/import-std-module/conflicts/TestStdModuleWithConflicts.py (1591 of 2357) PASS: lldb-unit :: SymbolFile/NativePDB/./SymbolFileNativePDBTests/PDBFPOProgramToDWARFExpressionTests.InvalidOpBinary (1592 of 2357) PASS: lldb-unit :: Utility/./UtilityTests/StringListTest.LongestCommonPrefixDuplicateElement (1593 of 2357) PASS: lldb-unit :: Utility/./UtilityTests/BinaryStreamTest.PutSLEB128Zero (1594 of 2357) PASS: lldb-api :: functionalities/data-formatter/hexcaps/TestDataFormatterHexCaps.py (1595 of 2357) PASS: lldb-shell :: Commands/command-regex-unalias.test (1596 of 2357) PASS: lldb-unit :: Utility/./UtilityTests/StreamTeeTest.SetStreamAtIndexOverwrite (1597 of 2357) PASS: lldb-api :: commands/frame/var-scope/TestFrameVariableScope.py (1598 of 2357) UNSUPPORTED: lldb-shell :: Register/x86-64-ymm16-read.test (1599 of 2357) PASS: lldb-api :: lang/cpp/nsimport/TestCppNsImport.py (1600 of 2357) PASS: lldb-unit :: Utility/./UtilityTests/Predicate.WaitForValueNotEqualTo (1601 of 2357) PASS: lldb-unit :: Utility/./UtilityTests/StringExtractorTest.GetU32BigEndian (1602 of 2357) PASS: lldb-unit :: UnwindAssembly/x86/./UnwindAssemblyx86Tests/Testx86AssemblyInspectionEngine.TestPushImm (1603 of 2357) PASS: lldb-api :: functionalities/thread/concurrent_events/TestConcurrentManyBreakpoints.py (1604 of 2357) PASS: lldb-shell :: Driver/TestUseColor.test (1605 of 2357) PASS: lldb-unit :: UnwindAssembly/x86/./UnwindAssemblyx86Tests/Testx86AssemblyInspectionEngine.TestDisassemblyMidFunctionEpilogues (1606 of 2357) PASS: lldb-shell :: SymbolFile/DWARF/x86/dwo-type-in-main-file.s (1607 of 2357) UNSUPPORTED: lldb-api :: functionalities/darwin_log/filter/regex/message/TestDarwinLogFilterRegexMessage.py (1608 of 2357) PASS: lldb-api :: functionalities/thread/backtrace_all/TestBacktraceAll.py (1609 of 2357) PASS: lldb-unit :: Core/./LLDBCoreTests/CommunicationTest.SynchronizeWhileClosing (1610 of 2357) UNSUPPORTED: lldb-shell :: Reproducer/TestLuaImport.test (1611 of 2357) PASS: lldb-api :: lang/cpp/elaborated-types/TestElaboratedTypes.py (1612 of 2357) PASS: lldb-unit :: Utility/./UtilityTests/StringLexerTest.HasAtLeast (1613 of 2357) PASS: lldb-api :: commands/watchpoints/watchpoint_commands/command/TestWatchpointCommandLLDB.py (1614 of 2357) PASS: lldb-unit :: Utility/./UtilityTests/RegisterValueTest.GetScalarValue (1615 of 2357) PASS: lldb-unit :: Symbol/./SymbolTests/TestClangASTImporter.CompleteFwdDeclWithOtherOrigin (1616 of 2357) PASS: lldb-api :: lang/objcxx/class-name-clash/TestNameClash.py (1617 of 2357) PASS: lldb-api :: functionalities/data-formatter/data-formatter-stl/libcxx/map/TestDataFormatterLibccMap.py (1618 of 2357) PASS: lldb-shell :: ObjectFile/Breakpad/uuid-matching-mac.test (1619 of 2357) PASS: lldb-unit :: ScriptInterpreter/Python/./ScriptInterpreterPythonTests/PythonDataObjectsTest.TestCallable (1620 of 2357) PASS: lldb-unit :: Process/gdb-remote/./ProcessGdbRemoteTests/GDBRemoteClientBaseTest.SendContinueDelegateStructuredDataReceipt (1621 of 2357) PASS: lldb-api :: lang/cpp/gmodules-templates/TestGModules.py (1622 of 2357) PASS: lldb-api :: lang/cpp/trivial_abi/TestTrivialABI.py (1623 of 2357) PASS: lldb-api :: commands/expression/context-object/TestContextObject.py (1624 of 2357) PASS: lldb-unit :: Expression/./ExpressionTests/CppModuleConfigurationTest.Sysroot (1625 of 2357) PASS: lldb-unit :: Utility/./UtilityTests/ProcessInstanceInfo.DumpTable (1626 of 2357) PASS: lldb-api :: functionalities/thread/concurrent_events/TestConcurrentDelaySignalBreak.py (1627 of 2357) PASS: lldb-unit :: Utility/./UtilityTests/ScalarTest.Getters (1628 of 2357) PASS: lldb-unit :: Utility/./UtilityTests/SubsystemRAIITest.NormalSubsystem (1629 of 2357) UNSUPPORTED: lldb-api :: lang/cpp/printf/TestPrintf.py (1630 of 2357) PASS: lldb-unit :: Utility/./UtilityTests/VMRange.Ordering (1631 of 2357) PASS: lldb-api :: python_api/symbol-context/two-files/TestSymbolContextTwoFiles.py (1632 of 2357) PASS: lldb-shell :: ScriptInterpreter/None/import_module.test (1633 of 2357) PASS: lldb-api :: commands/watchpoints/watchpoint_count/TestWatchpointCount.py (1634 of 2357) PASS: lldb-api :: functionalities/data-formatter/data-formatter-smart-array/TestDataFormatterSmartArray.py (1635 of 2357) PASS: lldb-unit :: Utility/./UtilityTests/StreamTest.PutULEB128 (1636 of 2357) PASS: lldb-api :: functionalities/tail_call_frames/sbapi_support/TestTailCallFrameSBAPI.py (1637 of 2357) PASS: lldb-api :: functionalities/breakpoint/address_breakpoints/TestAddressBreakpoints.py (1638 of 2357) PASS: lldb-api :: tools/lldb-server/commandline/TestStubSetSID.py (1639 of 2357) PASS: lldb-shell :: Commands/command-image-lookup.yaml (1640 of 2357) PASS: lldb-shell :: Quit/TestQuitExitCode0.test (1641 of 2357) PASS: lldb-shell :: SymbolFile/DWARF/x86/dir-separator-no-comp-dir-relative-name.s (1642 of 2357) PASS: lldb-api :: functionalities/pre_run_dylibs/TestPreRunDylibs.py (1643 of 2357) PASS: lldb-api :: functionalities/data-formatter/data-formatter-stl/libcxx/deque/TestDataFormatterLibcxxDeque.py (1644 of 2357) PASS: lldb-unit :: Utility/./UtilityTests/DataExtractorTest.PeekData (1645 of 2357) PASS: lldb-unit :: Utility/./UtilityTests/StringExtractorTest.DecodeHexU8_Underflow2 (1646 of 2357) PASS: lldb-api :: functionalities/data-formatter/format-propagation/TestFormatPropagation.py (1647 of 2357) PASS: lldb-api :: python_api/value_var_update/TestValueVarUpdate.py (1648 of 2357) PASS: lldb-unit :: Utility/./UtilityTests/VASprintfTest.BufferResize (1649 of 2357) PASS: lldb-unit :: Host/./HostTests/HostInfoTest.GetXcodeSDK (1650 of 2357) PASS: lldb-unit :: Process/gdb-remote/./ProcessGdbRemoteTests/GDBRemoteCommunicationClientTest.SendSignalsToIgnore (1651 of 2357) PASS: lldb-unit :: Utility/./UtilityTests/UriParserTest.BadPort2 (1652 of 2357) UNSUPPORTED: lldb-api :: iohandler/resize/TestIOHandlerResize.py (1653 of 2357) PASS: lldb-unit :: Interpreter/./InterpreterTests/OptionValueFileColonLine.setFromString (1654 of 2357) PASS: lldb-unit :: Utility/./UtilityTests/ArgsTest.TestInsertArg (1655 of 2357) PASS: lldb-api :: functionalities/data-formatter/data-formatter-synth/TestDataFormatterSynth.py (1656 of 2357) PASS: lldb-shell :: SymbolFile/Breakpad/line-table.test (1657 of 2357) UNSUPPORTED: lldb-api :: tools/lldb-server/libraries-svr4/TestGdbRemoteLibrariesSvr4Support.py (1658 of 2357) PASS: lldb-api :: python_api/watchpoint/watchlocation/TestTargetWatchAddress.py (1659 of 2357) PASS: lldb-unit :: Process/gdb-remote/./ProcessGdbRemoteTests/GDBRemoteClientBaseTest.InterruptNoResponse (1660 of 2357) PASS: lldb-unit :: Expression/./ExpressionTests/CppModuleConfigurationTest.MissingLibCpp (1661 of 2357) PASS: lldb-unit :: Utility/./UtilityTests/RangeTest.ContainsRange (1662 of 2357) PASS: lldb-api :: functionalities/abbreviation/TestCommonShortSpellings.py (1663 of 2357) UNSUPPORTED: lldb-api :: tools/lldb-server/TestGdbRemoteModuleInfo.py (1664 of 2357) PASS: lldb-unit :: Host/./HostTests/FileSystemTest.Readable (1665 of 2357) PASS: lldb-api :: commands/target/stop-hooks/TestStopHooks.py (1666 of 2357) PASS: lldb-api :: lang/cpp/enum_types/TestCPP11EnumTypes.py (1667 of 2357) PASS: lldb-unit :: Utility/./UtilityTests/UriParserTest.MinimalPortPath (1668 of 2357) PASS: lldb-shell :: SymbolFile/DWARF/DW_AT_range-DW_FORM_sec_offset.s (1669 of 2357) PASS: lldb-api :: functionalities/step_scripted/TestStepScripted.py (1670 of 2357) PASS: lldb-api :: macosx/find-app-in-bundle/TestFindAppInBundle.py (1671 of 2357) PASS: lldb-unit :: Utility/./UtilityTests/NameMatchesTest.StartsWith (1672 of 2357) PASS: lldb-unit :: Symbol/./SymbolTests/TestTypeSystemClang.TestOwningModule (1673 of 2357) PASS: lldb-shell :: SymbolFile/DWARF/x86/gnu-style-compression.cpp (1674 of 2357) PASS: lldb-unit :: Process/minidump/./LLDBMinidumpTests/MinidumpParserTest.GetMiscInfoWindows (1675 of 2357) PASS: lldb-api :: functionalities/thread/concurrent_events/TestConcurrentTwoWatchpointsOneBreakpoint.py (1676 of 2357) PASS: lldb-shell :: Register/Core/x86-64-netbsd-fp.test (1677 of 2357) PASS: lldb-api :: commands/expression/import-std-module/vector-dbg-info-content/TestDbgInfoContentVectorFromStdModule.py (1678 of 2357) XFAIL: lldb-shell :: Register/x86-64-fp-write.test (1679 of 2357) PASS: lldb-unit :: Utility/./UtilityTests/RegularExpression.CopyAssignment (1680 of 2357) PASS: lldb-shell :: Quit/TestQuitExitCodeHex0.test (1681 of 2357) PASS: lldb-api :: functionalities/thread/step_out/TestThreadStepOut.py (1682 of 2357) UNSUPPORTED: lldb-api :: commands/gui/basicdebug/TestGuiBasicDebug.py (1683 of 2357) PASS: lldb-api :: lang/objc/blocks/TestObjCIvarsInBlocks.py (1684 of 2357) PASS: lldb-api :: functionalities/type_get_module/TestTypeGetModule.py (1685 of 2357) PASS: lldb-shell :: SymbolFile/DWARF/x86/dwp.s (1686 of 2357) PASS: lldb-shell :: ObjectFile/ELF/many-sections.s (1687 of 2357) PASS: lldb-api :: lang/cpp/virtual-overload/TestVirtualOverload.py (1688 of 2357) PASS: lldb-api :: lang/c/stepping/TestThreadStepping.py (1689 of 2357) PASS: lldb-unit :: Host/./HostTests/SocketTests/SocketTest.TCPListen0ConnectAccept/ipv4 (1690 of 2357) PASS: lldb-unit :: Utility/./UtilityTests/RegularExpression.Invalid (1691 of 2357) PASS: lldb-api :: functionalities/thread/num_threads/TestNumThreads.py (1692 of 2357) PASS: lldb-unit :: ScriptInterpreter/Python/./ScriptInterpreterPythonTests/PythonDataObjectsTest.TestPythonDictionaryValueEquality (1693 of 2357) PASS: lldb-unit :: Utility/./UtilityTests/ArchSpecTest.MergeFrom (1694 of 2357) PASS: lldb-unit :: UnwindAssembly/x86/./UnwindAssemblyx86Tests/Testx86AssemblyInspectionEngine.TestReturnDetect (1695 of 2357) PASS: lldb-api :: python_api/lldbutil/iter/TestRegistersIterator.py (1696 of 2357) PASS: lldb-api :: python_api/sbenvironment/TestSBEnvironment.py (1697 of 2357) UNSUPPORTED: lldb-shell :: SymbolFile/PDB/class-layout.test (1698 of 2357) PASS: lldb-api :: lang/objc/modules-auto-import/TestModulesAutoImport.py (1699 of 2357) UNSUPPORTED: lldb-shell :: BuildScript/toolchain-msvc.test (1700 of 2357) PASS: lldb-unit :: Utility/./UtilityTests/UriParserTest.BracketedHostnameWithPortIPv4 (1701 of 2357) PASS: lldb-unit :: Utility/./UtilityTests/StreamTest.PutHex64ByteOrderLittle (1702 of 2357) PASS: lldb-shell :: Commands/CommandScriptImmediateOutput/CommandScriptImmediateOutputFile.test (1703 of 2357) PASS: lldb-unit :: Utility/./UtilityTests/BroadcasterTest.BroadcastEvent (1704 of 2357) PASS: lldb-unit :: Utility/./UtilityTests/ArgsTest.ReplaceArgumentAtIndexShort (1705 of 2357) UNSUPPORTED: lldb-api :: commands/watchpoints/hello_watchlocation/TestWatchLocation.py (1706 of 2357) PASS: lldb-unit :: Core/./LLDBCoreTests/SourceFileCache.FindSourceFileNotFound (1707 of 2357) UNSUPPORTED: lldb-api :: tools/lldb-server/registers-target-xml-reading/TestGdbRemoteTargetXmlPacket.py (1708 of 2357) PASS: lldb-unit :: Utility/./UtilityTests/DataExtractorTest.GetFloatUnaligned (1709 of 2357) PASS: lldb-shell :: ObjectFile/MachO/lc_build_version_notools.yaml (1710 of 2357) PASS: lldb-shell :: Reproducer/TestDump.test (1711 of 2357) PASS: lldb-api :: commands/target/select/TestTargetSelect.py (1712 of 2357) PASS: lldb-unit :: UnwindAssembly/x86/./UnwindAssemblyx86Tests/Testx86AssemblyInspectionEngine.TestPopR13 (1713 of 2357) PASS: lldb-unit :: Language/Highlighting/./HighlighterTests/HighlighterTest.ClangStringLiterals (1714 of 2357) PASS: lldb-unit :: Interpreter/./InterpreterTests/TestProperties.DeepCopy (1715 of 2357) PASS: lldb-api :: lang/cpp/call-function/TestCallCPPFunction.py (1716 of 2357) PASS: lldb-api :: sample_test/TestSampleTest.py (1717 of 2357) PASS: lldb-unit :: Utility/./UtilityTests/ArgsTest.StringListConstructor (1718 of 2357) PASS: lldb-shell :: Reproducer/TestGDBRemoteRepro.test (1719 of 2357) PASS: lldb-unit :: Host/./HostTests/SocketTests/SocketTest.TCPListen0GetPort/ipv6 (1720 of 2357) PASS: lldb-api :: functionalities/data-formatter/data-formatter-stl/libcxx/unique_ptr/TestDataFormatterLibcxxUniquePtr.py (1721 of 2357) PASS: lldb-unit :: ScriptInterpreter/Python/./ScriptInterpreterPythonTests/PythonDataObjectsTest.TestPythonListValueEquality (1722 of 2357) PASS: lldb-api :: lang/cpp/operators/TestCppOperators.py (1723 of 2357) UNSUPPORTED: lldb-api :: benchmarks/expression/TestExpressionCmd.py (1724 of 2357) PASS: lldb-unit :: Language/Highlighting/./HighlighterTests/HighlighterTest.DefaultHighlighterWithCursorOutOfBounds (1725 of 2357) PASS: lldb-unit :: Language/CPlusPlus/./LanguageCPlusPlusTests/CPlusPlusLanguage.ExtractContextAndIdentifier (1726 of 2357) PASS: lldb-api :: functionalities/data-formatter/data-formatter-objc/TestDataFormatterObjCNSURL.py (1727 of 2357) PASS: lldb-api :: commands/expression/fixits/TestFixIts.py (1728 of 2357) PASS: lldb-unit :: Utility/./UtilityTests/FileSpecTest.EqualDotsPosixRoot (1729 of 2357) PASS: lldb-unit :: Utility/./UtilityTests/BinaryStreamTest.PutULEB128ThreeBytes (1730 of 2357) PASS: lldb-api :: commands/expression/import-std-module/forward_list/TestForwardListFromStdModule.py (1731 of 2357) PASS: lldb-shell :: SymbolFile/DWARF/x86/dwarf5-partial-index.cpp (1732 of 2357) PASS: lldb-shell :: Reproducer/Functionalities/TestDataFormatter.test (1733 of 2357) PASS: lldb-api :: functionalities/data-formatter/data-formatter-stl/libcxx/multimap/TestDataFormatterLibccMultiMap.py (1734 of 2357) PASS: lldb-api :: lang/objc/exceptions/TestObjCExceptions.py (1735 of 2357) PASS: lldb-unit :: Interpreter/./InterpreterTests/OptionArgParserTest.toBoolean (1736 of 2357) PASS: lldb-api :: functionalities/breakpoint/serialize/TestBreakpointSerialization.py (1737 of 2357) PASS: lldb-api :: commands/expression/persist_objc_pointeetype/TestPersistObjCPointeeType.py (1738 of 2357) PASS: lldb-unit :: Utility/./UtilityTests/XcodeSDKTest.FindXcodeContentsDirectoryInPath (1739 of 2357) UNSUPPORTED: lldb-shell :: SymbolFile/PDB/function-nested-block.test (1740 of 2357) PASS: lldb-api :: functionalities/paths/TestPaths.py (1741 of 2357) PASS: lldb-shell :: Unwind/thread-step-out-ret-addr-check.test (1742 of 2357) PASS: lldb-api :: tools/lldb-server/signal-filtering/TestGdbRemote_QPassSignals.py (1743 of 2357) PASS: lldb-unit :: Symbol/./SymbolTests/TestTypeSystemClang.TestRemoveFastQualifiers (1744 of 2357) PASS: lldb-unit :: Utility/./UtilityTests/CompletionRequest.DuplicateFiltering (1745 of 2357) PASS: lldb-shell :: SymbolFile/DWARF/x86/debug-types-dwarf5.s (1746 of 2357) PASS: lldb-api :: lang/cpp/namespace_conflicts/TestNamespaceConflicts.py (1747 of 2357) PASS: lldb-api :: commands/expression/argument_passing_restrictions/TestArgumentPassingRestrictions.py (1748 of 2357) PASS: lldb-shell :: Breakpoint/debug_rnglist_offset_pair.test (1749 of 2357) UNSUPPORTED: lldb-shell :: SymbolFile/PDB/expressions.test (1750 of 2357) PASS: lldb-api :: functionalities/thread/concurrent_events/TestConcurrentDelaySignalWatch.py (1751 of 2357) PASS: lldb-api :: lang/cpp/class_static/TestStaticVariables.py (1752 of 2357) PASS: lldb-api :: functionalities/thread/state_after_expression/TestStateAfterExpression.py (1753 of 2357) PASS: lldb-unit :: Utility/./UtilityTests/BinaryStreamTest.PutULEB128NineBytes (1754 of 2357) PASS: lldb-api :: lang/cpp/keywords_enabled/TestCppKeywordsEnabled.py (1755 of 2357) PASS: lldb-shell :: Driver/TestTarget.test (1756 of 2357) PASS: lldb-api :: functionalities/gdb_remote_client/TestTargetXMLArch.py (1757 of 2357) PASS: lldb-unit :: Utility/./UtilityTests/ArchSpecTest.TestParseMachCPUDashSubtypeTripleSimple (1758 of 2357) PASS: lldb-unit :: Language/Highlighting/./HighlighterTests/HighlighterTest.FallbackHighlighter (1759 of 2357) PASS: lldb-unit :: Language/Highlighting/./HighlighterTests/HighlighterTest.DefaultHighlighter (1760 of 2357) PASS: lldb-api :: lang/objcxx/cpp_keywords_enabled/TestObjCppKeywordsEnabled.py (1761 of 2357) PASS: lldb-api :: functionalities/thread/jump/TestThreadJump.py (1762 of 2357) PASS: lldb-api :: functionalities/multidebugger_commands/TestMultipleDebuggersCommands.py (1763 of 2357) PASS: lldb-unit :: Core/./LLDBCoreTests/RichManglingContextTest.SwitchProvider (1764 of 2357) PASS: lldb-unit :: Utility/./UtilityTests/RangeTest.SizeTypes (1765 of 2357) PASS: lldb-api :: functionalities/data-formatter/poarray/TestPrintObjectArray.py (1766 of 2357) PASS: lldb-unit :: Utility/./UtilityTests/ListenerTest.GetEventWait (1767 of 2357) UNSUPPORTED: lldb-api :: arm/breakpoint-it/TestBreakpointIt.py (1768 of 2357) PASS: lldb-api :: commands/frame/diagnose/dereference-function-return/TestDiagnoseDereferenceFunctionReturn.py (1769 of 2357) PASS: lldb-unit :: Utility/./UtilityTests/DataExtractorTest.GetCStrUnterminated (1770 of 2357) PASS: lldb-shell :: ObjectFile/ELF/section-types-edgecases.yaml (1771 of 2357) PASS: lldb-unit :: Thread/./ThreadTests/ThreadTest.GetPrivateStopInfo (1772 of 2357) PASS: lldb-unit :: Host/./HostTests/SocketTests/SocketTest.TCPGetAddress/ipv4 (1773 of 2357) PASS: lldb-api :: lang/c/blocks/TestBlocks.py (1774 of 2357) PASS: lldb-api :: lang/cpp/virtual-functions/TestCppVirtualFunctions.py (1775 of 2357) PASS: lldb-shell :: SymbolFile/NativePDB/break-by-function.cpp (1776 of 2357) PASS: lldb-api :: functionalities/recursion/TestValueObjectRecursion.py (1777 of 2357) UNSUPPORTED: lldb-shell :: Unwind/unwind-plan-dwarf-dump.test (1778 of 2357) PASS: lldb-unit :: Utility/./UtilityTests/StringListTest.SplitIntoLines (1779 of 2357) PASS: lldb-api :: lang/objc/objc-baseclass-sbtype/TestObjCBaseClassSBType.py (1780 of 2357) PASS: lldb-api :: lang/cpp/class_types/TestClassTypes.py (1781 of 2357) PASS: lldb-shell :: Minidump/Windows/Sigsegv/sigsegv.test (1782 of 2357) PASS: lldb-unit :: Signals/./SignalsTests/UnixSignalsTest.VersionChange (1783 of 2357) PASS: lldb-unit :: Utility/./UtilityTests/FileSpecTest.RemoveLastPathComponent (1784 of 2357) UNSUPPORTED: lldb-shell :: Register/x86-64-gp-write.test (1785 of 2357) PASS: lldb-unit :: Process/minidump/./LLDBMinidumpTests/MinidumpParserTest.MinidumpDuplicateModuleMinAddress (1786 of 2357) PASS: lldb-unit :: Host/./HostTests/HostInfoTest.GetHostname (1787 of 2357) PASS: lldb-unit :: Utility/./UtilityTests/StreamTest.Indent (1788 of 2357) PASS: lldb-unit :: Utility/./UtilityTests/UriParserTest.BracketedHostnameWithColon (1789 of 2357) PASS: lldb-api :: commands/expression/scoped_enums/TestScopedEnumType.py (1790 of 2357) UNSUPPORTED: lldb-api :: python_api/event/TestEvents.py (1791 of 2357) PASS: lldb-api :: api/multiple-debuggers/TestMultipleDebuggers.py (1792 of 2357) PASS: lldb-unit :: DataFormatter/./LLDBFormatterTests/TypeMatcherTests.CreatedBySameMatchStringExactNamePrefixes (1793 of 2357) PASS: lldb-unit :: Utility/./UtilityTests/StringListTest.ShiftCString (1794 of 2357) UNSUPPORTED: lldb-api :: functionalities/darwin_log/source/info/TestDarwinLogSourceInfo.py (1795 of 2357) PASS: lldb-shell :: ObjectFile/PECOFF/symbol.yaml (1796 of 2357) PASS: lldb-api :: lang/objc/modules/TestObjCModules.py (1797 of 2357) PASS: lldb-api :: functionalities/breakpoint/breakpoint_ids/TestBreakpointIDs.py (1798 of 2357) UNSUPPORTED: lldb-api :: functionalities/tty/TestTerminal.py (1799 of 2357) PASS: lldb-unit :: Host/./HostTests/File.GetStreamFromDescriptor (1800 of 2357) PASS: lldb-unit :: SymbolFile/NativePDB/./SymbolFileNativePDBTests/PDBFPOProgramToDWARFExpressionTests.UnresolvedRegisterAssignmentReference (1801 of 2357) PASS: lldb-shell :: ObjectFile/ELF/section-overlap.yaml (1802 of 2357) PASS: lldb-api :: functionalities/data-formatter/data-formatter-synthval/TestDataFormatterSynthVal.py (1803 of 2357) PASS: lldb-api :: lang/objc/modules-hash-mismatch/TestClangModulesHashMismatch.py (1804 of 2357) PASS: lldb-unit :: Symbol/./SymbolTests/TestClangASTImporter.MetadataPropagationIndirectImport (1805 of 2357) PASS: lldb-unit :: UnwindAssembly/x86/./UnwindAssemblyx86Tests/Testx86AssemblyInspectionEngine.TestPushEDI (1806 of 2357) PASS: lldb-shell :: lldb-server/TestErrorMessages.test (1807 of 2357) PASS: lldb-api :: lang/cpp/dynamic-value/TestDynamicValue.py (1808 of 2357) PASS: lldb-unit :: ScriptInterpreter/Python/./ScriptInterpreterPythonTests/PythonDataObjectsTest.TestPythonDictionaryManipulation (1809 of 2357) PASS: lldb-api :: macosx/version_zero/TestGetVersionZeroVersion.py (1810 of 2357) UNSUPPORTED: lldb-shell :: SymbolFile/NativePDB/typedefs.cpp (1811 of 2357) PASS: lldb-api :: commands/expression/rdar42038760/TestScalarURem.py (1812 of 2357) PASS: lldb-api :: lang/cpp/class-template-non-type-parameter-pack/TestClassTemplateNonTypeParameterPack.py (1813 of 2357) PASS: lldb-shell :: ObjectFile/PECOFF/basic-info.yaml (1814 of 2357) PASS: lldb-api :: types/TestCharTypeExpr.py (1815 of 2357) PASS: lldb-shell :: ObjectFile/PECOFF/export-dllfunc.yaml (1816 of 2357) PASS: lldb-unit :: ScriptInterpreter/Python/./ScriptInterpreterPythonTests/PythonDataObjectsTest.TestPythonBoolean (1817 of 2357) PASS: lldb-unit :: Utility/./UtilityTests/UriParserTest.BracketedHostname (1818 of 2357) PASS: lldb-unit :: Expression/./ExpressionTests/DiagnosticManagerTest.AddDiagnostic (1819 of 2357) PASS: lldb-unit :: Utility/./UtilityTests/ConstStringTest.YAML (1820 of 2357) PASS: lldb-shell :: SymbolFile/NativePDB/globals-fundamental.cpp (1821 of 2357) PASS: lldb-unit :: Interpreter/./InterpreterTests/OptionArgParserTest.toChar (1822 of 2357) PASS: lldb-shell :: SymbolFile/DWARF/x86/DW_AT_decl_file-DW_AT_specification-crosscu.s (1823 of 2357) UNSUPPORTED: lldb-shell :: Register/x86-64-xmm16-write.test (1824 of 2357) PASS: lldb-api :: lang/cpp/extern_c/TestExternCSymbols.py (1825 of 2357) PASS: lldb-api :: lang/cpp/namespace_definitions/TestNamespaceDefinitions.py (1826 of 2357) PASS: lldb-shell :: Minidump/dump-all.test (1827 of 2357) UNSUPPORTED: lldb-api :: functionalities/breakpoint/hardware_breakpoints/write_memory_with_hw_breakpoint/TestWriteMemoryWithHWBreakpoint.py (1828 of 2357) PASS: lldb-api :: commands/expression/anonymous-struct/TestCallUserAnonTypedef.py (1829 of 2357) PASS: lldb-unit :: Utility/./UtilityTests/RangeTest.DoesIntersect (1830 of 2357) PASS: lldb-api :: lang/cpp/member-and-local-vars-with-same-name/TestMembersAndLocalsWithSameName.py (1831 of 2357) PASS: lldb-unit :: Target/./TargetTests/PathMappingListTest.RelativeTests (1832 of 2357) PASS: lldb-shell :: SymbolFile/DWARF/clang-ast-from-dwarf-objc-property.m (1833 of 2357) PASS: lldb-api :: commands/watchpoints/multiple_hits/TestMultipleHits.py (1834 of 2357) PASS: lldb-api :: lang/cpp/nested-class-other-compilation-unit/TestNestedClassWithParentInAnotherCU.py (1835 of 2357) UNSUPPORTED: lldb-api :: linux/add-symbols/TestTargetSymbolsAddCommand.py (1836 of 2357) PASS: lldb-shell :: ObjectFile/ELF/build-id-case.yaml (1837 of 2357) PASS: lldb-api :: functionalities/thread/step_until/TestStepUntil.py (1838 of 2357) PASS: lldb-shell :: ObjectFile/wasm/basic.yaml (1839 of 2357) PASS: lldb-api :: commands/target/dump-symtab-demangle/TestDumpSymtabDemangle.py (1840 of 2357) PASS: lldb-shell :: SymbolFile/DWARF/x86/DW_OP_piece-struct.s (1841 of 2357) PASS: lldb-api :: lang/objc/modules-incomplete/TestIncompleteModules.py (1842 of 2357) PASS: lldb-api :: functionalities/breakpoint/breakpoint_command/TestBreakpointCommandsFromPython.py (1843 of 2357) PASS: lldb-shell :: Settings/TestEchoCommands.test (1844 of 2357) PASS: lldb-unit :: Host/./HostTests/HostInfoTestInitialization.InitTwice (1845 of 2357) PASS: lldb-unit :: Utility/./UtilityTests/DataExtractorTest.GetDouble (1846 of 2357) PASS: lldb-api :: python_api/process/TestProcessAPI.py (1847 of 2357) UNSUPPORTED: lldb-api :: commands/gui/basic/TestGuiBasic.py (1848 of 2357) PASS: lldb-api :: functionalities/deleted-executable/TestDeletedExecutable.py (1849 of 2357) PASS: lldb-unit :: Utility/./UtilityTests/FileSpecTest.GetPath (1850 of 2357) PASS: lldb-shell :: SymbolFile/DWARF/x86/dwarf5-index-is-used.cpp (1851 of 2357) PASS: lldb-api :: functionalities/data-formatter/data-formatter-cpp/TestDataFormatterCpp.py (1852 of 2357) PASS: lldb-api :: commands/target/create-deps/TestTargetCreateDeps.py (1853 of 2357) PASS: lldb-unit :: Process/Utility/./ProcessUtilityTests/ProcSMapTests/LinuxProcSMapsTestFixture.ParseSMapRegions/8 (1854 of 2357) PASS: lldb-api :: tools/lldb-server/TestGdbRemoteAttachWait.py (1855 of 2357) UNSUPPORTED: lldb-shell :: Register/arm-gp-read.test (1856 of 2357) PASS: lldb-api :: commands/expression/no-deadlock/TestExprDoesntBlock.py (1857 of 2357) PASS: lldb-unit :: Expression/./ExpressionTests/CppModuleConfigurationTest.Linux (1858 of 2357) UNSUPPORTED: lldb-api :: functionalities/ptr_refs/TestPtrRefs.py (1859 of 2357) PASS: lldb-api :: lang/objc/objc-class-method/TestObjCClassMethod.py (1860 of 2357) PASS: lldb-api :: lang/objc/global_ptrs/TestGlobalObjects.py (1861 of 2357) PASS: lldb-shell :: ObjectFile/PECOFF/section-types.yaml (1862 of 2357) PASS: lldb-api :: commands/expression/weak_symbols/TestWeakSymbols.py (1863 of 2357) PASS: lldb-api :: commands/expression/import-std-module/missing-module-sources/TestStdModuleSourcesMissing.py (1864 of 2357) PASS: lldb-api :: commands/expression/invalid-args/TestInvalidArgsExpression.py (1865 of 2357) PASS: lldb-unit :: Utility/./UtilityTests/StringListTest.ForRangeEmpty (1866 of 2357) PASS: lldb-api :: functionalities/abbreviation/TestAbbreviations.py (1867 of 2357) PASS: lldb-api :: commands/command/script/import/TestImport.py (1868 of 2357) PASS: lldb-api :: functionalities/data-formatter/data-formatter-globals/TestDataFormatterGlobals.py (1869 of 2357) PASS: lldb-api :: lang/objc/modules-non-objc-target/TestObjCModulesNonObjCTarget.py (1870 of 2357) PASS: lldb-api :: lang/c/complex/TestComplexC99.py (1871 of 2357) PASS: lldb-api :: commands/expression/char/TestExprsChar.py (1872 of 2357) PASS: lldb-api :: functionalities/type_completion/TestTypeCompletion.py (1873 of 2357) PASS: lldb-unit :: Utility/./UtilityTests/StreamTest.PutHex32ByteOrderLittle (1874 of 2357) PASS: lldb-shell :: SymbolFile/DWARF/x86/dwarf5_tu_index_abbrev_offset.s (1875 of 2357) PASS: lldb-shell :: Register/x86-64-read.test (1876 of 2357) PASS: lldb-api :: lang/cpp/operator-overload/TestOperatorOverload.py (1877 of 2357) PASS: lldb-api :: lang/objc/real-definition/TestRealDefinition.py (1878 of 2357) UNSUPPORTED: lldb-api :: commands/gui/breakpoints/TestGuiBreakpoints.py (1879 of 2357) UNSUPPORTED: lldb-shell :: SymbolFile/PDB/enums-layout.test (1880 of 2357) PASS: lldb-unit :: Process/Utility/./ProcessUtilityTests/ProcMapTests/LinuxProcMapsTestFixture.ParseMapRegions/4 (1881 of 2357) PASS: lldb-api :: macosx/function-starts/TestFunctionStarts.py (1882 of 2357) PASS: lldb-api :: lang/cpp/bitfields/TestCppBitfields.py (1883 of 2357) PASS: lldb-shell :: Reproducer/Functionalities/TestImageList.test (1884 of 2357) UNSUPPORTED: lldb-shell :: ScriptInterpreter/Lua/lua.test (1885 of 2357) PASS: lldb-api :: lang/cpp/struct_with_keyword_name/TestStructWithKeywordName.py (1886 of 2357) PASS: lldb-api :: functionalities/data-formatter/stringprinter/TestStringPrinter.py (1887 of 2357) PASS: lldb-unit :: Language/Highlighting/./HighlighterTests/HighlighterTest.ClangSquareBrackets (1888 of 2357) PASS: lldb-api :: lang/cpp/reference-to-outer-type/TestCppReferenceToOuterClass.py (1889 of 2357) PASS: lldb-api :: lang/objc/objc_direct-methods/TestObjCDirectMethods.py (1890 of 2357) PASS: lldb-unit :: Host/./HostTests/NativeProcessProtocolTest.SetBreakpointFailRead (1891 of 2357) PASS: lldb-unit :: Process/gdb-remote/./ProcessGdbRemoteTests/GDBRemoteCommunicationClientTest.GetModulesInfo_UUID20 (1892 of 2357) PASS: lldb-unit :: DataFormatter/./LLDBFormatterTests/StringPrinterTests.CxxASCII (1893 of 2357) PASS: lldb-api :: commands/expression/regression-access-function-template-in-record/TestRegressionAccessFunctionTemplateInRecord.py (1894 of 2357) PASS: lldb-unit :: ObjectFile/ELF/./ObjectFileELFTests/ObjectFileELFTest.GetSymtab_NoSymEntryPointArmAddressClass (1895 of 2357) PASS: lldb-unit :: Expression/./ExpressionTests/DWARFExpressionMockProcessTest.DW_OP_deref (1896 of 2357) PASS: lldb-api :: python_api/lldbutil/TestSwigVersion.py (1897 of 2357) PASS: lldb-shell :: ObjectFile/ELF/riscv-arch.yaml (1898 of 2357) UNSUPPORTED: lldb-api :: lang/objc/foundation/TestFoundationDisassembly.py (1899 of 2357) PASS: lldb-api :: commands/expression/persistent_variables/TestPersistentVariables.py (1900 of 2357) PASS: lldb-shell :: SymbolFile/NativePDB/ast-functions.cpp (1901 of 2357) PASS: lldb-api :: commands/expression/timeout/TestCallWithTimeout.py (1902 of 2357) PASS: lldb-unit :: Utility/./UtilityTests/XcodeSDKTest.GetSDKTypeForTriple (1903 of 2357) PASS: lldb-unit :: Host/./HostTests/FileSystemTest.GetByteSize (1904 of 2357) PASS: lldb-unit :: Utility/./UtilityTests/CompletionRequest.FakeLastArg (1905 of 2357) PASS: lldb-unit :: Process/gdb-remote/./ProcessGdbRemoteTests/PortMapTest.Constructors (1906 of 2357) PASS: lldb-api :: commands/frame/diagnose/local-variable/TestLocalVariable.py (1907 of 2357) PASS: lldb-shell :: Minidump/memory-region.yaml (1908 of 2357) PASS: lldb-api :: functionalities/thread/concurrent_events/TestConcurrentCrashWithWatchpointBreakpointSignal.py (1909 of 2357) PASS: lldb-shell :: SymbolFile/DWARF/x86/debug-types-basic.test (1910 of 2357) PASS: lldb-unit :: Utility/./UtilityTests/StringExtractorTest.GetHexU8_Exact (1911 of 2357) PASS: lldb-api :: lang/c/find_struct_type/TestFindStructTypes.py (1912 of 2357) PASS: lldb-api :: lang/cpp/chained-calls/TestCppChainedCalls.py (1913 of 2357) PASS: lldb-api :: python_api/lldbutil/frame/TestFrameUtils.py (1914 of 2357) PASS: lldb-unit :: Utility/./UtilityTests/ScalarTest.LongLongAssigmentOperator (1915 of 2357) PASS: lldb-shell :: SymbolFile/NativePDB/source-list.cpp (1916 of 2357) PASS: lldb-shell :: VSCode/TestOptions.test (1917 of 2357) PASS: lldb-unit :: Utility/./UtilityTests/SerializationRountripTest.SerializeDeserializePodReferences (1918 of 2357) PASS: lldb-unit :: Expression/./ExpressionTests/DiagnosticManagerTest.FixedExpression (1919 of 2357) PASS: lldb-unit :: tools/lldb-server/tests/./LLDBServerTests/TestBase.LaunchModePreservesEnvironment (1920 of 2357) PASS: lldb-unit :: DataFormatter/./LLDBFormatterTests/TypeMatcherTests.RegexName (1921 of 2357) PASS: lldb-unit :: Symbol/./SymbolTests/TestClangASTImporter.MetadataPropagationAfterCopying (1922 of 2357) PASS: lldb-shell :: SymbolFile/DWARF/x86/find-variable-dwo.cpp (1923 of 2357) PASS: lldb-unit :: Utility/./UtilityTests/StringListTest.DefaultConstructor (1924 of 2357) PASS: lldb-api :: lang/objc/objc-static-method-stripped/TestObjCStaticMethodStripped.py (1925 of 2357) PASS: lldb-unit :: UnwindAssembly/x86/./UnwindAssemblyx86Tests/Testx86AssemblyInspectionEngine.Test64bitFramelessSmallStackFrame (1926 of 2357) PASS: lldb-unit :: Symbol/./SymbolTests/LineEntryTest.GetSameLineContiguousAddressRangeOneInline (1927 of 2357) PASS: lldb-shell :: ScriptInterpreter/Python/python.test (1928 of 2357) PASS: lldb-shell :: ObjectFile/ELF/null-jmprel.yaml (1929 of 2357) PASS: lldb-unit :: Expression/./ExpressionTests/CppModuleConfigurationTest.Xcode (1930 of 2357) UNSUPPORTED: lldb-api :: linux/thread/create_during_instruction_step/TestCreateDuringInstructionStep.py (1931 of 2357) PASS: lldb-unit :: Utility/./UtilityTests/VMRange.Clear (1932 of 2357) PASS: lldb-api :: lang/cpp/typeof/TestTypeOfDeclTypeExpr.py (1933 of 2357) PASS: lldb-unit :: SymbolFile/DWARF/./SymbolFileDWARFTests/DWARFUnitTest.NullUnitDie (1934 of 2357) PASS: lldb-shell :: ObjectFile/ELF/PT_TLS-overlap-PT_LOAD.yaml (1935 of 2357) PASS: lldb-api :: lang/cpp/breakpoint-commands/TestCPPBreakpointCommands.py (1936 of 2357) PASS: lldb-api :: lang/cpp/dynamic-value-same-basename/TestDynamicValueSameBase.py (1937 of 2357) PASS: lldb-api :: commands/process/attach/TestProcessAttach.py (1938 of 2357) PASS: lldb-unit :: Host/./HostTests/File.GetWaitableHandleFileno (1939 of 2357) PASS: lldb-api :: lang/cpp/subst_template_type_param/TestSubstTemplateTypeParam.py (1940 of 2357) PASS: lldb-unit :: Utility/./UtilityTests/StringListTest.Join (1941 of 2357) PASS: lldb-shell :: SymbolFile/NativePDB/globals-bss.cpp (1942 of 2357) PASS: lldb-api :: lang/cpp/diamond/TestDiamond.py (1943 of 2357) PASS: lldb-unit :: Symbol/./SymbolTests/TestCreateClassTemplateDecl.FindExistingTemplatesWithParameterPack (1944 of 2357) PASS: lldb-shell :: ObjectFile/MachO/lc_version_min.yaml (1945 of 2357) PASS: lldb-shell :: Register/Core/x86-32-linux-addr.test (1946 of 2357) PASS: lldb-api :: commands/expression/import-std-module/non-module-type-separation/TestNonModuleTypeSeparation.py (1947 of 2357) PASS: lldb-api :: tools/lldb-server/TestGdbRemoteRegisterState.py (1948 of 2357) UNSUPPORTED: lldb-shell :: ScriptInterpreter/Lua/breakpoint_callback.test (1949 of 2357) UNSUPPORTED: lldb-shell :: ScriptInterpreter/Lua/persistent_state.test (1950 of 2357) UNSUPPORTED: lldb-shell :: ScriptInterpreter/Lua/fail_breakpoint_oneline.test (1951 of 2357) PASS: lldb-unit :: Signals/./SignalsTests/UnixSignalsTest.Iteration (1952 of 2357) PASS: lldb-unit :: Utility/./UtilityTests/BinaryStreamTest.PutSLEB128MaxValue (1953 of 2357) UNSUPPORTED: lldb-api :: functionalities/unwind/aarch64_unwind_pac/TestAArch64UnwindPAC.py (1954 of 2357) PASS: lldb-unit :: Utility/./UtilityTests/EnvironmentTest.EnvpConstruction (1955 of 2357) PASS: lldb-api :: functionalities/data-formatter/data-formatter-stl/libcxx/optional/TestDataFormatterLibcxxOptional.py (1956 of 2357) PASS: lldb-api :: commands/expression/import-std-module/retry-with-std-module/TestRetryWithStdModule.py (1957 of 2357) PASS: lldb-unit :: Utility/./UtilityTests/FileSpecTest.Yaml (1958 of 2357) PASS: lldb-unit :: Process/Utility/./ProcessUtilityTests/ProcSMapTests/LinuxProcSMapsTestFixture.ParseSMapRegions/3 (1959 of 2357) PASS: lldb-unit :: SymbolFile/NativePDB/./SymbolFileNativePDBTests/PDBFPOProgramToDWARFExpressionTests.UnresolvedRegisterReference (1960 of 2357) PASS: lldb-api :: lang/objc/cpp_keyword_identifiers/TestCppKeywordsAsObjCIdentifiers.py (1961 of 2357) PASS: lldb-unit :: Utility/./UtilityTests/NameMatchesTest.EndsWith (1962 of 2357) PASS: lldb-api :: lang/c/set_values/TestSetValues.py (1963 of 2357) PASS: lldb-unit :: Utility/./UtilityTests/StreamTest.AddressPrefixAndSuffix (1964 of 2357) PASS: lldb-api :: commands/process/attach-resume/TestAttachResume.py (1965 of 2357) PASS: lldb-unit :: Symbol/./SymbolTests/SymbolsTest.LocateExecutableSymbolFileForUnknownExecutableAndMissingSymbolFile (1966 of 2357) PASS: lldb-api :: functionalities/inferior-crashing/recursive-inferior/TestRecursiveInferiorStep.py (1967 of 2357) UNSUPPORTED: lldb-api :: lang/objc/rdar-12408181/TestRdar12408181.py (1968 of 2357) PASS: lldb-unit :: DataFormatter/./LLDBFormatterTests/FormatManagerTests.CompatibleLangs (1969 of 2357) UNSUPPORTED: lldb-shell :: Register/x86-ymm-read.test (1970 of 2357) PASS: lldb-api :: functionalities/data-formatter/data-formatter-objc/TestDataFormatterObjCExpr.py (1971 of 2357) PASS: lldb-api :: types/TestLongTypesExpr.py (1972 of 2357) PASS: lldb-unit :: Utility/./UtilityTests/StreamTest.PutCString (1973 of 2357) PASS: lldb-unit :: Host/./HostTests/SocketAddressTest.Set (1974 of 2357) UNSUPPORTED: lldb-api :: functionalities/darwin_log/filter/exact_match/activity/TestDarwinLogFilterMatchActivity.py (1975 of 2357) PASS: lldb-unit :: Symbol/./SymbolTests/Type.GetTypeScopeAndBasename (1976 of 2357) UNSUPPORTED: lldb-api :: tools/lldb-vscode/completions/TestVSCode_completions.py (1977 of 2357) UNSUPPORTED: lldb-api :: commands/watchpoints/variable_out_of_scope/TestWatchedVarHitWhenInScope.py (1978 of 2357) PASS: lldb-api :: functionalities/breakpoint/breakpoint_names/TestBreakpointNames.py (1979 of 2357) PASS: lldb-unit :: Utility/./UtilityTests/OptionsWithRawTest.WhitespaceInput (1980 of 2357) PASS: lldb-unit :: Utility/./UtilityTests/OptionsWithRawTest.SingleWordSuffix (1981 of 2357) PASS: lldb-unit :: ScriptInterpreter/Python/./ScriptInterpreterPythonTests/PythonDataObjectsTest.TestPythonStringToStructuredString (1982 of 2357) PASS: lldb-unit :: ScriptInterpreter/Python/./ScriptInterpreterPythonTests/PythonDataObjectsTest.TestPythonDictionaryToStructuredDictionary (1983 of 2357) PASS: lldb-shell :: ScriptInterpreter/Python/Crashlog/text.test (1984 of 2357) PASS: lldb-api :: functionalities/thread/concurrent_events/TestConcurrentWatchBreakDelay.py (1985 of 2357) UNSUPPORTED: lldb-api :: commands/watchpoints/multi_watchpoint_slots/TestWatchpointMultipleSlots.py (1986 of 2357) PASS: lldb-unit :: Utility/./UtilityTests/Predicate.WaitForValueEqualTo (1987 of 2357) PASS: lldb-api :: commands/thread/select/TestThreadSelect.py (1988 of 2357) PASS: lldb-unit :: Utility/./UtilityTests/StringListTest.ForRange (1989 of 2357) PASS: lldb-api :: functionalities/return-value/TestReturnValue.py (1990 of 2357) PASS: lldb-api :: commands/watchpoints/watchpoint_set_command/TestWatchLocationWithWatchSet.py (1991 of 2357) PASS: lldb-api :: commands/frame/var/TestFrameVar.py (1992 of 2357) PASS: lldb-shell :: SymbolFile/DWARF/x86/DW_TAG_basic_type_DW_ATE_UTF_nonC.ll (1993 of 2357) PASS: lldb-api :: commands/expression/call-throws/TestCallThatThrows.py (1994 of 2357) PASS: lldb-unit :: Host/./HostTests/PipeTest.OpenAsReader (1995 of 2357) PASS: lldb-unit :: Utility/./UtilityTests/OptionsWithRawTest.SingleWhitespaceInput (1996 of 2357) PASS: lldb-shell :: SymbolFile/DWARF/x86/dwarf5_locations.s (1997 of 2357) UNSUPPORTED: lldb-shell :: Register/x86-gp-write.test (1998 of 2357) UNSUPPORTED: lldb-api :: functionalities/ubsan/user-expression/TestUbsanUserExpression.py (1999 of 2357) PASS: lldb-api :: lang/objcxx/objc-builtin-types/TestObjCBuiltinTypes.py (2000 of 2357) PASS: lldb-unit :: Process/minidump/./LLDBMinidumpTests/MinidumpParserTest.MinidumpDuplicateModuleMappedSecondHigh (2001 of 2357) PASS: lldb-api :: sanity/TestSettingSkipping.py (2002 of 2357) PASS: lldb-api :: functionalities/postmortem/elf-core/TestLinuxCore.py (2003 of 2357) PASS: lldb-unit :: Language/CLanguages/./LanguageCLanguagesTests/CLanguages.LookupCLanguagesByLanguageType (2004 of 2357) PASS: lldb-api :: lang/objc/objc-dyn-sbtype/TestObjCDynamicSBType.py (2005 of 2357) PASS: lldb-api :: python_api/watchpoint/TestWatchpointIter.py (2006 of 2357) PASS: lldb-unit :: Utility/./UtilityTests/ArgsTest.DoubleQuotedItem (2007 of 2357) PASS: lldb-unit :: Symbol/./SymbolTests/PostfixExpression.ParseOneExpression (2008 of 2357) PASS: lldb-unit :: UnwindAssembly/x86/./UnwindAssemblyx86Tests/Testx86AssemblyInspectionEngine.TestPushEBP (2009 of 2357) PASS: lldb-unit :: Host/./HostTests/ProcessLaunchInfoTest.Constructor (2010 of 2357) PASS: lldb-unit :: Expression/./ExpressionTests/CppModuleConfigurationTest.AmbiguousLibCpp (2011 of 2357) PASS: lldb-api :: lang/cpp/constructors/TestCppConstructors.py (2012 of 2357) PASS: lldb-unit :: Utility/./UtilityTests/LogChannelTest.List (2013 of 2357) PASS: lldb-unit :: Symbol/./SymbolTests/LineEntryTest.GetSameLineContiguousAddressRangeNoInlines (2014 of 2357) PASS: lldb-unit :: Utility/./UtilityTests/ReproducerTest.SetCapture (2015 of 2357) PASS: lldb-unit :: ScriptInterpreter/Python/./ScriptInterpreterPythonTests/PythonDataObjectsTest.TestPythonCallableCheck (2016 of 2357) PASS: lldb-api :: commands/expression/test/TestExprs2.py (2017 of 2357) PASS: lldb-unit :: Utility/./UtilityTests/BinaryStreamTest.PutSLEB128ThreeBytes (2018 of 2357) PASS: lldb-unit :: Core/./LLDBCoreTests/DumpDataExtractorTest.BaseAddress (2019 of 2357) PASS: lldb-api :: functionalities/tail_call_frames/disambiguate_tail_call_seq/TestDisambiguateTailCallSeq.py (2020 of 2357) PASS: lldb-api :: functionalities/data-formatter/data-formatter-named-summaries/TestDataFormatterNamedSummaries.py (2021 of 2357) PASS: lldb-unit :: Language/Highlighting/./HighlighterTests/HighlighterTest.ClangTrailingBackslashBeforeNewline (2022 of 2357) PASS: lldb-unit :: Host/./HostTests/SocketTests/SocketTest.UDPGetConnectURI/ipv4 (2023 of 2357) UNSUPPORTED: lldb-api :: commands/trace/TestTraceDumpInstructions.py (2024 of 2357) PASS: lldb-unit :: Utility/./UtilityTests/RangeTest.Copy (2025 of 2357) PASS: lldb-shell :: SymbolFile/DWARF/x86/dwarf5-debug_line-file-index.s (2026 of 2357) PASS: lldb-unit :: Language/Highlighting/./HighlighterTests/HighlighterTest.ClangCommas (2027 of 2357) PASS: lldb-api :: commands/expression/calculator_mode/TestCalculatorMode.py (2028 of 2357) PASS: lldb-unit :: ObjectFile/Breakpad/./ObjectFileBreakpadTests/FuncRecord.parse (2029 of 2357) PASS: lldb-unit :: Symbol/./SymbolTests/TestTypeSystemClang.TestGetTypeClassDeclType (2030 of 2357) PASS: lldb-api :: lang/objc/modules-compile-error/TestModulesCompileError.py (2031 of 2357) PASS: lldb-unit :: Symbol/./SymbolTests/TestTypeSystemClang.TestGetEnumIntegerTypeBasicTypes (2032 of 2357) PASS: lldb-shell :: Minidump/disassemble-no-module.yaml (2033 of 2357) PASS: lldb-unit :: Utility/./UtilityTests/StreamTest.AddressRange (2034 of 2357) PASS: lldb-api :: functionalities/thread/exit_during_expression/TestExitDuringExpression.py (2035 of 2357) PASS: lldb-api :: commands/expression/import_builtin_fileid/TestImportBuiltinFileID.py (2036 of 2357) UNSUPPORTED: lldb-shell :: SymbolFile/PDB/type-quals.test (2037 of 2357) PASS: lldb-api :: commands/frame/diagnose/dereference-this/TestDiagnoseDereferenceThis.py (2038 of 2357) UNSUPPORTED: lldb-api :: functionalities/gdb_remote_client/TestQemuAArch64TargetXml.py (2039 of 2357) PASS: lldb-shell :: Breakpoint/split-dwarf-5-addrbase.test (2040 of 2357) PASS: lldb-api :: functionalities/unwind/zeroth_frame/TestZerothFrame.py (2041 of 2357) XFAIL: lldb-shell :: Register/x86-64-ymm-write.test (2042 of 2357) PASS: lldb-unit :: Utility/./UtilityTests/ConstStringTest.CompareConstString (2043 of 2357) PASS: lldb-api :: lang/cpp/incomplete-types/TestCppIncompleteTypes.py (2044 of 2357) PASS: lldb-unit :: Utility/./UtilityTests/UriParserTest.PortOverflow (2045 of 2357) PASS: lldb-unit :: ScriptInterpreter/Python/./ScriptInterpreterPythonTests/PythonDataObjectsTest.TestPythonListManipulation (2046 of 2357) PASS: lldb-api :: functionalities/data-formatter/data-formatter-objc/TestDataFormatterObjCNSDate.py (2047 of 2357) PASS: lldb-shell :: SymbolFile/DWARF/x86/debug_rnglists.s (2048 of 2357) PASS: lldb-unit :: Utility/./UtilityTests/StreamTest.PutBytesAsRawHex8ToLittleEndian (2049 of 2357) PASS: lldb-unit :: Utility/./UtilityTests/StringLexerTest.NextIf (2050 of 2357) PASS: lldb-unit :: Process/./ProcessEventDataTests/ProcessEventDataTest.ShouldStop (2051 of 2357) PASS: lldb-api :: lang/objc/bitfield_ivars/TestBitfieldIvars.py (2052 of 2357) PASS: lldb-unit :: Symbol/./SymbolTests/TestTypeSystemClang.TestDisplayName (2053 of 2357) PASS: lldb-shell :: Settings/TestLineMarkerColor.test (2054 of 2357) PASS: lldb-api :: functionalities/breakpoint/hardware_breakpoints/require_hw_breakpoints/TestRequireHWBreakpoints.py (2055 of 2357) PASS: lldb-api :: commands/expression/pr35310/TestExprsBug35310.py (2056 of 2357) PASS: lldb-unit :: Utility/./UtilityTests/RangeTest.Slide (2057 of 2357) PASS: lldb-unit :: Language/Highlighting/./HighlighterTests/HighlighterTest.ClangCursorPos (2058 of 2357) PASS: lldb-unit :: Process/minidump/./LLDBMinidumpTests/MinidumpParserTest.GetMemory (2059 of 2357) PASS: lldb-shell :: Breakpoint/debug_addrx.test (2060 of 2357) PASS: lldb-api :: functionalities/gdb_remote_client/TestNoWatchpointSupportInfo.py (2061 of 2357) UNSUPPORTED: lldb-api :: functionalities/thread/thread_specific_break_plus_condition/TestThreadSpecificBpPlusCondition.py (2062 of 2357) PASS: lldb-unit :: Process/Utility/./ProcessUtilityTests/ProcMapTests/LinuxProcMapsTestFixture.ParseMapRegions/5 (2063 of 2357) PASS: lldb-unit :: Utility/./UtilityTests/RangeTest.Equal (2064 of 2357) PASS: lldb-api :: functionalities/signal/TestSendSignal.py (2065 of 2357) PASS: lldb-unit :: UnwindAssembly/x86/./UnwindAssemblyx86Tests/Testx86AssemblyInspectionEngine.Test32bitFramelessBigStackFrame (2066 of 2357) PASS: lldb-api :: macosx/skinny-corefile/TestSkinnyCorefile.py (2067 of 2357) PASS: lldb-api :: commands/expression/import-std-module/deque-dbg-info-content/TestDbgInfoContentDequeFromStdModule.py (2068 of 2357) UNSUPPORTED: lldb-api :: lang/objc/modules-update/TestClangModulesUpdate.py (2069 of 2357) PASS: lldb-unit :: Language/CPlusPlus/./LanguageCPlusPlusTests/CPlusPlusLanguage.CPlusPlusNameParser (2070 of 2357) PASS: lldb-unit :: SymbolFile/DWARF/./SymbolFileDWARFTests/DWARFUnitTest.MissingSentinel (2071 of 2357) UNSUPPORTED: lldb-api :: functionalities/darwin_log/filter/exact_match/message/TestDarwinLogFilterMatchMessage.py (2072 of 2357) PASS: lldb-api :: functionalities/data-formatter/vector-types/TestVectorTypesFormatting.py (2073 of 2357) PASS: lldb-unit :: UnwindAssembly/x86/./UnwindAssemblyx86Tests/Testx86AssemblyInspectionEngine.TestPopRBP (2074 of 2357) PASS: lldb-shell :: ScriptInterpreter/Python/eof.test (2075 of 2357) PASS: lldb-api :: functionalities/thread/concurrent_events/TestConcurrentSignalDelayBreak.py (2076 of 2357) PASS: lldb-api :: commands/expression/persistent_types/TestNestedPersistentTypes.py (2077 of 2357) PASS: lldb-unit :: Utility/./UtilityTests/StreamTeeTest.Constructor2Streams (2078 of 2357) PASS: lldb-unit :: Utility/./UtilityTests/ScalarTest.GetBytes (2079 of 2357) PASS: lldb-unit :: Host/./HostTests/NativeProcessProtocolTest.ReadCStringFromMemory (2080 of 2357) PASS: lldb-api :: functionalities/data-formatter/data-formatter-stl/libcxx/function/TestLibCxxFunction.py (2081 of 2357) PASS: lldb-unit :: Process/minidump/./LLDBMinidumpTests/MinidumpParserTest.GetPidWow64 (2082 of 2357) UNSUPPORTED: lldb-shell :: ScriptInterpreter/Lua/convenience_variables.test (2083 of 2357) PASS: lldb-unit :: UnwindAssembly/x86/./UnwindAssemblyx86Tests/Testx86AssemblyInspectionEngine.TestSpillRegToStackViaMOVi386 (2084 of 2357) PASS: lldb-api :: lang/c/shared_lib_stripped_symbols/TestSharedLibStrippedSymbols.py (2085 of 2357) PASS: lldb-api :: python_api/value/change_values/TestChangeValueAPI.py (2086 of 2357) PASS: lldb-unit :: Utility/./UtilityTests/StringExtractorTest.GetHexU8_InvalidHex (2087 of 2357) PASS: lldb-api :: functionalities/thread/concurrent_events/TestConcurrentWatchpointDelayWatchpointOneBreakpoint.py (2088 of 2357) PASS: lldb-unit :: Core/./LLDBCoreTests/RichManglingContextTest.Basic (2089 of 2357) PASS: lldb-unit :: DataFormatter/./LLDBFormatterTests/StringPrinterTests.SwiftUTF8 (2090 of 2357) PASS: lldb-unit :: Utility/./UtilityTests/StreamTest.PutHex8 (2091 of 2357) PASS: lldb-api :: python_api/get-value-32bit-int/TestGetValue32BitInt.py (2092 of 2357) PASS: lldb-unit :: Process/minidump/./LLDBMinidumpTests/MinidumpParserTest.GetThreadContext_x86_64 (2093 of 2357) PASS: lldb-shell :: SymbolFile/DWARF/x86/debug_ranges.s (2094 of 2357) PASS: lldb-shell :: Reproducer/TestProcessList.test (2095 of 2357) PASS: lldb-unit :: Utility/./UtilityTests/OptionsWithRawTest.UnterminatedQuote (2096 of 2357) PASS: lldb-shell :: ScriptInterpreter/Python/silent_command_script_import.test (2097 of 2357) PASS: lldb-api :: commands/frame/diagnose/dereference-argument/TestDiagnoseDereferenceArgument.py (2098 of 2357) PASS: lldb-unit :: Language/Highlighting/./HighlighterTests/HighlighterTest.ClangBraces (2099 of 2357) PASS: lldb-unit :: UnwindAssembly/x86/./UnwindAssemblyx86Tests/Testx86AssemblyInspectionEngine.Test32bitFramelessSmallStackFrame (2100 of 2357) PASS: lldb-unit :: Host/./HostTests/FileSystemTest.Exists (2101 of 2357) PASS: lldb-unit :: Utility/./UtilityTests/StringListTest.LongestCommonPrefix (2102 of 2357) PASS: lldb-unit :: Utility/./UtilityTests/StringExtractorGDBRemoteTest.GetPidTid (2103 of 2357) PASS: lldb-unit :: Utility/./UtilityTests/RegularExpression.Empty (2104 of 2357) PASS: lldb-api :: functionalities/tail_call_frames/disambiguate_call_site/TestDisambiguateCallSite.py (2105 of 2357) PASS: lldb-unit :: Symbol/./SymbolTests/TestClangASTImporter.ImportInvalidType (2106 of 2357) PASS: lldb-api :: functionalities/plugins/python_os_plugin/TestPythonOSPlugin.py (2107 of 2357) PASS: lldb-shell :: SymbolFile/NativePDB/function-types-classes.cpp (2108 of 2357) PASS: lldb-api :: functionalities/gdb_remote_client/TestGDBRemoteDiskFileCompletion.py (2109 of 2357) PASS: lldb-api :: python_api/frame/get-variables/TestGetVariables.py (2110 of 2357) PASS: lldb-shell :: SymbolFile/DWARF/x86/find-variable-file.cpp (2111 of 2357) PASS: lldb-unit :: UnwindAssembly/x86/./UnwindAssemblyx86Tests/Testx86AssemblyInspectionEngine.TestSubESP (2112 of 2357) PASS: lldb-api :: python_api/interpreter/TestRunCommandInterpreterAPI.py (2113 of 2357) PASS: lldb-shell :: SymbolFile/DWARF/x86/DW_AT_location-DW_AT_const_value.s (2114 of 2357) PASS: lldb-unit :: Utility/./UtilityTests/StreamTest.PutCStringWithStringRef (2115 of 2357) PASS: lldb-unit :: Utility/./UtilityTests/StringExtractorTest.GetNameColonValueNoSemicolon (2116 of 2357) PASS: lldb-unit :: Process/minidump/./LLDBMinidumpTests/MinidumpParserTest.GetPid (2117 of 2357) PASS: lldb-unit :: Utility/./UtilityTests/StringExtractorTest.GetHexU8_InvalidHex_NoEof (2118 of 2357) PASS: lldb-unit :: Utility/./UtilityTests/FileSpecTest.CopyByAppendingPathComponent (2119 of 2357) PASS: lldb-unit :: Process/gdb-remote/./ProcessGdbRemoteTests/GDBRemoteCommunicationClientTest.GetQOffsets (2120 of 2357) PASS: lldb-api :: commands/expression/namespace_local_var_same_name_cpp_and_c/TestNamespaceLocalVarSameNameCppAndC.py (2121 of 2357) PASS: lldb-api :: functionalities/mtc/simple/TestMTCSimple.py (2122 of 2357) PASS: lldb-unit :: Process/gdb-remote/./ProcessGdbRemoteTests/GDBRemoteCommunicationClientTest.SaveRestoreRegistersNoSuffix (2123 of 2357) PASS: lldb-shell :: Register/Core/x86-64-freebsd-fp.test (2124 of 2357) PASS: lldb-unit :: Utility/./UtilityTests/IndexToObjectTest.ObjectForIndex (2125 of 2357) PASS: lldb-api :: tools/lldb-vscode/launch/TestVSCode_launch.py (2126 of 2357) PASS: lldb-api :: commands/frame/diagnose/complicated-expression/TestComplicatedExpression.py (2127 of 2357) PASS: lldb-unit :: Utility/./UtilityTests/SerializationRountripTest.SerializeDeserializeObjectPointer (2128 of 2357) PASS: lldb-unit :: Host/./HostTests/FileSystemTest.GetPermissions (2129 of 2357) PASS: lldb-unit :: Utility/./UtilityTests/RangeTest.LessThanInvalid (2130 of 2357) PASS: lldb-shell :: SymbolFile/NativePDB/tag-types.cpp (2131 of 2357) PASS: lldb-unit :: Utility/./UtilityTests/UUIDTest.StringConverion (2132 of 2357) PASS: lldb-api :: lang/objc/self/TestObjCSelf.py (2133 of 2357) PASS: lldb-unit :: Language/Highlighting/./HighlighterTests/HighlighterTest.HighlighterSelectionPath (2134 of 2357) PASS: lldb-shell :: Settings/TestDisassemblyFormat.test (2135 of 2357) PASS: lldb-unit :: Utility/./UtilityTests/StringListTest.InsertStringAtIndexOutOfBounds (2136 of 2357) PASS: lldb-unit :: Utility/./UtilityTests/BinaryStreamTest.PutSLEB128OneByte (2137 of 2357) UNSUPPORTED: lldb-api :: functionalities/thread/create_during_step/TestCreateDuringStep.py (2138 of 2357) PASS: lldb-api :: types/TestDoubleTypesExpr.py (2139 of 2357) PASS: lldb-unit :: Host/./HostTests/MainLoopTest.TwoSignalCallbacks (2140 of 2357) PASS: lldb-unit :: Utility/./UtilityTests/ArgsTest.TestOverwriteArgs (2141 of 2357) PASS: lldb-unit :: Host/./HostTests/ConnectionFileDescriptorTest.TCPGetURIv4 (2142 of 2357) PASS: lldb-unit :: Breakpoint/./LLDBBreakpointTests/BreakpointIDTest.StringIsBreakpointName (2143 of 2357) PASS: lldb-api :: lang/objc/foundation/TestObjCMethodsString.py (2144 of 2357) PASS: lldb-unit :: Utility/./UtilityTests/XcodeSDKTest.MergeTest (2145 of 2357) PASS: lldb-api :: commands/command/nested_alias/TestNestedAlias.py (2146 of 2357) UNSUPPORTED: lldb-api :: functionalities/thread/concurrent_events/TestConcurrentManySignals.py (2147 of 2357) PASS: lldb-api :: api/listeners/TestListener.py (2148 of 2357) PASS: lldb-unit :: Utility/./UtilityTests/OptionsWithRawTest.WhitespaceSuffix (2149 of 2357) PASS: lldb-shell :: SymbolFile/Breakpad/symtab.test (2150 of 2357) PASS: lldb-unit :: Host/./HostTests/SocketTests/SocketTest.UDPConnect/ipv6 (2151 of 2357) PASS: lldb-shell :: SymbolFile/DWARF/x86/find-inline-method.s (2152 of 2357) PASS: lldb-unit :: Core/./LLDBCoreTests/MangledTest.NameIndexes_FindFunctionSymbols (2153 of 2357) PASS: lldb-unit :: Utility/./UtilityTests/StreamTest.AddressPrefix (2154 of 2357) PASS: lldb-unit :: Utility/./UtilityTests/ArgsTest.TestQuotedUnknownEscape (2155 of 2357) PASS: lldb-api :: functionalities/data-formatter/pyobjsynthprovider/TestPyObjSynthProvider.py (2156 of 2357) PASS: lldb-unit :: Target/./TargetTests/ExecutionContextTest.GetByteOrderProcess (2157 of 2357) PASS: lldb-unit :: Symbol/./SymbolTests/TestTypeSystemClang.TestNotDeletingUserCopyCstrDueToMoveCStr (2158 of 2357) PASS: lldb-unit :: Platform/Android/./AdbClientTests/AdbClientTest.CreateByDeviceId (2159 of 2357) PASS: lldb-unit :: Language/Highlighting/./HighlighterTests/HighlighterTest.ClangCursorPosAfterOtherToken (2160 of 2357) PASS: lldb-unit :: Utility/./UtilityTests/StringExtractorTest.GetHexU8_Underflow2_NoEof (2161 of 2357) PASS: lldb-api :: commands/expression/diagnostics/TestExprDiagnostics.py (2162 of 2357) PASS: lldb-unit :: Process/Utility/./ProcessUtilityTests/ProcMapTests/LinuxProcMapsTestFixture.ParseMapRegions/3 (2163 of 2357) PASS: lldb-unit :: ObjectFile/Breakpad/./ObjectFileBreakpadTests/LineRecord.parse (2164 of 2357) PASS: lldb-unit :: Utility/./UtilityTests/RangeTest.NotEqualInvalid (2165 of 2357) UNSUPPORTED: lldb-api :: functionalities/data-formatter/data-formatter-stl/libstdcpp/list/TestDataFormatterStdList.py (2166 of 2357) PASS: lldb-api :: lang/objc/objc-super/TestObjCSuper.py (2167 of 2357) PASS: lldb-unit :: Expression/./ExpressionTests/DiagnosticManagerTest.AppendMessageAttachToLastDiag (2168 of 2357) PASS: lldb-api :: functionalities/data-formatter/data-formatter-stl/libcxx/shared_ptr/TestDataFormatterLibcxxSharedPtr.py (2169 of 2357) PASS: lldb-api :: lang/objc/objc-optimized/TestObjcOptimized.py (2170 of 2357) PASS: lldb-unit :: Utility/./UtilityTests/OptionsWithRawTest.ArgsButNoDelimiter (2171 of 2357) PASS: lldb-unit :: Core/./LLDBCoreTests/RichManglingContextTest.FromCxxMethodName (2172 of 2357) PASS: lldb-shell :: Driver/TestPositionalArgs.test (2173 of 2357) PASS: lldb-unit :: Utility/./UtilityTests/SubsystemRAIITest.SubsystemWithErrorSuccess (2174 of 2357) PASS: lldb-api :: functionalities/thread/concurrent_events/TestConcurrentTwoBreakpointsOneSignal.py (2175 of 2357) UNSUPPORTED: lldb-api :: benchmarks/libcxxmap/TestBenchmarkLibcxxMap.py (2176 of 2357) UNSUPPORTED: lldb-api :: functionalities/gdb_remote_client/TestAArch64XMLRegOffsets.py (2177 of 2357) PASS: lldb-unit :: Utility/./UtilityTests/ArgsTest.TestUnknownEscape (2178 of 2357) PASS: lldb-unit :: UnwindAssembly/x86/./UnwindAssemblyx86Tests/Testx86AssemblyInspectionEngine.TestPushEDX (2179 of 2357) PASS: lldb-unit :: Utility/./UtilityTests/StreamTest.PutCharNull (2180 of 2357) UNSUPPORTED: lldb-shell :: Register/aarch64-gp-read.test (2181 of 2357) PASS: lldb-unit :: Process/gdb-remote/./ProcessGdbRemoteTests/PortMapTest.FreePortForProcess (2182 of 2357) UNSUPPORTED: lldb-api :: functionalities/breakpoint/hardware_breakpoints/hardware_breakpoint_on_multiple_threads/TestHWBreakMultiThread.py (2183 of 2357) PASS: lldb-shell :: SymbolFile/Breakpad/line-table-missing-file.test (2184 of 2357) UNSUPPORTED: lldb-api :: functionalities/darwin_log/format/TestDarwinLogMessageFormat.py (2185 of 2357) PASS: lldb-unit :: Utility/./UtilityTests/BinaryStreamTest.PutSLEB128NineBytes (2186 of 2357) PASS: lldb-unit :: Utility/./UtilityTests/CompletionRequest.TestCompletionOwnership (2187 of 2357) PASS: lldb-unit :: ScriptInterpreter/Python/./ScriptInterpreterPythonTests/PythonDataObjectsTest.TestPythonIntegerToStr (2188 of 2357) PASS: lldb-unit :: Target/./TargetTests/MCBasedABI.MapRegisterName (2189 of 2357) PASS: lldb-api :: commands/expression/namespace_local_var_same_name_obj_c/TestNamespaceLocalVarSameNameObjC.py (2190 of 2357) PASS: lldb-api :: functionalities/gdb_remote_client/TestRegDefinitionInParts.py (2191 of 2357) PASS: lldb-unit :: Utility/./UtilityTests/StringListTest.GetMaxStringLengthMixed (2192 of 2357) PASS: lldb-api :: types/TestFloatTypesExpr.py (2193 of 2357) PASS: lldb-unit :: Process/./ProcessEventDataTests/ProcessEventDataTest.DoOnRemoval (2194 of 2357) PASS: lldb-api :: tools/lldb-vscode/breakpoint/TestVSCode_setExceptionBreakpoints.py (2195 of 2357) PASS: lldb-api :: functionalities/reproducers/fs-case-sensitivity/TestReproducerFSCaseSensitivity.py (2196 of 2357) PASS: lldb-unit :: Process/gdb-remote/./ProcessGdbRemoteTests/GDBRemoteClientBaseTest.SendContinueAndAsyncPacket (2197 of 2357) PASS: lldb-unit :: UnwindAssembly/x86/./UnwindAssemblyx86Tests/Testx86AssemblyInspectionEngine.TestPushR13 (2198 of 2357) PASS: lldb-unit :: Process/Utility/./ProcessUtilityTests/RegisterContext_x86Test.FullToAbridgedTagWord (2199 of 2357) PASS: lldb-unit :: Host/./HostTests/SocketTests/SocketTest.TCPListen0GetPort/ipv4 (2200 of 2357) PASS: lldb-api :: functionalities/postmortem/elf-core/thread_crash/TestLinuxCoreThreads.py (2201 of 2357) PASS: lldb-api :: types/TestFloatTypes.py (2202 of 2357) PASS: lldb-api :: lang/objc/objc-new-syntax/TestObjCNewSyntaxDictionary.py (2203 of 2357) UNSUPPORTED: lldb-api :: benchmarks/turnaround/TestCompileRunToBreakpointTurnaround.py (2204 of 2357) PASS: lldb-api :: functionalities/inferior-changed/TestInferiorChanged.py (2205 of 2357) PASS: lldb-api :: macosx/find-dsym/bundle-with-dot-in-filename/TestBundleWithDotInFilename.py (2206 of 2357) PASS: lldb-api :: lang/cpp/rvalue-references/TestRvalueReferences.py (2207 of 2357) PASS: lldb-unit :: Utility/./UtilityTests/UriParserTest.SchemeHostSeparator (2208 of 2357) PASS: lldb-api :: python_api/sbdata/TestSBData.py (2209 of 2357) PASS: lldb-api :: functionalities/data-formatter/boolreference/TestFormattersBoolRefPtr.py (2210 of 2357) PASS: lldb-shell :: ObjectFile/ELF/short-build-id.yaml (2211 of 2357) UNSUPPORTED: lldb-api :: tools/lldb-server/vCont-threads/TestGdbRemote_vContThreads.py (2212 of 2357) PASS: lldb-api :: commands/session/history/TestSessionHistory.py (2213 of 2357) PASS: lldb-api :: tools/lldb-server/TestGdbRemoteThreadsInStopReply.py (2214 of 2357) PASS: lldb-api :: types/TestCharType.py (2215 of 2357) PASS: lldb-api :: lang/c/complex_int/TestComplexInt.py (2216 of 2357) PASS: lldb-unit :: Expression/./ExpressionTests/CppModuleConfigurationTest.AmbiguousCLib (2217 of 2357) PASS: lldb-shell :: SymbolFile/DWARF/deterministic-build.cpp (2218 of 2357) PASS: lldb-unit :: Utility/./UtilityTests/StringExtractorTest.GetHexU8_Extra_NoEof (2219 of 2357) PASS: lldb-shell :: Register/Core/x86-64-linux-fp.test (2220 of 2357) UNSUPPORTED: lldb-api :: macosx/simulator/TestSimulatorPlatform.py (2221 of 2357) UNSUPPORTED: lldb-shell :: Register/x86-64-zmm-write.test (2222 of 2357) PASS: lldb-api :: lang/objc/foundation/TestConstStrings.py (2223 of 2357) PASS: lldb-api :: functionalities/data-formatter/data-formatter-objc/TestDataFormatterObjCNSContainer.py (2224 of 2357) PASS: lldb-unit :: Utility/./UtilityTests/TimerTest.CategoryTimes2 (2225 of 2357) PASS: lldb-unit :: Utility/./UtilityTests/StreamTest.QuotedCString (2226 of 2357) PASS: lldb-unit :: Symbol/./SymbolTests/TestClangASTImporter.CopyDeclTagDecl (2227 of 2357) PASS: lldb-shell :: Reproducer/Functionalities/TestExpressionEvaluation.test (2228 of 2357) PASS: lldb-unit :: Utility/./UtilityTests/StringListTest.AppendListCStringArrayEmpty (2229 of 2357) PASS: lldb-api :: functionalities/data-formatter/synthcapping/TestSyntheticCapping.py (2230 of 2357) PASS: lldb-shell :: SymbolFile/DWARF/x86/DW_TAG_variable-DW_AT_const_value.s (2231 of 2357) PASS: lldb-unit :: Expression/./ExpressionTests/ClangHostTest.ComputeClangResourceDirectory (2232 of 2357) UNSUPPORTED: lldb-api :: functionalities/longjmp/TestLongjmp.py (2233 of 2357) PASS: lldb-api :: functionalities/breakpoint/scripted_bkpt/TestScriptedResolver.py (2234 of 2357) PASS: lldb-api :: lang/objc/print-obj/TestPrintObj.py (2235 of 2357) PASS: lldb-unit :: Utility/./UtilityTests/ArchSpecTest.OperatorBool (2236 of 2357) PASS: lldb-api :: functionalities/lazy-loading/TestLazyLoading.py (2237 of 2357) PASS: lldb-unit :: Utility/./UtilityTests/StreamTeeTest.Assignment (2238 of 2357) PASS: lldb-api :: functionalities/tail_call_frames/thread_step_out_message/TestArtificialFrameStepOutMessage.py (2239 of 2357) PASS: lldb-unit :: SymbolFile/DWARF/./SymbolFileDWARFTests/XcodeSDKModuleTests.TestModuleGetXcodeSDK (2240 of 2357) PASS: lldb-api :: lang/cpp/default-template-args/TestDefaultTemplateArgs.py (2241 of 2357) PASS: lldb-unit :: Host/./HostTests/MainLoopTest.Signal (2242 of 2357) PASS: lldb-unit :: Symbol/./SymbolTests/TestTypeSystemClang.AddMethodToObjCObjectType (2243 of 2357) PASS: lldb-api :: functionalities/thread/concurrent_events/TestConcurrentSignalNWatchNBreak.py (2244 of 2357) PASS: lldb-shell :: SymbolFile/DWARF/x86/find-method.cpp (2245 of 2357) PASS: lldb-shell :: Driver/TestError.test (2246 of 2357) PASS: lldb-unit :: ScriptInterpreter/Python/./ScriptInterpreterPythonTests/PythonDataObjectsTest.TestRun (2247 of 2357) PASS: lldb-unit :: Utility/./UtilityTests/UUIDTest.Validity (2248 of 2357) PASS: lldb-shell :: Reproducer/TestHomeDir.test (2249 of 2357) PASS: lldb-unit :: Process/Utility/./ProcessUtilityTests/MemoryTagManagerAArch64MTETest.GetLogicalTag (2250 of 2357) PASS: lldb-unit :: Utility/./UtilityTests/ArgsTest.TestArgv (2251 of 2357) UNSUPPORTED: lldb-shell :: SymbolFile/PDB/pointers.test (2252 of 2357) PASS: lldb-unit :: Utility/./UtilityTests/StringListTest.CopyList (2253 of 2357) PASS: lldb-api :: functionalities/data-formatter/data-formatter-stl/libcxx/unordered/TestDataFormatterUnordered.py (2254 of 2357) UNSUPPORTED: lldb-api :: commands/platform/connect/TestPlatformConnect.py (2255 of 2357) PASS: lldb-api :: lang/cpp/template-function/TestTemplateFunctions.py (2256 of 2357) PASS: lldb-api :: functionalities/breakpoint/breakpoint_ignore_count/TestBreakpointIgnoreCount.py (2257 of 2357) PASS: lldb-api :: commands/disassemble/basic/TestFrameDisassemble.py (2258 of 2357) PASS: lldb-unit :: Utility/./UtilityTests/LogChannelEnabledTest.log_options (2259 of 2357) PASS: lldb-unit :: SymbolFile/DWARF/./SymbolFileDWARFTests/SymbolFileDWARFTests.ParseArangesSkipErrors (2260 of 2357) PASS: lldb-unit :: Utility/./UtilityTests/ArchSpecTest.TestSetTriple (2261 of 2357) PASS: lldb-api :: lang/cpp/char8_t/TestCxxChar8_t.py (2262 of 2357) PASS: lldb-unit :: Process/gdb-remote/./ProcessGdbRemoteTests/GDBRemoteClientBaseTest.SendContinueAndAsyncSignal (2263 of 2357) PASS: lldb-shell :: SymbolFile/DWARF/x86/debug-line-basic.s (2264 of 2357) PASS: lldb-unit :: Utility/./UtilityTests/RegularExpression.Valid (2265 of 2357) PASS: lldb-api :: python_api/disassemble-raw-data/TestDisassembleRawData.py (2266 of 2357) PASS: lldb-unit :: Utility/./UtilityTests/StringListTest.JoinThree (2267 of 2357) PASS: lldb-unit :: Utility/./UtilityTests/StringListTest.GetMaxStringLengthDecreasingSize (2268 of 2357) PASS: lldb-unit :: Utility/./UtilityTests/ArgsTest.Yaml (2269 of 2357) PASS: lldb-unit :: Utility/./UtilityTests/StringListTest.ShiftMove (2270 of 2357) PASS: lldb-unit :: Platform/Android/./AdbClientTests/AdbClientTest.CreateByDeviceId_ByEnvVar (2271 of 2357) UNSUPPORTED: lldb-api :: lang/c/typedef/Testtypedef.py (2272 of 2357) PASS: lldb-unit :: Symbol/./SymbolTests/TestTypeSystemClang.OnlyPackName (2273 of 2357) PASS: lldb-unit :: Utility/./UtilityTests/NameMatchesTest.RegularExpression (2274 of 2357) PASS: lldb-unit :: Symbol/./SymbolTests/TestTypeSystemClang.TestFunctionTemplateConstruction (2275 of 2357) PASS: lldb-api :: functionalities/breakpoint/inlined_breakpoints/TestInlinedBreakpoints.py (2276 of 2357) PASS: lldb-unit :: Utility/./UtilityTests/ArgsTest.GetQuotedCommandString (2277 of 2357) PASS: lldb-unit :: Core/./LLDBCoreTests/RichManglingContextTest.IPDRealloc (2278 of 2357) PASS: lldb-unit :: Process/minidump/./LLDBMinidumpTests/MinidumpParserTest.GetLinuxProcStatus_no_stream (2279 of 2357) PASS: lldb-api :: commands/settings/quoting/TestQuoting.py (2280 of 2357) PASS: lldb-api :: commands/expression/dollar-in-variable/TestDollarInVariable.py (2281 of 2357) PASS: lldb-unit :: ObjectFile/Breakpad/./ObjectFileBreakpadTests/ModuleRecord.parse (2282 of 2357) PASS: lldb-api :: types/TestIntegerTypeExpr.py (2283 of 2357) PASS: lldb-unit :: Expression/./ExpressionTests/DiagnosticManagerTest.PutString (2284 of 2357) PASS: lldb-unit :: Core/./LLDBCoreTests/ModuleSpecTest.InvalidInMemoryBufferValidFile (2285 of 2357) PASS: lldb-api :: functionalities/gdb_remote_client/TestGDBRemoteLoad.py (2286 of 2357) PASS: lldb-shell :: Register/x86-64-gp-read.test (2287 of 2357) PASS: lldb-unit :: ScriptInterpreter/Python/./ScriptInterpreterPythonTests/PythonDataObjectsTest.TestResetting (2288 of 2357) PASS: lldb-api :: lang/cpp/this_class_type_mixing/TestThisClassTypeMixing.py (2289 of 2357) PASS: lldb-unit :: Utility/./UtilityTests/StringListTest.AppendStringCString (2290 of 2357) PASS: lldb-api :: functionalities/gdb_remote_client/TestMultiprocess.py (2291 of 2357) PASS: lldb-unit :: ScriptInterpreter/Python/./ScriptInterpreterPythonTests/PythonDataObjectsTest.TestPythonTupleInitializerList2 (2292 of 2357) PASS: lldb-unit :: SymbolFile/DWARF/./SymbolFileDWARFTests/SymbolFileDWARFTests.ParseArangesWithMultipleTerminators (2293 of 2357) PASS: lldb-unit :: debugserver/./debugserverTests/JSON.Parse (2294 of 2357) PASS: lldb-api :: python_api/function_symbol/TestSymbolAPI.py (2295 of 2357) PASS: lldb-unit :: Process/gdb-remote/./ProcessGdbRemoteTests/GDBRemoteCommunicationClientTest.WriteRegister (2296 of 2357) PASS: lldb-shell :: SymbolFile/DWARF/x86/debug_ranges_and_rnglists.test (2297 of 2357) PASS: lldb-unit :: Utility/./UtilityTests/StreamTest.PutSLEB128 (2298 of 2357) PASS: lldb-unit :: Process/gdb-remote/./ProcessGdbRemoteTests/PortMapTest.FreePort (2299 of 2357) PASS: lldb-unit :: API/./APITests/SBCommandInterpreterTest.MultiWordCommand (2300 of 2357) PASS: lldb-unit :: Utility/./UtilityTests/RecordReplayTest.InstrumentedBarRef (2301 of 2357) PASS: lldb-shell :: Settings/TestFrameFormatNoColor.test (2302 of 2357) PASS: lldb-unit :: Utility/./UtilityTests/PassiveReplayTest.InstrumentedBarRef (2303 of 2357) PASS: lldb-unit :: debugserver/./debugserverTests/RNBSocket.LoopBackConnectIPv6 (2304 of 2357) PASS: lldb-unit :: Utility/./UtilityTests/FileSpecTest.Equal (2305 of 2357) PASS: lldb-unit :: UnwindAssembly/x86/./UnwindAssemblyx86Tests/Testx86AssemblyInspectionEngine.TestPopR12 (2306 of 2357) PASS: lldb-unit :: Language/Highlighting/./HighlighterTests/HighlighterTest.ClangPPDirectives (2307 of 2357) PASS: lldb-unit :: Core/./LLDBCoreTests/MangledTest.EmptyForInvalidRustV0Name (2308 of 2357) PASS: lldb-api :: functionalities/data-formatter/ptr_ref_typedef/TestPtrRef2Typedef.py (2309 of 2357) UNSUPPORTED: lldb-shell :: ExecControl/StopHook/stop-hook-threads.test (2310 of 2357) PASS: lldb-api :: functionalities/tail_call_frames/thread_step_out_or_return/TestSteppingOutWithArtificialFrames.py (2311 of 2357) PASS: lldb-api :: lang/cpp/wchar_t/TestCxxWCharT.py (2312 of 2357) PASS: lldb-unit :: UnwindAssembly/x86/./UnwindAssemblyx86Tests/Testx86AssemblyInspectionEngine.TestSimple64bitFrameFunction (2313 of 2357) PASS: lldb-unit :: UnwindAssembly/x86/./UnwindAssemblyx86Tests/Testx86AssemblyInspectionEngine.TestMovRSPtoRBP (2314 of 2357) PASS: lldb-api :: lang/objcxx/objcxx-ivar-vector/TestIvarVector.py (2315 of 2357) PASS: lldb-unit :: Utility/./UtilityTests/ReproducerTest.SetReplay (2316 of 2357) PASS: lldb-unit :: Expression/./ExpressionTests/ClangHostTest.MacOSX (2317 of 2357) PASS: lldb-unit :: Utility/./UtilityTests/XcodeSDKTest.SDKSupportsSwift (2318 of 2357) PASS: lldb-unit :: Utility/./UtilityTests/StructuredDataTest.StringDump (2319 of 2357) PASS: lldb-api :: commands/expression/completion/TestExprCompletion.py (2320 of 2357) PASS: lldb-api :: functionalities/breakpoint/global_constructor/TestBreakpointInGlobalConstructor.py (2321 of 2357) PASS: lldb-unit :: Symbol/./SymbolTests/TestTypeSystemClang.GetExeModuleWhenMissingSymbolFile (2322 of 2357) PASS: lldb-unit :: ObjectFile/Breakpad/./ObjectFileBreakpadTests/FileRecord.parse (2323 of 2357) PASS: lldb-unit :: Utility/./UtilityTests/StringExtractorTest.GetU64BigEndian (2324 of 2357) PASS: lldb-api :: commands/platform/file/read/TestPlatformFileRead.py (2325 of 2357) PASS: lldb-api :: python_api/formatters/TestFormattersSBAPI.py (2326 of 2357) PASS: lldb-shell :: ScriptInterpreter/Python/Crashlog/parser_json.test (2327 of 2357) PASS: lldb-api :: functionalities/load_using_paths/TestLoadUsingPaths.py (2328 of 2357) PASS: lldb-api :: commands/platform/process/list/TestProcessList.py (2329 of 2357) PASS: lldb-unit :: Interpreter/./InterpreterTests/CompletionTest.DirCompletionUsername (2330 of 2357) PASS: lldb-unit :: ObjectFile/PECOFF/./ObjectFilePECOFFTests/PECallFrameInfoTest.Basic_eh (2331 of 2357) PASS: lldb-unit :: Utility/./UtilityTests/FileSpecTest.EqualDotsPosix (2332 of 2357) UNSUPPORTED: lldb-shell :: Process/Windows/exception_access_violation.cpp (2333 of 2357) PASS: lldb-unit :: Host/./HostTests/ConnectionFileDescriptorTest.TCPGetURIv6 (2334 of 2357) PASS: lldb-shell :: Settings/TestSettingsSet.test (2335 of 2357) UNSUPPORTED: lldb-shell :: Unwind/basic-block-sections.test (2336 of 2357) PASS: lldb-api :: functionalities/tail_call_frames/ambiguous_tail_call_seq2/TestAmbiguousTailCallSeq2.py (2337 of 2357) PASS: lldb-api :: functionalities/postmortem/elf-core/gcore/TestGCore.py (2338 of 2357) PASS: lldb-api :: functionalities/set-data/TestSetData.py (2339 of 2357) PASS: lldb-shell :: SymbolFile/DWARF/x86/find-basic-variable.cpp (2340 of 2357) PASS: lldb-shell :: Quit/TestQuitExitCodeImplicit0.test (2341 of 2357) PASS: lldb-shell :: SymbolFile/DWARF/x86/find-basic-type.cpp (2342 of 2357) PASS: lldb-unit :: Host/./HostTests/SocketTests/SocketTest.TCPGetConnectURI/ipv4 (2343 of 2357) PASS: lldb-api :: functionalities/backticks/TestBackticksWithoutATarget.py (2344 of 2357) PASS: lldb-api :: functionalities/thread/concurrent_events/TestConcurrentTwoWatchpointsOneDelayBreakpoint.py (2345 of 2357) PASS: lldb-unit :: Utility/./UtilityTests/RangeTest.ContainsRangeStartingFromZero (2346 of 2357) PASS: lldb-unit :: UnwindAssembly/x86/./UnwindAssemblyx86Tests/Testx86AssemblyInspectionEngine.TestPushR14 (2347 of 2357) PASS: lldb-unit :: Utility/./UtilityTests/LogChannelEnabledTest.LLDB_LOG_ERROR (2348 of 2357) PASS: lldb-api :: lang/cpp/exceptions/TestCPPExceptionBreakpoints.py (2349 of 2357) PASS: lldb-unit :: Utility/./UtilityTests/Flags.Reset (2350 of 2357) PASS: lldb-api :: functionalities/thread/exit_during_step/TestExitDuringStep.py (2351 of 2357) PASS: lldb-api :: commands/expression/expr-in-syscall/TestExpressionInSyscall.py (2352 of 2357) PASS: lldb-unit :: UnwindAssembly/x86/./UnwindAssemblyx86Tests/Testx86AssemblyInspectionEngine.TestSpArithx86_64Augmented (2353 of 2357) UNSUPPORTED: lldb-api :: functionalities/tsan/thread_numbers/TestTsanThreadNumbers.py (2354 of 2357) PASS: lldb-api :: commands/expression/context-object-objc/TestContextObjectObjc.py (2355 of 2357) PASS: lldb-shell :: Reproducer/TestVersionCheck.test (2356 of 2357) PASS: lldb-api :: tools/lldb-server/TestLldbGdbServer.py (2357 of 2357) Slowest Tests: -------------------------------------------------------------------------- 279.96s: lldb-api :: tools/lldb-server/TestLldbGdbServer.py 211.10s: lldb-api :: functionalities/memory-region/TestMemoryRegion.py 192.12s: lldb-api :: api/multithreaded/TestMultithreaded.py 177.48s: lldb-api :: macosx/skinny-corefile/TestSkinnyCorefile.py 115.30s: lldb-api :: types/TestLongTypesExpr.py 108.76s: lldb-api :: commands/expression/import-std-module/queue/TestQueueFromStdModule.py 108.32s: lldb-api :: commands/expression/import-std-module/stack/TestStackFromStdModule.py 103.46s: lldb-api :: lang/objc/objc-new-syntax/TestObjCNewSyntaxLiteral.py 97.35s: lldb-api :: lang/objc/exceptions/TestObjCExceptions.py 93.00s: lldb-api :: lang/objc/hidden-ivars/TestHiddenIvars.py 91.93s: lldb-api :: functionalities/gdb_remote_client/TestWasm.py 89.33s: lldb-api :: lang/cpp/namespace/TestNamespaceLookup.py 88.12s: lldb-api :: commands/expression/import-std-module/vector/TestVectorFromStdModule.py 87.93s: lldb-api :: lang/objc/foundation/TestObjCMethods.py 78.18s: lldb-api :: commands/expression/import-std-module/deque-basic/TestDequeFromStdModule.py 75.41s: lldb-api :: commands/expression/import-std-module/deque-dbg-info-content/TestDbgInfoContentDequeFromStdModule.py 73.70s: lldb-api :: types/TestIntegerTypeExpr.py 71.99s: lldb-api :: commands/expression/import-std-module/vector-dbg-info-content/TestDbgInfoContentVectorFromStdModule.py 71.63s: lldb-api :: lang/objc/objc-new-syntax/TestObjCNewSyntaxArray.py 71.08s: lldb-api :: lang/objc/objc-new-syntax/TestObjCNewSyntaxDictionary.py

Hide Details

Tests Times: -------------------------------------------------------------------------- [ Range ] :: [ Percentage ] :: [ Count ] -------------------------------------------------------------------------- [260s,280s) :: [ ] :: [ 1/2357] [240s,260s) :: [ ] :: [ 0/2357] [220s,240s) :: [ ] :: [ 0/2357] [200s,220s) :: [ ] :: [ 1/2357] [180s,200s) :: [ ] :: [ 1/2357] [160s,180s) :: [ ] :: [ 1/2357] [140s,160s) :: [ ] :: [ 0/2357] [120s,140s) :: [ ] :: [ 0/2357] [100s,120s) :: [ ] :: [ 4/2357] [ 80s,100s) :: [ ] :: [ 6/2357] [ 60s, 80s) :: [ ] :: [ 8/2357] [ 40s, 60s) :: [ ] :: [ 25/2357] [ 20s, 40s) :: [** ] :: [ 128/2357] [ 0s, 20s) :: [************************************* ] :: [2182/2357] -------------------------------------------------------------------------- ******************** Failed Tests (3): lldb-api :: tools/lldb-vscode/breakpoint/TestVSCode_setBreakpoints.py lldb-api :: tools/lldb-vscode/breakpoint/TestVSCode_setFunctionBreakpoints.py lldb-api :: tools/lldb-vscode/evaluate/TestVSCode_evaluate.py

Hide Details

Hide Details

Testing Time: 3517.44s Unsupported : 213 Passed : 2131 Expectedly Failed: 10 Failed : 3 FAILED: tools/lldb/test/CMakeFiles/check-lldb cd /Users/buildslave/jenkins/workspace/lldb-cmake-sanitized/lldb-build/tools/lldb/test && /usr/local/Frameworks/Python.framework/Versions/3.7/bin/python3.7 /Users/buildslave/jenkins/workspace/lldb-cmake-sanitized/lldb-build/./bin/llvm-lit -v --time-tests --shuffle --xunit-xml-output=/Users/buildslave/jenkins/workspace/lldb-cmake-sanitized/test/results.xml -v -j 4 --timeout 1200 /Users/buildslave/jenkins/workspace/lldb-cmake-sanitized/lldb-build/tools/lldb/test ninja: build stopped: subcommand failed. Command failed: Command '['/usr/bin/env', 'TERM=vt100', '/usr/local/bin/ninja', '-v', 'check-lldb']' returned non-zero exit status 1. Command: ['/usr/bin/env', 'TERM=vt100', '/usr/local/bin/ninja', '-v', 'check-lldb'] [Pipeline] } [Pipeline] // timeout [Pipeline] } [Pipeline] // stage [Pipeline] stage [Pipeline] { (Declarative: Post Actions) [Pipeline] scanForIssues [Clang (LLVM based)] Sleeping for 5 seconds due to JENKINS-32191... [Clang (LLVM based)] Parsing console log (workspace: '/Users/buildslave/jenkins/workspace/lldb-cmake-sanitized') [Clang (LLVM based)] Successfully parsed console log [Clang (LLVM based)] -> found 5 issues (skipped 3 duplicates) [Clang (LLVM based)] [-ERROR-] Can't create fingerprints for some files: [Clang (LLVM based)] [-ERROR-] - '/Users/buildslave/jenkins/workspace/lldb-cmake-sanitized/lldb-build/{"body":{"category":"console","output":"/Users/buildslave/jenkins/workspace/lldb-cmake-sanitized/llvm-project/lldb/tools/lldb-vscode/ProgressEvent.cpp', IO exception has been thrown: java.nio.file.NoSuchFileException: /Users/buildslave/jenkins/workspace/lldb-cmake-sanitized/lldb-build/{"body":{"category":"console","output":"/Users/buildslave/jenkins/workspace/lldb-cmake-sanitized/llvm-project/lldb/tools/lldb-vscode/ProgressEvent.cpp [Clang (LLVM based)] [-ERROR-] - '/Users/buildslave/jenkins/workspace/lldb-cmake-sanitized/lldb-build/{"body":{"category":"console","output":"/Users/buildslave/jenkins/workspace/lldb-cmake-sanitized/llvm-project/lldb/tools/lldb-vscode/ProgressEvent.cpp', IO exception has been thrown: java.nio.file.NoSuchFileException: /Users/buildslave/jenkins/workspace/lldb-cmake-sanitized/lldb-build/{"body":{"category":"console","output":"/Users/buildslave/jenkins/workspace/lldb-cmake-sanitized/llvm-project/lldb/tools/lldb-vscode/ProgressEvent.cpp [Clang (LLVM based)] Post processing issues on 'green-dragon-23' with source code encoding 'UTF-8' [Clang (LLVM based)] Creating SCM blamer to obtain author and commit information for affected files [Clang (LLVM based)] -> No blamer installed yet. You need to install the 'git-forensics' plugin to enable blaming for Git. [Clang (LLVM based)] Resolving file names for all issues in source directory '/Users/buildslave/jenkins/workspace/lldb-cmake-sanitized' [Clang (LLVM based)] -> resolved paths in source directory (3 found, 1 not found) [Clang (LLVM based)] Resolving module names from module definitions (build.xml, pom.xml, or Manifest.mf files) [Clang (LLVM based)] -> resolved module names for 5 issues [Clang (LLVM based)] Resolving package names (or namespaces) by parsing the affected files [Clang (LLVM based)] -> resolved package names of 4 affected files [Clang (LLVM based)] No filter has been set, publishing all 5 issues [Clang (LLVM based)] Creating fingerprints for all affected code blocks to track issues over different builds [Clang (LLVM based)] -> created fingerprints for 3 issues (skipped 2 issues) [Clang (LLVM based)] Copying affected files to Jenkins' build folder '/Users/Shared/Jenkins/Home/jobs/lldb-cmake-sanitized/builds/1910/files-with-issues' [Clang (LLVM based)] -> 3 copied, 0 not in workspace, 2 not-found, 0 with I/O error [Clang (LLVM based)] Repository miner is not configured, skipping repository mining [Pipeline] junit Recording test results [Checks API] No suitable checks publisher found. [Pipeline] } [Pipeline] // stage [Pipeline] } [Pipeline] // withEnv [Pipeline] } [Pipeline] // node [Pipeline] End of Pipeline ERROR: script returned exit code 1 Finished: FAILURE