Failed

lldb-unit.Host/_/HostTests.SocketTests/SocketTest.DomainGetConnectURI/ipv6 (from lldb-unit)

Failing for the past 3 builds (Since #1984 )
Took 0.11 sec.

Stacktrace

Script:
--
/Users/buildslave/jenkins/workspace/lldb-cmake-sanitized/lldb-build/tools/lldb/unittests/Host/./HostTests --gtest_filter=SocketTests/SocketTest.DomainGetConnectURI/ipv6
--
Note: Google Test filter = SocketTests/SocketTest.DomainGetConnectURI/ipv6
[==========] Running 1 test from 1 test suite.
[----------] Global test environment set-up.
[----------] 1 test from SocketTests/SocketTest
[ RUN      ] SocketTests/SocketTest.DomainGetConnectURI/ipv6
/Users/buildslave/jenkins/workspace/lldb-cmake-sanitized/llvm-project/lldb/unittests/Host/SocketTest.cpp:226: Failure
Expected equality of these values:
  socket_b_up->GetRemoteConnectionURI()
    Which is: "unix-connect://\0\0\0\0\0\0\0\0\0\0\0\0\0"
  ""
[  FAILED  ] SocketTests/SocketTest.DomainGetConnectURI/ipv6, where GetParam() = 32-byte object <01-BE BE-BE BE-BE BE-BE 06-3A 3A-31 00-61 00-00 B0-AE A7-EA FE-7F 00-00 1F-07 27-05 01-00 00-00> (1 ms)
[----------] 1 test from SocketTests/SocketTest (1 ms total)

[----------] Global test environment tear-down
[==========] 1 test from 1 test suite ran. (1 ms total)
[  PASSED  ] 0 tests.
[  FAILED  ] 1 test, listed below:
[  FAILED  ] SocketTests/SocketTest.DomainGetConnectURI/ipv6, where GetParam() = 32-byte object <01-BE BE-BE BE-BE BE-BE 06-3A 3A-31 00-61 00-00 B0-AE A7-EA FE-7F 00-00 1F-07 27-05 01-00 00-00>

 1 FAILED TEST