Console Output

Skipping 9,527 KB.. Full Log
PASS: lldb-api :: lang/cpp/non-type-template-param/TestCppNonTypeTemplateParam.py (898 of 2421)
PASS: lldb-shell :: ObjectFile/ELF/many-sections.s (899 of 2421)
PASS: lldb-unit :: Utility/./UtilityTests/FileSpecTest.OperatorBool (900 of 2421)
PASS: lldb-unit :: Expression/./ExpressionTests/DWARFExpressionMockProcessTest.DW_OP_deref (901 of 2421)
PASS: lldb-unit :: Utility/./UtilityTests/TimerTest.CategoryTimesStats (902 of 2421)
PASS: lldb-unit :: Utility/./UtilityTests/BinaryStreamTest.PutSLEB128FiveBytes (903 of 2421)
PASS: lldb-unit :: Utility/./UtilityTests/StatusTest.ErrorCodeConstructor (904 of 2421)
PASS: lldb-unit :: Utility/./UtilityTests/StreamTest.PutCharNull (905 of 2421)
UNSUPPORTED: lldb-shell :: ScriptInterpreter/Lua/breakpoint_callback.test (906 of 2421)
PASS: lldb-api :: python_api/process/io/TestProcessIO.py (907 of 2421)
PASS: lldb-shell :: Settings/TestDisableColor.test (908 of 2421)
UNSUPPORTED: lldb-api :: commands/register/register/intel_xtended_registers/mpx_offset_intersection/TestMPXOffsetIntersection.py (909 of 2421)
PASS: lldb-unit :: Expression/./ExpressionTests/DWARFExpression.DW_OP_pick (910 of 2421)
PASS: lldb-unit :: UnwindAssembly/x86/./UnwindAssemblyx86Tests/Testx86AssemblyInspectionEngine.TestCALLNextInsn (911 of 2421)
PASS: lldb-api :: commands/command/script/import/TestImport.py (912 of 2421)
PASS: lldb-api :: functionalities/thread/thread_specific_break/TestThreadSpecificBreakpoint.py (913 of 2421)
PASS: lldb-shell :: Reproducer/TestDiscard.test (914 of 2421)
PASS: lldb-unit :: Target/./TargetTests/PathMappingListTest.RemapRoot (915 of 2421)
UNSUPPORTED: lldb-api :: commands/expression/completion-crash-invalid-iterator/TestInvalidIteratorCompletionCrash.py (916 of 2421)
PASS: lldb-api :: python_api/class_members/TestSBTypeClassMembers.py (917 of 2421)
PASS: lldb-unit :: API/./APITests/SBCommandInterpreterTest.SingleWordCommand (918 of 2421)
PASS: lldb-api :: commands/expression/unicode-in-variable/TestUnicodeInVariable.py (919 of 2421)
PASS: lldb-api :: commands/expression/static-initializers/TestStaticInitializers.py (920 of 2421)
PASS: lldb-api :: lang/cpp/std-function-step-into-callable/TestStdFunctionStepIntoCallable.py (921 of 2421)
UNSUPPORTED: lldb-shell :: ExecControl/StopHook/stop-hook-threads.test (922 of 2421)
PASS: lldb-shell :: Register/Core/x86-64-linux-multithread.test (923 of 2421)
PASS: lldb-api :: python_api/sberror/TestSBError.py (924 of 2421)
PASS: lldb-unit :: Interpreter/./InterpreterTests/CompletionTest.FileCompletionAbsolute (925 of 2421)
PASS: lldb-api :: python_api/sbvalue_persist/TestSBValuePersist.py (926 of 2421)
PASS: lldb-unit :: Utility/./UtilityTests/StringExtractorTest.GetHexU8_Extra_NoEof (927 of 2421)
PASS: lldb-api :: commands/breakpoint/command/list/TestBreakpointCommandList.py (928 of 2421)
PASS: lldb-unit :: Expression/./ExpressionTests/DiagnosticManagerTest.GetStringSeverityLabels (929 of 2421)
PASS: lldb-api :: lang/c/find_struct_type/TestFindStructTypes.py (930 of 2421)
PASS: lldb-api :: functionalities/thread/thread_exit/TestThreadExit.py (931 of 2421)
PASS: lldb-shell :: SymbolFile/DWARF/x86/debug_aranges-empty-section.s (932 of 2421)
PASS: lldb-unit :: Utility/./UtilityTests/CompletionRequest.TryCompleteCurrentArgMode (933 of 2421)
PASS: lldb-shell :: ObjectFile/PDB/object.test (934 of 2421)
PASS: lldb-shell :: Heap/heap-cstr.test (935 of 2421)
PASS: lldb-api :: lang/cpp/limit-debug-info/TestWithLimitDebugInfo.py (936 of 2421)
PASS: lldb-api :: functionalities/lazy-loading/TestLazyLoading.py (937 of 2421)
PASS: lldb-api :: types/TestShortTypeExpr.py (938 of 2421)
PASS: lldb-shell :: Minidump/no-process-id.yaml (939 of 2421)
PASS: lldb-api :: lang/cpp/overloaded-functions/TestOverloadedFunctions.py (940 of 2421)
PASS: lldb-unit :: UnwindAssembly/x86/./UnwindAssemblyx86Tests/Testx86AssemblyInspectionEngine.TestPushECX (941 of 2421)
PASS: lldb-unit :: Language/Highlighting/./HighlighterTests/HighlighterTest.DefaultHighlighterWithCursorOutOfBounds (942 of 2421)
PASS: lldb-api :: lang/objc/unicode-string/TestUnicodeString.py (943 of 2421)
UNSUPPORTED: lldb-api :: repl/clang/TestClangREPL.py (944 of 2421)
PASS: lldb-api :: functionalities/breakpoint/breakpoint_hit_count/TestBreakpointHitCount.py (945 of 2421)
PASS: lldb-api :: lang/c/const_variables/TestConstVariables.py (946 of 2421)
PASS: lldb-unit :: Target/./TargetTests/PathMappingListTest.RelativeTests (947 of 2421)
PASS: lldb-unit :: SymbolFile/NativePDB/./SymbolFileNativePDBTests/PDBFPOProgramToDWARFExpressionTests.InvalidOpUnary (948 of 2421)
PASS: lldb-unit :: Expression/./ExpressionTests/CppModuleConfigurationTest.MissingLibCpp (949 of 2421)
PASS: lldb-api :: functionalities/data-formatter/data-formatter-stl/libcxx/set/TestDataFormatterLibcxxSet.py (950 of 2421)
PASS: lldb-unit :: ObjectFile/ELF/./ObjectFileELFTests/ObjectFileELFTest.SectionsResolveConsistently (951 of 2421)
PASS: lldb-unit :: Utility/./UtilityTests/DataExtractorTest.GetBitfield (952 of 2421)
PASS: lldb-unit :: Process/gdb-remote/./ProcessGdbRemoteTests/GDBRemoteCommunicationClientTest.ReadMemoryTags (953 of 2421)
PASS: lldb-shell :: SymbolFile/DWARF/x86/DW_OP_piece-struct.s (954 of 2421)
PASS: lldb-api :: lang/objc/modules-compile-error/TestModulesCompileError.py (955 of 2421)
PASS: lldb-unit :: Language/Highlighting/./HighlighterTests/HighlighterTest.Keywords (956 of 2421)
PASS: lldb-shell :: ObjectFile/MachO/symtab.yaml (957 of 2421)
PASS: lldb-api :: python_api/disassemble-raw-data/TestDisassembleRawData.py (958 of 2421)
PASS: lldb-api :: lang/objc/foundation/TestObjectDescriptionAPI.py (959 of 2421)
PASS: lldb-api :: tools/lldb-server/commandline/TestGdbRemoteConnection.py (960 of 2421)
PASS: lldb-unit :: Utility/./UtilityTests/GeneratorTest.Create (961 of 2421)
UNSUPPORTED: lldb-shell :: SymbolFile/NativePDB/ast-functions-msvc.cpp (962 of 2421)
PASS: lldb-shell :: ObjectFile/ELF/aarch64-relocations.yaml (963 of 2421)
UNSUPPORTED: lldb-shell :: SymbolFile/PDB/vbases.test (964 of 2421)
PASS: lldb-unit :: ScriptInterpreter/Python/./ScriptInterpreterPythonTests/PythonDataObjectsTest.TestPythonCallableCheck (965 of 2421)
PASS: lldb-unit :: Utility/./UtilityTests/ArgsTest.TestAppendArg (966 of 2421)
PASS: lldb-unit :: Utility/./UtilityTests/StreamTest.PutHex64ByteOrderLittle (967 of 2421)
PASS: lldb-unit :: Core/./LLDBCoreTests/SourceLocationSpecTest.FileLineColumnComponents (968 of 2421)
PASS: lldb-api :: commands/expression/import-std-module/shared_ptr/TestSharedPtrFromStdModule.py (969 of 2421)
PASS: lldb-shell :: Settings/TestFrameFormatColor.test (970 of 2421)
PASS: lldb-api :: tools/lldb-server/TestGdbRemote_vCont.py (971 of 2421)
PASS: lldb-api :: functionalities/data-formatter/boolreference/TestFormattersBoolRefPtr.py (972 of 2421)
PASS: lldb-api :: functionalities/data-formatter/data-formatter-python-synth/TestDataFormatterPythonSynth.py (973 of 2421)
PASS: lldb-api :: functionalities/plugins/python_os_plugin/TestPythonOSPlugin.py (974 of 2421)
UNSUPPORTED: lldb-api :: linux/aarch64/mte_tag_access/TestAArch64LinuxMTEMemoryTagAccess.py (975 of 2421)
PASS: lldb-unit :: Utility/./UtilityTests/StringExtractorTest.GetHexU8_Extra (976 of 2421)
PASS: lldb-api :: tools/lldb-vscode/correct-thread/TestVSCode_correct_thread.py (977 of 2421)
PASS: lldb-api :: macosx/function-starts/TestFunctionStarts.py (978 of 2421)
PASS: lldb-api :: commands/platform/file/close/TestPlatformFileClose.py (979 of 2421)
PASS: lldb-unit :: Host/./HostTests/FileSystemTest.Readable (980 of 2421)
PASS: lldb-shell :: Reproducer/Functionalities/TestImageList.test (981 of 2421)
PASS: lldb-shell :: Register/x86-multithread-read.test (982 of 2421)
PASS: lldb-api :: functionalities/inferior-assert/TestInferiorAssert.py (983 of 2421)
PASS: lldb-unit :: Utility/./UtilityTests/StringListTest.SplitIntoLinesSingleTrailingCR (984 of 2421)
UNSUPPORTED: lldb-shell :: Register/x86-zmm-write.test (985 of 2421)
PASS: lldb-unit :: Interpreter/./InterpreterTests/OptionArgParserTest.toChar (986 of 2421)
UNSUPPORTED: lldb-api :: linux/add-symbols/TestTargetSymbolsAddCommand.py (987 of 2421)
PASS: lldb-unit :: Process/Utility/./ProcessUtilityTests/ProcSMapTests/LinuxProcSMapsTestFixture.ParseSMapRegions/1 (988 of 2421)
PASS: lldb-api :: lang/cpp/this/TestCPPThis.py (989 of 2421)
PASS: lldb-api :: commands/expression/entry-bp/TestExprEntryBP.py (990 of 2421)
PASS: lldb-shell :: SymbolFile/NativePDB/ast-functions.cpp (991 of 2421)
UNSUPPORTED: lldb-api :: commands/gui/breakpoints/TestGuiBreakpoints.py (992 of 2421)
PASS: lldb-unit :: Process/gdb-remote/./ProcessGdbRemoteTests/GDBRemoteClientBaseTest.SendContinueAndWait (993 of 2421)
PASS: lldb-unit :: Utility/./UtilityTests/TimerTest.CategoryTimes (994 of 2421)
UNSUPPORTED: lldb-shell :: Unwind/split-machine-functions.test (995 of 2421)
PASS: lldb-unit :: Utility/./UtilityTests/StringListTest.DefaultConstructor (996 of 2421)
PASS: lldb-api :: functionalities/breakpoint/inlined_breakpoints/TestInlinedBreakpoints.py (997 of 2421)
PASS: lldb-api :: lang/objc/modules-incomplete/TestIncompleteModules.py (998 of 2421)
UNSUPPORTED: lldb-api :: linux/aarch64/mte_tag_faults/TestAArch64LinuxMTEMemoryTagFaults.py (999 of 2421)
PASS: lldb-unit :: Utility/./UtilityTests/ArgsTest.GetArgumentArrayRef (1000 of 2421)
PASS: lldb-unit :: Utility/./UtilityTests/DataExtractorTest.GetDouble (1001 of 2421)
PASS: lldb-shell :: SymbolFile/DWARF/dwo-relative-path.s (1002 of 2421)
UNSUPPORTED: lldb-shell :: SymbolFile/PDB/func-symbols.test (1003 of 2421)
PASS: lldb-shell :: SymbolFile/DWARF/x86/debug_loc.s (1004 of 2421)
PASS: lldb-unit :: Process/Utility/./ProcessUtilityTests/ProcSMapTests/LinuxProcSMapsTestFixture.ParseSMapRegions/8 (1005 of 2421)
UNSUPPORTED: lldb-shell :: BuildScript/toolchain-clang-cl.test (1006 of 2421)
PASS: lldb-unit :: Host/./HostTests/File.GetStreamFromDescriptor (1007 of 2421)
PASS: lldb-unit :: Symbol/./SymbolTests/TestScratchTypeSystemClang.InferSubASTFromLangOpts (1008 of 2421)
PASS: lldb-unit :: Symbol/./SymbolTests/TestTypeSystemClang.TestGetEnumIntegerTypeBasicTypes (1009 of 2421)
PASS: lldb-api :: python_api/exprpath_synthetic/TestExprPathSynthetic.py (1010 of 2421)
PASS: lldb-api :: functionalities/tail_call_frames/ambiguous_tail_call_seq1/TestAmbiguousTailCallSeq1.py (1011 of 2421)
PASS: lldb-unit :: ScriptInterpreter/Python/./ScriptInterpreterPythonTests/PythonDataObjectsTest.TestDictionaryResolutionWithDot (1012 of 2421)
PASS: lldb-shell :: ObjectFile/ELF/section-permissions.yaml (1013 of 2421)
PASS: lldb-unit :: Process/gdb-remote/./ProcessGdbRemoteTests/GDBRemoteCommunicationClientTest.GetMemoryRegionInfo (1014 of 2421)
PASS: lldb-api :: commands/expression/top-level/TestTopLevelExprs.py (1015 of 2421)
PASS: lldb-unit :: Utility/./UtilityTests/AnsiTerminal.Twice (1016 of 2421)
PASS: lldb-unit :: Host/./HostTests/Host.WaitStatusFormat (1017 of 2421)
PASS: lldb-api :: commands/expression/persistent_ptr_update/TestPersistentPtrUpdate.py (1018 of 2421)
PASS: lldb-unit :: Utility/./UtilityTests/TimeoutTest.Construction (1019 of 2421)
PASS: lldb-api :: commands/expression/result_numbering/TestResultNumbering.py (1020 of 2421)
UNSUPPORTED: lldb-api :: commands/gui/expand-threads-tree/TestGuiExpandThreadsTree.py (1021 of 2421)
PASS: lldb-shell :: SymbolFile/NativePDB/source-list.cpp (1022 of 2421)
UNSUPPORTED: lldb-api :: lang/objc/conflicting-class-list-function-from-user/TestObjCClassListFunctionFromUser.py (1023 of 2421)
PASS: lldb-api :: tools/lldb-server/TestGdbRemoteKill.py (1024 of 2421)
PASS: lldb-shell :: Commands/command-backtrace-parser-1.test (1025 of 2421)
PASS: lldb-api :: functionalities/thread/state_after_expression/TestStateAfterExpression.py (1026 of 2421)
PASS: lldb-unit :: ScriptInterpreter/Python/./ScriptInterpreterPythonTests/PythonDataObjectsTest.TestPythonTupleValues (1027 of 2421)
UNSUPPORTED: lldb-api :: functionalities/disassemble/aarch64-adrp-add/TestAArch64AdrpAdd.py (1028 of 2421)
UNSUPPORTED: lldb-shell :: ObjectFile/ELF/minidebuginfo-set-and-hit-breakpoint.test (1029 of 2421)
PASS: lldb-api :: commands/target/select/TestTargetSelect.py (1030 of 2421)
PASS: lldb-unit :: Utility/./UtilityTests/Flags.AnySet (1031 of 2421)
PASS: lldb-unit :: Utility/./UtilityTests/TildeExpressionResolver.ResolveFullPath (1032 of 2421)
PASS: lldb-unit :: Utility/./UtilityTests/XcodeSDKTest.GetSDKTypeForTriple (1033 of 2421)
PASS: lldb-shell :: SymbolFile/DWARF/x86/static_scope.s (1034 of 2421)
PASS: lldb-unit :: Host/./HostTests/NativeProcessProtocolTest.SetBreakpointFailVerify (1035 of 2421)
PASS: lldb-shell :: SymbolFile/DWARF/x86/array-sizes.s (1036 of 2421)
PASS: lldb-unit :: Utility/./UtilityTests/StringExtractorTest.InitEmpty (1037 of 2421)
PASS: lldb-shell :: Register/Core/x86-64-linux-gp.test (1038 of 2421)
PASS: lldb-unit :: UnwindAssembly/x86/./UnwindAssemblyx86Tests/Testx86AssemblyInspectionEngine.TestPopRBX (1039 of 2421)
PASS: lldb-unit :: Expression/./ExpressionTests/CppModuleConfigurationTest.Sysroot (1040 of 2421)
PASS: lldb-api :: functionalities/data-formatter/data-formatter-disabling/TestDataFormatterDisabling.py (1041 of 2421)
PASS: lldb-unit :: Interpreter/./InterpreterTests/CompletionTest.DirCompletionAbsolute (1042 of 2421)
PASS: lldb-unit :: SymbolFile/NativePDB/./SymbolFileNativePDBTests/PDBFPOProgramToDWARFExpressionTests.UnresolvedRegisterReference (1043 of 2421)
PASS: lldb-api :: functionalities/inferior-crashing/TestInferiorCrashing.py (1044 of 2421)
UNSUPPORTED: lldb-api :: commands/expression/import-std-module/pair/TestPairFromStdModule.py (1045 of 2421)
PASS: lldb-unit :: Utility/./UtilityTests/StreamTest.PutChar (1046 of 2421)
PASS: lldb-api :: lang/cpp/covariant-return-types/TestCovariantReturnTypes.py (1047 of 2421)
PASS: lldb-api :: lang/cpp/typeof/TestTypeOfDeclTypeExpr.py (1048 of 2421)
PASS: lldb-unit :: ObjectFile/Breakpad/./ObjectFileBreakpadTests/InfoRecord.parse (1049 of 2421)
PASS: lldb-api :: python_api/lldbutil/frame/TestFrameUtils.py (1050 of 2421)
PASS: lldb-api :: functionalities/data-formatter/data-formatter-stl/libcxx/map/TestDataFormatterLibccMap.py (1051 of 2421)
PASS: lldb-shell :: SymbolFile/DWARF/x86/win-i386-line-table.s (1052 of 2421)
PASS: lldb-shell :: SymbolFile/NativePDB/disassembly.cpp (1053 of 2421)
PASS: lldb-shell :: SymbolFile/DWARF/x86/find-variable-dwo.cpp (1054 of 2421)
PASS: lldb-unit :: Utility/./UtilityTests/StringExtractorTest.InitMisc (1055 of 2421)
PASS: lldb-api :: commands/expression/timeout/TestCallWithTimeout.py (1056 of 2421)
PASS: lldb-shell :: SymbolFile/DWARF/x86/debug_rnglists-dwo.s (1057 of 2421)
PASS: lldb-unit :: Target/./TargetTests/StackFrameRecognizerTest.NullModuleRegex (1058 of 2421)
PASS: lldb-api :: functionalities/gdb_remote_client/TestGDBRemotePlatformFile.py (1059 of 2421)
PASS: lldb-unit :: Utility/./UtilityTests/SerializationRountripTest.SerializeDeserializePodPointers (1060 of 2421)
PASS: lldb-api :: functionalities/data-formatter/array_typedef/TestArrayTypedef.py (1061 of 2421)
PASS: lldb-api :: python_api/lldbutil/process/TestPrintStackTraces.py (1062 of 2421)
PASS: lldb-shell :: SymbolFile/DWARF/x86/DW_OP_piece-smaller-than-struct.s (1063 of 2421)
PASS: lldb-unit :: Utility/./UtilityTests/StreamTeeTest.SetStreamAtIndexOutOfBounds (1064 of 2421)
PASS: lldb-shell :: Breakpoint/single-file-split-dwarf.test (1065 of 2421)
PASS: lldb-unit :: Utility/./UtilityTests/VMRange.ContainsAddr (1066 of 2421)
PASS: lldb-unit :: SymbolFile/NativePDB/./SymbolFileNativePDBTests/PDBFPOProgramToDWARFExpressionTests.SingleAssignmentRegisterRef (1067 of 2421)
PASS: lldb-unit :: Utility/./UtilityTests/StreamTest.AddressRange (1068 of 2421)
PASS: lldb-api :: functionalities/avoids-fd-leak/TestFdLeak.py (1069 of 2421)
UNSUPPORTED: lldb-shell :: Register/x86-64-gp-write.test (1070 of 2421)
PASS: lldb-api :: lang/objc/objc-ivar-protocols/TestIvarProtocols.py (1071 of 2421)
UNSUPPORTED: lldb-shell :: ScriptInterpreter/Lua/command_script_import.test (1072 of 2421)
PASS: lldb-unit :: Process/gdb-remote/./ProcessGdbRemoteTests/GDBRemoteCommunicationTest.ReadPacket_checksum (1073 of 2421)
PASS: lldb-shell :: Register/Core/x86-32-linux-fp.test (1074 of 2421)
PASS: lldb-unit :: Host/./HostTests/FileSystemTest.Resolve (1075 of 2421)
UNSUPPORTED: lldb-shell :: Register/x86-ymm-read.test (1076 of 2421)
PASS: lldb-unit :: Utility/./UtilityTests/OptionsWithRawTest.WhitespaceInput (1077 of 2421)
PASS: lldb-api :: functionalities/data-formatter/data-formatter-objc/TestDataFormatterObjCNSURL.py (1078 of 2421)
PASS: lldb-api :: functionalities/breakpoint/breakpoint_by_line_and_column/TestBreakpointByLineAndColumn.py (1079 of 2421)
PASS: lldb-api :: commands/thread/select/TestThreadSelect.py (1080 of 2421)
PASS: lldb-unit :: Core/./LLDBCoreTests/ModuleSpecTest.InvalidInMemoryBufferValidFile (1081 of 2421)
UNSUPPORTED: lldb-api :: commands/expression/multiline-navigation/TestMultilineNavigation.py (1082 of 2421)
PASS: lldb-api :: commands/expression/import-std-module/list-dbg-info-content/TestDbgInfoContentListFromStdModule.py (1083 of 2421)
UNSUPPORTED: lldb-shell :: Unwind/eh-frame-small-fde.test (1084 of 2421)
PASS: lldb-api :: python_api/symbol-context/TestSymbolContext.py (1085 of 2421)
PASS: lldb-unit :: UnwindAssembly/x86/./UnwindAssemblyx86Tests/Testx86AssemblyInspectionEngine.TestLEAVE (1086 of 2421)
PASS: lldb-shell :: ObjectFile/ELF/PT_TLS-overlap-PT_LOAD.yaml (1087 of 2421)
PASS: lldb-shell :: ScriptInterpreter/Python/scripted_breakpoint_lua.test (1088 of 2421)
PASS: lldb-unit :: Host/./HostTests/NativeProcessProtocolTest.ReadCStringFromMemory_MaxSize (1089 of 2421)
UNSUPPORTED: lldb-api :: iohandler/resize/TestIOHandlerResize.py (1090 of 2421)
PASS: lldb-api :: lang/c/bitfields/TestBitfields.py (1091 of 2421)
PASS: lldb-unit :: ScriptInterpreter/Python/./ScriptInterpreterPythonTests/PythonDataObjectsTest.TestPythonListManipulation (1092 of 2421)
PASS: lldb-api :: commands/expression/import-std-module/vector-bool/TestVectorBoolFromStdModule.py (1093 of 2421)
PASS: lldb-shell :: SymbolFile/DWARF/x86/find-inline-method.s (1094 of 2421)
UNSUPPORTED: lldb-shell :: Subprocess/clone-follow-child-wp.test (1095 of 2421)
PASS: lldb-api :: macosx/find-dsym/deep-bundle/TestDeepBundle.py (1096 of 2421)
PASS: lldb-shell :: Commands/command-disassemble-process.yaml (1097 of 2421)
PASS: lldb-api :: lang/objc/foundation/TestObjCMethodsString.py (1098 of 2421)
PASS: lldb-unit :: Host/./HostTests/MainLoopTest.TwoSignalCallbacks (1099 of 2421)
PASS: lldb-unit :: Utility/./UtilityTests/ArgsTest.TestInsertArg (1100 of 2421)
UNSUPPORTED: lldb-api :: functionalities/tsan/basic/TestTsanBasic.py (1101 of 2421)
PASS: lldb-unit :: Process/Utility/./ProcessUtilityTests/ProcMapTests/LinuxProcMapsTestFixture.ParseMapRegions/3 (1102 of 2421)
PASS: lldb-unit :: DataFormatter/./LLDBFormatterTests/TypeMatcherTests.RegexMatchPart (1103 of 2421)
PASS: lldb-shell :: SymbolFile/Breakpad/unwind-via-stack-win.test (1104 of 2421)
PASS: lldb-unit :: Utility/./UtilityTests/StringExtractorTest.GetNameColonValueContainsColon (1105 of 2421)
PASS: lldb-api :: functionalities/thread/concurrent_events/TestConcurrentTwoWatchpointThreads.py (1106 of 2421)
PASS: lldb-shell :: SymbolFile/DWARF/x86/debug-types-address-ranges.s (1107 of 2421)
PASS: lldb-unit :: Utility/./UtilityTests/RangeTest.NotEqual (1108 of 2421)
PASS: lldb-shell :: Driver/TestHelp.test (1109 of 2421)
PASS: lldb-api :: functionalities/thread/create_after_attach/TestCreateAfterAttach.py (1110 of 2421)
PASS: lldb-api :: functionalities/thread/concurrent_events/TestConcurrentManyWatchpoints.py (1111 of 2421)
UNSUPPORTED: lldb-shell :: SymbolFile/PDB/variables.test (1112 of 2421)
PASS: lldb-unit :: Core/./LLDBCoreTests/SourceLocationSpecTest.OperatorBool (1113 of 2421)
PASS: lldb-unit :: SymbolFile/DWARF/./SymbolFileDWARFTests/SymbolFileDWARFTests.TestAbbrevMissingTerminator (1114 of 2421)
PASS: lldb-unit :: Utility/./UtilityTests/AnsiTerminal.Incomplete (1115 of 2421)
UNSUPPORTED: lldb-shell :: ScriptInterpreter/Lua/watchpoint_callback.test (1116 of 2421)
PASS: lldb-unit :: Process/Utility/./ProcessUtilityTests/ProcMapTests/LinuxProcMapsTestFixture.ParseMapRegions/6 (1117 of 2421)
PASS: lldb-unit :: Expression/./ExpressionTests/DWARFExpression.DW_OP_stack_value (1118 of 2421)
PASS: lldb-api :: functionalities/data-formatter/data-formatter-stl/libcxx/multiset/TestDataFormatterLibcxxMultiSet.py (1119 of 2421)
PASS: lldb-unit :: Utility/./UtilityTests/StreamTest.PutHex16ByteOrderLittle (1120 of 2421)
PASS: lldb-shell :: ObjectFile/ELF/eh_frame-symbols.yaml (1121 of 2421)
PASS: lldb-api :: lang/c/anonymous/TestAnonymous.py (1122 of 2421)
PASS: lldb-unit :: Utility/./UtilityTests/ArchSpecTest.TripleComponentsWereSpecified (1123 of 2421)
PASS: lldb-unit :: Utility/./UtilityTests/OptionsWithRawTest.EmptyArgsOnlySuffix (1124 of 2421)
PASS: lldb-unit :: ObjectFile/Breakpad/./ObjectFileBreakpadTests/StackCFIRecord.parse (1125 of 2421)
PASS: lldb-api :: lang/cpp/namespace_conflicts/TestNamespaceConflicts.py (1126 of 2421)
PASS: lldb-unit :: Utility/./UtilityTests/StringExtractorTest.GetHexU8_Exact_NoEof (1127 of 2421)
PASS: lldb-unit :: Utility/./UtilityTests/StreamTest.PutRawBytesToMixedEndian (1128 of 2421)
PASS: lldb-unit :: Host/./HostTests/FileSystemTest.Exists (1129 of 2421)
PASS: lldb-unit :: Target/./TargetTests/ModuleCacheTest.GetAndPutUuidExists (1130 of 2421)
PASS: lldb-api :: commands/quit/TestQuit.py (1131 of 2421)
PASS: lldb-api :: tools/lldb-server/register-reading/TestGdbRemoteGPacket.py (1132 of 2421)
PASS: lldb-shell :: Reproducer/TestFinalize.test (1133 of 2421)
PASS: lldb-api :: lang/cpp/pointer_to_member_type_depending_on_parent_size/TestPointerToMemberTypeDependingOnParentSize.py (1134 of 2421)
PASS: lldb-unit :: Process/minidump/./LLDBMinidumpTests/RegisterContextMinidump.ConvertMinidumpContext_x86_32 (1135 of 2421)
PASS: lldb-api :: lang/objc/modules/TestObjCModules.py (1136 of 2421)
PASS: lldb-api :: python_api/sbdata/TestSBData.py (1137 of 2421)
PASS: lldb-unit :: Utility/./UtilityTests/VMRange.IsValid (1138 of 2421)
PASS: lldb-shell :: ObjectFile/Breakpad/breakpad-identification.test (1139 of 2421)
PASS: lldb-api :: types/TestDoubleTypesExpr.py (1140 of 2421)
PASS: lldb-shell :: Reproducer/Modules/TestModuleCXX.test (1141 of 2421)
PASS: lldb-unit :: Process/gdb-remote/./ProcessGdbRemoteTests/GDBRemoteClientBaseTest.SendContinueDelegateInterface (1142 of 2421)
PASS: lldb-unit :: Utility/./UtilityTests/UriParserTest.MinimalPortPath (1143 of 2421)
PASS: lldb-api :: functionalities/data-formatter/format-propagation/TestFormatPropagation.py (1144 of 2421)
PASS: lldb-unit :: Symbol/./SymbolTests/TestClangASTImporter.RecordLayout (1145 of 2421)
UNSUPPORTED: lldb-api :: functionalities/tsan/global_location/TestTsanGlobalLocation.py (1146 of 2421)
PASS: lldb-unit :: Host/./HostTests/FileSystemTest.FileAndDirectoryComponents (1147 of 2421)
PASS: lldb-shell :: SymbolFile/DWARF/x86/debug-line-basic.s (1148 of 2421)
PASS: lldb-api :: lang/cpp/static_members/TestCPPStaticMembers.py (1149 of 2421)
PASS: lldb-api :: lang/objcxx/cpp_keywords_enabled/TestObjCppKeywordsEnabled.py (1150 of 2421)
PASS: lldb-api :: functionalities/thread/concurrent_events/TestConcurrentCrashWithWatchpointBreakpointSignal.py (1151 of 2421)
PASS: lldb-unit :: Utility/./UtilityTests/StreamTest.AddressPrefix (1152 of 2421)
UNSUPPORTED: lldb-api :: functionalities/ptrauth_diagnostics/BLRAA_error/TestPtrauthBLRAADiagnostic.py (1153 of 2421)
PASS: lldb-unit :: Utility/./UtilityTests/VMRange.SetEndAddress (1154 of 2421)
PASS: lldb-api :: lang/cpp/gmodules-templates/TestGModules.py (1155 of 2421)
PASS: lldb-unit :: Utility/./UtilityTests/StreamTest.QuotedCString (1156 of 2421)
UNSUPPORTED: lldb-api :: iohandler/completion/TestIOHandlerCompletion.py (1157 of 2421)
PASS: lldb-shell :: Reproducer/TestPythonImport.test (1158 of 2421)
PASS: lldb-unit :: Utility/./UtilityTests/ArgsTest.ReplaceArgumentAtIndexEqual (1159 of 2421)
PASS: lldb-api :: tools/lldb-server/TestLldbGdbServer.py (1160 of 2421)
PASS: lldb-unit :: Process/minidump/./LLDBMinidumpTests/MinidumpParserTest.GetThreadContext_x86_64 (1161 of 2421)
PASS: lldb-unit :: Utility/./UtilityTests/ArgsTest.EscapeLLDBCommandArgument (1162 of 2421)
PASS: lldb-shell :: Commands/command-breakpoint-col.test (1163 of 2421)
PASS: lldb-shell :: ObjectFile/ELF/minidebuginfo-find-symbols.yaml (1164 of 2421)
PASS: lldb-api :: lang/cpp/class-template-non-type-parameter-pack/TestClassTemplateNonTypeParameterPack.py (1165 of 2421)
PASS: lldb-api :: commands/expression/import_base_class_when_class_has_derived_member/TestImportBaseClassWhenClassHasDerivedMember.py (1166 of 2421)
PASS: lldb-unit :: Language/Highlighting/./HighlighterTests/HighlighterTest.DefaultHighlighter (1167 of 2421)
UNSUPPORTED: lldb-api :: functionalities/gdb_remote_client/TestAArch64XMLRegOffsets.py (1168 of 2421)
PASS: lldb-api :: functionalities/breakpoint/objc/TestObjCBreakpoints.py (1169 of 2421)
PASS: lldb-api :: functionalities/data-formatter/data-formatter-stl/libcxx/list/loop/TestDataFormatterLibcxxListLoop.py (1170 of 2421)
UNSUPPORTED: lldb-shell :: Subprocess/clone-follow-child.test (1171 of 2421)
UNSUPPORTED: lldb-shell :: ScriptInterpreter/Lua/lua.test (1172 of 2421)
PASS: lldb-api :: lang/cpp/subst_template_type_param/TestSubstTemplateTypeParam.py (1173 of 2421)
PASS: lldb-api :: python_api/section/TestSectionAPI.py (1174 of 2421)
PASS: lldb-unit :: Host/./HostTests/SocketTests/SocketTest.TCPGetConnectURI/ipv6 (1175 of 2421)
PASS: lldb-unit :: Utility/./UtilityTests/FileSpecTest.IsRelative (1176 of 2421)
UNSUPPORTED: lldb-shell :: ScriptInterpreter/Lua/breakpoint_function_callback.test (1177 of 2421)
PASS: lldb-shell :: ObjectFile/ELF/PT_LOAD-overlap-PT_INTERP.yaml (1178 of 2421)
PASS: lldb-api :: python_api/watchpoint/watchlocation/TestSetWatchlocation.py (1179 of 2421)
PASS: lldb-unit :: ObjectFile/Breakpad/./ObjectFileBreakpadTests/ModuleRecord.parse (1180 of 2421)
PASS: lldb-shell :: SymbolFile/DWARF/x86/find-basic-type.cpp (1181 of 2421)
PASS: lldb-api :: macosx/nslog/TestDarwinNSLogOutput.py (1182 of 2421)
PASS: lldb-unit :: SymbolFile/NativePDB/./SymbolFileNativePDBTests/PDBFPOProgramToDWARFExpressionTests.InvalidAssignmentMultiple (1183 of 2421)
PASS: lldb-unit :: Utility/./UtilityTests/Flags.Reset (1184 of 2421)
PASS: lldb-unit :: ObjectFile/Breakpad/./ObjectFileBreakpadTests/Record.classify (1185 of 2421)
PASS: lldb-unit :: Utility/./UtilityTests/NameMatchesTest.Ignore (1186 of 2421)
PASS: lldb-unit :: Utility/./UtilityTests/VMRange.Clear (1187 of 2421)
PASS: lldb-unit :: debugserver/./debugserverTests/RNBSocket.LoopBackConnectIPv4 (1188 of 2421)
PASS: lldb-unit :: Utility/./UtilityTests/StringExtractorTest.GetHexBytes_FullString (1189 of 2421)
PASS: lldb-unit :: Utility/./UtilityTests/StreamTest.PutCharWhitespace (1190 of 2421)
UNSUPPORTED: lldb-api :: functionalities/breakpoint/breakpoint_in_delayslot/TestAvoidBreakpointInDelaySlot.py (1191 of 2421)
PASS: lldb-api :: python_api/name_lookup/TestNameLookup.py (1192 of 2421)
PASS: lldb-api :: python_api/sblaunchinfo/TestSBLaunchInfo.py (1193 of 2421)
PASS: lldb-api :: commands/target/create-no-such-arch/TestNoSuchArch.py (1194 of 2421)
PASS: lldb-unit :: Utility/./UtilityTests/ConstStringTest.CompareStringRef (1195 of 2421)
PASS: lldb-api :: functionalities/gdb_remote_client/TestRestartBug.py (1196 of 2421)
PASS: lldb-shell :: ObjectFile/Breakpad/sections-trailing-func.test (1197 of 2421)
PASS: lldb-shell :: BuildScript/script-args.test (1198 of 2421)
PASS: lldb-unit :: Host/./HostTests/MainLoopTest.ReadObject (1199 of 2421)
PASS: lldb-unit :: Utility/./UtilityTests/StreamTeeTest.Assignment (1200 of 2421)
PASS: lldb-api :: functionalities/breakpoint/source_regexp/TestSourceRegexBreakpoints.py (1201 of 2421)
PASS: lldb-api :: lang/cpp/template-specialization-type/TestTemplateSpecializationType.py (1202 of 2421)
PASS: lldb-api :: functionalities/jitloader_gdb/TestJITLoaderGDB.py (1203 of 2421)
UNSUPPORTED: lldb-api :: commands/watchpoints/watch_tagged_addr/TestWatchTaggedAddress.py (1204 of 2421)
PASS: lldb-unit :: Language/Highlighting/./HighlighterTests/HighlighterTest.ClangScalarLiterals (1205 of 2421)
PASS: lldb-unit :: Utility/./UtilityTests/StringListTest.PopBack (1206 of 2421)
PASS: lldb-unit :: ScriptInterpreter/Python/./ScriptInterpreterPythonTests/PythonDataObjectsTest.TestInstanceNameResolutionNoDot (1207 of 2421)
PASS: lldb-api :: tools/lldb-vscode/console/TestVSCode_console.py (1208 of 2421)
PASS: lldb-shell :: SymbolFile/Breakpad/symtab.test (1209 of 2421)
PASS: lldb-shell :: SymbolFile/NativePDB/function-types-calling-conv.cpp (1210 of 2421)
PASS: lldb-api :: python_api/sbvalue_const_addrof/TestSBValueConstAddrOf.py (1211 of 2421)
PASS: lldb-shell :: Settings/TestSettingsWrite.test (1212 of 2421)
PASS: lldb-unit :: UnwindAssembly/x86/./UnwindAssemblyx86Tests/Testx86AssemblyInspectionEngine.Test64bitFramelessBigStackFrame (1213 of 2421)
PASS: lldb-unit :: Utility/./UtilityTests/OptionsWithRawTest.QuotedSuffix (1214 of 2421)
PASS: lldb-api :: commands/target/stop-hook/delete/TestTargetStopHookDelete.py (1215 of 2421)
PASS: lldb-shell :: ObjectFile/MachO/lc_version_min.yaml (1216 of 2421)
PASS: lldb-unit :: Utility/./UtilityTests/RegularExpression.Empty (1217 of 2421)
PASS: lldb-unit :: Target/./TargetTests/ExecutionContextTest.GetByteOrderProcess (1218 of 2421)
PASS: lldb-shell :: Reproducer/Functionalities/TestExpressionEvaluation.test (1219 of 2421)
PASS: lldb-unit :: Host/./HostTests/MainLoopTest.UnmonitoredSignal (1220 of 2421)
PASS: lldb-unit :: Process/Utility/./ProcessUtilityTests/ProcMapTests/LinuxProcMapsTestFixture.ParseMapRegions/7 (1221 of 2421)
PASS: lldb-api :: commands/expression/vector_of_enums/TestVectorOfEnums.py (1222 of 2421)
PASS: lldb-shell :: Register/Core/x86-32-netbsd-gp.test (1223 of 2421)
PASS: lldb-unit :: Utility/./UtilityTests/FileSpecTest.RemoveLastPathComponent (1224 of 2421)
PASS: lldb-api :: macosx/save_crashlog/TestSaveCrashlog.py (1225 of 2421)
PASS: lldb-unit :: UnwindAssembly/x86/./UnwindAssemblyx86Tests/Testx86AssemblyInspectionEngine.Test32bitFramelessSmallStackFrame (1226 of 2421)
PASS: lldb-api :: functionalities/breakpoint/consecutive_breakpoints/TestConsecutiveBreakpoints.py (1227 of 2421)
UNSUPPORTED: lldb-shell :: Subprocess/clone-follow-parent.test (1228 of 2421)
PASS: lldb-unit :: Utility/./UtilityTests/UriParserTest.LongPath (1229 of 2421)
PASS: lldb-unit :: UnwindAssembly/x86/./UnwindAssemblyx86Tests/Testx86AssemblyInspectionEngine.TestPopR13 (1230 of 2421)
PASS: lldb-unit :: Utility/./UtilityTests/StringListTest.ShiftMove (1231 of 2421)
PASS: lldb-shell :: SymbolFile/DWARF/x86/debug-types-dwarf5.s (1232 of 2421)
PASS: lldb-unit :: SymbolFile/DWARF/./SymbolFileDWARFTests/DWARFASTParserClangTests.EnsureAllDIEsInDeclContextHaveBeenParsedParsesOnlyMatchingEntries (1233 of 2421)
PASS: lldb-unit :: Host/./HostTests/MainLoopTest.TerminatesImmediately (1234 of 2421)
PASS: lldb-unit :: Core/./LLDBCoreTests/FormatEntityTest.DefinitionConstructionNameTypeData (1235 of 2421)
UNSUPPORTED: lldb-api :: functionalities/process_save_core_minidump/TestProcessSaveCoreMinidump.py (1236 of 2421)
PASS: lldb-api :: functionalities/unwind/sigtramp/TestSigtrampUnwind.py (1237 of 2421)
PASS: lldb-unit :: Process/gdb-remote/./ProcessGdbRemoteTests/PortMapTest.FreePort (1238 of 2421)
PASS: lldb-unit :: UnwindAssembly/x86/./UnwindAssemblyx86Tests/Testx86AssemblyInspectionEngine.TestStackRealignMSVC_i386 (1239 of 2421)
PASS: lldb-api :: functionalities/data-formatter/data-formatter-stl/libcxx/tuple/TestDataFormatterLibcxxTuple.py (1240 of 2421)
PASS: lldb-unit :: UnwindAssembly/x86/./UnwindAssemblyx86Tests/Testx86AssemblyInspectionEngine.TestPushImm (1241 of 2421)
PASS: lldb-api :: lang/cpp/wchar_t/TestCxxWCharT.py (1242 of 2421)
UNSUPPORTED: lldb-api :: iohandler/autosuggestion/TestAutosuggestion.py (1243 of 2421)
PASS: lldb-unit :: Language/CPlusPlus/./LanguageCPlusPlusTests/CPlusPlusLanguage.MethodNameParsing (1244 of 2421)
PASS: lldb-unit :: SymbolFile/NativePDB/./SymbolFileNativePDBTests/PDBFPOProgramToDWARFExpressionTests.MultipleDependentAssignments (1245 of 2421)
PASS: lldb-api :: python_api/lldbutil/TestSwigVersion.py (1246 of 2421)
PASS: lldb-shell :: ObjectFile/PECOFF/basic-info-arm.yaml (1247 of 2421)
PASS: lldb-api :: functionalities/inferior-crashing/recursive-inferior/TestRecursiveInferior.py (1248 of 2421)
PASS: lldb-unit :: Expression/./ExpressionTests/CppModuleConfigurationTest.AmbiguousCLib (1249 of 2421)
PASS: lldb-unit :: UnwindAssembly/x86/./UnwindAssemblyx86Tests/Testx86AssemblyInspectionEngine.TestSpillRegToStackViaMOVx86_64 (1250 of 2421)
PASS: lldb-api :: commands/expression/invalid-args/TestInvalidArgsExpression.py (1251 of 2421)
PASS: lldb-api :: functionalities/data-formatter/data-formatter-proper-plurals/TestFormattersOneIsSingular.py (1252 of 2421)
PASS: lldb-unit :: Utility/./UtilityTests/RangeDataVector.FindEntryIndexesThatContain (1253 of 2421)
PASS: lldb-api :: lang/c/tls_globals/TestTlsGlobals.py (1254 of 2421)
PASS: lldb-unit :: Language/Highlighting/./HighlighterTests/HighlighterTest.ClangEmptyInput (1255 of 2421)
UNSUPPORTED: lldb-api :: commands/register/register/intel_xtended_registers/mpx_bound_violation/TestBoundViolation.py (1256 of 2421)
PASS: lldb-shell :: Commands/command-target-modules-dump-sections.yaml (1257 of 2421)
PASS: lldb-unit :: UnwindAssembly/x86/./UnwindAssemblyx86Tests/Testx86AssemblyInspectionEngine.TestDisassemblyJunkBytes (1258 of 2421)
PASS: lldb-unit :: Utility/./UtilityTests/StringLexerTest.AdvanceIf (1259 of 2421)
PASS: lldb-api :: lang/objc/foundation/TestRuntimeTypes.py (1260 of 2421)
PASS: lldb-unit :: Utility/./UtilityTests/DataExtractorTest.GetCStrUnterminated (1261 of 2421)
PASS: lldb-api :: python_api/frame/get-variables/TestGetVariables.py (1262 of 2421)
PASS: lldb-api :: functionalities/data-formatter/frameformat_smallstruct/TestFrameFormatSmallStruct.py (1263 of 2421)
PASS: lldb-unit :: Utility/./UtilityTests/StringExtractorTest.GetHexU8_Exact (1264 of 2421)
PASS: lldb-unit :: Utility/./UtilityTests/ScalarTest.RightShiftOperator (1265 of 2421)
PASS: lldb-unit :: Process/Utility/./ProcessUtilityTests/ProcSMapTests/LinuxProcSMapsTestFixture.ParseSMapRegions/3 (1266 of 2421)
PASS: lldb-unit :: Process/./ProcessEventDataTests/ProcessEventDataTest.DoOnRemoval (1267 of 2421)
PASS: lldb-shell :: Commands/command-thread-select.test (1268 of 2421)
PASS: lldb-api :: commands/source/info/TestSourceInfo.py (1269 of 2421)
PASS: lldb-unit :: Utility/./UtilityTests/StringExtractorTest.GetNameColonValueNoColon (1270 of 2421)
UNSUPPORTED: lldb-shell :: SymbolFile/NativePDB/stack_unwinding01.cpp (1271 of 2421)
PASS: lldb-unit :: Utility/./UtilityTests/PassiveReplayTest.InstrumentedBarPtr (1272 of 2421)
PASS: lldb-unit :: Symbol/./SymbolTests/TestTypeSystemClang.TestGetEnumIntegerTypeUnexpectedType (1273 of 2421)
PASS: lldb-api :: functionalities/data-formatter/data-formatter-stl/libcxx/initializerlist/TestInitializerList.py (1274 of 2421)
PASS: lldb-shell :: SymbolFile/DWARF/x86/DW_AT_const_value.s (1275 of 2421)
PASS: lldb-unit :: Host/./HostTests/SocketTests/SocketTest.DecodeHostAndPort/ipv4 (1276 of 2421)
PASS: lldb-shell :: Quit/TestQuitExitCodeHexA.test (1277 of 2421)
PASS: lldb-unit :: DataFormatter/./LLDBFormatterTests/TypeMatcherTests.CreatedBySameMatchStringExactNamePrefixes (1278 of 2421)
PASS: lldb-unit :: Utility/./UtilityTests/BinaryStreamTest.PutULEB128NineBytes (1279 of 2421)
PASS: lldb-api :: commands/command/delete/TestCommandDelete.py (1280 of 2421)
PASS: lldb-unit :: SymbolFile/DWARF/./SymbolFileDWARFTests/XcodeSDKModuleTests.TestModuleGetXcodeSDK (1281 of 2421)
PASS: lldb-api :: functionalities/thread/jump/TestThreadJump.py (1282 of 2421)
PASS: lldb-shell :: ObjectFile/Breakpad/discontiguous-sections.test (1283 of 2421)
PASS: lldb-unit :: Host/./HostTests/HostInfoTest.GetAugmentedArchSpec (1284 of 2421)
PASS: lldb-api :: functionalities/pointer_num_children/TestPointerNumChildren.py (1285 of 2421)
PASS: lldb-api :: commands/frame/diagnose/complicated-expression/TestComplicatedExpression.py (1286 of 2421)
PASS: lldb-shell :: Minidump/fb-dump.test (1287 of 2421)
UNSUPPORTED: lldb-api :: functionalities/asan/TestMemoryHistory.py (1288 of 2421)
PASS: lldb-api :: commands/expression/error-limit/TestExprErrorLimit.py (1289 of 2421)
PASS: lldb-api :: types/TestDoubleTypes.py (1290 of 2421)
PASS: lldb-unit :: Utility/./UtilityTests/DataExtractorTest.GetULEB128_bit63 (1291 of 2421)
UNSUPPORTED: lldb-shell :: Subprocess/vfork-follow-child-softbp.test (1292 of 2421)
PASS: lldb-unit :: ObjectFile/Breakpad/./ObjectFileBreakpadTests/FuncRecord.parse (1293 of 2421)
PASS: lldb-api :: commands/expression/po_verbosity/TestPoVerbosity.py (1294 of 2421)
PASS: lldb-shell :: Recognizer/assert.test (1295 of 2421)
PASS: lldb-unit :: UnwindAssembly/x86/./UnwindAssemblyx86Tests/Testx86AssemblyInspectionEngine.TestDisassemblyMidFunctionEpilogues (1296 of 2421)
PASS: lldb-api :: lang/cpp/reference-to-outer-type/TestCppReferenceToOuterClass.py (1297 of 2421)
PASS: lldb-api :: functionalities/breakpoint/cpp/TestCPPBreakpointLocations.py (1298 of 2421)
PASS: lldb-shell :: SymbolFile/Breakpad/unwind-via-raSearch.test (1299 of 2421)
PASS: lldb-api :: functionalities/data-formatter/data-formatter-objc/nsstring/TestDataFormatterNSString.py (1300 of 2421)
PASS: lldb-unit :: Utility/./UtilityTests/UriParserTest.BracketedHostnameWithColon (1301 of 2421)
UNSUPPORTED: lldb-api :: commands/expression/multiline-completion/TestMultilineCompletion.py (1302 of 2421)
PASS: lldb-api :: commands/target/dump-symtab-demangle/TestDumpSymtabDemangle.py (1303 of 2421)
PASS: lldb-api :: functionalities/fat_archives/TestFatArchives.py (1304 of 2421)
PASS: lldb-unit :: Utility/./UtilityTests/BinaryStreamTest.PutULEB128FourBytes (1305 of 2421)
PASS: lldb-unit :: Process/minidump/./LLDBMinidumpTests/MinidumpParserTest.GetThreadContext_x86_32_wow64 (1306 of 2421)
PASS: lldb-unit :: Host/./HostTests/ProcessLaunchInfoTest.Constructor (1307 of 2421)
PASS: lldb-unit :: Utility/./UtilityTests/BinaryStreamTest.PutSLEB128EightBytes (1308 of 2421)
PASS: lldb-unit :: Utility/./UtilityTests/DataExtractorTest.GetMaxS64 (1309 of 2421)
PASS: lldb-unit :: Core/./LLDBCoreTests/MangledTest.EmptyForInvalidRustV0Name (1310 of 2421)
PASS: lldb-unit :: UnwindAssembly/x86/./UnwindAssemblyx86Tests/Testx86AssemblyInspectionEngine.TestSpArithx86_64Augmented (1311 of 2421)
PASS: lldb-api :: functionalities/data-formatter/data-formatter-advanced/TestDataFormatterAdv.py (1312 of 2421)
PASS: lldb-unit :: Process/gdb-remote/./ProcessGdbRemoteTests/GDBRemoteCommunicationClientTest.SaveRestoreRegistersNoSuffix (1313 of 2421)
UNSUPPORTED: lldb-api :: tools/lldb-server/TestGdbRemoteAuxvSupport.py (1314 of 2421)
PASS: lldb-api :: functionalities/data-formatter/data-formatter-stl/libcxx/variant/TestDataFormatterLibcxxVariant.py (1315 of 2421)
XFAIL: lldb-shell :: Unwind/prefer-debug-over-eh-frame.test (1316 of 2421)
PASS: lldb-unit :: UnwindAssembly/x86/./UnwindAssemblyx86Tests/Testx86AssemblyInspectionEngine.TestSimplei386ugmented (1317 of 2421)
PASS: lldb-unit :: DataFormatter/./LLDBFormatterTests/TypeMatcherTests.GetMatchStringRegex (1318 of 2421)
PASS: lldb-shell :: ScriptInterpreter/Python/command_relative_import.test (1319 of 2421)
PASS: lldb-unit :: Utility/./UtilityTests/RangeTest.SetRangeBase (1320 of 2421)
PASS: lldb-unit :: Symbol/./SymbolTests/TestTypeSystemClang.OnlyPackName (1321 of 2421)
PASS: lldb-api :: lang/c/blocks/TestBlocks.py (1322 of 2421)
PASS: lldb-api :: python_api/formatters/TestFormattersSBAPI.py (1323 of 2421)
UNSUPPORTED: lldb-shell :: Unwind/unwind-plan-dwarf-dump.test (1324 of 2421)
PASS: lldb-unit :: Host/./HostTests/SocketTests/SocketTest.UDPConnect/ipv4 (1325 of 2421)
PASS: lldb-unit :: ScriptInterpreter/Python/./ScriptInterpreterPythonTests/PythonDataObjectsTest.TestPythonDictionaryManipulation (1326 of 2421)
PASS: lldb-api :: functionalities/data-formatter/data-formatter-skip-summary/TestDataFormatterSkipSummary.py (1327 of 2421)
PASS: lldb-api :: lang/c/array_types/TestArrayTypes.py (1328 of 2421)
PASS: lldb-shell :: SymbolFile/DWARF/clang-ast-from-dwarf-unamed-and-anon-structs.cpp (1329 of 2421)
PASS: lldb-api :: lang/mixed/TestMixedLanguages.py (1330 of 2421)
PASS: lldb-unit :: Utility/./UtilityTests/UUIDTest.SetFromStringRef (1331 of 2421)
PASS: lldb-api :: functionalities/thread/concurrent_events/TestConcurrentWatchpointWithDelayWatchpointThreads.py (1332 of 2421)
PASS: lldb-unit :: Core/./LLDBCoreTests/FormatEntityTest.DefinitionConstructionNameTypeChildren (1333 of 2421)
PASS: lldb-api :: functionalities/data-formatter/data-formatter-objc/TestDataFormatterObjCNSContainer.py (1334 of 2421)
PASS: lldb-shell :: SymbolFile/DWARF/x86/DW_AT_loclists_base.s (1335 of 2421)
UNSUPPORTED: lldb-shell :: Reproducer/TestLuaImport.test (1336 of 2421)
UNSUPPORTED: lldb-shell :: SymbolFile/NativePDB/local-variables.cpp (1337 of 2421)
XFAIL: lldb-shell :: Register/x86-64-fp-write.test (1338 of 2421)
PASS: lldb-api :: commands/expression/call-function/TestCallUserDefinedFunction.py (1339 of 2421)
PASS: lldb-unit :: Process/Utility/./ProcessUtilityTests/MemoryTagManagerAArch64MTETest.RemoveNonAddressBits (1340 of 2421)
PASS: lldb-unit :: Utility/./UtilityTests/FileSpecTest.PrependPathComponent (1341 of 2421)
PASS: lldb-shell :: SymbolFile/DWARF/x86/debug-types-signature-loop.s (1342 of 2421)
PASS: lldb-unit :: Utility/./UtilityTests/RegularExpression.Invalid (1343 of 2421)
PASS: lldb-shell :: ScriptInterpreter/None/import_module.test (1344 of 2421)
PASS: lldb-shell :: Register/x86-64-ymm-read.test (1345 of 2421)
PASS: lldb-shell :: SymbolFile/DWARF/x86/debug_loclists-dwp.s (1346 of 2421)
PASS: lldb-shell :: Quit/TestQuitExitCodeNonInt.test (1347 of 2421)
PASS: lldb-api :: commands/target/basic/TestTargetCommand.py (1348 of 2421)
UNSUPPORTED: lldb-shell :: Register/x86-ymm-write.test (1349 of 2421)
PASS: lldb-api :: functionalities/thread/concurrent_events/TestConcurrentTwoWatchpointsOneBreakpoint.py (1350 of 2421)
PASS: lldb-unit :: ScriptInterpreter/Python/./ScriptInterpreterPythonTests/PythonDataObjectsTest.TestPythonListValueEquality (1351 of 2421)
PASS: lldb-api :: functionalities/data-formatter/setvaluefromcstring/TestSetValueFromCString.py (1352 of 2421)
PASS: lldb-unit :: UnwindAssembly/x86/./UnwindAssemblyx86Tests/Testx86AssemblyInspectionEngine.TestPopEBP (1353 of 2421)
PASS: lldb-unit :: Process/gdb-remote/./ProcessGdbRemoteTests/GDBRemoteCommunicationClientTest.TestPacketSpeedJSON (1354 of 2421)
PASS: lldb-unit :: Interpreter/./InterpreterTests/OptionValueArgs.DeepCopy (1355 of 2421)
UNSUPPORTED: lldb-shell :: ScriptInterpreter/Lua/nested_sessions.test (1356 of 2421)
PASS: lldb-shell :: Commands/CommandScriptImmediateOutput/CommandScriptImmediateOutputFile.test (1357 of 2421)
UNSUPPORTED: lldb-shell :: Register/x86-64-ymm16-write.test (1358 of 2421)
PASS: lldb-shell :: Minidump/breakpad-symbols.test (1359 of 2421)
PASS: lldb-unit :: Symbol/./SymbolTests/TestTypeSystemClang.TestFunctionTemplateInRecordConstruction (1360 of 2421)
PASS: lldb-api :: commands/expression/persist_objc_pointeetype/TestPersistObjCPointeeType.py (1361 of 2421)
PASS: lldb-api :: functionalities/tail_call_frames/thread_step_out_message/TestArtificialFrameStepOutMessage.py (1362 of 2421)
UNSUPPORTED: lldb-shell :: ScriptInterpreter/Lua/partial_statements.test (1363 of 2421)
PASS: lldb-api :: commands/expression/radar_9673664/TestExprHelpExamples.py (1364 of 2421)
PASS: lldb-api :: functionalities/thread/step_until/TestStepUntil.py (1365 of 2421)
UNSUPPORTED: lldb-api :: commands/trace/TestTraceSchema.py (1366 of 2421)
PASS: lldb-api :: commands/expression/codegen-crash-import-def-arraytype-element/TestImportDefinitionArrayType.py (1367 of 2421)
PASS: lldb-unit :: Host/./HostTests/MainLoopTest.Signal (1368 of 2421)
PASS: lldb-unit :: Process/gdb-remote/./ProcessGdbRemoteTests/GDBRemoteCommunicationServerTest.SendErrorResponse_StringError (1369 of 2421)
PASS: lldb-shell :: Settings/TestStopCommandSourceOnError.test (1370 of 2421)
UNSUPPORTED: lldb-api :: macosx/simulator/TestSimulatorPlatform.py (1371 of 2421)
PASS: lldb-unit :: Utility/./UtilityTests/VASprintfTest.BufferResize (1372 of 2421)
PASS: lldb-unit :: Utility/./UtilityTests/StringListTest.Clear (1373 of 2421)
PASS: lldb-unit :: Utility/./UtilityTests/ArchSpecTest.TestSetTriple (1374 of 2421)
PASS: lldb-unit :: Host/./HostTests/XML.GetAs (1375 of 2421)
PASS: lldb-unit :: Utility/./UtilityTests/BinaryStreamTest.PutSLEB128One (1376 of 2421)
PASS: lldb-shell :: Register/Core/x86-32-linux-addr.test (1377 of 2421)
PASS: lldb-shell :: Minidump/memory-region-from-module.yaml (1378 of 2421)
UNSUPPORTED: lldb-shell :: Register/x86-64-zmm-write.test (1379 of 2421)
PASS: lldb-shell :: SymbolFile/DWARF/x86/find-variable-file.cpp (1380 of 2421)
UNSUPPORTED: lldb-api :: functionalities/data-formatter/data-formatter-stl/libstdcpp/list/TestDataFormatterStdList.py (1381 of 2421)
PASS: lldb-unit :: Process/Utility/./ProcessUtilityTests/ProcMapTests/LinuxProcMapsTestFixture.ParseMapRegions/4 (1382 of 2421)
PASS: lldb-shell :: Reproducer/TestProcessList.test (1383 of 2421)
PASS: lldb-api :: commands/expression/persistent_types/TestNestedPersistentTypes.py (1384 of 2421)
PASS: lldb-unit :: UnwindAssembly/x86/./UnwindAssemblyx86Tests/Testx86AssemblyInspectionEngine.TestPushESI (1385 of 2421)
PASS: lldb-unit :: Utility/./UtilityTests/StringExtractorTest.GetHexU8_Underflow (1386 of 2421)
PASS: lldb-unit :: Utility/./UtilityTests/ArgsTest.ReplaceArgumentAtIndexOutOfRange (1387 of 2421)
PASS: lldb-unit :: Core/./LLDBCoreTests/DumpDataExtractorTest.StartOffset (1388 of 2421)
PASS: lldb-unit :: Utility/./UtilityTests/UserIDResolver.GetGroupName (1389 of 2421)
UNSUPPORTED: lldb-shell :: SymbolFile/PDB/expressions.test (1390 of 2421)
PASS: lldb-api :: functionalities/tail_call_frames/unambiguous_sequence/TestUnambiguousTailCalls.py (1391 of 2421)
PASS: lldb-shell :: ObjectFile/PECOFF/export-dllfunc.yaml (1392 of 2421)
UNSUPPORTED: lldb-api :: functionalities/process_save_core/TestProcessSaveCore.py (1393 of 2421)
PASS: lldb-unit :: Symbol/./SymbolTests/TestTypeSystemClang.TestGetEnumIntegerTypeInvalid (1394 of 2421)
UNSUPPORTED: lldb-api :: functionalities/ptrauth_diagnostics/LDRAA_error/TestPtrauthLDRAADiagnostic.py (1395 of 2421)
PASS: lldb-api :: functionalities/data-formatter/data-formatter-smart-array/TestDataFormatterSmartArray.py (1396 of 2421)
PASS: lldb-api :: functionalities/data-formatter/data-formatter-objc/TestDataFormatterObjCNSNumber.py (1397 of 2421)
PASS: lldb-unit :: Thread/./ThreadTests/ThreadTest.GetPrivateStopInfo (1398 of 2421)
PASS: lldb-api :: commands/version/TestVersion.py (1399 of 2421)
PASS: lldb-unit :: Utility/./UtilityTests/ArgsTest.ReplaceArgumentAtIndexLonger (1400 of 2421)
PASS: lldb-unit :: Utility/./UtilityTests/ReproducerTest.SetCapture (1401 of 2421)
PASS: lldb-unit :: Utility/./UtilityTests/ScalarTest.LongLongAssigmentOperator (1402 of 2421)
PASS: lldb-api :: lang/cpp/scope/TestCppScope.py (1403 of 2421)
PASS: lldb-shell :: SymbolFile/Breakpad/unwind-via-stack-cfi.test (1404 of 2421)
UNSUPPORTED: lldb-api :: functionalities/ptrauth_diagnostics/brkC47x_code/TestPtrauthBRKc47xDiagnostic.py (1405 of 2421)
PASS: lldb-api :: lang/c/unions/TestUnionMembers.py (1406 of 2421)
PASS: lldb-unit :: Utility/./UtilityTests/ArgsTest.TestUnknownEscape (1407 of 2421)
PASS: lldb-shell :: Unwind/thread-step-out-ret-addr-check.test (1408 of 2421)
PASS: lldb-shell :: Commands/command-script-import.test (1409 of 2421)
PASS: lldb-api :: lang/objc/foundation/TestObjCMethods2.py (1410 of 2421)
PASS: lldb-shell :: SymbolFile/DWARF/x86/dwp-debug-types.s (1411 of 2421)
PASS: lldb-shell :: Settings/TestFrameFormatMangling.test (1412 of 2421)
UNSUPPORTED: lldb-api :: functionalities/data-formatter/data-formatter-stl/libstdcpp/vbool/TestDataFormatterStdVBool.py (1413 of 2421)
PASS: lldb-unit :: ObjectFile/MachO/./ObjectFileMachOTests/ObjectFileMachOTest.ModuleFromSharedCacheInfo (1414 of 2421)
PASS: lldb-unit :: Utility/./UtilityTests/RegularExpression.Match (1415 of 2421)
PASS: lldb-shell :: Settings/TestSettingsSet.test (1416 of 2421)
UNSUPPORTED: lldb-api :: functionalities/thread/concurrent_events/TestConcurrentManySignals.py (1417 of 2421)
PASS: lldb-api :: commands/frame/language/TestGuessLanguage.py (1418 of 2421)
PASS: lldb-api :: functionalities/multidebugger_commands/TestMultipleDebuggersCommands.py (1419 of 2421)
PASS: lldb-unit :: Process/gdb-remote/./ProcessGdbRemoteTests/GDBRemoteCommunicationServerTest.SendErrorResponse_UnimplementedError (1420 of 2421)
PASS: lldb-shell :: Minidump/dump-all.test (1421 of 2421)
PASS: lldb-shell :: Reproducer/TestVersionCheck.test (1422 of 2421)
UNSUPPORTED: lldb-api :: functionalities/tsan/thread_leak/TestTsanThreadLeak.py (1423 of 2421)
UNSUPPORTED: lldb-shell :: Unwind/eh-frame-augment-noop.test (1424 of 2421)
PASS: lldb-api :: commands/watchpoints/hello_watchpoint/TestMyFirstWatchpoint.py (1425 of 2421)
UNSUPPORTED: lldb-api :: functionalities/data-formatter/data-formatter-stl/libstdcpp/iterator/TestDataFormatterStdIterator.py (1426 of 2421)
PASS: lldb-api :: macosx/stack-corefile/TestStackCorefile.py (1427 of 2421)
PASS: lldb-unit :: Utility/./UtilityTests/StringListTest.GetSize (1428 of 2421)
PASS: lldb-api :: functionalities/breakpoint/breakpoint_locations/TestBreakpointLocations.py (1429 of 2421)
PASS: lldb-api :: functionalities/data-formatter/data-formatter-objc/nsindexpath/TestDataFormatterNSIndexPath.py (1430 of 2421)
PASS: lldb-unit :: Utility/./UtilityTests/StringListTest.LongestCommonPrefixNoPrefix (1431 of 2421)
PASS: lldb-unit :: Signals/./SignalsTests/UnixSignalsTest.GetFilteredSignals (1432 of 2421)
PASS: lldb-api :: lang/objc/objc++/TestObjCXX.py (1433 of 2421)
PASS: lldb-shell :: ObjectFile/ELF/PT_LOAD.yaml (1434 of 2421)
PASS: lldb-unit :: Target/./TargetTests/ModuleCacheTest.GetAndPutStrangeHostname (1435 of 2421)
PASS: lldb-unit :: Utility/./UtilityTests/OptionsWithRawTest.SingleWordSuffix (1436 of 2421)
PASS: lldb-unit :: Utility/./UtilityTests/ConstStringTest.NullAndEmptyStates (1437 of 2421)
UNSUPPORTED: lldb-api :: functionalities/data-formatter/data-formatter-stl/libstdcpp/vector/TestDataFormatterStdVector.py (1438 of 2421)
PASS: lldb-shell :: BuildScript/compiler-full-path.test (1439 of 2421)
PASS: lldb-api :: types/TestFloatTypes.py (1440 of 2421)
PASS: lldb-unit :: Utility/./UtilityTests/ScalarTest.GetValue (1441 of 2421)
PASS: lldb-api :: commands/watchpoints/watchpoint_set_command/TestWatchLocationWithWatchSet.py (1442 of 2421)
PASS: lldb-unit :: Utility/./UtilityTests/ConstStringTest.FromMidOfBufferStringRef (1443 of 2421)
PASS: lldb-api :: functionalities/postmortem/mach-core/TestMachCore.py (1444 of 2421)
PASS: lldb-unit :: Editline/./EditlineTests/EditlineTestFixture.EditlineReceivesSingleLineText (1445 of 2421)
PASS: lldb-api :: types/TestFloatTypesExpr.py (1446 of 2421)
PASS: lldb-shell :: ObjectFile/PECOFF/uuid.yaml (1447 of 2421)
PASS: lldb-shell :: Subprocess/fork-follow-parent-wp.test (1448 of 2421)
UNSUPPORTED: lldb-shell :: Register/x86-db-read.test (1449 of 2421)
PASS: lldb-shell :: Minidump/Windows/broken-unwind.test (1450 of 2421)
PASS: lldb-unit :: UnwindAssembly/x86/./UnwindAssemblyx86Tests/Testx86AssemblyInspectionEngine.TestPopEBX (1451 of 2421)
UNSUPPORTED: lldb-api :: functionalities/breakpoint/hardware_breakpoints/write_memory_with_hw_breakpoint/TestWriteMemoryWithHWBreakpoint.py (1452 of 2421)
UNSUPPORTED: lldb-shell :: ScriptInterpreter/Lua/lua-python.test (1453 of 2421)
PASS: lldb-api :: commands/expression/codegen-crash-typedefdecl-not-in_declcontext/TestCodegenCrashTypedefDeclNotInDeclContext.py (1454 of 2421)
PASS: lldb-api :: macosx/find-dsym/bundle-with-dot-in-filename/TestBundleWithDotInFilename.py (1455 of 2421)
PASS: lldb-api :: lang/objc/radar-9691614/TestObjCMethodReturningBOOL.py (1456 of 2421)
PASS: lldb-api :: commands/watchpoints/watchpoint_on_vectors/TestValueOfVectorVariable.py (1457 of 2421)
UNSUPPORTED: lldb-shell :: Register/x86-gp-write.test (1458 of 2421)
PASS: lldb-api :: functionalities/data-formatter/data-formatter-stl/libcxx/function/TestLibCxxFunction.py (1459 of 2421)
PASS: lldb-api :: tools/lldb-vscode/variables/TestVSCode_variables.py (1460 of 2421)
PASS: lldb-api :: commands/expression/class_template_specialization_empty_pack/TestClassTemplateSpecializationParametersHandling.py (1461 of 2421)
PASS: lldb-unit :: Utility/./UtilityTests/RangeTest.DefaultConstructor (1462 of 2421)
PASS: lldb-shell :: SymbolFile/DWARF/x86/apple-index-is-used.cpp (1463 of 2421)
PASS: lldb-unit :: DataFormatter/./LLDBFormatterTests/StringPrinterTests.CxxUTF8 (1464 of 2421)
PASS: lldb-unit :: Symbol/./SymbolTests/TestTypeSystemClang.TestIsClangType (1465 of 2421)
PASS: lldb-api :: lang/c/enum_types/TestEnumTypes.py (1466 of 2421)
PASS: lldb-api :: lang/objc/exceptions/TestObjCExceptions.py (1467 of 2421)
PASS: lldb-api :: python_api/watchpoint/TestSetWatchpoint.py (1468 of 2421)
PASS: lldb-api :: lang/objc/objc-new-syntax/TestObjCNewSyntaxLiteral.py (1469 of 2421)
PASS: lldb-unit :: Utility/./UtilityTests/StreamTest.AddressSuffix (1470 of 2421)
PASS: lldb-api :: functionalities/thread/exit_during_break/TestExitDuringBreak.py (1471 of 2421)
PASS: lldb-shell :: Reproducer/TestHomeDir.test (1472 of 2421)
PASS: lldb-api :: lang/cpp/rvalue-references/TestRvalueReferences.py (1473 of 2421)
PASS: lldb-unit :: Host/./HostTests/NativeProcessProtocolTest.SetBreakpoint (1474 of 2421)
PASS: lldb-unit :: UnwindAssembly/x86/./UnwindAssemblyx86Tests/Testx86AssemblyInspectionEngine.TestPushRBPWithREX (1475 of 2421)
PASS: lldb-unit :: Utility/./UtilityTests/PassiveReplayTest.InstrumentedFoo (1476 of 2421)
PASS: lldb-shell :: SymbolFile/DWARF/x86/dir-separator-posix.s (1477 of 2421)
PASS: lldb-api :: functionalities/gdb_remote_client/TestMultiprocess.py (1478 of 2421)
PASS: lldb-api :: commands/expression/test/TestExprs2.py (1479 of 2421)
PASS: lldb-unit :: Utility/./UtilityTests/StringListTest.JoinMultiCharSeparator (1480 of 2421)
PASS: lldb-unit :: Process/Utility/./ProcessUtilityTests/ProcSMapTests/LinuxProcSMapsTestFixture.ParseSMapRegions/6 (1481 of 2421)
PASS: lldb-api :: tools/lldb-server/thread-name/TestGdbRemoteThreadName.py (1482 of 2421)
PASS: lldb-api :: commands/expression/calculator_mode/TestCalculatorMode.py (1483 of 2421)
PASS: lldb-shell :: Settings/TestDefaultModuleCachePath.test (1484 of 2421)
PASS: lldb-api :: functionalities/recursion/TestValueObjectRecursion.py (1485 of 2421)
PASS: lldb-unit :: Utility/./UtilityTests/StringExtractorTest.GetHexU8_Underflow2 (1486 of 2421)
PASS: lldb-unit :: Utility/./UtilityTests/BinaryStreamTest.PutULEB128MaxValue (1487 of 2421)
PASS: lldb-api :: lang/c/sizeof/TestCSizeof.py (1488 of 2421)
PASS: lldb-api :: lang/cpp/class_types/TestClassTypes.py (1489 of 2421)
PASS: lldb-api :: lang/c/global_variables/TestGlobalVariables.py (1490 of 2421)
PASS: lldb-unit :: Utility/./UtilityTests/LogTest.Unregister (1491 of 2421)
PASS: lldb-shell :: ScriptInterpreter/Python/sb_address_exception.test (1492 of 2421)
PASS: lldb-shell :: SymbolFile/DWARF/x86/find-basic-namespace.cpp (1493 of 2421)
PASS: lldb-shell :: Commands/command-stop-hook-output.test (1494 of 2421)
PASS: lldb-unit :: Utility/./UtilityTests/ArgsTest.GetShellSafeArgument (1495 of 2421)
PASS: lldb-api :: lang/cpp/call-function/TestCallCPPFunction.py (1496 of 2421)
PASS: lldb-unit :: Utility/./UtilityTests/AnsiTerminal.Basic (1497 of 2421)
PASS: lldb-api :: types/TestRecursiveTypes.py (1498 of 2421)
PASS: lldb-unit :: Utility/./UtilityTests/StringExtractorTest.GetHexBytesAvail_OddPair (1499 of 2421)
PASS: lldb-api :: lang/objc/objc_direct-methods/TestObjCDirectMethods.py (1500 of 2421)
PASS: lldb-unit :: Core/./LLDBCoreTests/DumpDataExtractorTest.BaseAddress (1501 of 2421)
PASS: lldb-api :: commands/expression/call-throws/TestCallThatThrows.py (1502 of 2421)
PASS: lldb-api :: functionalities/gdb_remote_client/TestNestedRegDefinitions.py (1503 of 2421)
PASS: lldb-api :: functionalities/data-formatter/data-formatter-objc/TestDataFormatterObjCNSBundle.py (1504 of 2421)
PASS: lldb-unit :: Symbol/./SymbolTests/TestTypeSystemClang.TestGetTypeClassTypeOfExpr (1505 of 2421)
PASS: lldb-shell :: ObjectFile/ELF/riscv-arch.yaml (1506 of 2421)
UNSUPPORTED: lldb-shell :: SymbolFile/PDB/function-level-linking.test (1507 of 2421)
UNSUPPORTED: lldb-api :: android/platform/TestDefaultCacheLineSize.py (1508 of 2421)
UNSUPPORTED: lldb-api :: functionalities/tsan/thread_numbers/TestTsanThreadNumbers.py (1509 of 2421)
PASS: lldb-api :: functionalities/thread/ignore_suspended/TestIgnoreSuspendedThread.py (1510 of 2421)
PASS: lldb-unit :: ScriptInterpreter/Python/./ScriptInterpreterPythonTests/PythonDataObjectsTest.TestExtractingUInt64ThroughStructuredData (1511 of 2421)
PASS: lldb-shell :: ObjectFile/PECOFF/dep-modules.yaml (1512 of 2421)
PASS: lldb-api :: functionalities/tail_call_frames/thread_step_out_or_return/TestSteppingOutWithArtificialFrames.py (1513 of 2421)
UNSUPPORTED: lldb-api :: terminal/TestEditline.py (1514 of 2421)
PASS: lldb-unit :: Expression/./ExpressionTests/DiagnosticManagerTest.GetStringMultipleDiags (1515 of 2421)
PASS: lldb-unit :: Utility/./UtilityTests/StringListTest.SetSize (1516 of 2421)
PASS: lldb-unit :: Utility/./UtilityTests/LogChannelEnabledTest.log_options (1517 of 2421)
PASS: lldb-unit :: Utility/./UtilityTests/RangeDataVector.CustomSort (1518 of 2421)
PASS: lldb-unit :: Utility/./UtilityTests/XcodeSDKTest.SDKSupportsModules (1519 of 2421)
PASS: lldb-unit :: debugserver/./debugserverTests/RNBSocket.LoopBackConnectIPv6 (1520 of 2421)
PASS: lldb-unit :: SymbolFile/NativePDB/./SymbolFileNativePDBTests/PDBFPOProgramToDWARFExpressionTests.UnsupportedRASearch (1521 of 2421)
PASS: lldb-unit :: Utility/./UtilityTests/BinaryStreamTest.PutULEB128SevenBytes (1522 of 2421)
PASS: lldb-unit :: Utility/./UtilityTests/StreamTest.PutHex32ByteOrderBig (1523 of 2421)
PASS: lldb-api :: lang/cpp/template-arguments/TestCppTemplateArguments.py (1524 of 2421)
PASS: lldb-api :: functionalities/gdb_remote_client/TestStopPCs.py (1525 of 2421)
PASS: lldb-shell :: SymbolFile/NativePDB/tag-types.cpp (1526 of 2421)
PASS: lldb-unit :: Utility/./UtilityTests/StringLexerTest.NextIfList (1527 of 2421)
PASS: lldb-unit :: Utility/./UtilityTests/Flags.GetBitSize (1528 of 2421)
PASS: lldb-unit :: Utility/./UtilityTests/BinaryStreamTest.PutULEB128SixBytes (1529 of 2421)
UNSUPPORTED: lldb-api :: benchmarks/expression/TestExpressionCmd.py (1530 of 2421)
PASS: lldb-unit :: Utility/./UtilityTests/ScalarTest.Scalar_512 (1531 of 2421)
PASS: lldb-api :: lang/c/complex/TestComplexC99.py (1532 of 2421)
PASS: lldb-shell :: Register/Core/x86-64-netbsd-multithread.test (1533 of 2421)
PASS: lldb-unit :: debugserver/./debugserverTests/RNBSocket.AnyListen (1534 of 2421)
UNSUPPORTED: lldb-api :: lang/objc/objc-dynamic-value/TestObjCDynamicValue.py (1535 of 2421)
PASS: lldb-unit :: Utility/./UtilityTests/Flags.Test (1536 of 2421)
PASS: lldb-shell :: ObjectFile/ELF/avr-basic-info.yaml (1537 of 2421)
PASS: lldb-api :: lang/objc/real-definition/TestRealDefinition.py (1538 of 2421)
PASS: lldb-unit :: Utility/./UtilityTests/FileSpecTest.EqualDotsPosixRoot (1539 of 2421)
PASS: lldb-unit :: Expression/./ExpressionTests/ClangExpressionDeclMapTest.TestUnknownIdentifierLookup (1540 of 2421)
PASS: lldb-unit :: Utility/./UtilityTests/StringListTest.LongestCommonPrefix (1541 of 2421)
PASS: lldb-shell :: Reproducer/TestFileRepro.test (1542 of 2421)
PASS: lldb-api :: functionalities/data-formatter/data-formatter-named-summaries/TestDataFormatterNamedSummaries.py (1543 of 2421)
PASS: lldb-unit :: Utility/./UtilityTests/ArgsTest.TestQuotedUnknownEscape (1544 of 2421)
PASS: lldb-unit :: Process/gdb-remote/./ProcessGdbRemoteTests/GDBRemoteCommunicationClientTest.GetModulesInfo_UUID20 (1545 of 2421)
XFAIL: lldb-shell :: Register/x86-mm-xmm-write.test (1546 of 2421)
PASS: lldb-unit :: Utility/./UtilityTests/StringExtractorTest.GetHexBytes_OddPair (1547 of 2421)
PASS: lldb-unit :: Expression/./ExpressionTests/DiagnosticManagerTest.PutString (1548 of 2421)
PASS: lldb-unit :: Process/minidump/./LLDBMinidumpTests/MinidumpParserTest.GetArchitectureWindows (1549 of 2421)
PASS: lldb-api :: functionalities/gdb_remote_client/TestPartialGPacket.py (1550 of 2421)
PASS: lldb-shell :: ScriptInterpreter/None/none.test (1551 of 2421)
PASS: lldb-shell :: SymbolFile/NativePDB/s_constant.cpp (1552 of 2421)
PASS: lldb-shell :: SymbolFile/DWARF/x86/debug_loc-aslr.s (1553 of 2421)
UNSUPPORTED: lldb-api :: macosx/corefile-exception-reason/TestCorefileExceptionReason.py (1554 of 2421)
PASS: lldb-api :: functionalities/data-formatter/data-formatter-stl/libcxx/shared_ptr/TestDataFormatterLibcxxSharedPtr.py (1555 of 2421)
PASS: lldb-api :: lang/cpp/offsetof/TestOffsetofCpp.py (1556 of 2421)
PASS: lldb-unit :: Utility/./UtilityTests/ProcessInstanceInfo.Yaml (1557 of 2421)
PASS: lldb-shell :: Quit/TestQuitExitCodeHex0.test (1558 of 2421)
PASS: lldb-shell :: ObjectFile/PECOFF/sections.yaml (1559 of 2421)
PASS: lldb-shell :: Register/Core/x86-32-linux-multithread.test (1560 of 2421)
PASS: lldb-api :: lang/cpp/member-and-local-vars-with-same-name/TestMembersAndLocalsWithSameName.py (1561 of 2421)
PASS: lldb-unit :: Utility/./UtilityTests/OptionsWithRawTest.EmptySuffix (1562 of 2421)
UNSUPPORTED: lldb-api :: commands/platform/connect/TestPlatformConnect.py (1563 of 2421)
PASS: lldb-unit :: Utility/./UtilityTests/ArgsTest.StringListConstructor (1564 of 2421)
PASS: lldb-shell :: SymbolFile/DWARF/x86/subprogram_ranges.test (1565 of 2421)
PASS: lldb-api :: lang/objc/modules-auto-import/TestModulesAutoImport.py (1566 of 2421)
PASS: lldb-unit :: UnwindAssembly/x86/./UnwindAssemblyx86Tests/Testx86AssemblyInspectionEngine.TestPopESI (1567 of 2421)
PASS: lldb-unit :: Utility/./UtilityTests/BinaryStreamTest.PutULEB128FiveBytes (1568 of 2421)
PASS: lldb-unit :: Editline/./EditlineTests/EditlineTestFixture.EditlineReceivesMultiLineText (1569 of 2421)
PASS: lldb-unit :: Utility/./UtilityTests/EnvironmentTest.EnvpConstruction (1570 of 2421)
PASS: lldb-unit :: Language/Highlighting/./HighlighterTests/HighlighterTest.ClangCursorPosAfterOtherToken (1571 of 2421)
PASS: lldb-shell :: SymbolFile/NativePDB/bitfields.cpp (1572 of 2421)
UNSUPPORTED: lldb-shell :: Register/x86-64-xmm16-read.test (1573 of 2421)
UNSUPPORTED: lldb-shell :: SymbolFile/PDB/compilands.test (1574 of 2421)
PASS: lldb-api :: tools/lldb-server/memory-allocation/TestGdbRemoteMemoryAllocation.py (1575 of 2421)
PASS: lldb-shell :: SymbolFile/NativePDB/global-classes.cpp (1576 of 2421)
PASS: lldb-unit :: Symbol/./SymbolTests/TestTypeSystemClang.TestBuiltinTypeForEncodingAndBitSize (1577 of 2421)
PASS: lldb-api :: functionalities/breakpoint/cpp_exception/TestCPPExceptionBreakpoint.py (1578 of 2421)
PASS: lldb-unit :: Utility/./UtilityTests/ProcessInstanceInfoList.Yaml (1579 of 2421)
PASS: lldb-unit :: Utility/./UtilityTests/StatusTest.ErrorConstructor (1580 of 2421)
PASS: lldb-shell :: SymbolFile/DWARF/x86/dir-separator-no-comp-dir-relative-name.s (1581 of 2421)
PASS: lldb-api :: functionalities/breakpoint/dummy_target_breakpoints/TestBreakpointsWithNoTargets.py (1582 of 2421)
PASS: lldb-unit :: Core/./LLDBCoreTests/ModuleSpecTest.TestELFFile (1583 of 2421)
PASS: lldb-api :: macosx/builtin-debugtrap/TestBuiltinDebugTrap.py (1584 of 2421)
PASS: lldb-unit :: Utility/./UtilityTests/TimeoutTest.Format (1585 of 2421)
PASS: lldb-unit :: Utility/./UtilityTests/AnsiTerminal.AtEnd (1586 of 2421)
UNSUPPORTED: lldb-api :: tools/lldb-server/TestGdbRemoteFork.py (1587 of 2421)
PASS: lldb-unit :: Utility/./UtilityTests/ArgsTest.TestQuotedTrailingBackslash (1588 of 2421)
PASS: lldb-shell :: ObjectFile/MachO/lc_build_version_notools.yaml (1589 of 2421)
PASS: lldb-shell :: Commands/command-disassemble.s (1590 of 2421)
PASS: lldb-api :: functionalities/process_crash_info/TestProcessCrashInfo.py (1591 of 2421)
PASS: lldb-unit :: Utility/./UtilityTests/StructuredDataTest.StringDump (1592 of 2421)
PASS: lldb-unit :: Utility/./UtilityTests/StreamTeeTest.SetStreamAtIndexOverwrite (1593 of 2421)
PASS: lldb-shell :: Subprocess/vfork-follow-parent.test (1594 of 2421)
PASS: lldb-shell :: SymbolFile/DWARF/x86/debug_ranges.s (1595 of 2421)
PASS: lldb-api :: lang/cpp/enum_types/TestCPP11EnumTypes.py (1596 of 2421)
PASS: lldb-unit :: Process/minidump/./LLDBMinidumpTests/MinidumpParserTest.GetMemoryRegionInfoFromMemory64List (1597 of 2421)
UNSUPPORTED: lldb-api :: tools/lldb-vscode/completions/TestVSCode_completions.py (1598 of 2421)
PASS: lldb-api :: functionalities/paths/TestPaths.py (1599 of 2421)
PASS: lldb-shell :: Register/x86-64-read.test (1600 of 2421)
PASS: lldb-shell :: SymbolFile/Breakpad/line-table-edgecases.test (1601 of 2421)
PASS: lldb-api :: sample_test/TestSampleTest.py (1602 of 2421)
PASS: lldb-unit :: Utility/./UtilityTests/StreamTest.Indent (1603 of 2421)
PASS: lldb-api :: lang/c/stepping/TestStepAndBreakpoints.py (1604 of 2421)
PASS: lldb-unit :: Symbol/./SymbolTests/PostfixExpression.ToDWARF (1605 of 2421)
PASS: lldb-api :: functionalities/data-formatter/data-formatter-objc/TestDataFormatterObjCNSDate.py (1606 of 2421)
PASS: lldb-unit :: Host/./HostTests/NativeProcessProtocolTest.ReadCStringFromMemory_CrossPageBoundary (1607 of 2421)
PASS: lldb-unit :: Symbol/./SymbolTests/TestTypeSystemClang.TestGetTypeClassNested (1608 of 2421)
PASS: lldb-api :: functionalities/breakpoint/breakpoint_command/TestBreakpointCommand.py (1609 of 2421)
PASS: lldb-shell :: ObjectFile/wasm/unified-debug-sections.yaml (1610 of 2421)
PASS: lldb-api :: functionalities/thread/concurrent_events/TestConcurrentTwoWatchpointsOneDelayBreakpoint.py (1611 of 2421)
PASS: lldb-unit :: Core/./LLDBCoreTests/DumpDataExtractorTest.FormatCharArray (1612 of 2421)
PASS: lldb-api :: lang/objc/ivar-IMP/TestObjCiVarIMP.py (1613 of 2421)
PASS: lldb-unit :: Host/./HostTests/SocketTests/SocketTest.UDPGetConnectURI/ipv4 (1614 of 2421)
PASS: lldb-unit :: ScriptInterpreter/Python/./ScriptInterpreterPythonTests/PythonDataObjectsTest.TestPythonTupleSize (1615 of 2421)
PASS: lldb-unit :: Utility/./UtilityTests/SerializationRountripTest.SerializeDeserializeCStringArray (1616 of 2421)
PASS: lldb-api :: functionalities/thread/concurrent_events/TestConcurrentNWatchNBreak.py (1617 of 2421)
PASS: lldb-unit :: Utility/./UtilityTests/CompletionRequest.Constructor (1618 of 2421)
PASS: lldb-api :: commands/command/source/TestCommandSource.py (1619 of 2421)
PASS: lldb-unit :: Core/./LLDBCoreTests/RichManglingContextTest.SwitchProvider (1620 of 2421)
PASS: lldb-unit :: Utility/./UtilityTests/UriParserTest.SchemeHostSeparator4 (1621 of 2421)
PASS: lldb-unit :: Utility/./UtilityTests/FileSpecTest.Equal (1622 of 2421)
PASS: lldb-unit :: Symbol/./SymbolTests/TestClangASTImporter.MetadataPropagationIndirectImport (1623 of 2421)
PASS: lldb-unit :: Utility/./UtilityTests/BinaryStreamTest.PutSLEB128SevenBytes (1624 of 2421)
PASS: lldb-unit :: UnwindAssembly/x86/./UnwindAssemblyx86Tests/Testx86AssemblyInspectionEngine.TestSimple32bitFrameFunction (1625 of 2421)
PASS: lldb-unit :: ScriptInterpreter/Python/./ScriptInterpreterPythonTests/PythonDataObjectsTest.TestOwnedReferences (1626 of 2421)
PASS: lldb-api :: commands/expression/no-deadlock/TestExprDoesntBlock.py (1627 of 2421)
PASS: lldb-unit :: Core/./LLDBCoreTests/SourceFileCache.FindSourceFileFound (1628 of 2421)
PASS: lldb-unit :: Symbol/./SymbolTests/PostfixExpression.ParseFPOProgram (1629 of 2421)
PASS: lldb-api :: lang/c/unicode/TestUnicodeSymbols.py (1630 of 2421)
PASS: lldb-unit :: Utility/./UtilityTests/ArgsTest.TestOverwriteArgs (1631 of 2421)
PASS: lldb-api :: lang/cpp/dynamic-value/TestDynamicValue.py (1632 of 2421)
PASS: lldb-unit :: ScriptInterpreter/Python/./ScriptInterpreterPythonTests/PythonDataObjectsTest.TestPythonByteArray (1633 of 2421)
PASS: lldb-unit :: ScriptInterpreter/Python/./ScriptInterpreterPythonTests/PythonDataObjectsTest.TestGlobalNameResolutionNoDot (1634 of 2421)
UNSUPPORTED: lldb-api :: functionalities/tsan/multiple/TestTsanMultiple.py (1635 of 2421)
PASS: lldb-api :: sample_test/TestSampleInlineTest.py (1636 of 2421)
PASS: lldb-unit :: Host/./HostTests/PipeTest.CreateWithUniqueName (1637 of 2421)
PASS: lldb-api :: macosx/skinny-corefile/TestSkinnyCorefile.py (1638 of 2421)
UNSUPPORTED: lldb-shell :: SymbolFile/DWARF/split-dwarf-expression-eval-bug.cpp (1639 of 2421)
PASS: lldb-api :: functionalities/show_location/TestShowLocationDwarf5.py (1640 of 2421)
UNSUPPORTED: lldb-api :: commands/register/register/aarch64_dynamic_regset/TestArm64DynamicRegsets.py (1641 of 2421)
PASS: lldb-unit :: Utility/./UtilityTests/XcodeSDKTest.ParseTest (1642 of 2421)
PASS: lldb-unit :: Process/minidump/./LLDBMinidumpTests/MinidumpParserTest.GetPidWow64 (1643 of 2421)
PASS: lldb-api :: macosx/dyld-trie-symbols/TestDyldTrieSymbols.py (1644 of 2421)
PASS: lldb-api :: functionalities/conditional_break/TestConditionalBreak.py (1645 of 2421)
PASS: lldb-shell :: SymbolFile/DWARF/x86/debug_rnglists.s (1646 of 2421)
PASS: lldb-api :: commands/expression/import-std-module/missing-module-sources/TestStdModuleSourcesMissing.py (1647 of 2421)
PASS: lldb-unit :: Expression/./ExpressionTests/DiagnosticManagerTest.HasFixits (1648 of 2421)
PASS: lldb-shell :: ObjectFile/Breakpad/sections.test (1649 of 2421)
PASS: lldb-unit :: Utility/./UtilityTests/XcodeSDKTest.SDKSupportsSwift (1650 of 2421)
UNSUPPORTED: lldb-shell :: SymbolFile/dissassemble-entry-point.s (1651 of 2421)
PASS: lldb-unit :: Utility/./UtilityTests/StringListTest.GetMaxStringLengthIncreasingSize (1652 of 2421)
PASS: lldb-api :: lang/c/shared_lib_stripped_symbols/TestSharedLibStrippedSymbols.py (1653 of 2421)
PASS: lldb-unit :: Utility/./UtilityTests/OptionsWithRawTest.LeadingSpaceArgs (1654 of 2421)
PASS: lldb-api :: functionalities/thread/concurrent_events/TestConcurrentTwoBreakpointsOneWatchpoint.py (1655 of 2421)
PASS: lldb-unit :: Process/minidump/./LLDBMinidumpTests/MinidumpParserTest.GetPidWindows (1656 of 2421)
PASS: lldb-unit :: Utility/./UtilityTests/SerializationRountripTest.SerializeDeserializeCStringArrayNullptr (1657 of 2421)
PASS: lldb-unit :: UnwindAssembly/x86/./UnwindAssemblyx86Tests/Testx86AssemblyInspectionEngine.TestPushExtended (1658 of 2421)
PASS: lldb-api :: functionalities/inline-stepping/TestInlineStepping.py (1659 of 2421)
PASS: lldb-api :: commands/target/stop-hook/disable/TestTargetStopHookDisable.py (1660 of 2421)
PASS: lldb-unit :: Core/./LLDBCoreTests/ModuleSpecTest.InvalidInMemoryBuffer (1661 of 2421)
PASS: lldb-api :: lang/objc/foundation/TestConstStrings.py (1662 of 2421)
PASS: lldb-unit :: SymbolFile/DWARF/./SymbolFileDWARFTests/SymbolFileDWARFTests.ParseArangesWithMultipleTerminators (1663 of 2421)
PASS: lldb-api :: source-manager/TestSourceManager.py (1664 of 2421)
UNSUPPORTED: lldb-api :: functionalities/ptrauth_diagnostics/BRAA_error/TestPtrauthBRAADiagnostic.py (1665 of 2421)
PASS: lldb-unit :: Process/gdb-remote/./ProcessGdbRemoteTests/GDBRemoteClientBaseTest.SendPacketAndReceiveResponseWithOutputSupport (1666 of 2421)
PASS: lldb-unit :: Language/Highlighting/./HighlighterTests/HighlighterTest.ClangCursorPosEndOfLine (1667 of 2421)
PASS: lldb-unit :: Utility/./UtilityTests/ArgsTest.TestArgv (1668 of 2421)
PASS: lldb-api :: types/TestIntegerTypeExpr.py (1669 of 2421)
PASS: lldb-unit :: UnwindAssembly/x86/./UnwindAssemblyx86Tests/Testx86AssemblyInspectionEngine.TestSubESP (1670 of 2421)
PASS: lldb-unit :: Utility/./UtilityTests/StringLexerTest.Peek (1671 of 2421)
PASS: lldb-api :: lang/cpp/template-function/TestTemplateFunctions.py (1672 of 2421)
PASS: lldb-shell :: SymbolFile/DWARF/x86/DW_AT_low_pc-addrx.s (1673 of 2421)
PASS: lldb-unit :: Utility/./UtilityTests/VASprintfTest.EncodingError (1674 of 2421)
PASS: lldb-unit :: Target/./TargetTests/MemoryRegionInfoTest.Formatv (1675 of 2421)
FAIL: lldb-unit :: Host/./HostTests/TerminalTest.SaveRestoreRAII (1676 of 2421)
******************** TEST 'lldb-unit :: Host/./HostTests/TerminalTest.SaveRestoreRAII' FAILED ********************
Script:
--
/Users/buildslave/jenkins/workspace/lldb-cmake-sanitized/lldb-build/tools/lldb/unittests/Host/./HostTests --gtest_filter=TerminalTest.SaveRestoreRAII
--
Note: Google Test filter = TerminalTest.SaveRestoreRAII
[==========] Running 1 test from 1 test suite.
[----------] Global test environment set-up.
[----------] 1 test from TerminalTest
[ RUN      ] TerminalTest.SaveRestoreRAII
/Users/buildslave/jenkins/workspace/lldb-cmake-sanitized/llvm-project/lldb/unittests/Host/posix/TerminalTest.cpp:74: Failure
Expected equality of these values:
  tcgetattr(m_pty.GetPrimaryFileDescriptor(), &orig_terminfo)
    Which is: -1
  0
[  FAILED  ] TerminalTest.SaveRestoreRAII (0 ms)
[----------] 1 test from TerminalTest (0 ms total)

Hide Details

[----------] Global test environment tear-down [==========] 1 test from 1 test suite ran. (1 ms total) [ PASSED ] 0 tests. [ FAILED ] 1 test, listed below: [ FAILED ] TerminalTest.SaveRestoreRAII

Hide Details

1 FAILED TEST

Hide Details

******************** UNSUPPORTED: lldb-api :: arm/breakpoint-it/TestBreakpointIt.py (1677 of 2421) PASS: lldb-api :: tools/lldb-vscode/breakpoint/TestVSCode_setBreakpoints.py (1678 of 2421) PASS: lldb-unit :: Platform/./LLDBPlatformTests/PlatformAppleSimulatorTest.TestHostPlatformToSim (1679 of 2421) PASS: lldb-api :: lang/c/local_variables/TestLocalVariables.py (1680 of 2421) PASS: lldb-api :: lang/cpp/global_variables/TestCPPGlobalVariables.py (1681 of 2421) PASS: lldb-shell :: SymbolFile/DWARF/x86/DW_AT_declaration-with-children.s (1682 of 2421) PASS: lldb-shell :: Minidump/disassemble-no-module.yaml (1683 of 2421) PASS: lldb-api :: lang/cpp/static_member_type_depending_on_parent_size/TestStaticMemberTypeDependingOnParentSize.py (1684 of 2421) PASS: lldb-api :: arm/emulation/TestEmulations.py (1685 of 2421) PASS: lldb-unit :: UnwindAssembly/x86/./UnwindAssemblyx86Tests/Testx86AssemblyInspectionEngine.TestPushR15 (1686 of 2421) PASS: lldb-unit :: Utility/./UtilityTests/StringExtractorTest.DecodeHexU8_InvalidHex2 (1687 of 2421) PASS: lldb-unit :: Core/./LLDBCoreTests/ModuleSpecTest.TestMachOFile (1688 of 2421) PASS: lldb-unit :: Process/minidump/./LLDBMinidumpTests/MinidumpParserTest.MinidumpDuplicateModuleMappedSecondHigh (1689 of 2421) UNSUPPORTED: lldb-shell :: SymbolFile/DWARF/x86/DW_TAG_GNU_call_site-DW_AT_low_pc.s (1690 of 2421) PASS: lldb-api :: commands/expression/completion-crash-incomplete-record/TestCompletionCrashIncompleteRecord.py (1691 of 2421) PASS: lldb-api :: commands/disassemble/basic/TestDisassembleBreakpoint.py (1692 of 2421) PASS: lldb-unit :: Utility/./UtilityTests/StringExtractorTest.GetHexBytesAvail_OddPair2 (1693 of 2421) PASS: lldb-api :: lang/objcxx/conflicting-names-class-update-utility-expr/TestObjCConflictingNamesForClassUpdateExpr.py (1694 of 2421) PASS: lldb-unit :: SymbolFile/DWARF/./SymbolFileDWARFTests/SymbolFileDWARFTests.TestAbilitiesForDWARF (1695 of 2421) PASS: lldb-unit :: Utility/./UtilityTests/StringListTest.ShiftCString (1696 of 2421) PASS: lldb-api :: functionalities/breakpoint/breakpoint_ids/TestBreakpointIDs.py (1697 of 2421) PASS: lldb-unit :: Utility/./UtilityTests/ScalarTest.Equality (1698 of 2421) PASS: lldb-api :: commands/expression/import-std-module/list/TestListFromStdModule.py (1699 of 2421) PASS: lldb-unit :: Symbol/./SymbolTests/TestTypeSystemClang.TestRemoveFastQualifiers (1700 of 2421) PASS: lldb-api :: macosx/macCatalyst/TestMacCatalyst.py (1701 of 2421) PASS: lldb-api :: functionalities/thread/backtrace_limit/TestBacktraceLimit.py (1702 of 2421) PASS: lldb-unit :: Host/./HostTests/SocketTests/SocketTest.DomainGetConnectURI/ipv6 (1703 of 2421) PASS: lldb-api :: commands/expression/import-std-module/non-module-type-separation/TestNonModuleTypeSeparation.py (1704 of 2421) PASS: lldb-unit :: Language/Highlighting/./HighlighterTests/HighlighterTest.ClangUnterminatedString (1705 of 2421) PASS: lldb-shell :: SymbolFile/NativePDB/ast-methods.cpp (1706 of 2421) PASS: lldb-unit :: Utility/./UtilityTests/StringListTest.GetMaxStringLengthMixed (1707 of 2421) PASS: lldb-api :: lang/objc/objc-baseclass-sbtype/TestObjCBaseClassSBType.py (1708 of 2421) PASS: lldb-shell :: Reproducer/TestSynchronous.test (1709 of 2421) PASS: lldb-api :: commands/platform/basic/TestPlatformPython.py (1710 of 2421) PASS: lldb-shell :: SymbolFile/DWARF/x86/dwarf5-index-is-used.cpp (1711 of 2421) PASS: lldb-api :: lang/objc/rdar-10967107/TestRdar10967107.py (1712 of 2421) PASS: lldb-api :: lang/cpp/incompatible-class-templates/TestCppIncompatibleClassTemplates.py (1713 of 2421) PASS: lldb-unit :: Utility/./UtilityTests/StructuredDataTest.ParseJSONFromFile (1714 of 2421) PASS: lldb-api :: functionalities/gdb_remote_client/TestPty.py (1715 of 2421) PASS: lldb-shell :: ObjectFile/ELF/section-types.yaml (1716 of 2421) PASS: lldb-api :: functionalities/postmortem/elf-core/gcore/TestGCore.py (1717 of 2421) PASS: lldb-unit :: Core/./LLDBCoreTests/RichManglingContextTest.Basic (1718 of 2421) PASS: lldb-api :: functionalities/tail_call_frames/disambiguate_call_site/TestDisambiguateCallSite.py (1719 of 2421) PASS: lldb-unit :: Target/./TargetTests/DynamicRegisterInfoTest.add_supplementary_register (1720 of 2421) UNSUPPORTED: lldb-api :: functionalities/tty/TestTerminal.py (1721 of 2421) PASS: lldb-shell :: ObjectFile/PECOFF/symbol.yaml (1722 of 2421) PASS: lldb-api :: tools/lldb-server/TestGdbRemoteAttachOrWait.py (1723 of 2421) PASS: lldb-unit :: Utility/./UtilityTests/DataExtractorTest.GetFloat (1724 of 2421) PASS: lldb-api :: commands/expression/regression-access-function-template-in-record/TestRegressionAccessFunctionTemplateInRecord.py (1725 of 2421) PASS: lldb-api :: functionalities/signal/TestSendSignal.py (1726 of 2421) PASS: lldb-shell :: SymbolFile/DWARF/x86/find-qualified-variable.cpp (1727 of 2421) PASS: lldb-api :: functionalities/thread/concurrent_events/TestConcurrentTwoBreakpointThreads.py (1728 of 2421) PASS: lldb-api :: commands/expression/import-std-module/basic/TestImportStdModule.py (1729 of 2421) PASS: lldb-shell :: Driver/TestSingleQuote.test (1730 of 2421) PASS: lldb-api :: macosx/load-kext/TestLoadKext.py (1731 of 2421) PASS: lldb-unit :: Utility/./UtilityTests/StringExtractorTest.GetU64BigEndian (1732 of 2421) PASS: lldb-unit :: Process/gdb-remote/./ProcessGdbRemoteTests/GDBRemoteClientBaseTest.SendContinueAndAsyncSignal (1733 of 2421) PASS: lldb-unit :: Utility/./UtilityTests/StringExtractorTest.GetU64LittleEndian (1734 of 2421) PASS: lldb-api :: commands/expression/import-std-module/array/TestArrayFromStdModule.py (1735 of 2421) PASS: lldb-unit :: Process/Utility/./ProcessUtilityTests/ProcSMapTests/LinuxProcSMapsTestFixture.ParseSMapRegions/4 (1736 of 2421) PASS: lldb-unit :: UnwindAssembly/x86/./UnwindAssemblyx86Tests/Testx86AssemblyInspectionEngine.TestPushEDI (1737 of 2421) UNSUPPORTED: lldb-api :: functionalities/data-formatter/data-formatter-stl/libstdcpp/map/TestDataFormatterStdMap.py (1738 of 2421) PASS: lldb-unit :: Expression/./ExpressionTests/DiagnosticManagerTest.AddDiagnostic (1739 of 2421) PASS: lldb-unit :: DataFormatter/./LLDBFormatterTests/TypeMatcherTests.CreatedBySameMatchString (1740 of 2421) PASS: lldb-api :: functionalities/pre_run_dylibs/TestPreRunDylibs.py (1741 of 2421) PASS: lldb-api :: functionalities/data-formatter/refpointer-recursion/TestDataFormatterRefPtrRecursion.py (1742 of 2421) PASS: lldb-unit :: Process/Utility/./ProcessUtilityTests/MemoryTagManagerAArch64MTETest.UnpackTagsData (1743 of 2421) PASS: lldb-api :: lang/cpp/dereferencing_references/TestCPPDereferencingReferences.py (1744 of 2421) PASS: lldb-api :: commands/register/register/register_command/TestRegisters.py (1745 of 2421) PASS: lldb-api :: commands/expression/radar_9531204/TestPrintfAfterUp.py (1746 of 2421) PASS: lldb-unit :: ScriptInterpreter/Python/./ScriptInterpreterPythonTests/PythonDataObjectsTest.TestPythonDictionaryValueEquality (1747 of 2421) PASS: lldb-api :: lang/cpp/symbols/TestSymbols.py (1748 of 2421) PASS: lldb-api :: tools/lldb-server/TestAppleSimulatorOSType.py (1749 of 2421) PASS: lldb-unit :: Symbol/./SymbolTests/LineEntryTest.GetAllExactLineMatchesWithoutColumn (1750 of 2421) PASS: lldb-api :: commands/expression/context-object-objc/TestContextObjectObjc.py (1751 of 2421) PASS: lldb-shell :: Breakpoint/debug_rnglistx_rlex.test (1752 of 2421) PASS: lldb-unit :: Utility/./UtilityTests/BinaryStreamTest.PutULEB128EightBytes (1753 of 2421) PASS: lldb-unit :: Utility/./UtilityTests/AnsiTerminal.Unknown (1754 of 2421) PASS: lldb-unit :: Host/./HostTests/ConnectionFileDescriptorTest.TCPGetURIv4 (1755 of 2421) PASS: lldb-unit :: Utility/./UtilityTests/StreamTest.PutSLEB128 (1756 of 2421) PASS: lldb-api :: functionalities/data-formatter/var-in-aggregate-misuse/TestVarInAggregateMisuse.py (1757 of 2421) PASS: lldb-api :: functionalities/inferior-crashing/TestInferiorCrashingStep.py (1758 of 2421) PASS: lldb-shell :: ScriptInterpreter/Python/Crashlog/parser_json.test (1759 of 2421) PASS: lldb-unit :: Utility/./UtilityTests/UriParserTest.BracketedHostnameWithPortIPv4 (1760 of 2421) PASS: lldb-shell :: SymbolFile/DWARF/x86/dwp-separate-debug-file.cpp (1761 of 2421) PASS: lldb-unit :: Utility/./UtilityTests/BinaryStreamTest.PutULEB128One (1762 of 2421) PASS: lldb-api :: functionalities/object-file/TestImageListMultiArchitecture.py (1763 of 2421) PASS: lldb-shell :: ScriptInterpreter/Python/fail_breakpoint_oneline.test (1764 of 2421) PASS: lldb-unit :: Target/./TargetTests/DynamicRegisterInfoTest.finalize_regs (1765 of 2421) PASS: lldb-unit :: Utility/./UtilityTests/CompletionRequest.TryCompleteCurrentArgBad (1766 of 2421) PASS: lldb-api :: functionalities/data-formatter/data-formatter-enum-format/TestDataFormatterEnumFormat.py (1767 of 2421) PASS: lldb-unit :: Host/./HostTests/FileSystemTest.OpenErrno (1768 of 2421) PASS: lldb-unit :: Symbol/./SymbolTests/TestTypeSystemClang.TestGetBasicTypeFromName (1769 of 2421) PASS: lldb-shell :: ObjectFile/MachO/lc_build_version.yaml (1770 of 2421) PASS: lldb-api :: lang/cpp/type_lookup/TestCppTypeLookup.py (1771 of 2421) PASS: lldb-shell :: SymbolFile/DWARF/x86/dir-separator-windows.s (1772 of 2421) PASS: lldb-shell :: Commands/command-image-lookup.yaml (1773 of 2421) PASS: lldb-unit :: Utility/./UtilityTests/ArgsTest.TestMultipleArgs (1774 of 2421) PASS: lldb-api :: python_api/watchpoint/TestWatchpointIter.py (1775 of 2421) PASS: lldb-api :: lang/objc/foundation/TestObjCMethodsNSArray.py (1776 of 2421) PASS: lldb-unit :: Utility/./UtilityTests/StateTest.Formatv (1777 of 2421) PASS: lldb-unit :: Utility/./UtilityTests/UriParserTest.Minimal (1778 of 2421) PASS: lldb-api :: python_api/sbstructureddata/TestStructuredDataAPI.py (1779 of 2421) UNSUPPORTED: lldb-api :: lang/objc/ptr_refs/TestPtrRefsObjC.py (1780 of 2421) PASS: lldb-unit :: Host/./HostTests/TerminalTest.PipeIsNotATerminal (1781 of 2421) PASS: lldb-unit :: Symbol/./SymbolTests/TestTypeSystemClang.TestDisplayName (1782 of 2421) PASS: lldb-unit :: Utility/./UtilityTests/StreamTest.PutULEB128 (1783 of 2421) PASS: lldb-unit :: Process/gdb-remote/./ProcessGdbRemoteTests/GDBRemoteClientBaseTest.SendContinueAndInterrupt (1784 of 2421) PASS: lldb-unit :: Utility/./UtilityTests/GeneratorTest.YamlMultiProvider (1785 of 2421) PASS: lldb-unit :: Utility/./UtilityTests/StringListTest.SplitIntoLines (1786 of 2421) PASS: lldb-api :: test_utils/TestPExpectTest.py (1787 of 2421) PASS: lldb-unit :: Process/minidump/./LLDBMinidumpTests/MinidumpParserTest.GetThreadContext_x86_32 (1788 of 2421) PASS: lldb-unit :: Utility/./UtilityTests/StreamTest.PutMaxHex64ByteOrderLittle (1789 of 2421) PASS: lldb-api :: lang/cpp/multiple-inheritance/TestCppMultipleInheritance.py (1790 of 2421) PASS: lldb-unit :: Utility/./UtilityTests/CompletionRequest.TryCompleteCurrentArgGood (1791 of 2421) PASS: lldb-api :: commands/frame/diagnose/dereference-argument/TestDiagnoseDereferenceArgument.py (1792 of 2421) PASS: lldb-unit :: Language/Highlighting/./HighlighterTests/HighlighterTest.ClangStringLiterals (1793 of 2421) PASS: lldb-unit :: Utility/./UtilityTests/RangeDataVector.FindEntryThatContains (1794 of 2421) PASS: lldb-unit :: Utility/./UtilityTests/OptionsWithRawTest.EmptySuffixSingleWhitespace (1795 of 2421) PASS: lldb-api :: commands/expression/rdar42038760/TestScalarURem.py (1796 of 2421) PASS: lldb-shell :: Subprocess/fork-follow-parent.test (1797 of 2421) UNSUPPORTED: lldb-shell :: SymbolFile/Breakpad/stack-cfi-arm.yaml (1798 of 2421) PASS: lldb-unit :: Utility/./UtilityTests/SerializationRountripTest.SerializeDeserializePod (1799 of 2421) PASS: lldb-api :: functionalities/data-formatter/data-formatter-stl/libcxx/atomic/TestLibCxxAtomic.py (1800 of 2421) PASS: lldb-unit :: Utility/./UtilityTests/OptionsWithRawTest.UnterminatedQuote (1801 of 2421) PASS: lldb-api :: functionalities/gdb_remote_client/TestArmRegisterDefinition.py (1802 of 2421) PASS: lldb-unit :: Host/./HostTests/SocketTests/SocketTest.UDPGetConnectURI/ipv6 (1803 of 2421) PASS: lldb-shell :: ObjectFile/ELF/gnu-debuglink.yaml (1804 of 2421) PASS: lldb-api :: functionalities/thread/concurrent_events/TestConcurrentSignalBreak.py (1805 of 2421) UNSUPPORTED: lldb-shell :: Subprocess/fork-follow-child-softbp.test (1806 of 2421) PASS: lldb-api :: functionalities/postmortem/minidump-new/TestMiniDumpUUID.py (1807 of 2421) PASS: lldb-api :: functionalities/postmortem/netbsd-core/TestNetBSDCore.py (1808 of 2421) PASS: lldb-api :: macosx/thread_suspend/TestInternalThreadSuspension.py (1809 of 2421) PASS: lldb-unit :: UnwindAssembly/x86/./UnwindAssemblyx86Tests/Testx86AssemblyInspectionEngine.TestSimplex86_64Augmented (1810 of 2421) PASS: lldb-unit :: Utility/./UtilityTests/StringListTest.JoinEmpty (1811 of 2421) PASS: lldb-api :: functionalities/optimized_code/TestNoASanExceptionAfterEvalOP_piece.py (1812 of 2421) PASS: lldb-shell :: SymbolFile/symbol-binding.test (1813 of 2421) PASS: lldb-api :: lang/c/offsetof/TestOffsetof.py (1814 of 2421) PASS: lldb-api :: commands/watchpoints/multiple_threads/TestWatchpointMultipleThreads.py (1815 of 2421) PASS: lldb-shell :: ObjectFile/ELF/PT_LOAD-overlap-section.yaml (1816 of 2421) PASS: lldb-unit :: ObjectFile/ELF/./ObjectFileELFTests/ObjectFileELFTest.GetModuleSpecifications_EarlySectionHeaders (1817 of 2421) PASS: lldb-api :: python_api/type/TestTypeList.py (1818 of 2421) PASS: lldb-api :: lang/objc/hidden-ivars/TestHiddenIvars.py (1819 of 2421) PASS: lldb-unit :: Process/gdb-remote/./ProcessGdbRemoteTests/GDBRemoteClientBaseTest.InterruptNoResponse (1820 of 2421) PASS: lldb-unit :: Language/Highlighting/./HighlighterTests/HighlighterTest.ClangTrailingBackslashWithWhitespace (1821 of 2421) PASS: lldb-api :: python_api/frame/TestFrames.py (1822 of 2421) PASS: lldb-shell :: Register/Core/x86-64-freebsd-fp.test (1823 of 2421) UNSUPPORTED: lldb-shell :: Watchpoint/netbsd-nouserdbregs.test (1824 of 2421) PASS: lldb-api :: lang/objc/objc-property/TestObjCProperty.py (1825 of 2421) PASS: lldb-api :: tools/lldb-server/TestGdbRemoteExpeditedRegisters.py (1826 of 2421) PASS: lldb-api :: functionalities/data-formatter/language_category_updates/TestDataFormatterLanguageCategoryUpdates.py (1827 of 2421) PASS: lldb-api :: commands/apropos/basic/TestApropos.py (1828 of 2421) PASS: lldb-unit :: Process/Utility/./ProcessUtilityTests/ProcSMapTests/LinuxProcSMapsTestFixture.ParseSMapRegions/7 (1829 of 2421) PASS: lldb-unit :: Core/./LLDBCoreTests/DumpDataExtractorTest.MultiLine (1830 of 2421) PASS: lldb-unit :: Symbol/./SymbolTests/TestTypeSystemClang.TestFunctionTemplateConstruction (1831 of 2421) PASS: lldb-unit :: Symbol/./SymbolTests/TestClangASTImporter.CanImportInvalidType (1832 of 2421) PASS: lldb-shell :: ObjectFile/wasm/basic.yaml (1833 of 2421) PASS: lldb-unit :: Symbol/./SymbolTests/TestClangASTImporter.DeportDeclTagDecl (1834 of 2421) PASS: lldb-unit :: tools/lldb-server/tests/./LLDBServerTests/TestBase.DebugserverEnv (1835 of 2421) PASS: lldb-api :: lang/cpp/char1632_t/TestChar1632T.py (1836 of 2421) UNSUPPORTED: lldb-api :: commands/trace/TestTraceSave.py (1837 of 2421) PASS: lldb-shell :: ObjectFile/ELF/compressed-sections.yaml (1838 of 2421) PASS: lldb-api :: commands/expression/two-files/TestObjCTypeQueryFromOtherCompileUnit.py (1839 of 2421) PASS: lldb-unit :: Host/./HostTests/FileSystemTest.EnumerateDirectory (1840 of 2421) PASS: lldb-api :: lang/c/step-target/TestStepTarget.py (1841 of 2421) PASS: lldb-shell :: SymbolFile/DWARF/anon_class_w_and_wo_export_symbols.ll (1842 of 2421) PASS: lldb-api :: lang/cpp/typedef/TestCppTypedef.py (1843 of 2421) PASS: lldb-api :: functionalities/data-formatter/ostypeformatting/TestFormattersOsType.py (1844 of 2421) PASS: lldb-unit :: ScriptInterpreter/Python/./ScriptInterpreterPythonTests/PythonDataObjectsTest.TestObjectAttributes (1845 of 2421) PASS: lldb-unit :: ScriptInterpreter/Python/./ScriptInterpreterPythonTests/PythonDataObjectsTest.TestPythonIntegerToStr (1846 of 2421) PASS: lldb-unit :: Symbol/./SymbolTests/TestClangASTImporter.CompleteFwdDeclWithOtherOrigin (1847 of 2421) PASS: lldb-api :: python_api/target/TestTargetAPI.py (1848 of 2421) PASS: lldb-unit :: Language/Highlighting/./HighlighterTests/HighlighterTest.ClangTrailingBackslashBeforeNewline (1849 of 2421) PASS: lldb-shell :: SymbolFile/NativePDB/nested-types.cpp (1850 of 2421) PASS: lldb-unit :: SymbolFile/DWARF/./SymbolFileDWARFTests/SymbolFileDWARFTests.TestAbbrevInvalidNULLTag (1851 of 2421) UNSUPPORTED: lldb-api :: commands/trace/multiple-threads/TestTraceStartStopMultipleThreads.py (1852 of 2421) PASS: lldb-api :: lang/objc/objc-super/TestObjCSuper.py (1853 of 2421) PASS: lldb-shell :: SymbolFile/DWARF/x86/debug_line-relative_path.s (1854 of 2421) PASS: lldb-shell :: Reproducer/TestDSYM.test (1855 of 2421) UNSUPPORTED: lldb-shell :: Register/x86-64-ymm16-read.test (1856 of 2421) PASS: lldb-api :: lang/objc/objc-static-method/TestObjCStaticMethod.py (1857 of 2421) PASS: lldb-api :: commands/target/stop-hooks/TestStopHookScripted.py (1858 of 2421) PASS: lldb-api :: functionalities/thread/crash_during_step/TestCrashDuringStep.py (1859 of 2421) PASS: lldb-api :: python_api/findvalue_duplist/TestSBFrameFindValue.py (1860 of 2421) PASS: lldb-shell :: ObjectFile/wasm/stripped-debug-sections.yaml (1861 of 2421) PASS: lldb-unit :: Language/Highlighting/./HighlighterTests/HighlighterTest.Colons (1862 of 2421) UNSUPPORTED: lldb-shell :: SymbolFile/PDB/function-nested-block.test (1863 of 2421) PASS: lldb-unit :: UnwindAssembly/x86/./UnwindAssemblyx86Tests/Testx86AssemblyInspectionEngine.TestPushEBP (1864 of 2421) PASS: lldb-api :: functionalities/memory/tag/TestMemoryTag.py (1865 of 2421) PASS: lldb-unit :: Utility/./UtilityTests/OptionsWithRawTest.SingleWhitespaceInput (1866 of 2421) PASS: lldb-unit :: Utility/./UtilityTests/OptionsWithRawTest.TerminatedQuote (1867 of 2421) PASS: lldb-api :: commands/expression/expr-in-syscall/TestExpressionInSyscall.py (1868 of 2421) PASS: lldb-api :: commands/platform/process/list/TestProcessList.py (1869 of 2421) PASS: lldb-unit :: ScriptInterpreter/Python/./ScriptInterpreterPythonTests/PythonDataObjectsTest.TestPythonTupleToStructuredList (1870 of 2421) PASS: lldb-unit :: Language/Highlighting/./HighlighterTests/HighlighterTest.HighlighterSelectionType (1871 of 2421) PASS: lldb-api :: functionalities/data-formatter/data-formatter-stl/libcxx/bitset/TestDataFormatterLibcxxBitset.py (1872 of 2421) PASS: lldb-api :: tools/lldb-vscode/module/TestVSCode_module.py (1873 of 2421) PASS: lldb-unit :: Utility/./UtilityTests/RangeDataVector.FindEntryIndexesThatContain_Overlap (1874 of 2421) PASS: lldb-unit :: ScriptInterpreter/Python/./ScriptInterpreterPythonTests/PythonDataObjectsTest.TestPythonCallableInvoke (1875 of 2421) PASS: lldb-api :: commands/frame/diagnose/dereference-function-return/TestDiagnoseDereferenceFunctionReturn.py (1876 of 2421) PASS: lldb-shell :: Quit/TestQuitExitCode30.test (1877 of 2421) PASS: lldb-api :: commands/expression/import_builtin_fileid/TestImportBuiltinFileID.py (1878 of 2421) PASS: lldb-api :: functionalities/data-formatter/typedef_array/TestTypedefArray.py (1879 of 2421) PASS: lldb-api :: functionalities/source-map/TestTargetSourceMap.py (1880 of 2421) PASS: lldb-api :: commands/expression/dont_allow_jit/TestAllowJIT.py (1881 of 2421) PASS: lldb-unit :: Utility/./UtilityTests/LogChannelEnabledTest.LogGetLogThread (1882 of 2421) UNSUPPORTED: lldb-api :: functionalities/unwind/aarch64_unwind_pac/TestAArch64UnwindPAC.py (1883 of 2421) PASS: lldb-unit :: Utility/./UtilityTests/ArgsTest.AppendArguments (1884 of 2421) PASS: lldb-unit :: UnwindAssembly/x86/./UnwindAssemblyx86Tests/Testx86AssemblyInspectionEngine.TestPopRBP (1885 of 2421) PASS: lldb-unit :: Utility/./UtilityTests/StreamTeeTest.Flush (1886 of 2421) UNSUPPORTED: lldb-api :: commands/gui/basic/TestGuiBasic.py (1887 of 2421) PASS: lldb-unit :: UnwindAssembly/x86/./UnwindAssemblyx86Tests/Testx86AssemblyInspectionEngine.TestPopR14 (1888 of 2421) PASS: lldb-unit :: ScriptInterpreter/Python/./ScriptInterpreterPythonTests/PythonDataObjectsTest.TestExceptions (1889 of 2421) PASS: lldb-shell :: Commands/CommandScriptImmediateOutput/CommandScriptImmediateOutputConsole.test (1890 of 2421) PASS: lldb-api :: commands/expression/call-function/TestCallStdStringFunction.py (1891 of 2421) PASS: lldb-api :: lang/cpp/this_class_type_mixing/TestThisClassTypeMixing.py (1892 of 2421) PASS: lldb-shell :: SymbolFile/DWARF/x86/childless-compile-unit.s (1893 of 2421) PASS: lldb-unit :: Utility/./UtilityTests/UriParserTest.BadPort2 (1894 of 2421) PASS: lldb-api :: python_api/function_symbol/TestDisasmAPI.py (1895 of 2421) PASS: lldb-api :: functionalities/load_unload/TestLoadUnload.py (1896 of 2421) PASS: lldb-api :: lang/cpp/constructors/TestCppConstructors.py (1897 of 2421) PASS: lldb-api :: python_api/value/empty_class/TestValueAPIEmptyClass.py (1898 of 2421) PASS: lldb-api :: functionalities/abbreviation/TestAbbreviations.py (1899 of 2421) PASS: lldb-api :: functionalities/breakpoint/debugbreak/TestDebugBreak.py (1900 of 2421) PASS: lldb-api :: lang/cpp/auto/TestCPPAuto.py (1901 of 2421) PASS: lldb-unit :: Host/./HostTests/FileSystemTest.GetPermissions (1902 of 2421) UNSUPPORTED: lldb-shell :: BuildScript/toolchain-msvc.test (1903 of 2421) UNSUPPORTED: lldb-api :: functionalities/data-formatter/data-formatter-stl/libstdcpp/smart_ptr/TestDataFormatterStdSmartPtr.py (1904 of 2421) PASS: lldb-unit :: Utility/./UtilityTests/VMRange.Reset (1905 of 2421) PASS: lldb-shell :: Reproducer/TestDriverOptions.test (1906 of 2421) PASS: lldb-api :: lang/cpp/virtual-functions/TestCppVirtualFunctions.py (1907 of 2421) PASS: lldb-unit :: Interpreter/./InterpreterTests/CompletionTest.DirCompletionUsername (1908 of 2421) PASS: lldb-api :: lang/c/modules/TestCModules.py (1909 of 2421) PASS: lldb-api :: lang/c/complex_int/TestComplexInt.py (1910 of 2421) PASS: lldb-unit :: Utility/./UtilityTests/LogTest.Register (1911 of 2421) PASS: lldb-unit :: Process/minidump/./LLDBMinidumpTests/MinidumpParserTest.GetThreadsAndGetThreadContext (1912 of 2421) PASS: lldb-unit :: Host/./HostTests/HostInfoTestInitialization.InitTwice (1913 of 2421) PASS: lldb-unit :: Utility/./UtilityTests/StringExtractorTest.GetU32LittleEndian (1914 of 2421) PASS: lldb-unit :: Process/gdb-remote/./ProcessGdbRemoteTests/GDBRemoteClientBaseTest.SendContinueAndInterrupt2PacketBug (1915 of 2421) PASS: lldb-unit :: Symbol/./SymbolTests/TestTypeSystemClang.TestRecordHasFields (1916 of 2421) PASS: lldb-api :: lang/cpp/breakpoint_in_member_func_w_non_primitive_params/TestBreakpointInMemberFuncWNonPrimitiveParams.py (1917 of 2421) PASS: lldb-api :: python_api/get-value-32bit-int/TestGetValue32BitInt.py (1918 of 2421) PASS: lldb-unit :: Utility/./UtilityTests/SerializationRountripTest.SerializeDeserializeCString (1919 of 2421) PASS: lldb-api :: lang/cpp/class_types/TestClassTypesDisassembly.py (1920 of 2421) PASS: lldb-shell :: Register/Core/x86-32-freebsd-fp.test (1921 of 2421) PASS: lldb-api :: commands/expression/persistent_types/TestPersistentTypes.py (1922 of 2421) PASS: lldb-api :: functionalities/memory/read/TestMemoryRead.py (1923 of 2421) UNSUPPORTED: lldb-shell :: Subprocess/vfork-follow-child-wp.test (1924 of 2421) PASS: lldb-unit :: UnwindAssembly/x86/./UnwindAssemblyx86Tests/Testx86AssemblyInspectionEngine.Test32BitOnlyInstruction (1925 of 2421) PASS: lldb-shell :: Reproducer/Functionalities/TestStepping.test (1926 of 2421) PASS: lldb-unit :: Utility/./UtilityTests/StringListTest.JoinSingle (1927 of 2421) PASS: lldb-unit :: Utility/./UtilityTests/DataExtractorTest.GetDoubleUnaligned (1928 of 2421) PASS: lldb-unit :: Utility/./UtilityTests/TimerTest.CategoryTimes2 (1929 of 2421) PASS: lldb-api :: functionalities/breakpoint/address_breakpoints/TestAddressBreakpoints.py (1930 of 2421) PASS: lldb-shell :: ObjectFile/MachO/subsections.yaml (1931 of 2421) PASS: lldb-api :: lang/objc/objc-runtime-ivars/TestRuntimeIvars.py (1932 of 2421) PASS: lldb-unit :: Utility/./UtilityTests/RangeTest.LessThanInvalid (1933 of 2421) PASS: lldb-api :: commands/frame/select/TestFrameSelect.py (1934 of 2421) UNSUPPORTED: lldb-api :: commands/watchpoints/variable_out_of_scope/TestWatchedVarHitWhenInScope.py (1935 of 2421) PASS: lldb-api :: functionalities/gdb_remote_client/TestPlatformClient.py (1936 of 2421) UNSUPPORTED: lldb-shell :: Subprocess/fork-follow-parent-softbp.test (1937 of 2421) PASS: lldb-api :: lang/cpp/accelerator-table/TestCPPAccelerator.py (1938 of 2421) PASS: lldb-api :: commands/expression/inline-namespace/TestInlineNamespace.py (1939 of 2421) PASS: lldb-api :: functionalities/thread/concurrent_events/TestConcurrentCrashWithBreak.py (1940 of 2421) PASS: lldb-api :: commands/frame/var/TestFrameVar.py (1941 of 2421) PASS: lldb-shell :: Driver/TestCommands.test (1942 of 2421) UNSUPPORTED: lldb-shell :: Subprocess/clone-follow-parent-softbp.test (1943 of 2421) PASS: lldb-api :: functionalities/target_var/no_vars/TestTargetVarNoVars.py (1944 of 2421) PASS: lldb-api :: functionalities/signal/raise/TestRaise.py (1945 of 2421) PASS: lldb-api :: functionalities/process_group/TestChangeProcessGroup.py (1946 of 2421) PASS: lldb-unit :: Utility/./UtilityTests/StreamTeeTest.Write (1947 of 2421) PASS: lldb-api :: functionalities/thread/concurrent_events/TestConcurrentSignalNWatchNBreak.py (1948 of 2421) PASS: lldb-api :: macosx/version_zero/TestGetVersionZeroVersion.py (1949 of 2421) PASS: lldb-unit :: Language/Highlighting/./HighlighterTests/HighlighterTest.ClangBraces (1950 of 2421) PASS: lldb-api :: tools/lldb-server/signal-filtering/TestGdbRemote_QPassSignals.py (1951 of 2421) UNSUPPORTED: lldb-api :: tools/lldb-server/TestGdbRemotePlatformFile.py (1952 of 2421) PASS: lldb-api :: lang/cpp/virtual-overload/TestVirtualOverload.py (1953 of 2421) PASS: lldb-api :: commands/platform/sdk/TestPlatformSDK.py (1954 of 2421) PASS: lldb-unit :: Host/./HostTests/Host.GetEnvironment (1955 of 2421) PASS: lldb-unit :: Utility/./UtilityTests/RangeTest.Slide (1956 of 2421) PASS: lldb-unit :: Utility/./UtilityTests/StreamTeeTest.Constructor1Stream (1957 of 2421) PASS: lldb-shell :: ObjectFile/ELF/section-types-edgecases.yaml (1958 of 2421) PASS: lldb-unit :: Utility/./UtilityTests/ArgsTest.DoubleQuotedItem (1959 of 2421) PASS: lldb-unit :: Utility/./UtilityTests/StringExtractorTest.GetHexBytes_Partial (1960 of 2421) PASS: lldb-unit :: Utility/./UtilityTests/StreamTeeTest.Constructor2Streams (1961 of 2421) PASS: lldb-api :: lang/cpp/static_methods/TestCPPStaticMethods.py (1962 of 2421) PASS: lldb-api :: functionalities/postmortem/minidump-new/TestMiniDumpNew.py (1963 of 2421) PASS: lldb-api :: python_api/interpreter/TestRunCommandInterpreterAPI.py (1964 of 2421) PASS: lldb-api :: lang/objc/self/TestObjCSelf.py (1965 of 2421) PASS: lldb-shell :: ObjectFile/PECOFF/basic-info.yaml (1966 of 2421) PASS: lldb-unit :: Utility/./UtilityTests/RecordReplayTest.InstrumentedFoo (1967 of 2421) PASS: lldb-api :: python_api/value/TestValueAPI.py (1968 of 2421) PASS: lldb-api :: python_api/file_handle/TestFileHandle.py (1969 of 2421) PASS: lldb-api :: functionalities/gdb_remote_client/TestGDBRemoteLoad.py (1970 of 2421) PASS: lldb-unit :: Language/Highlighting/./HighlighterTests/HighlighterTest.ClangCursorPosBeforeOtherToken (1971 of 2421) PASS: lldb-shell :: SymbolFile/DWARF/x86/DW_AT_data_bit_offset-DW_OP_stack_value.s (1972 of 2421) PASS: lldb-unit :: Platform/./LLDBPlatformTests/PlatformDarwinTest.TestParseVersionBuildDir (1973 of 2421) PASS: lldb-api :: commands/expression/import-std-module/retry-with-std-module/TestRetryWithStdModule.py (1974 of 2421) PASS: lldb-unit :: UnwindAssembly/x86/./UnwindAssemblyx86Tests/Testx86AssemblyInspectionEngine.TestStackRealign8BitDisp_i386 (1975 of 2421) PASS: lldb-api :: lang/objc/bitfield_ivars/TestBitfieldIvars.py (1976 of 2421) PASS: lldb-api :: commands/process/attach/TestProcessAttach.py (1977 of 2421) PASS: lldb-shell :: Breakpoint/debug_rnglist_basic.test (1978 of 2421) PASS: lldb-api :: python_api/symbol-context/two-files/TestSymbolContextTwoFiles.py (1979 of 2421) UNSUPPORTED: lldb-api :: commands/register/register/intel_xtended_registers/TestMPXRegisters.py (1980 of 2421) PASS: lldb-unit :: Utility/./UtilityTests/SubsystemRAIITest.SubsystemWithErrorSuccess (1981 of 2421) PASS: lldb-api :: functionalities/gdb_remote_client/TestThreadSelectionBug.py (1982 of 2421) PASS: lldb-api :: commands/expression/test/TestExprs.py (1983 of 2421) PASS: lldb-unit :: tools/lldb-server/tests/./LLDBServerTests/TestBase.LaunchModePreservesEnvironment (1984 of 2421) PASS: lldb-unit :: Signals/./SignalsTests/UnixSignalsTest.GetInfo (1985 of 2421) UNSUPPORTED: lldb-shell :: Process/Windows/exception_access_violation.cpp (1986 of 2421) PASS: lldb-api :: functionalities/step_scripted/TestStepScripted.py (1987 of 2421) PASS: lldb-api :: functionalities/step-avoids-no-debug/TestStepNoDebug.py (1988 of 2421) UNSUPPORTED: lldb-shell :: SymbolFile/PDB/pointers.test (1989 of 2421) UNSUPPORTED: lldb-api :: macosx/lc-note/addrable-bits/TestAddrableBitsCorefile.py (1990 of 2421) PASS: lldb-api :: functionalities/completion/TestCompletion.py (1991 of 2421) PASS: lldb-unit :: Host/./HostTests/FileSystemTest.EmptyTest (1992 of 2421) PASS: lldb-shell :: ScriptInterpreter/Python/Crashlog/parser_text.test (1993 of 2421) PASS: lldb-unit :: Utility/./UtilityTests/StringListTest.JoinNonSpace (1994 of 2421) PASS: lldb-unit :: Utility/./UtilityTests/DataExtractorTest.UncommonAddressSize (1995 of 2421) PASS: lldb-api :: functionalities/breakpoint/breakpoint_by_file_colon_line/TestBreakpointByFileColonLine.py (1996 of 2421) PASS: lldb-api :: commands/expression/import-std-module/forward_list-dbg-info-content/TestDbgInfoContentForwardListFromStdModule.py (1997 of 2421) PASS: lldb-unit :: Utility/./UtilityTests/StringExtractorTest.GetHexU8_InvalidHex (1998 of 2421) PASS: lldb-shell :: ScriptInterpreter/Python/command_import.test (1999 of 2421) PASS: lldb-shell :: Register/Core/x86-64-netbsd-gp.test (2000 of 2421) PASS: lldb-unit :: Symbol/./SymbolTests/TestClangASTImporter.CopyDeclTagDecl (2001 of 2421) PASS: lldb-shell :: ObjectFile/ELF/PT_LOAD-overlap-PT_TLS.yaml (2002 of 2421) UNSUPPORTED: lldb-api :: tools/lldb-server/libraries-svr4/TestGdbRemoteLibrariesSvr4Support.py (2003 of 2421) PASS: lldb-shell :: Driver/TestConvenienceVariables.test (2004 of 2421) PASS: lldb-unit :: UnwindAssembly/x86/./UnwindAssemblyx86Tests/Testx86AssemblyInspectionEngine.TestSubRSP (2005 of 2421) PASS: lldb-unit :: SymbolFile/NativePDB/./SymbolFileNativePDBTests/PDBFPOProgramToDWARFExpressionTests.UnresolvedCyclicRegisterAssignmentReference (2006 of 2421) PASS: lldb-unit :: Language/Highlighting/./HighlighterTests/HighlighterTest.ClangPreserveNewLine (2007 of 2421) PASS: lldb-unit :: Expression/./ExpressionTests/ClangHostTest.ComputeClangResourceDirectory (2008 of 2421) PASS: lldb-api :: lang/cpp/class-template-type-parameter-pack/TestClassTemplateTypeParameterPack.py (2009 of 2421) PASS: lldb-api :: functionalities/memory-region/TestMemoryRegion.py (2010 of 2421) PASS: lldb-unit :: Utility/./UtilityTests/ScalarTest.SetValueFromData (2011 of 2421) PASS: lldb-unit :: Core/./LLDBCoreTests/MangledTest.ResultForValidName (2012 of 2421) PASS: lldb-api :: functionalities/scripted_process/TestScriptedProcess.py (2013 of 2421) PASS: lldb-api :: commands/watchpoints/watchpoint_commands/command/TestWatchpointCommandPython.py (2014 of 2421) UNSUPPORTED: lldb-api :: tools/lldb-server/TestGdbRemoteCompletion.py (2015 of 2421) PASS: lldb-api :: functionalities/postmortem/elf-core/TestLinuxCore.py (2016 of 2421) UNSUPPORTED: lldb-api :: commands/trace/TestTraceLoad.py (2017 of 2421) PASS: lldb-api :: functionalities/tail_call_frames/ambiguous_tail_call_seq2/TestAmbiguousTailCallSeq2.py (2018 of 2421) UNSUPPORTED: lldb-shell :: SymbolFile/NativePDB/typedefs.cpp (2019 of 2421) PASS: lldb-api :: commands/expression/import-std-module/vector-dbg-info-content/TestDbgInfoContentVectorFromStdModule.py (2020 of 2421) PASS: lldb-api :: macosx/queues/TestQueues.py (2021 of 2421) PASS: lldb-shell :: SymbolFile/DWARF/x86/inline-function-address.ll (2022 of 2421) PASS: lldb-api :: functionalities/thread/concurrent_events/TestConcurrentBreakpointsDelayedBreakpointOneWatchpoint.py (2023 of 2421) PASS: lldb-api :: functionalities/data-formatter/user-format-vs-summary/TestUserFormatVsSummary.py (2024 of 2421) PASS: lldb-unit :: Symbol/./SymbolTests/LineEntryTest.GetAllExactLineColumnMatches (2025 of 2421) PASS: lldb-unit :: Utility/./UtilityTests/DataExtractorTest.GetSLEB128_bit63 (2026 of 2421) PASS: lldb-api :: commands/expression/import-std-module/queue/TestQueueFromStdModule.py (2027 of 2421) PASS: lldb-api :: lang/cpp/stl/TestSTL.py (2028 of 2421) PASS: lldb-unit :: Utility/./UtilityTests/StringListTest.JoinThree (2029 of 2421) PASS: lldb-api :: functionalities/multiword-commands/TestMultiWordCommands.py (2030 of 2421) PASS: lldb-shell :: ObjectFile/ELF/duplicate-section.yaml (2031 of 2421) PASS: lldb-api :: lang/cpp/function_refs/TestFunctionRefs.py (2032 of 2421) PASS: lldb-shell :: Process/UnsupportedLanguage.test (2033 of 2421) PASS: lldb-unit :: Utility/./UtilityTests/FileSpecTest.Yaml (2034 of 2421) PASS: lldb-api :: lang/objc/foundation/TestObjCMethodsNSError.py (2035 of 2421) PASS: lldb-api :: macosx/safe-to-func-call/TestSafeFuncCalls.py (2036 of 2421) PASS: lldb-unit :: Utility/./UtilityTests/NameMatchesTest.Contains (2037 of 2421) PASS: lldb-unit :: Utility/./UtilityTests/StringExtractorTest.DecodeHexU8_Exact (2038 of 2421) UNSUPPORTED: lldb-shell :: Subprocess/vfork-follow-parent-softbp.test (2039 of 2421) PASS: lldb-unit :: Process/minidump/./LLDBMinidumpTests/MinidumpParserTest.GetExceptionStream (2040 of 2421) PASS: lldb-api :: commands/target/create-deps/TestTargetCreateDeps.py (2041 of 2421) PASS: lldb-unit :: Process/Utility/./ProcessUtilityTests/ProcMapTests/LinuxProcMapsTestFixture.ParseMapRegions/8 (2042 of 2421) PASS: lldb-unit :: Process/Utility/./ProcessUtilityTests/MemoryTagManagerAArch64MTETest.PackTags (2043 of 2421) PASS: lldb-shell :: ObjectFile/ELF/section-addresses.yaml (2044 of 2421) PASS: lldb-unit :: debugserver/./debugserverTests/RNBSocket.LoopBackListenIPv4 (2045 of 2421) PASS: lldb-api :: lang/objcxx/hide-runtime-values/TestObjCXXHideRuntimeValues.py (2046 of 2421) PASS: lldb-api :: tools/lldb-server/inferior-crash/TestGdbRemoteSegFault.py (2047 of 2421) PASS: lldb-api :: sanity/TestSettingSkipping.py (2048 of 2421) PASS: lldb-api :: commands/expression/argument_passing_restrictions/TestArgumentPassingRestrictions.py (2049 of 2421) PASS: lldb-unit :: Utility/./UtilityTests/StreamTeeTest.DefaultConstructor (2050 of 2421) UNSUPPORTED: lldb-api :: benchmarks/continue/TestBenchmarkContinue.py (2051 of 2421) PASS: lldb-api :: lang/cpp/namespace/TestNamespace.py (2052 of 2421) PASS: lldb-shell :: Register/x86-64-gp-read.test (2053 of 2421) PASS: lldb-unit :: Host/./HostTests/SocketAddressTest.GetAddressInfo (2054 of 2421) PASS: lldb-api :: lang/cpp/namespace_definitions/TestNamespaceDefinitions.py (2055 of 2421) PASS: lldb-api :: functionalities/thread/num_threads/TestNumThreads.py (2056 of 2421) PASS: lldb-unit :: Utility/./UtilityTests/XcodeSDKTest.GetCanonicalNameAndConstruct (2057 of 2421) PASS: lldb-api :: functionalities/breakpoint/global_constructor/TestBreakpointInGlobalConstructor.py (2058 of 2421) PASS: lldb-unit :: Utility/./UtilityTests/ArgsTest.TestTrailingBackslash (2059 of 2421) PASS: lldb-api :: macosx/order/TestOrderFile.py (2060 of 2421) PASS: lldb-unit :: Utility/./UtilityTests/Flags.Clear (2061 of 2421) PASS: lldb-unit :: Breakpoint/./LLDBBreakpointTests/BreakpointIDTest.StringIsBreakpointName (2062 of 2421) PASS: lldb-api :: functionalities/data-formatter/data-formatter-globals/TestDataFormatterGlobals.py (2063 of 2421) PASS: lldb-unit :: ScriptInterpreter/Python/./ScriptInterpreterPythonTests/PythonDataObjectsTest.TestPythonInteger (2064 of 2421) PASS: lldb-shell :: SymbolFile/NativePDB/ast-types.cpp (2065 of 2421) PASS: lldb-shell :: Register/Core/x86-32-netbsd-multithread.test (2066 of 2421) PASS: lldb-unit :: Symbol/./SymbolTests/TestCreateClassTemplateDecl.FindExistingTemplatesWithParameterPack (2067 of 2421) PASS: lldb-api :: lang/cpp/class-template-parameter-pack/TestClassTemplateParameterPack.py (2068 of 2421) PASS: lldb-unit :: Symbol/./SymbolTests/TestTypeSystemClang.AddMethodToObjCObjectType (2069 of 2421) PASS: lldb-unit :: UnwindAssembly/x86/./UnwindAssemblyx86Tests/Testx86AssemblyInspectionEngine.TestPushEBX (2070 of 2421) PASS: lldb-api :: commands/frame/diagnose/virtual-method-call/TestDiagnoseDereferenceVirtualMethodCall.py (2071 of 2421) PASS: lldb-api :: python_api/signals/TestSignalsAPI.py (2072 of 2421) PASS: lldb-api :: functionalities/data-formatter/data-formatter-objc/TestDataFormatterObjCExpr.py (2073 of 2421) PASS: lldb-api :: commands/expression/import-std-module/module-build-errors/TestStdModuleBuildErrors.py (2074 of 2421) PASS: lldb-api :: lang/cpp/nsimport/TestCppNsImport.py (2075 of 2421) PASS: lldb-unit :: Utility/./UtilityTests/StringListTest.InsertStringAtIndexStdString (2076 of 2421) PASS: lldb-api :: functionalities/gdb_remote_client/TestThreadInfoTrailingComma.py (2077 of 2421) PASS: lldb-api :: commands/expression/namespace_local_var_same_name_obj_c/TestNamespaceLocalVarSameNameObjC.py (2078 of 2421) PASS: lldb-unit :: Process/Utility/./ProcessUtilityTests/ProcSMapTests/LinuxProcSMapsTestFixture.ParseSMapRegions/0 (2079 of 2421) UNSUPPORTED: lldb-shell :: ScriptInterpreter/Lua/convenience_variables.test (2080 of 2421) PASS: lldb-unit :: Platform/./LLDBPlatformTests/PlatformDarwinTest.FindComponentInPath (2081 of 2421) PASS: lldb-api :: tools/lldb-vscode/console/TestVSCode_redirection_to_console.py (2082 of 2421) PASS: lldb-unit :: Utility/./UtilityTests/FileSpecTest.GuessPathStyle (2083 of 2421) PASS: lldb-api :: functionalities/thread/concurrent_events/TestConcurrentTwoBreakpointsOneDelaySignal.py (2084 of 2421) UNSUPPORTED: lldb-shell :: SymbolFile/PDB/variables-locations.test (2085 of 2421) FAIL: lldb-unit :: Host/./HostTests/TerminalTest.SaveRestore (2086 of 2421) ******************** TEST 'lldb-unit :: Host/./HostTests/TerminalTest.SaveRestore' FAILED ******************** Script: -- /Users/buildslave/jenkins/workspace/lldb-cmake-sanitized/lldb-build/tools/lldb/unittests/Host/./HostTests --gtest_filter=TerminalTest.SaveRestore -- Note: Google Test filter = TerminalTest.SaveRestore [==========] Running 1 test from 1 test suite. [----------] Global test environment set-up. [----------] 1 test from TerminalTest [ RUN ] TerminalTest.SaveRestore /Users/buildslave/jenkins/workspace/lldb-cmake-sanitized/llvm-project/lldb/unittests/Host/posix/TerminalTest.cpp:101: Failure Expected equality of these values: tcgetattr(m_pty.GetPrimaryFileDescriptor(), &orig_terminfo) Which is: -1 0 [ FAILED ] TerminalTest.SaveRestore (0 ms) [----------] 1 test from TerminalTest (0 ms total)

Hide Details

[----------] Global test environment tear-down [==========] 1 test from 1 test suite ran. (0 ms total) [ PASSED ] 0 tests. [ FAILED ] 1 test, listed below: [ FAILED ] TerminalTest.SaveRestore

Hide Details

1 FAILED TEST

Hide Details

******************** PASS: lldb-unit :: Utility/./UtilityTests/UriParserTest.BracketedHostname (2087 of 2421) PASS: lldb-api :: assert_messages_test/TestAssertMessages.py (2088 of 2421) PASS: lldb-api :: functionalities/thread/concurrent_events/TestConcurrentTwoBreakpointsOneSignal.py (2089 of 2421) PASS: lldb-unit :: Utility/./UtilityTests/ProcessInstanceInfo.Dump (2090 of 2421) PASS: lldb-api :: lang/cpp/template/TestTemplateArgs.py (2091 of 2421) PASS: lldb-api :: macosx/debugserver-exit-code/TestDebugServerExitCode.py (2092 of 2421) PASS: lldb-shell :: ObjectFile/ELF/build-id-case.yaml (2093 of 2421) PASS: lldb-api :: macosx/duplicate-archive-members/TestDuplicateMembers.py (2094 of 2421) PASS: lldb-unit :: Symbol/./SymbolTests/Type.GetTypeScopeAndBasename (2095 of 2421) PASS: lldb-unit :: Process/gdb-remote/./ProcessGdbRemoteTests/GDBRemoteCommunicationClientTest.GetMemoryRegionInfoInvalidResponse (2096 of 2421) PASS: lldb-unit :: Utility/./UtilityTests/SubsystemRAIITest.SubsystemWithErrorFailure (2097 of 2421) PASS: lldb-unit :: Host/./HostTests/SocketTests/SocketTest.TCPListen0GetPort/ipv4 (2098 of 2421) PASS: lldb-unit :: Thread/./ThreadTests/ThreadTest.SetStopInfo (2099 of 2421) PASS: lldb-unit :: Utility/./UtilityTests/StringListTest.InsertStringAtIndexOutOfBounds (2100 of 2421) PASS: lldb-unit :: Utility/./UtilityTests/ArchSpecTest.TestParseMachCPUDashSubtypeTripleExtra (2101 of 2421) PASS: lldb-unit :: Utility/./UtilityTests/RangeDataVector.FindEntryThatContains_Overlap (2102 of 2421) UNSUPPORTED: lldb-api :: commands/watchpoints/hello_watchlocation/TestWatchLocation.py (2103 of 2421) PASS: lldb-api :: functionalities/data-formatter/compactvectors/TestCompactVectors.py (2104 of 2421) PASS: lldb-api :: lang/cpp/stl/TestStdCXXDisassembly.py (2105 of 2421) PASS: lldb-unit :: Utility/./UtilityTests/UriParserTest.SchemeHostSeparator2 (2106 of 2421) PASS: lldb-unit :: Utility/./UtilityTests/FileSpecTest.FormatFileSpec (2107 of 2421) PASS: lldb-api :: lang/cpp/extern_c/TestExternCSymbols.py (2108 of 2421) PASS: lldb-unit :: Symbol/./SymbolTests/SymbolsTest.TerminateLocateExecutableSymbolFileForUnknownExecutableAndUnknownSymbolFile (2109 of 2421) PASS: lldb-shell :: SymbolFile/DWARF/x86/debug_ranges_and_rnglists.test (2110 of 2421) PASS: lldb-unit :: Utility/./UtilityTests/UUIDTest.Validity (2111 of 2421) PASS: lldb-api :: commands/expression/import-std-module/forward_decl_from_module/TestForwardDeclFromStdModule.py (2112 of 2421) PASS: lldb-unit :: Core/./LLDBCoreTests/UniqueCStringMap.NoDefaultConstructor (2113 of 2421) PASS: lldb-api :: macosx/universal/TestUniversal.py (2114 of 2421) PASS: lldb-shell :: Settings/TestLineMarkerColor.test (2115 of 2421) PASS: lldb-unit :: Host/./HostTests/SocketTests/SocketTest.TCPListen0ConnectAccept/ipv6 (2116 of 2421) PASS: lldb-unit :: Symbol/./SymbolTests/TestClangASTImporter.MetadataPropagation (2117 of 2421) PASS: lldb-unit :: Utility/./UtilityTests/DeserializerTest.HasData (2118 of 2421) PASS: lldb-unit :: Utility/./UtilityTests/StringLexerTest.Next (2119 of 2421) PASS: lldb-unit :: Process/minidump/./LLDBMinidumpTests/MinidumpParserTest.InvalidMinidump (2120 of 2421) PASS: lldb-unit :: Utility/./UtilityTests/StringListTest.ShiftStdString (2121 of 2421) PASS: lldb-api :: lang/c/shared_lib/TestSharedLib.py (2122 of 2421) PASS: lldb-shell :: Register/Core/x86-64-freebsd-gp.test (2123 of 2421) PASS: lldb-api :: functionalities/data-formatter/data-formatter-stl/libcxx/vector/TestDataFormatterLibcxxVector.py (2124 of 2421) PASS: lldb-unit :: Utility/./UtilityTests/StreamTest.PutHex16ByteOrderBig (2125 of 2421) PASS: lldb-api :: functionalities/gdb_remote_client/TestRemoteRegNums.py (2126 of 2421) PASS: lldb-shell :: Unwind/trap_frame_sym_ctx.test (2127 of 2421) PASS: lldb-unit :: Utility/./UtilityTests/FileSpecTest.Match (2128 of 2421) PASS: lldb-api :: functionalities/thread_plan/TestThreadPlanCommands.py (2129 of 2421) PASS: lldb-shell :: SymbolFile/DWARF/x86/split-dwarf-multiple-cu.ll (2130 of 2421) PASS: lldb-shell :: SymbolFile/NativePDB/function-types-classes.cpp (2131 of 2421) PASS: lldb-api :: lang/objc/modules-app-update/TestClangModulesAppUpdate.py (2132 of 2421) PASS: lldb-api :: commands/command/invalid-args/TestInvalidArgsCommand.py (2133 of 2421) PASS: lldb-unit :: UnwindAssembly/x86/./UnwindAssemblyx86Tests/Testx86AssemblyInspectionEngine.TestPushRBX (2134 of 2421) PASS: lldb-unit :: Expression/./ExpressionTests/DiagnosticManagerTest.GetStringPreserveOrder (2135 of 2421) UNSUPPORTED: lldb-api :: functionalities/data-formatter/data-formatter-stl/libstdcpp/unique_ptr/TestDataFormatterStdUniquePtr.py (2136 of 2421) PASS: lldb-api :: functionalities/data-formatter/cstring-utf8-summary/TestCstringUnicode.py (2137 of 2421) UNSUPPORTED: lldb-shell :: ScriptInterpreter/Lua/quit.test (2138 of 2421) PASS: lldb-shell :: Breakpoint/breakpoint-command.test (2139 of 2421) PASS: lldb-api :: commands/expression/import-std-module/weak_ptr/TestWeakPtrFromStdModule.py (2140 of 2421) PASS: lldb-shell :: Expr/TestIRMemoryMap.test (2141 of 2421) PASS: lldb-api :: functionalities/load_using_paths/TestLoadUsingPaths.py (2142 of 2421) PASS: lldb-unit :: Process/minidump/./LLDBMinidumpTests/RegisterContextMinidump.CheckRegisterContextMinidump_ARM (2143 of 2421) PASS: lldb-unit :: Utility/./UtilityTests/OptionsWithRawTest.ArgsButNoLeadingDash (2144 of 2421) PASS: lldb-api :: commands/expression/import-std-module/sysroot/TestStdModuleSysroot.py (2145 of 2421) PASS: lldb-api :: functionalities/gdb_remote_client/TestFork.py (2146 of 2421) PASS: lldb-unit :: SymbolFile/DWARF/./SymbolFileDWARFTests/SymbolFileDWARFTests.TestAbbrevNullAttrValidForm (2147 of 2421) PASS: lldb-api :: functionalities/thread/step_out/TestThreadStepOut.py (2148 of 2421) PASS: lldb-unit :: Utility/./UtilityTests/StringListTest.CopyList (2149 of 2421) PASS: lldb-api :: functionalities/gdb_remote_client/TestGDBRemoteClient.py (2150 of 2421) PASS: lldb-api :: functionalities/gdb_remote_client/TestJLink6Armv7RegisterDefinition.py (2151 of 2421) PASS: lldb-unit :: Target/./TargetTests/ModuleCacheTest.GetAndPut (2152 of 2421) PASS: lldb-unit :: Utility/./UtilityTests/RangeVector.CombineConsecutiveRanges (2153 of 2421) PASS: lldb-unit :: Utility/./UtilityTests/ScalarTest.Promotion (2154 of 2421) PASS: lldb-api :: commands/expression/rdar44436068/Test128BitsInteger.py (2155 of 2421) PASS: lldb-api :: tools/lldb-server/TestGdbRemoteHostInfo.py (2156 of 2421) PASS: lldb-unit :: Interpreter/./InterpreterTests/OptionValueString.DeepCopy (2157 of 2421) PASS: lldb-shell :: Driver/TestRepl.test (2158 of 2421) PASS: lldb-unit :: Utility/./UtilityTests/StreamTest.AddressRangeSize (2159 of 2421) PASS: lldb-api :: tools/lldb-vscode/attach/TestVSCode_attach.py (2160 of 2421) PASS: lldb-api :: functionalities/thread/concurrent_events/TestConcurrentTwoWatchpointsOneSignal.py (2161 of 2421) PASS: lldb-unit :: Utility/./UtilityTests/CompletionRequest.FakeLastArg (2162 of 2421) PASS: lldb-unit :: Expression/./ExpressionTests/CppModuleConfigurationTest.MissingUsrInclude (2163 of 2421) PASS: lldb-api :: python_api/lldbutil/iter/TestRegistersIterator.py (2164 of 2421) UNSUPPORTED: lldb-api :: tools/lldb-server/TestGdbRemoteModuleInfo.py (2165 of 2421) PASS: lldb-unit :: Utility/./UtilityTests/FileSpecTest.GetPath (2166 of 2421) PASS: lldb-api :: functionalities/data-formatter/nsarraysynth/TestNSArraySynthetic.py (2167 of 2421) PASS: lldb-api :: commands/breakpoint/set/func-regex/TestBreakpointRegexError.py (2168 of 2421) PASS: lldb-api :: tools/lldb-vscode/step/TestVSCode_step.py (2169 of 2421) PASS: lldb-unit :: Utility/./UtilityTests/XcodeSDKTest.FindXcodeContentsDirectoryInPath (2170 of 2421) PASS: lldb-unit :: UnwindAssembly/x86/./UnwindAssemblyx86Tests/Testx86AssemblyInspectionEngine.TestSimple64bitFrameFunction (2171 of 2421) PASS: lldb-api :: lang/cpp/gmodules/TestWithModuleDebugging.py (2172 of 2421) PASS: lldb-unit :: Host/./HostTests/SocketTests/SocketTest.DomainListenConnectAccept/ipv4 (2173 of 2421) PASS: lldb-unit :: Host/./HostTests/File.GetWaitableHandleFileno (2174 of 2421) PASS: lldb-unit :: Utility/./UtilityTests/StreamTest.SetIndentLevel (2175 of 2421) PASS: lldb-api :: functionalities/thread/concurrent_events/TestConcurrentManyCrash.py (2176 of 2421) UNSUPPORTED: lldb-api :: functionalities/unwind/standard/TestStandardUnwind.py (2177 of 2421) PASS: lldb-unit :: Host/./HostTests/PipeTest.OpenAsReader (2178 of 2421) PASS: lldb-unit :: Utility/./UtilityTests/DataExtractorTest.PeekData (2179 of 2421) PASS: lldb-api :: lang/objc/print-obj/TestPrintObj.py (2180 of 2421) UNSUPPORTED: lldb-api :: tools/lldb-server/TestGdbRemoteSaveCore.py (2181 of 2421) PASS: lldb-api :: commands/expression/import-std-module/iterator/TestIteratorFromStdModule.py (2182 of 2421) PASS: lldb-shell :: Driver/TestUseColor.test (2183 of 2421) PASS: lldb-api :: commands/expression/fixits/TestFixIts.py (2184 of 2421) PASS: lldb-api :: functionalities/data-formatter/data-formatter-caching/TestDataFormatterCaching.py (2185 of 2421) PASS: lldb-api :: commands/expression/call-function/TestCallStopAndContinue.py (2186 of 2421) PASS: lldb-unit :: Utility/./UtilityTests/BinaryStreamTest.PutSLEB128FourBytes (2187 of 2421) PASS: lldb-unit :: Process/Utility/./ProcessUtilityTests/RegisterContext_x86Test.AbridgedToFullTagWord (2188 of 2421) PASS: lldb-unit :: Symbol/./SymbolTests/TestTypeSystemClang.TestOwningModule (2189 of 2421) PASS: lldb-unit :: Utility/./UtilityTests/RangeTest.Equal (2190 of 2421) PASS: lldb-unit :: Language/Highlighting/./HighlighterTests/HighlighterTest.ClangComments (2191 of 2421) UNSUPPORTED: lldb-shell :: SymbolFile/PDB/typedefs.test (2192 of 2421) PASS: lldb-api :: tools/lldb-vscode/runInTerminal/TestVSCode_runInTerminal.py (2193 of 2421) PASS: lldb-api :: commands/command/script/import/rdar-12586188/TestRdar12586188.py (2194 of 2421) PASS: lldb-unit :: Symbol/./SymbolTests/TestTypeSystemClang.TestGetBasicTypeFromEnum (2195 of 2421) PASS: lldb-api :: functionalities/dead-strip/TestDeadStrip.py (2196 of 2421) PASS: lldb-api :: lang/cpp/operators/TestCppOperators.py (2197 of 2421) PASS: lldb-api :: python_api/process/TestProcessAPI.py (2198 of 2421) PASS: lldb-api :: python_api/module_section/TestModuleAndSection.py (2199 of 2421) PASS: lldb-api :: functionalities/data-formatter/data-formatter-stl/libcxx/unordered/TestDataFormatterUnordered.py (2200 of 2421) PASS: lldb-api :: types/TestCharTypeExpr.py (2201 of 2421) PASS: lldb-api :: functionalities/unwind/zeroth_frame/TestZerothFrame.py (2202 of 2421) PASS: lldb-unit :: Host/./HostTests/NativeProcessProtocolTest.SetBreakpointFailRead (2203 of 2421) UNSUPPORTED: lldb-shell :: SymbolFile/PDB/calling-conventions.test (2204 of 2421) PASS: lldb-api :: lang/c/vla/TestVLA.py (2205 of 2421) UNSUPPORTED: lldb-api :: functionalities/asan/TestReportData.py (2206 of 2421) PASS: lldb-api :: functionalities/testid/TestTestId.py (2207 of 2421) PASS: lldb-unit :: Symbol/./SymbolTests/TestTypeSystemClang.TemplateArguments (2208 of 2421) PASS: lldb-unit :: Target/./TargetTests/RemoteAwarePlatformTest.TestResolveExecutabelOnClientByPlatform (2209 of 2421) PASS: lldb-shell :: ObjectFile/ELF/PT_LOAD-empty.yaml (2210 of 2421) PASS: lldb-unit :: Core/./LLDBCoreTests/SourceFileCache.FindSourceFileNotFound (2211 of 2421) PASS: lldb-unit :: Process/minidump/./LLDBMinidumpTests/MinidumpParserTest.GetArchitecture (2212 of 2421) PASS: lldb-api :: lang/cpp/namespace/TestNamespaceLookup.py (2213 of 2421) PASS: lldb-api :: lang/cpp/breakpoint-commands/TestCPPBreakpointCommands.py (2214 of 2421) PASS: lldb-unit :: Utility/./UtilityTests/NameMatchesTest.Equals (2215 of 2421) PASS: lldb-shell :: SymbolFile/DWARF/x86/dwo-type-in-main-file.s (2216 of 2421) UNSUPPORTED: lldb-shell :: Register/x86-gp-read.test (2217 of 2421) PASS: lldb-shell :: Register/Core/x86-64-netbsd-addr.test (2218 of 2421) PASS: lldb-api :: commands/expression/import-std-module/unique_ptr/TestUniquePtrFromStdModule.py (2219 of 2421) PASS: lldb-api :: commands/expression/unwind_expression/TestUnwindExpression.py (2220 of 2421) PASS: lldb-unit :: ObjectFile/PECOFF/./ObjectFilePECOFFTests/PECallFrameInfoTest.Basic_eh (2221 of 2421) PASS: lldb-shell :: SymbolFile/DWARF/x86/dwarf5-debug_line.s (2222 of 2421) PASS: lldb-unit :: Host/./HostTests/NativeProcessProtocolTest.ReadCStringFromMemory (2223 of 2421) PASS: lldb-unit :: Core/./LLDBCoreTests/DumpDataExtractorTest.ItemByteSizeErrors (2224 of 2421) PASS: lldb-api :: lang/objc/modules-cache/TestClangModulesCache.py (2225 of 2421) PASS: lldb-api :: commands/expression/dollar-in-variable/TestDollarInVariable.py (2226 of 2421) PASS: lldb-api :: lang/cpp/elaborated-types/TestElaboratedTypes.py (2227 of 2421) PASS: lldb-shell :: SymbolFile/Breakpad/symtab-macho.test (2228 of 2421) PASS: lldb-shell :: Reproducer/TestMultipleTargets.test (2229 of 2421) PASS: lldb-shell :: Driver/TestNoUseColor.test (2230 of 2421) PASS: lldb-api :: functionalities/thread/concurrent_events/TestConcurrentBreakpointDelayBreakpointOneSignal.py (2231 of 2421) PASS: lldb-shell :: SymbolFile/DWARF/x86/find-method-local-struct.cpp (2232 of 2421) PASS: lldb-unit :: UnwindAssembly/x86/./UnwindAssemblyx86Tests/Testx86AssemblyInspectionEngine.TestPushR13 (2233 of 2421) UNSUPPORTED: lldb-api :: commands/register/register/aarch64_sve_registers/rw_access_static_config/TestSVERegisters.py (2234 of 2421) PASS: lldb-unit :: Utility/./UtilityTests/StringListTest.AppendListCStringArrayEmpty (2235 of 2421) PASS: lldb-unit :: Utility/./UtilityTests/VMRange.Comparison (2236 of 2421) PASS: lldb-api :: commands/reproducer/invalid-args/TestInvalidArgsReproducer.py (2237 of 2421) PASS: lldb-unit :: Utility/./UtilityTests/StreamTest.PutHex8 (2238 of 2421) PASS: lldb-api :: tools/lldb-vscode/launch/TestVSCode_launch.py (2239 of 2421) PASS: lldb-unit :: Utility/./UtilityTests/RecordReplayTest.InstrumentedBarRef (2240 of 2421) PASS: lldb-shell :: SymbolFile/DWARF/x86/dwarf5-implicit-const.s (2241 of 2421) PASS: lldb-shell :: Commands/command-regex-unalias.test (2242 of 2421) PASS: lldb-unit :: Utility/./UtilityTests/GeneratorTest.Get (2243 of 2421) UNSUPPORTED: lldb-api :: linux/aarch64/mte_memory_region/TestAArch64LinuxMTEMemoryRegion.py (2244 of 2421) PASS: lldb-shell :: SymbolFile/Breakpad/line-table-mixed-path-styles.test (2245 of 2421) PASS: lldb-api :: types/TestLongTypesExpr.py (2246 of 2421) PASS: lldb-unit :: Host/./HostTests/SocketTests/SocketTest.TCPGetAddress/ipv6 (2247 of 2421) PASS: lldb-api :: lang/cpp/char8_t/TestCxxChar8_t.py (2248 of 2421) PASS: lldb-unit :: Process/minidump/./LLDBMinidumpTests/MinidumpParserTest.GetMemoryRegionInfoLinuxMapsError (2249 of 2421) PASS: lldb-unit :: UnwindAssembly/x86/./UnwindAssemblyx86Tests/Testx86AssemblyInspectionEngine.TestPushR14 (2250 of 2421) UNSUPPORTED: lldb-api :: commands/trace/TestTraceStartStop.py (2251 of 2421) PASS: lldb-shell :: BuildScript/toolchain-clang.test (2252 of 2421) PASS: lldb-unit :: SymbolFile/DWARF/./SymbolFileDWARFTests/DWARFUnitTest.MissingSentinel (2253 of 2421) PASS: lldb-api :: commands/expression/import-std-module/deque-dbg-info-content/TestDbgInfoContentDequeFromStdModule.py (2254 of 2421) PASS: lldb-unit :: Utility/./UtilityTests/ScalarTest.ExtractBitfield (2255 of 2421) PASS: lldb-api :: functionalities/data-formatter/data-formatter-objc/TestDataFormatterObjCCF.py (2256 of 2421) PASS: lldb-api :: python_api/sbenvironment/TestSBEnvironment.py (2257 of 2421) PASS: lldb-unit :: Utility/./UtilityTests/StringExtractorGDBRemoteTest.GetPidTidMultipleValues (2258 of 2421) PASS: lldb-api :: types/TestCharType.py (2259 of 2421) PASS: lldb-unit :: SymbolFile/NativePDB/./SymbolFileNativePDBTests/PDBFPOProgramToDWARFExpressionTests.InvalidAssignmentSingle (2260 of 2421) UNSUPPORTED: lldb-api :: iohandler/unicode/TestUnicode.py (2261 of 2421) PASS: lldb-unit :: Utility/./UtilityTests/SubsystemRAIITest.NormalSubsystem (2262 of 2421) PASS: lldb-shell :: Reproducer/Functionalities/TestDataFormatter.test (2263 of 2421) PASS: lldb-unit :: Utility/./UtilityTests/UriParserTest.BadPort (2264 of 2421) PASS: lldb-unit :: Utility/./UtilityTests/ProcessInstanceInfoMatch.Name (2265 of 2421) PASS: lldb-api :: commands/watchpoints/watchpoint_count/TestWatchpointCount.py (2266 of 2421) PASS: lldb-api :: commands/target/auto-install-main-executable/TestAutoInstallMainExecutable.py (2267 of 2421) PASS: lldb-api :: commands/expression/import-std-module/conflicts/TestStdModuleWithConflicts.py (2268 of 2421) UNSUPPORTED: lldb-api :: lang/objc/rdar-12408181/TestRdar12408181.py (2269 of 2421) PASS: lldb-api :: functionalities/find-line-entry/TestFindLineEntry.py (2270 of 2421) PASS: lldb-shell :: ScriptInterpreter/Python/eof.test (2271 of 2421) PASS: lldb-unit :: Utility/./UtilityTests/RangeTest.Clear (2272 of 2421) PASS: lldb-unit :: Utility/./UtilityTests/XcodeSDKTest.MergeTest (2273 of 2421) PASS: lldb-unit :: Utility/./UtilityTests/StreamTest.PutHex32ByteOrderLittle (2274 of 2421) PASS: lldb-shell :: ObjectFile/Breakpad/uuid-matching-mac.test (2275 of 2421) PASS: lldb-shell :: Register/Core/x86-64-linux-fp.test (2276 of 2421) PASS: lldb-api :: tools/lldb-vscode/breakpoint/TestVSCode_setExceptionBreakpoints.py (2277 of 2421) PASS: lldb-unit :: Core/./LLDBCoreTests/FormatEntityTest.DefinitionConstructionNameAndType (2278 of 2421) UNSUPPORTED: lldb-shell :: SymbolFile/target-symbols-add-unwind.test (2279 of 2421) PASS: lldb-unit :: Core/./LLDBCoreTests/StreamCallbackTest.Callback (2280 of 2421) PASS: lldb-api :: lang/cpp/class_static/TestStaticVariables.py (2281 of 2421) PASS: lldb-unit :: Utility/./UtilityTests/StringListTest.CopyListSingle (2282 of 2421) PASS: lldb-unit :: Utility/./UtilityTests/NameMatchesTest.EndsWith (2283 of 2421) UNSUPPORTED: lldb-api :: commands/expression/call-restarts/TestCallThatRestarts.py (2284 of 2421) PASS: lldb-unit :: Process/Utility/./ProcessUtilityTests/ProcMapTests/LinuxProcMapsTestFixture.ParseMapRegions/2 (2285 of 2421) PASS: lldb-shell :: lldb-server/TestErrorMessages.test (2286 of 2421) UNSUPPORTED: lldb-api :: benchmarks/stepping/TestSteppingSpeed.py (2287 of 2421) PASS: lldb-shell :: Driver/TestTarget.test (2288 of 2421) PASS: lldb-shell :: SymbolFile/NativePDB/break-by-line.cpp (2289 of 2421) PASS: lldb-api :: commands/expression/import-std-module/shared_ptr-dbg-info-content/TestSharedPtrDbgInfoContentFromStdModule.py (2290 of 2421) PASS: lldb-api :: functionalities/unwind/noreturn/TestNoreturnUnwind.py (2291 of 2421) PASS: lldb-api :: tools/lldb-server/TestGdbRemoteAttachWait.py (2292 of 2421) PASS: lldb-api :: functionalities/breakpoint/step_over_breakpoint/TestStepOverBreakpoint.py (2293 of 2421) PASS: lldb-api :: python_api/watchpoint/watchlocation/TestTargetWatchAddress.py (2294 of 2421) PASS: lldb-api :: api/multiple-targets/TestMultipleTargets.py (2295 of 2421) UNSUPPORTED: lldb-shell :: SymbolFile/PDB/type-quals.test (2296 of 2421) PASS: lldb-unit :: Utility/./UtilityTests/BinaryStreamTest.PutSLEB128TwoBytes (2297 of 2421) PASS: lldb-api :: lang/objc/modules-non-objc-target/TestObjCModulesNonObjCTarget.py (2298 of 2421) PASS: lldb-api :: functionalities/gdb_remote_client/TestTargetXMLArch.py (2299 of 2421) PASS: lldb-api :: linux/builtin_trap/TestBuiltinTrap.py (2300 of 2421) PASS: lldb-unit :: Utility/./UtilityTests/ArgsTest.TestSingleArg (2301 of 2421) PASS: lldb-unit :: Symbol/./SymbolTests/SymbolsTest.LocateExecutableSymbolFileForUnknownExecutableAndMissingSymbolFile (2302 of 2421) UNSUPPORTED: lldb-shell :: Subprocess/vfork-follow-parent-wp.test (2303 of 2421) PASS: lldb-shell :: SymbolFile/DWARF/x86/debug-types-dwo-cross-reference.cpp (2304 of 2421) PASS: lldb-unit :: Process/gdb-remote/./ProcessGdbRemoteTests/PortMapTest.AllowPort (2305 of 2421) PASS: lldb-shell :: Host/TestCustomShell.test (2306 of 2421) PASS: lldb-shell :: Register/Core/x86-64-netbsd-fp.test (2307 of 2421) PASS: lldb-unit :: Utility/./UtilityTests/StreamTest.PutRawBytesToLittleEndian (2308 of 2421) UNSUPPORTED: lldb-shell :: ScriptInterpreter/Lua/breakpoint_oneline_callback.test (2309 of 2421) PASS: lldb-unit :: Process/gdb-remote/./ProcessGdbRemoteTests/GDBRemoteCommunicationClientTest.SyncThreadState (2310 of 2421) PASS: lldb-unit :: Utility/./UtilityTests/IndexToObjectTest.ObjectForIndex (2311 of 2421) PASS: lldb-unit :: Core/./LLDBCoreTests/CommunicationTest.SynchronizeWhileClosing (2312 of 2421) PASS: lldb-api :: tools/lldb-server/TestGdbRemote_qThreadStopInfo.py (2313 of 2421) PASS: lldb-api :: tools/lldb-vscode/evaluate/TestVSCode_evaluate.py (2314 of 2421) PASS: lldb-unit :: Utility/./UtilityTests/ConstStringTest.UpdateMangledCounterpart (2315 of 2421) PASS: lldb-api :: functionalities/backticks/TestBackticksWithoutATarget.py (2316 of 2421) PASS: lldb-shell :: Quit/TestQuitExitCode0.test (2317 of 2421) PASS: lldb-unit :: Utility/./UtilityTests/StringExtractorTest.GetHexBytes_OddPair2 (2318 of 2421) PASS: lldb-shell :: Breakpoint/debug_rnglist_rlestartend.test (2319 of 2421) PASS: lldb-shell :: SymbolFile/Breakpad/stack-cfi-parsing.test (2320 of 2421) PASS: lldb-api :: functionalities/data-formatter/parray/TestPrintArray.py (2321 of 2421) PASS: lldb-unit :: Utility/./UtilityTests/EnvironmentTest.EnvpConversion (2322 of 2421) PASS: lldb-unit :: Language/Highlighting/./HighlighterTests/HighlighterTest.ClangTrailingBackslashMissingNewLine (2323 of 2421) PASS: lldb-api :: functionalities/data-formatter/synthcapping/TestSyntheticCapping.py (2324 of 2421) PASS: lldb-api :: python_api/default-constructor/TestDefaultConstructorForAPIObjects.py (2325 of 2421) PASS: lldb-unit :: Utility/./UtilityTests/UriParserTest.SchemeHostSeparator (2326 of 2421) PASS: lldb-unit :: Core/./LLDBCoreTests/RichManglingContextTest.FromCxxMethodName (2327 of 2421) PASS: lldb-api :: sanity/TestModuleCacheSanity.py (2328 of 2421) PASS: lldb-api :: python_api/lldbutil/iter/TestLLDBIterator.py (2329 of 2421) PASS: lldb-unit :: Utility/./UtilityTests/StringListTest.AppendStringCString (2330 of 2421) PASS: lldb-shell :: SymbolFile/DWARF/x86/DW_TAG_variable-DW_AT_const_value.s (2331 of 2421) UNSUPPORTED: lldb-api :: functionalities/ubsan/basic/TestUbsanBasic.py (2332 of 2421) PASS: lldb-unit :: Process/gdb-remote/./ProcessGdbRemoteTests/GDBRemoteClientBaseTest.SendContinueAndAsyncPacket (2333 of 2421) PASS: lldb-unit :: Target/./TargetTests/PathMappingListTest.AbsoluteTests (2334 of 2421) PASS: lldb-api :: commands/frame/recognizer/TestFrameRecognizer.py (2335 of 2421) PASS: lldb-unit :: Utility/./UtilityTests/GeneratorTest.GetOrCreate (2336 of 2421) PASS: lldb-api :: functionalities/data-formatter/data-formatter-synth/TestDataFormatterSynth.py (2337 of 2421) PASS: lldb-shell :: SymbolFile/DWARF/x86/module-ownership.mm (2338 of 2421) PASS: lldb-api :: functionalities/data-formatter/data-formatter-objc/TestDataFormatterObjNSException.py (2339 of 2421) PASS: lldb-shell :: Breakpoint/debug_rnglist_offset_pair.test (2340 of 2421) PASS: lldb-api :: functionalities/data-formatter/vector-types/TestVectorTypesFormatting.py (2341 of 2421) PASS: lldb-unit :: Utility/./UtilityTests/BinaryStreamTest.PutSLEB128ThreeBytes (2342 of 2421) PASS: lldb-api :: lang/cpp/frame-var-anon-unions/TestFrameVariableAnonymousUnions.py (2343 of 2421) PASS: lldb-unit :: SymbolFile/NativePDB/./SymbolFileNativePDBTests/PDBFPOProgramToDWARFExpressionTests.DependencyChain (2344 of 2421) PASS: lldb-api :: commands/expression/ir-interpreter-phi-nodes/TestIRInterpreterPHINodes.py (2345 of 2421) PASS: lldb-unit :: Utility/./UtilityTests/StringExtractorTest.DecodeHexU8_Extra (2346 of 2421) PASS: lldb-api :: functionalities/var_path/TestVarPath.py (2347 of 2421) PASS: lldb-unit :: Process/minidump/./LLDBMinidumpTests/MinidumpParserTest.GetMemoryRegionInfoFromMemoryList (2348 of 2421) PASS: lldb-unit :: Host/./HostTests/SocketTests/SocketTest.DomainGetConnectURI/ipv4 (2349 of 2421) PASS: lldb-api :: functionalities/inferior-crashing/recursive-inferior/TestRecursiveInferiorStep.py (2350 of 2421) PASS: lldb-api :: functionalities/thread/concurrent_events/TestConcurrentDelaySignalBreak.py (2351 of 2421) PASS: lldb-unit :: Utility/./UtilityTests/StreamTest.AddressNoSuffix (2352 of 2421) PASS: lldb-unit :: Utility/./UtilityTests/DataExtractorTest.GetMaxU64_unchecked (2353 of 2421) PASS: lldb-api :: functionalities/data-formatter/data-formatter-stl/libcxx/string/TestDataFormatterLibcxxString.py (2354 of 2421) PASS: lldb-unit :: Utility/./UtilityTests/DataExtractorTest.GetMaxU64 (2355 of 2421) PASS: lldb-api :: python_api/interpreter/TestCommandInterpreterAPI.py (2356 of 2421) PASS: lldb-api :: commands/log/invalid-args/TestInvalidArgsLog.py (2357 of 2421) PASS: lldb-unit :: Process/./ProcessEventDataTests/ProcessEventDataTest.ShouldStop (2358 of 2421) PASS: lldb-unit :: Utility/./UtilityTests/AnsiTerminal.WhiteSpace (2359 of 2421) PASS: lldb-api :: functionalities/data-formatter/data-formatter-ptr-to-array/TestPtrToArrayFormatting.py (2360 of 2421) PASS: lldb-api :: lang/objc/objc-new-syntax/TestObjCNewSyntaxDictionary.py (2361 of 2421) PASS: lldb-unit :: Utility/./UtilityTests/BinaryStreamTest.PutULEB128OneByte (2362 of 2421) PASS: lldb-api :: functionalities/breakpoint/breakpoint_conditions/TestBreakpointConditions.py (2363 of 2421) PASS: lldb-shell :: Driver/TestError.test (2364 of 2421) PASS: lldb-shell :: ObjectFile/ELF/PT_LOAD-overlap.yaml (2365 of 2421) PASS: lldb-unit :: Utility/./UtilityTests/StringExtractorTest.GetHexU8_Underflow_NoEof (2366 of 2421) PASS: lldb-unit :: Utility/./UtilityTests/ListenerTest.GetEventImmediate (2367 of 2421) PASS: lldb-unit :: Utility/./UtilityTests/RecordReplayTest.InstrumentedBarPtr (2368 of 2421) PASS: lldb-api :: commands/process/launch/TestProcessLaunch.py (2369 of 2421) PASS: lldb-unit :: Symbol/./SymbolTests/TestClangASTImporter.CopyTypeTagDecl (2370 of 2421) UNSUPPORTED: lldb-shell :: Breakpoint/ppc64-localentry.test (2371 of 2421) PASS: lldb-shell :: Reproducer/TestGDBRemoteRepro.test (2372 of 2421) PASS: lldb-unit :: Utility/./UtilityTests/StringListTest.LongestCommonPrefixEmpty (2373 of 2421) PASS: lldb-unit :: Utility/./UtilityTests/ProcessInstanceInfo.DumpTable (2374 of 2421) PASS: lldb-unit :: Process/gdb-remote/./ProcessGdbRemoteTests/GDBRemoteCommunicationClientTest.GetModulesInfoInvalidResponse (2375 of 2421) UNSUPPORTED: lldb-shell :: ObjectFile/ELF/minidebuginfo-no-lzma.yaml (2376 of 2421) PASS: lldb-unit :: ScriptInterpreter/Python/./ScriptInterpreterPythonTests/PythonDataObjectsTest.TestPythonIntegerToStructuredInteger (2377 of 2421) PASS: lldb-unit :: Utility/./UtilityTests/BinaryStreamTest.PutULEB128ThreeBytes (2378 of 2421) PASS: lldb-api :: functionalities/deleted-executable/TestDeletedExecutable.py (2379 of 2421) PASS: lldb-unit :: Process/Utility/./ProcessUtilityTests/RegisterContext_x86Test.FullToAbridgedTagWord (2380 of 2421) PASS: lldb-unit :: Utility/./UtilityTests/StringListTest.GetMaxStringLengthEmpty (2381 of 2421) PASS: lldb-unit :: Symbol/./SymbolTests/DWARFCallFrameInfoTest.Basic_eh (2382 of 2421) PASS: lldb-shell :: SymbolFile/Breakpad/line-table-missing-file.test (2383 of 2421) PASS: lldb-shell :: ObjectFile/PECOFF/basic-info-arm64.yaml (2384 of 2421) PASS: lldb-api :: python_api/hello_world/TestHelloWorld.py (2385 of 2421) XFAIL: lldb-shell :: Expr/nodefaultlib.cpp (2386 of 2421) PASS: lldb-unit :: Utility/./UtilityTests/TimerTest.CategoryTimesNested (2387 of 2421) PASS: lldb-unit :: Utility/./UtilityTests/UriParserTest.BracketedHostnamePort (2388 of 2421) PASS: lldb-api :: commands/expression/persistent_variables/TestPersistentVariables.py (2389 of 2421) UNSUPPORTED: lldb-shell :: ScriptInterpreter/Lua/io.test (2390 of 2421) PASS: lldb-unit :: Utility/./UtilityTests/StreamTest.AddressRangeInvalidRange (2391 of 2421) PASS: lldb-unit :: UnwindAssembly/x86/./UnwindAssemblyx86Tests/Testx86AssemblyInspectionEngine.Test64bitFramelessSmallStackFrame (2392 of 2421) PASS: lldb-unit :: Utility/./UtilityTests/ScalarTest.TruncOrExtendTo (2393 of 2421) PASS: lldb-unit :: Utility/./UtilityTests/BinaryStreamTest.PutULEB128Zero (2394 of 2421) PASS: lldb-unit :: Expression/./ExpressionTests/DiagnosticManagerTest.GetStringBasic (2395 of 2421) PASS: lldb-shell :: Breakpoint/split-dwarf5-debug-stroffsets.test (2396 of 2421) PASS: lldb-unit :: Utility/./UtilityTests/RecordReplayTest.ValidSequence (2397 of 2421) PASS: lldb-unit :: Utility/./UtilityTests/StringListTest.GetMaxStringLengthDecreasingSize (2398 of 2421) PASS: lldb-unit :: Target/./TargetTests/PathMappingListTest.CrossPlatformTests (2399 of 2421) PASS: lldb-unit :: Utility/./UtilityTests/StreamTest.PutHex64ByteOrderBig (2400 of 2421) PASS: lldb-shell :: SymbolFile/DWARF/deterministic-build.cpp (2401 of 2421) PASS: lldb-unit :: Host/./HostTests/TerminalTest.PtyIsATerminal (2402 of 2421) PASS: lldb-unit :: UnwindAssembly/x86/./UnwindAssemblyx86Tests/Testx86AssemblyInspectionEngine.TestPushRBP (2403 of 2421) PASS: lldb-unit :: Process/gdb-remote/./ProcessGdbRemoteTests/GDBRemoteCommunicationClientTest.SendTraceSupportedPacket (2404 of 2421) PASS: lldb-api :: lang/cpp/thread_local/TestThreadLocal.py (2405 of 2421) PASS: lldb-shell :: Minidump/Windows/Sigsegv/sigsegv.test (2406 of 2421) PASS: lldb-api :: functionalities/type_completion/TestTypeCompletion.py (2407 of 2421) PASS: lldb-api :: functionalities/data-formatter/data-formatter-objc/TestDataFormatterObjCNSError.py (2408 of 2421) PASS: lldb-api :: functionalities/data-formatter/type_summary_list_script/TestTypeSummaryListScript.py (2409 of 2421) PASS: lldb-unit :: Utility/./UtilityTests/ArchSpecTest.OperatorBool (2410 of 2421) PASS: lldb-unit :: Process/minidump/./LLDBMinidumpTests/MinidumpParserTest.GetMemoryRegionInfoLinuxMaps (2411 of 2421) PASS: lldb-unit :: Utility/./UtilityTests/StringExtractorTest.DecodeHexU8_Underflow2 (2412 of 2421) XFAIL: lldb-shell :: SymbolFile/DWARF/find-type-in-function.cpp (2413 of 2421) PASS: lldb-unit :: Utility/./UtilityTests/ScalarTest.SetValueFromCString (2414 of 2421) PASS: lldb-unit :: Language/CPlusPlus/./LanguageCPlusPlusTests/CPlusPlusLanguage.ExtractContextAndIdentifier (2415 of 2421) UNSUPPORTED: lldb-api :: functionalities/data-formatter/data-formatter-stl/libstdcpp/string/TestDataFormatterStdString.py (2416 of 2421) PASS: lldb-unit :: Target/./TargetTests/DynamicRegisterInfoTest.no_finalize_regs (2417 of 2421) PASS: lldb-unit :: Utility/./UtilityTests/StringExtractorTest.GetHexBytes_Underflow (2418 of 2421) UNSUPPORTED: lldb-api :: macosx/macCatalystAppMacOSFramework/TestMacCatalystAppWithMacOSFramework.py (2419 of 2421) PASS: lldb-api :: types/TestLongTypes.py (2420 of 2421) PASS: lldb-shell :: Driver/TestPositionalArgs.test (2421 of 2421) Slowest Tests: -------------------------------------------------------------------------- 267.39s: lldb-api :: tools/lldb-server/TestLldbGdbServer.py 228.40s: lldb-api :: functionalities/memory-region/TestMemoryRegion.py 178.95s: lldb-api :: macosx/skinny-corefile/TestSkinnyCorefile.py 169.72s: lldb-api :: macosx/stack-corefile/TestStackCorefile.py 142.31s: lldb-api :: api/multithreaded/TestMultithreaded.py 91.48s: lldb-api :: functionalities/gdb_remote_client/TestWasm.py 84.59s: lldb-api :: types/TestLongTypesExpr.py 73.27s: lldb-api :: commands/expression/import-std-module/queue/TestQueueFromStdModule.py 70.88s: lldb-api :: lang/objc/exceptions/TestObjCExceptions.py 70.81s: lldb-api :: commands/process/attach/TestProcessAttach.py 69.51s: lldb-api :: commands/expression/import-std-module/stack/TestStackFromStdModule.py 66.89s: lldb-api :: lang/cpp/namespace/TestNamespaceLookup.py 66.42s: lldb-api :: lang/objc/hidden-ivars/TestHiddenIvars.py 61.98s: lldb-api :: lang/objc/objc-new-syntax/TestObjCNewSyntaxLiteral.py 59.56s: lldb-api :: commands/expression/import-std-module/vector/TestVectorFromStdModule.py 55.85s: lldb-api :: lang/objc/foundation/TestObjCMethods.py 53.24s: lldb-api :: types/TestIntegerTypeExpr.py 51.22s: lldb-api :: commands/expression/import-std-module/deque-basic/TestDequeFromStdModule.py 50.78s: lldb-api :: tools/lldb-server/TestGdbRemoteThreadsInStopReply.py 50.17s: lldb-api :: python_api/target/TestTargetAPI.py

Hide Details

Tests Times: -------------------------------------------------------------------------- [ Range ] :: [ Percentage ] :: [ Count ] -------------------------------------------------------------------------- [260s,280s) :: [ ] :: [ 1/2421] [240s,260s) :: [ ] :: [ 0/2421] [220s,240s) :: [ ] :: [ 1/2421] [200s,220s) :: [ ] :: [ 0/2421] [180s,200s) :: [ ] :: [ 1/2421] [160s,180s) :: [ ] :: [ 1/2421] [140s,160s) :: [ ] :: [ 1/2421] [120s,140s) :: [ ] :: [ 0/2421] [100s,120s) :: [ ] :: [ 0/2421] [ 80s,100s) :: [ ] :: [ 2/2421] [ 60s, 80s) :: [ ] :: [ 8/2421] [ 40s, 60s) :: [ ] :: [ 19/2421] [ 20s, 40s) :: [* ] :: [ 79/2421] [ 0s, 20s) :: [************************************** ] :: [2308/2421] -------------------------------------------------------------------------- ******************** Failed Tests (4): lldb-unit :: Host/./HostTests/TerminalTest.SaveRestore lldb-unit :: Host/./HostTests/TerminalTest.SaveRestoreRAII lldb-unit :: Host/./HostTests/TerminalTest.SetCanonical lldb-unit :: Host/./HostTests/TerminalTest.SetEcho

Hide Details

Hide Details

Testing Time: 2627.34s Unsupported : 231 Passed : 2176 Expectedly Failed: 10 Failed : 4 FAILED: tools/lldb/test/CMakeFiles/check-lldb cd /Users/buildslave/jenkins/workspace/lldb-cmake-sanitized/lldb-build/tools/lldb/test && /usr/local/Frameworks/Python.framework/Versions/3.7/bin/python3.7 /Users/buildslave/jenkins/workspace/lldb-cmake-sanitized/lldb-build/./bin/llvm-lit -v --time-tests --shuffle --xunit-xml-output=/Users/buildslave/jenkins/workspace/lldb-cmake-sanitized/test/results.xml -v -j 4 --timeout 1200 /Users/buildslave/jenkins/workspace/lldb-cmake-sanitized/lldb-build/tools/lldb/test ninja: build stopped: subcommand failed. Command failed: Command '['/usr/bin/env', 'TERM=vt100', '/usr/local/bin/ninja', '-v', 'check-lldb']' returned non-zero exit status 1. Command: ['/usr/bin/env', 'TERM=vt100', '/usr/local/bin/ninja', '-v', 'check-lldb'] [Pipeline] } [Pipeline] // timeout [Pipeline] } [Pipeline] // stage [Pipeline] stage [Pipeline] { (Declarative: Post Actions) [Pipeline] scanForIssues [Clang] Sleeping for 5 seconds due to JENKINS-32191... [Clang] Parsing console log (workspace: '/Users/buildslave/jenkins/workspace/lldb-cmake-sanitized') [Clang] -> found 4 issues (skipped 0 duplicates) [Clang] Parsing console log (workspace: '/Users/buildslave/jenkins/workspace/lldb-cmake-sanitized') [Clang] -> found 4 issues (skipped 0 duplicates) [Clang] Successfully parsed console log [Clang] -> found 4 issues (skipped 0 duplicates) [Clang] Parsing console log (workspace: '/Users/buildslave/jenkins/workspace/lldb-cmake-sanitized') [Clang] Post processing issues on 'green-dragon-23' with source code encoding 'UTF-8' [Clang] Creating SCM blamer to obtain author and commit information for affected files [Clang] -> No blamer installed yet. You need to install the 'git-forensics' plugin to enable blaming for Git. [Clang] Resolving file names for all issues in source directory '/Users/buildslave/jenkins/workspace/lldb-cmake-sanitized' [Clang] -> resolved paths in source directory (4 found, 0 not found) [Clang] Resolving module names from module definitions (build.xml, pom.xml, or Manifest.mf files) [Clang] -> resolved module names for 4 issues [Clang] Resolving package names (or namespaces) by parsing the affected files [Clang] -> resolved package names of 4 affected files [Clang] No filter has been set, publishing all 4 issues [Clang] Creating fingerprints for all affected code blocks to track issues over different builds [Clang] -> created fingerprints for 4 issues (skipped 0 issues) [Clang] Copying affected files to Jenkins' build folder '/Users/Shared/Jenkins/Home/jobs/lldb-cmake-sanitized/builds/1996/files-with-issues' [Clang] -> 4 copied, 0 not in workspace, 0 not-found, 0 with I/O error [Clang] Repository miner is not configured, skipping repository mining [Pipeline] junit Recording test results [Checks API] No suitable checks publisher found. [Pipeline] } [Pipeline] // stage [Pipeline] } [Pipeline] // withEnv [Pipeline] } [Pipeline] // node [Pipeline] End of Pipeline ERROR: script returned exit code 1 Finished: FAILURE