Failed

lldb-unit.Host/_/HostTests.TerminalTest.SaveRestore (from lldb-unit)

Failing for the past 2 builds (Since #1996 )
Took 0.11 sec.

Stacktrace

Script:
--
/Users/buildslave/jenkins/workspace/lldb-cmake-sanitized/lldb-build/tools/lldb/unittests/Host/./HostTests --gtest_filter=TerminalTest.SaveRestore
--
Note: Google Test filter = TerminalTest.SaveRestore
[==========] Running 1 test from 1 test suite.
[----------] Global test environment set-up.
[----------] 1 test from TerminalTest
[ RUN      ] TerminalTest.SaveRestore
/Users/buildslave/jenkins/workspace/lldb-cmake-sanitized/llvm-project/lldb/unittests/Host/posix/TerminalTest.cpp:101: Failure
Expected equality of these values:
  tcgetattr(m_pty.GetPrimaryFileDescriptor(), &orig_terminfo)
    Which is: -1
  0
[  FAILED  ] TerminalTest.SaveRestore (0 ms)
[----------] 1 test from TerminalTest (0 ms total)

[----------] Global test environment tear-down
[==========] 1 test from 1 test suite ran. (0 ms total)
[  PASSED  ] 0 tests.
[  FAILED  ] 1 test, listed below:
[  FAILED  ] TerminalTest.SaveRestore

 1 FAILED TEST