Failed

lldb-unit.Host/_/HostTests.TerminalTest.SetEcho (from lldb-unit)

Failing for the past 3 builds (Since #1996 )
Took 0.16 sec.

Stacktrace

Script:
--
/Users/buildslave/jenkins/workspace/lldb-cmake-sanitized/lldb-build/tools/lldb/unittests/Host/./HostTests --gtest_filter=TerminalTest.SetEcho
--
Note: Google Test filter = TerminalTest.SetEcho
[==========] Running 1 test from 1 test suite.
[----------] Global test environment set-up.
[----------] 1 test from TerminalTest
[ RUN      ] TerminalTest.SetEcho
/Users/buildslave/jenkins/workspace/lldb-cmake-sanitized/llvm-project/lldb/unittests/Host/posix/TerminalTest.cpp:49: Failure
Expected equality of these values:
  term.SetEcho(true)
    Which is: false
  true
[  FAILED  ] TerminalTest.SetEcho (1 ms)
[----------] 1 test from TerminalTest (1 ms total)

[----------] Global test environment tear-down
[==========] 1 test from 1 test suite ran. (1 ms total)
[  PASSED  ] 0 tests.
[  FAILED  ] 1 test, listed below:
[  FAILED  ] TerminalTest.SetEcho

 1 FAILED TEST