Console Output

Skipping 9,799 KB.. Full Log
PASS: lldb-unit :: ScriptInterpreter/Python/./ScriptInterpreterPythonTests/PythonDataObjectsTest.TestPythonTupleInitializerList (1494 of 2426)
PASS: lldb-unit :: Core/./LLDBCoreTests/FormatEntityTest.DefinitionConstructionNameTypeData (1495 of 2426)
PASS: lldb-unit :: Utility/./UtilityTests/RangeTest.ContainsAddr (1496 of 2426)
PASS: lldb-api :: commands/expression/fixits/TestFixIts.py (1497 of 2426)
PASS: lldb-api :: commands/watchpoints/watchpoint_on_vectors/TestValueOfVectorVariable.py (1498 of 2426)
PASS: lldb-api :: lang/c/stepping/TestThreadStepping.py (1499 of 2426)
PASS: lldb-shell :: ObjectFile/PECOFF/sections.yaml (1500 of 2426)
PASS: lldb-api :: lang/c/strings/TestCStrings.py (1501 of 2426)
PASS: lldb-api :: commands/expression/import-std-module/non-module-type-separation/TestNonModuleTypeSeparation.py (1502 of 2426)
PASS: lldb-unit :: Utility/./UtilityTests/RangeTest.ContainsEndInclusive (1503 of 2426)
PASS: lldb-shell :: SymbolFile/DWARF/x86/dwp-debug-types.s (1504 of 2426)
PASS: lldb-unit :: ScriptInterpreter/Python/./ScriptInterpreterPythonTests/PythonDataObjectsTest.TestPythonTupleToStructuredList (1505 of 2426)
PASS: lldb-shell :: SymbolFile/NativePDB/nested-types.cpp (1506 of 2426)
PASS: lldb-api :: functionalities/breakpoint/cpp/TestCPPBreakpointLocations.py (1507 of 2426)
PASS: lldb-unit :: Language/Highlighting/./HighlighterTests/HighlighterTest.HighlighterSelectionPath (1508 of 2426)
PASS: lldb-unit :: Utility/./UtilityTests/RangeTest.DoesIntersect (1509 of 2426)
PASS: lldb-unit :: Utility/./UtilityTests/VMRange.Comparison (1510 of 2426)
PASS: lldb-api :: functionalities/gdb_remote_client/TestGDBRemoteLoad.py (1511 of 2426)
PASS: lldb-api :: python_api/class_members/TestSBTypeClassMembers.py (1512 of 2426)
PASS: lldb-unit :: ScriptInterpreter/Python/./ScriptInterpreterPythonTests/PythonDataObjectsTest.TestPythonBytes (1513 of 2426)
PASS: lldb-shell :: ScriptInterpreter/Python/command_import.test (1514 of 2426)
PASS: lldb-unit :: Utility/./UtilityTests/CompletionRequest.DuplicateFilteringWithComments (1515 of 2426)
PASS: lldb-unit :: Symbol/./SymbolTests/DWARFCallFrameInfoTest.Basic_dwarf3 (1516 of 2426)
PASS: lldb-unit :: Utility/./UtilityTests/SerializationRountripTest.SerializeDeserializeCStringArrayNullptr (1517 of 2426)
PASS: lldb-api :: types/TestDoubleTypesExpr.py (1518 of 2426)
PASS: lldb-api :: functionalities/process_group/TestChangeProcessGroup.py (1519 of 2426)
PASS: lldb-unit :: Symbol/./SymbolTests/LineEntryTest.GetAllExactLineMatchesWithoutColumn (1520 of 2426)
PASS: lldb-unit :: Language/Highlighting/./HighlighterTests/HighlighterTest.ClangCursorOutOfBounds (1521 of 2426)
PASS: lldb-unit :: Process/gdb-remote/./ProcessGdbRemoteTests/GDBRemoteCommunicationClientTest.GetModulesInfo (1522 of 2426)
PASS: lldb-unit :: Expression/./ExpressionTests/DiagnosticManagerTest.AppendMessageSubsequentDiags (1523 of 2426)
PASS: lldb-shell :: SymbolFile/Breakpad/unwind-via-stack-cfi.test (1524 of 2426)
FAIL: lldb-api :: lang/objc/foundation/TestConstStrings.py (1525 of 2426)
******************** TEST 'lldb-api :: lang/objc/foundation/TestConstStrings.py' FAILED ********************
Script:
--
/Users/buildslave/jenkins/workspace/lldb-cmake-sanitized/lldb-build/lldb-test-build.noindex/copied-python /Users/buildslave/jenkins/workspace/lldb-cmake-sanitized/llvm-project/lldb/test/API/dotest.py -u CXXFLAGS -u CFLAGS --codesign-identity lldb_codesign --arch x86_64 --build-dir /Users/buildslave/jenkins/workspace/lldb-cmake-sanitized/lldb-build/lldb-test-build.noindex -t --env TERM=vt100 --env LLVM_LIBS_DIR=/Users/buildslave/jenkins/workspace/lldb-cmake-sanitized/lldb-build/./lib --inferior-env ASAN_OPTIONS=detect_stack_use_after_return=1 --inferior-env DYLD_INSERT_LIBRARIES=/Users/buildslave/jenkins/workspace/lldb-cmake-sanitized/host-compiler/lib/clang/14.0.99/lib/darwin/libclang_rt.asan_osx_dynamic.dylib --arch x86_64 --build-dir /Users/buildslave/jenkins/workspace/lldb-cmake-sanitized/lldb-build/lldb-test-build.noindex --lldb-module-cache-dir /Users/buildslave/jenkins/workspace/lldb-cmake-sanitized/lldb-build/lldb-test-build.noindex/module-cache-lldb/lldb-api --clang-module-cache-dir /Users/buildslave/jenkins/workspace/lldb-cmake-sanitized/lldb-build/lldb-test-build.noindex/module-cache-clang/lldb-api --executable /Users/buildslave/jenkins/workspace/lldb-cmake-sanitized/lldb-build/./bin/lldb --compiler /Users/buildslave/jenkins/workspace/lldb-cmake-sanitized/host-compiler/bin/clang --dsymutil /Users/buildslave/jenkins/workspace/lldb-cmake-sanitized/lldb-build/./bin/dsymutil --llvm-tools-dir /Users/buildslave/jenkins/workspace/lldb-cmake-sanitized/lldb-build/./bin --lldb-libs-dir /Users/buildslave/jenkins/workspace/lldb-cmake-sanitized/lldb-build/./lib /Users/buildslave/jenkins/workspace/lldb-cmake-sanitized/llvm-project/lldb/test/API/lang/objc/foundation -p TestConstStrings.py
--
Exit Code: -6

Hide Details

Command Output (stdout): -- lldb version 14.0.99 (http://labmaster3.local/git/llvm-project.git revision ec2029f986d8bb80963c1efd9e5024bfe7ac3d30) clang revision ec2029f986d8bb80963c1efd9e5024bfe7ac3d30 llvm revision ec2029f986d8bb80963c1efd9e5024bfe7ac3d30

Hide Details

-- Command Output (stderr): -- Assertion failed: (0 && "Invalid SLocOffset or bad function choice"), function getFileIDLoaded, file /Users/buildslave/jenkins/workspace/lldb-cmake-sanitized/llvm-project/clang/lib/Basic/SourceManager.cpp, line 867.

Hide Details

--

Hide Details

******************** PASS: lldb-unit :: Utility/./UtilityTests/BroadcasterTest.EventTypeHasListeners (1526 of 2426) PASS: lldb-api :: commands/process/attach/attach_denied/TestAttachDenied.py (1527 of 2426) PASS: lldb-api :: functionalities/data-formatter/data-formatter-proper-plurals/TestFormattersOneIsSingular.py (1528 of 2426) PASS: lldb-shell :: ObjectFile/PECOFF/uuid.yaml (1529 of 2426) PASS: lldb-api :: commands/add-dsym/uuid/TestAddDsymCommand.py (1530 of 2426) PASS: lldb-api :: functionalities/breakpoint/comp_dir_symlink/TestCompDirSymLink.py (1531 of 2426) PASS: lldb-unit :: Host/./HostTests/SocketAddressTest.GetAddressInfo (1532 of 2426) PASS: lldb-unit :: Symbol/./SymbolTests/LineEntryTest.GetSameLineContiguousAddressRangeOneInline (1533 of 2426) UNSUPPORTED: lldb-api :: lang/objc/rdar-12408181/TestRdar12408181.py (1534 of 2426) PASS: lldb-unit :: Utility/./UtilityTests/ConstStringTest.MangledCounterpart (1535 of 2426) PASS: lldb-unit :: UnwindAssembly/x86/./UnwindAssemblyx86Tests/Testx86AssemblyInspectionEngine.Testi386IgnoredRegisters (1536 of 2426) PASS: lldb-unit :: debugserver/./debugserverTests/RNBSocket.LoopBackListenIPv4 (1537 of 2426) PASS: lldb-api :: functionalities/thread/concurrent_events/TestConcurrentTwoWatchpointThreads.py (1538 of 2426) PASS: lldb-shell :: ObjectFile/MachO/lc_version_min.yaml (1539 of 2426) PASS: lldb-shell :: Driver/TestError.test (1540 of 2426) PASS: lldb-unit :: Symbol/./SymbolTests/Type.GetTypeScopeAndBasename (1541 of 2426) PASS: lldb-shell :: ObjectFile/PECOFF/sections-names.yaml (1542 of 2426) FAIL: lldb-api :: lang/objc/foundation/TestObjCMethodsNSArray.py (1543 of 2426) ******************** TEST 'lldb-api :: lang/objc/foundation/TestObjCMethodsNSArray.py' FAILED ******************** Script: -- /Users/buildslave/jenkins/workspace/lldb-cmake-sanitized/lldb-build/lldb-test-build.noindex/copied-python /Users/buildslave/jenkins/workspace/lldb-cmake-sanitized/llvm-project/lldb/test/API/dotest.py -u CXXFLAGS -u CFLAGS --codesign-identity lldb_codesign --arch x86_64 --build-dir /Users/buildslave/jenkins/workspace/lldb-cmake-sanitized/lldb-build/lldb-test-build.noindex -t --env TERM=vt100 --env LLVM_LIBS_DIR=/Users/buildslave/jenkins/workspace/lldb-cmake-sanitized/lldb-build/./lib --inferior-env ASAN_OPTIONS=detect_stack_use_after_return=1 --inferior-env DYLD_INSERT_LIBRARIES=/Users/buildslave/jenkins/workspace/lldb-cmake-sanitized/host-compiler/lib/clang/14.0.99/lib/darwin/libclang_rt.asan_osx_dynamic.dylib --arch x86_64 --build-dir /Users/buildslave/jenkins/workspace/lldb-cmake-sanitized/lldb-build/lldb-test-build.noindex --lldb-module-cache-dir /Users/buildslave/jenkins/workspace/lldb-cmake-sanitized/lldb-build/lldb-test-build.noindex/module-cache-lldb/lldb-api --clang-module-cache-dir /Users/buildslave/jenkins/workspace/lldb-cmake-sanitized/lldb-build/lldb-test-build.noindex/module-cache-clang/lldb-api --executable /Users/buildslave/jenkins/workspace/lldb-cmake-sanitized/lldb-build/./bin/lldb --compiler /Users/buildslave/jenkins/workspace/lldb-cmake-sanitized/host-compiler/bin/clang --dsymutil /Users/buildslave/jenkins/workspace/lldb-cmake-sanitized/lldb-build/./bin/dsymutil --llvm-tools-dir /Users/buildslave/jenkins/workspace/lldb-cmake-sanitized/lldb-build/./bin --lldb-libs-dir /Users/buildslave/jenkins/workspace/lldb-cmake-sanitized/lldb-build/./lib /Users/buildslave/jenkins/workspace/lldb-cmake-sanitized/llvm-project/lldb/test/API/lang/objc/foundation -p TestObjCMethodsNSArray.py -- Exit Code: -6

Hide Details

Command Output (stdout): -- lldb version 14.0.99 (http://labmaster3.local/git/llvm-project.git revision ec2029f986d8bb80963c1efd9e5024bfe7ac3d30) clang revision ec2029f986d8bb80963c1efd9e5024bfe7ac3d30 llvm revision ec2029f986d8bb80963c1efd9e5024bfe7ac3d30

Hide Details

-- Command Output (stderr): -- Assertion failed: (0 && "Invalid SLocOffset or bad function choice"), function getFileIDLoaded, file /Users/buildslave/jenkins/workspace/lldb-cmake-sanitized/llvm-project/clang/lib/Basic/SourceManager.cpp, line 867.

Hide Details

--

Hide Details

******************** UNSUPPORTED: lldb-api :: android/platform/TestDefaultCacheLineSize.py (1544 of 2426) PASS: lldb-unit :: UnwindAssembly/x86/./UnwindAssemblyx86Tests/Testx86AssemblyInspectionEngine.TestSimple64bitFrameFunction (1545 of 2426) PASS: lldb-unit :: Utility/./UtilityTests/ArgsTest.ReplaceArgumentAtIndexLonger (1546 of 2426) PASS: lldb-unit :: SymbolFile/DWARF/./SymbolFileDWARFTests/DWARFUnitTest.ClangProducer (1547 of 2426) PASS: lldb-api :: tools/lldb-server/TestGdbRemoteSingleStep.py (1548 of 2426) PASS: lldb-api :: lang/c/shared_lib_stripped_symbols/TestSharedLibStrippedSymbols.py (1549 of 2426) UNSUPPORTED: lldb-shell :: SymbolFile/NativePDB/ast-functions-msvc.cpp (1550 of 2426) PASS: lldb-unit :: ScriptInterpreter/Python/./ScriptInterpreterPythonTests/PythonDataObjectsTest.TestBorrowedReferences (1551 of 2426) PASS: lldb-shell :: SymbolFile/DWARF/x86/find-qualified-variable.cpp (1552 of 2426) PASS: lldb-unit :: Language/Highlighting/./HighlighterTests/HighlighterTest.ClangCursorPosBeforeOtherToken (1553 of 2426) PASS: lldb-api :: commands/target/dump-symtab-demangle/TestDumpSymtabDemangle.py (1554 of 2426) PASS: lldb-api :: functionalities/source-map/TestTargetSourceMap.py (1555 of 2426) PASS: lldb-unit :: Process/minidump/./LLDBMinidumpTests/MinidumpParserTest.GetMemoryRegionInfoLinuxMaps (1556 of 2426) PASS: lldb-shell :: ObjectFile/ELF/riscv-arch.yaml (1557 of 2426) PASS: lldb-unit :: SymbolFile/DWARF/./SymbolFileDWARFTests/SymbolFileDWARFTests.TestAbbrevNullAttrValidForm (1558 of 2426) PASS: lldb-unit :: Core/./LLDBCoreTests/SourceLocationSpecTest.Compare (1559 of 2426) PASS: lldb-api :: commands/expression/import-std-module/forward_list/TestForwardListFromStdModule.py (1560 of 2426) PASS: lldb-api :: functionalities/data-formatter/data-formatter-synthtype/TestDataFormatterSynthType.py (1561 of 2426) PASS: lldb-shell :: ObjectFile/PECOFF/export-dllfunc.yaml (1562 of 2426) PASS: lldb-unit :: Utility/./UtilityTests/ScalarTest.Comparison (1563 of 2426) PASS: lldb-unit :: ObjectFile/ELF/./ObjectFileELFTests/ObjectFileELFTest.SectionsResolveConsistently (1564 of 2426) UNSUPPORTED: lldb-shell :: Subprocess/clone-follow-parent-softbp.test (1565 of 2426) PASS: lldb-unit :: Utility/./UtilityTests/RangeDataVector.FindEntryIndexesThatContain (1566 of 2426) PASS: lldb-api :: macosx/profile_vrs_detach/TestDetachVrsProfile.py (1567 of 2426) PASS: lldb-api :: tools/lldb-vscode/evaluate/TestVSCode_evaluate.py (1568 of 2426) PASS: lldb-api :: functionalities/avoids-fd-leak/TestFdLeak.py (1569 of 2426) PASS: lldb-api :: commands/statistics/basic/TestStats.py (1570 of 2426) UNSUPPORTED: lldb-shell :: Subprocess/fork-follow-parent-softbp.test (1571 of 2426) PASS: lldb-api :: functionalities/paths/TestPaths.py (1572 of 2426) PASS: lldb-unit :: Core/./LLDBCoreTests/MangledTest.ResultForValidName (1573 of 2426) PASS: lldb-unit :: Utility/./UtilityTests/StreamTest.PutNHex8 (1574 of 2426) PASS: lldb-unit :: Utility/./UtilityTests/ScalarTest.Scalar_512 (1575 of 2426) PASS: lldb-unit :: Utility/./UtilityTests/ArgsTest.TestAppendArg (1576 of 2426) PASS: lldb-unit :: ObjectFile/Breakpad/./ObjectFileBreakpadTests/Record.classify (1577 of 2426) PASS: lldb-api :: functionalities/data-formatter/parray/TestPrintArray.py (1578 of 2426) PASS: lldb-api :: commands/frame/diagnose/dereference-argument/TestDiagnoseDereferenceArgument.py (1579 of 2426) PASS: lldb-api :: lang/cpp/trivial_abi/TestTrivialABI.py (1580 of 2426) PASS: lldb-unit :: Utility/./UtilityTests/GeneratorTest.Get (1581 of 2426) PASS: lldb-unit :: Expression/./ExpressionTests/DiagnosticManagerTest.GetStringSeverityLabels (1582 of 2426) PASS: lldb-shell :: SymbolFile/DWARF/x86/debug-types-basic.test (1583 of 2426) PASS: lldb-api :: commands/expression/import-std-module/iterator/TestIteratorFromStdModule.py (1584 of 2426) PASS: lldb-unit :: Language/Highlighting/./HighlighterTests/HighlighterTest.ClangScalarLiterals (1585 of 2426) PASS: lldb-unit :: Symbol/./SymbolTests/TestTypeSystemClang.TestGetTypeClassTypeOfExpr (1586 of 2426) PASS: lldb-api :: commands/frame/diagnose/dereference-this/TestDiagnoseDereferenceThis.py (1587 of 2426) PASS: lldb-unit :: Symbol/./SymbolTests/TestTypeSystemClang.TestConvertAccessTypeToAccessSpecifier (1588 of 2426) FAIL: lldb-api :: lang/objc/foundation/TestObjCMethodsString.py (1589 of 2426) ******************** TEST 'lldb-api :: lang/objc/foundation/TestObjCMethodsString.py' FAILED ******************** Script: -- /Users/buildslave/jenkins/workspace/lldb-cmake-sanitized/lldb-build/lldb-test-build.noindex/copied-python /Users/buildslave/jenkins/workspace/lldb-cmake-sanitized/llvm-project/lldb/test/API/dotest.py -u CXXFLAGS -u CFLAGS --codesign-identity lldb_codesign --arch x86_64 --build-dir /Users/buildslave/jenkins/workspace/lldb-cmake-sanitized/lldb-build/lldb-test-build.noindex -t --env TERM=vt100 --env LLVM_LIBS_DIR=/Users/buildslave/jenkins/workspace/lldb-cmake-sanitized/lldb-build/./lib --inferior-env ASAN_OPTIONS=detect_stack_use_after_return=1 --inferior-env DYLD_INSERT_LIBRARIES=/Users/buildslave/jenkins/workspace/lldb-cmake-sanitized/host-compiler/lib/clang/14.0.99/lib/darwin/libclang_rt.asan_osx_dynamic.dylib --arch x86_64 --build-dir /Users/buildslave/jenkins/workspace/lldb-cmake-sanitized/lldb-build/lldb-test-build.noindex --lldb-module-cache-dir /Users/buildslave/jenkins/workspace/lldb-cmake-sanitized/lldb-build/lldb-test-build.noindex/module-cache-lldb/lldb-api --clang-module-cache-dir /Users/buildslave/jenkins/workspace/lldb-cmake-sanitized/lldb-build/lldb-test-build.noindex/module-cache-clang/lldb-api --executable /Users/buildslave/jenkins/workspace/lldb-cmake-sanitized/lldb-build/./bin/lldb --compiler /Users/buildslave/jenkins/workspace/lldb-cmake-sanitized/host-compiler/bin/clang --dsymutil /Users/buildslave/jenkins/workspace/lldb-cmake-sanitized/lldb-build/./bin/dsymutil --llvm-tools-dir /Users/buildslave/jenkins/workspace/lldb-cmake-sanitized/lldb-build/./bin --lldb-libs-dir /Users/buildslave/jenkins/workspace/lldb-cmake-sanitized/lldb-build/./lib /Users/buildslave/jenkins/workspace/lldb-cmake-sanitized/llvm-project/lldb/test/API/lang/objc/foundation -p TestObjCMethodsString.py -- Exit Code: -6

Hide Details

Command Output (stdout): -- lldb version 14.0.99 (http://labmaster3.local/git/llvm-project.git revision ec2029f986d8bb80963c1efd9e5024bfe7ac3d30) clang revision ec2029f986d8bb80963c1efd9e5024bfe7ac3d30 llvm revision ec2029f986d8bb80963c1efd9e5024bfe7ac3d30

Hide Details

-- Command Output (stderr): -- Assertion failed: (0 && "Invalid SLocOffset or bad function choice"), function getFileIDLoaded, file /Users/buildslave/jenkins/workspace/lldb-cmake-sanitized/llvm-project/clang/lib/Basic/SourceManager.cpp, line 867.

Hide Details

--

Hide Details

******************** PASS: lldb-api :: commands/watchpoints/watchpoint_commands/command/TestWatchpointCommandPython.py (1590 of 2426) PASS: lldb-api :: lang/cpp/lambdas/TestLambdas.py (1591 of 2426) PASS: lldb-shell :: SymbolFile/NativePDB/function-types-calling-conv.cpp (1592 of 2426) PASS: lldb-api :: functionalities/breakpoint/step_over_breakpoint/TestStepOverBreakpoint.py (1593 of 2426) PASS: lldb-api :: lang/cpp/namespace_definitions/TestNamespaceDefinitions.py (1594 of 2426) PASS: lldb-shell :: ObjectFile/Breakpad/sections.test (1595 of 2426) PASS: lldb-unit :: Utility/./UtilityTests/RangeTest.Union (1596 of 2426) PASS: lldb-shell :: SymbolFile/DWARF/x86/DW_TAG_variable-invalid_location.s (1597 of 2426) PASS: lldb-api :: functionalities/breakpoint/breakpoint_command/TestRegexpBreakCommand.py (1598 of 2426) PASS: lldb-unit :: Utility/./UtilityTests/RecordReplayTest.InstrumentedBarRef (1599 of 2426) PASS: lldb-unit :: Utility/./UtilityTests/LogChannelTest.EnableOptions (1600 of 2426) PASS: lldb-unit :: tools/lldb-server/tests/./LLDBServerTests/TestBase.DebugserverEnv (1601 of 2426) PASS: lldb-shell :: SymbolFile/DWARF/x86/debug_rnglists.s (1602 of 2426) PASS: lldb-api :: commands/expression/error-limit/TestExprErrorLimit.py (1603 of 2426) PASS: lldb-api :: types/TestRecursiveTypes.py (1604 of 2426) PASS: lldb-shell :: Reproducer/Functionalities/TestImageList.test (1605 of 2426) PASS: lldb-unit :: Expression/./ExpressionTests/DiagnosticManagerTest.AppendMessageAttachToLastDiag (1606 of 2426) UNSUPPORTED: lldb-shell :: ScriptInterpreter/Lua/lua.test (1607 of 2426) PASS: lldb-api :: functionalities/thread/crash_during_step/TestCrashDuringStep.py (1608 of 2426) PASS: lldb-api :: functionalities/load_unload/TestLoadUnload.py (1609 of 2426) PASS: lldb-unit :: Process/minidump/./LLDBMinidumpTests/RegisterContextMinidump.ConvertMinidumpContext_x86_64 (1610 of 2426) PASS: lldb-api :: python_api/default-constructor/TestDefaultConstructorForAPIObjects.py (1611 of 2426) PASS: lldb-api :: python_api/watchpoint/TestSetWatchpoint.py (1612 of 2426) UNSUPPORTED: lldb-api :: benchmarks/startup/TestStartupDelays.py (1613 of 2426) PASS: lldb-api :: lang/cpp/char8_t/TestCxxChar8_t.py (1614 of 2426) PASS: lldb-unit :: Process/minidump/./LLDBMinidumpTests/MinidumpParserTest.GetLinuxProcStatus (1615 of 2426) PASS: lldb-unit :: ScriptInterpreter/Python/./ScriptInterpreterPythonTests/PythonDataObjectsTest.TestModuleNameResolutionNoDot (1616 of 2426) PASS: lldb-unit :: Symbol/./SymbolTests/LineEntryTest.GetSameLineContiguousAddressRangeNestedInline (1617 of 2426) UNSUPPORTED: lldb-api :: linux/aarch64/mte_tag_faults/TestAArch64LinuxMTEMemoryTagFaults.py (1618 of 2426) PASS: lldb-unit :: Utility/./UtilityTests/CompletionRequest.TryCompleteCurrentArgMode (1619 of 2426) PASS: lldb-unit :: debugserver/./debugserverTests/RNBSocket.LoopBackConnectIPv6 (1620 of 2426) UNSUPPORTED: lldb-shell :: Subprocess/clone-follow-child.test (1621 of 2426) PASS: lldb-unit :: Language/Highlighting/./HighlighterTests/HighlighterTest.ClangTrailingBackslashMissingNewLine (1622 of 2426) PASS: lldb-unit :: Language/Highlighting/./HighlighterTests/HighlighterTest.ClangEmptyInput (1623 of 2426) PASS: lldb-unit :: Host/./HostTests/NativeProcessProtocolTest.ReadCStringFromMemory_MaxSize (1624 of 2426) PASS: lldb-api :: lang/cpp/template-specialization-type/TestTemplateSpecializationType.py (1625 of 2426) PASS: lldb-unit :: Utility/./UtilityTests/BinaryStreamTest.PutULEB128FiveBytes (1626 of 2426) PASS: lldb-api :: python_api/frame/TestFrames.py (1627 of 2426) PASS: lldb-shell :: SymbolFile/Breakpad/line-table-mixed-path-styles.test (1628 of 2426) UNSUPPORTED: lldb-shell :: Subprocess/clone-follow-parent.test (1629 of 2426) PASS: lldb-shell :: Watchpoint/SetErrorCases.test (1630 of 2426) PASS: lldb-shell :: SymbolFile/DWARF/x86/find-basic-namespace.cpp (1631 of 2426) PASS: lldb-unit :: UnwindAssembly/x86/./UnwindAssemblyx86Tests/Testx86AssemblyInspectionEngine.TestPushRBX (1632 of 2426) PASS: lldb-api :: functionalities/breakpoint/breakpoint_options/TestBreakpointOptions.py (1633 of 2426) PASS: lldb-unit :: Utility/./UtilityTests/BinaryStreamTest.PutSLEB128FourBytes (1634 of 2426) FAIL: lldb-api :: commands/expression/po_verbosity/TestPoVerbosity.py (1635 of 2426) ******************** TEST 'lldb-api :: commands/expression/po_verbosity/TestPoVerbosity.py' FAILED ******************** Script: -- /Users/buildslave/jenkins/workspace/lldb-cmake-sanitized/lldb-build/lldb-test-build.noindex/copied-python /Users/buildslave/jenkins/workspace/lldb-cmake-sanitized/llvm-project/lldb/test/API/dotest.py -u CXXFLAGS -u CFLAGS --codesign-identity lldb_codesign --arch x86_64 --build-dir /Users/buildslave/jenkins/workspace/lldb-cmake-sanitized/lldb-build/lldb-test-build.noindex -t --env TERM=vt100 --env LLVM_LIBS_DIR=/Users/buildslave/jenkins/workspace/lldb-cmake-sanitized/lldb-build/./lib --inferior-env ASAN_OPTIONS=detect_stack_use_after_return=1 --inferior-env DYLD_INSERT_LIBRARIES=/Users/buildslave/jenkins/workspace/lldb-cmake-sanitized/host-compiler/lib/clang/14.0.99/lib/darwin/libclang_rt.asan_osx_dynamic.dylib --arch x86_64 --build-dir /Users/buildslave/jenkins/workspace/lldb-cmake-sanitized/lldb-build/lldb-test-build.noindex --lldb-module-cache-dir /Users/buildslave/jenkins/workspace/lldb-cmake-sanitized/lldb-build/lldb-test-build.noindex/module-cache-lldb/lldb-api --clang-module-cache-dir /Users/buildslave/jenkins/workspace/lldb-cmake-sanitized/lldb-build/lldb-test-build.noindex/module-cache-clang/lldb-api --executable /Users/buildslave/jenkins/workspace/lldb-cmake-sanitized/lldb-build/./bin/lldb --compiler /Users/buildslave/jenkins/workspace/lldb-cmake-sanitized/host-compiler/bin/clang --dsymutil /Users/buildslave/jenkins/workspace/lldb-cmake-sanitized/lldb-build/./bin/dsymutil --llvm-tools-dir /Users/buildslave/jenkins/workspace/lldb-cmake-sanitized/lldb-build/./bin --lldb-libs-dir /Users/buildslave/jenkins/workspace/lldb-cmake-sanitized/lldb-build/./lib /Users/buildslave/jenkins/workspace/lldb-cmake-sanitized/llvm-project/lldb/test/API/commands/expression/po_verbosity -p TestPoVerbosity.py -- Exit Code: -6

Hide Details

Command Output (stdout): -- lldb version 14.0.99 (http://labmaster3.local/git/llvm-project.git revision ec2029f986d8bb80963c1efd9e5024bfe7ac3d30) clang revision ec2029f986d8bb80963c1efd9e5024bfe7ac3d30 llvm revision ec2029f986d8bb80963c1efd9e5024bfe7ac3d30

Hide Details

-- Command Output (stderr): -- Assertion failed: (0 && "Invalid SLocOffset or bad function choice"), function getFileIDLoaded, file /Users/buildslave/jenkins/workspace/lldb-cmake-sanitized/llvm-project/clang/lib/Basic/SourceManager.cpp, line 867.

Hide Details

--

Hide Details

******************** PASS: lldb-api :: python_api/debugger/TestDebuggerAPI.py (1636 of 2426) PASS: lldb-api :: functionalities/data-formatter/data-formatter-objc/TestDataFormatterObjCNSError.py (1637 of 2426) UNSUPPORTED: lldb-shell :: SymbolFile/PDB/compilands.test (1638 of 2426) PASS: lldb-shell :: Register/Core/x86-64-netbsd-fp.test (1639 of 2426) PASS: lldb-api :: commands/platform/file/read/TestPlatformFileRead.py (1640 of 2426) PASS: lldb-api :: lang/cpp/unicode-literals/TestUnicodeLiterals.py (1641 of 2426) PASS: lldb-api :: functionalities/data-formatter/data-formatter-stl/libcxx/multimap/TestDataFormatterLibccMultiMap.py (1642 of 2426) PASS: lldb-api :: api/listeners/TestListener.py (1643 of 2426) UNSUPPORTED: lldb-api :: functionalities/unwind/aarch64_unwind_pac/TestAArch64UnwindPAC.py (1644 of 2426) PASS: lldb-unit :: Utility/./UtilityTests/FileSpecTest.EqualSeparator (1645 of 2426) PASS: lldb-unit :: Expression/./ExpressionTests/CppModuleConfigurationTest.MissingUsrInclude (1646 of 2426) PASS: lldb-unit :: Utility/./UtilityTests/ConstStringTest.YAML (1647 of 2426) PASS: lldb-unit :: Platform/./LLDBPlatformTests/PlatformAppleSimulatorTest.TestHostPlatformToSim (1648 of 2426) PASS: lldb-unit :: Utility/./UtilityTests/ArchSpecTest.MergeFromMachOUnknown (1649 of 2426) UNSUPPORTED: lldb-api :: commands/watchpoints/variable_out_of_scope/TestWatchedVarHitWhenInScope.py (1650 of 2426) PASS: lldb-api :: functionalities/gdb_remote_client/TestRestartBug.py (1651 of 2426) PASS: lldb-unit :: Host/./HostTests/FileSystemTest.Exists (1652 of 2426) PASS: lldb-api :: lang/objc/modules-cache/TestClangModulesCache.py (1653 of 2426) PASS: lldb-unit :: UnwindAssembly/x86/./UnwindAssemblyx86Tests/Testx86AssemblyInspectionEngine.TestStackRealignMSVC_i386 (1654 of 2426) PASS: lldb-api :: lang/cpp/default-template-args/TestDefaultTemplateArgs.py (1655 of 2426) UNSUPPORTED: lldb-shell :: BuildScript/toolchain-msvc.test (1656 of 2426) PASS: lldb-unit :: SymbolFile/NativePDB/./SymbolFileNativePDBTests/PDBFPOProgramToDWARFExpressionTests.InvalidAssignmentSingle (1657 of 2426) PASS: lldb-shell :: Unwind/eh-frame-dwarf-unwind.test (1658 of 2426) PASS: lldb-api :: lang/cpp/symbols/TestSymbols.py (1659 of 2426) PASS: lldb-api :: python_api/function_symbol/TestDisasmAPI.py (1660 of 2426) PASS: lldb-api :: lang/c/cpp_keyword_identifiers/TestCppKeywordsAsCIdentifiers.py (1661 of 2426) PASS: lldb-unit :: Utility/./UtilityTests/StringListTest.ForRangeEmpty (1662 of 2426) PASS: lldb-api :: lang/c/enum_types/TestEnumTypes.py (1663 of 2426) PASS: lldb-shell :: Reproducer/TestDump.test (1664 of 2426) PASS: lldb-api :: functionalities/data-formatter/data-formatter-smart-array/TestDataFormatterSmartArray.py (1665 of 2426) PASS: lldb-api :: lang/cpp/namespace/TestNamespace.py (1666 of 2426) PASS: lldb-unit :: UnwindAssembly/x86/./UnwindAssemblyx86Tests/Testx86AssemblyInspectionEngine.TestLEAVE (1667 of 2426) PASS: lldb-api :: commands/expression/import-std-module/vector-bool/TestVectorBoolFromStdModule.py (1668 of 2426) PASS: lldb-unit :: UnwindAssembly/x86/./UnwindAssemblyx86Tests/Testx86AssemblyInspectionEngine.TestPushR13 (1669 of 2426) PASS: lldb-unit :: Utility/./UtilityTests/StatusTest.ErrorConstructor (1670 of 2426) PASS: lldb-api :: functionalities/target_var/no_vars/TestTargetVarNoVars.py (1671 of 2426) PASS: lldb-api :: commands/expression/import-std-module/missing-module-sources/TestStdModuleSourcesMissing.py (1672 of 2426) PASS: lldb-api :: functionalities/breakpoint/objc/TestObjCBreakpoints.py (1673 of 2426) PASS: lldb-api :: functionalities/breakpoint/auto_continue/TestBreakpointAutoContinue.py (1674 of 2426) PASS: lldb-shell :: Process/Optimization.test (1675 of 2426) UNSUPPORTED: lldb-api :: functionalities/process_save_core_minidump/TestProcessSaveCoreMinidump.py (1676 of 2426) PASS: lldb-unit :: Process/gdb-remote/./ProcessGdbRemoteTests/GDBRemoteClientBaseTest.SendContinueDelegateInterface (1677 of 2426) PASS: lldb-api :: python_api/symbol-context/two-files/TestSymbolContextTwoFiles.py (1678 of 2426) PASS: lldb-unit :: Utility/./UtilityTests/NameMatchesTest.Ignore (1679 of 2426) PASS: lldb-unit :: Platform/Android/./AdbClientTests/AdbClientTest.CreateByDeviceId (1680 of 2426) PASS: lldb-shell :: ObjectFile/ELF/duplicate-section.yaml (1681 of 2426) PASS: lldb-api :: functionalities/tail_call_frames/sbapi_support/TestTailCallFrameSBAPI.py (1682 of 2426) PASS: lldb-unit :: Utility/./UtilityTests/StringLexerTest.PutBack (1683 of 2426) UNSUPPORTED: lldb-shell :: Subprocess/vfork-follow-parent-wp.test (1684 of 2426) PASS: lldb-api :: lang/objc/forward-decl/TestForwardDecl.py (1685 of 2426) PASS: lldb-unit :: Expression/./ExpressionTests/ClangHostTest.MacOSX (1686 of 2426) PASS: lldb-unit :: Target/./TargetTests/PathMappingListTest.AbsoluteTests (1687 of 2426) PASS: lldb-shell :: Commands/command-disassemble-process.yaml (1688 of 2426) PASS: lldb-shell :: Breakpoint/split-dwarf5-debug-stroffsets.test (1689 of 2426) PASS: lldb-api :: functionalities/data-formatter/data-formatter-stl/libcxx/vbool/TestDataFormatterLibcxxVBool.py (1690 of 2426) UNSUPPORTED: lldb-shell :: ScriptInterpreter/Lua/breakpoint_oneline_callback.test (1691 of 2426) PASS: lldb-unit :: Process/minidump/./LLDBMinidumpTests/MinidumpParserTest.GetExceptionStream (1692 of 2426) PASS: lldb-unit :: Utility/./UtilityTests/StringListTest.LongestCommonPrefixEmpty (1693 of 2426) PASS: lldb-shell :: SymbolFile/DWARF/x86/debug_rnglists-dwo.s (1694 of 2426) PASS: lldb-api :: lang/objc/blocks/TestObjCIvarsInBlocks.py (1695 of 2426) PASS: lldb-shell :: Reproducer/Modules/TestModuleCXX.test (1696 of 2426) PASS: lldb-unit :: Utility/./UtilityTests/StringListTest.ShiftCString (1697 of 2426) PASS: lldb-unit :: Utility/./UtilityTests/UriParserTest.MinimalPort (1698 of 2426) PASS: lldb-api :: functionalities/thread/num_threads/TestNumThreads.py (1699 of 2426) PASS: lldb-api :: functionalities/data-formatter/data-formatter-categories/TestDataFormatterCategories.py (1700 of 2426) PASS: lldb-api :: lang/cpp/dynamic-value-same-basename/TestDynamicValueSameBase.py (1701 of 2426) PASS: lldb-unit :: Process/gdb-remote/./ProcessGdbRemoteTests/GDBRemoteClientBaseTest.SendContinueAndLateInterrupt (1702 of 2426) PASS: lldb-unit :: Utility/./UtilityTests/StringExtractorTest.GetHexBytesAvail_FullString (1703 of 2426) UNSUPPORTED: lldb-api :: functionalities/tsan/cpp_global_location/TestTsanCPPGlobalLocation.py (1704 of 2426) UNSUPPORTED: lldb-shell :: Process/Windows/exception_access_violation.cpp (1705 of 2426) PASS: lldb-api :: commands/breakpoint/command/list/TestBreakpointCommandList.py (1706 of 2426) PASS: lldb-unit :: Process/Utility/./ProcessUtilityTests/ProcMapTests/LinuxProcMapsTestFixture.ParseMapRegions/4 (1707 of 2426) PASS: lldb-shell :: SymbolFile/Breakpad/unwind-via-stack-win.test (1708 of 2426) PASS: lldb-unit :: SymbolFile/NativePDB/./SymbolFileNativePDBTests/PDBFPOProgramToDWARFExpressionTests.UnresolvedRegisterAssignmentReference (1709 of 2426) PASS: lldb-unit :: SymbolFile/DWARF/./SymbolFileDWARFTests/SymbolFileDWARFTests.TestAbbrevInvalidNULLTag (1710 of 2426) PASS: lldb-unit :: Utility/./UtilityTests/StructuredDataTest.ParseJSONFromFile (1711 of 2426) PASS: lldb-shell :: ObjectFile/PECOFF/basic-info-arm.yaml (1712 of 2426) FAIL: lldb-api :: lang/objcxx/cxx-bridged-po/TestObjCXXBridgedPO.py (1713 of 2426) ******************** TEST 'lldb-api :: lang/objcxx/cxx-bridged-po/TestObjCXXBridgedPO.py' FAILED ******************** Script: -- /Users/buildslave/jenkins/workspace/lldb-cmake-sanitized/lldb-build/lldb-test-build.noindex/copied-python /Users/buildslave/jenkins/workspace/lldb-cmake-sanitized/llvm-project/lldb/test/API/dotest.py -u CXXFLAGS -u CFLAGS --codesign-identity lldb_codesign --arch x86_64 --build-dir /Users/buildslave/jenkins/workspace/lldb-cmake-sanitized/lldb-build/lldb-test-build.noindex -t --env TERM=vt100 --env LLVM_LIBS_DIR=/Users/buildslave/jenkins/workspace/lldb-cmake-sanitized/lldb-build/./lib --inferior-env ASAN_OPTIONS=detect_stack_use_after_return=1 --inferior-env DYLD_INSERT_LIBRARIES=/Users/buildslave/jenkins/workspace/lldb-cmake-sanitized/host-compiler/lib/clang/14.0.99/lib/darwin/libclang_rt.asan_osx_dynamic.dylib --arch x86_64 --build-dir /Users/buildslave/jenkins/workspace/lldb-cmake-sanitized/lldb-build/lldb-test-build.noindex --lldb-module-cache-dir /Users/buildslave/jenkins/workspace/lldb-cmake-sanitized/lldb-build/lldb-test-build.noindex/module-cache-lldb/lldb-api --clang-module-cache-dir /Users/buildslave/jenkins/workspace/lldb-cmake-sanitized/lldb-build/lldb-test-build.noindex/module-cache-clang/lldb-api --executable /Users/buildslave/jenkins/workspace/lldb-cmake-sanitized/lldb-build/./bin/lldb --compiler /Users/buildslave/jenkins/workspace/lldb-cmake-sanitized/host-compiler/bin/clang --dsymutil /Users/buildslave/jenkins/workspace/lldb-cmake-sanitized/lldb-build/./bin/dsymutil --llvm-tools-dir /Users/buildslave/jenkins/workspace/lldb-cmake-sanitized/lldb-build/./bin --lldb-libs-dir /Users/buildslave/jenkins/workspace/lldb-cmake-sanitized/lldb-build/./lib /Users/buildslave/jenkins/workspace/lldb-cmake-sanitized/llvm-project/lldb/test/API/lang/objcxx/cxx-bridged-po -p TestObjCXXBridgedPO.py -- Exit Code: -6

Hide Details

Command Output (stdout): -- lldb version 14.0.99 (http://labmaster3.local/git/llvm-project.git revision ec2029f986d8bb80963c1efd9e5024bfe7ac3d30) clang revision ec2029f986d8bb80963c1efd9e5024bfe7ac3d30 llvm revision ec2029f986d8bb80963c1efd9e5024bfe7ac3d30

Hide Details

-- Command Output (stderr): -- Assertion failed: (0 && "Invalid SLocOffset or bad function choice"), function getFileIDLoaded, file /Users/buildslave/jenkins/workspace/lldb-cmake-sanitized/llvm-project/clang/lib/Basic/SourceManager.cpp, line 867.

Hide Details

--

Hide Details

******************** PASS: lldb-unit :: Utility/./UtilityTests/StringExtractorTest.GetHexBytes_OddPair (1714 of 2426) PASS: lldb-api :: functionalities/data-formatter/data-formatter-disabling/TestDataFormatterDisabling.py (1715 of 2426) PASS: lldb-unit :: Utility/./UtilityTests/RangeDataVector.FindEntryThatContains_Overlap (1716 of 2426) PASS: lldb-unit :: Target/./TargetTests/PathMappingListTest.CrossPlatformTests (1717 of 2426) UNSUPPORTED: lldb-shell :: Register/aarch64-gp-read.test (1718 of 2426) PASS: lldb-api :: lang/objcxx/cpp_keywords_enabled/TestObjCppKeywordsEnabled.py (1719 of 2426) PASS: lldb-api :: tools/lldb-vscode/breakpoint-events/TestVSCode_breakpointEvents.py (1720 of 2426) UNSUPPORTED: lldb-shell :: Subprocess/vfork-follow-parent-softbp.test (1721 of 2426) PASS: lldb-api :: commands/expression/import-std-module/unique_ptr/TestUniquePtrFromStdModule.py (1722 of 2426) PASS: lldb-unit :: Target/./TargetTests/DynamicRegisterInfoTest.finalize_regs (1723 of 2426) PASS: lldb-unit :: Utility/./UtilityTests/StringExtractorTest.GetHexU8_Underflow (1724 of 2426) PASS: lldb-unit :: Process/gdb-remote/./ProcessGdbRemoteTests/GDBRemoteCommunicationClientTest.GetModulesInfoInvalidResponse (1725 of 2426) PASS: lldb-api :: commands/command/source/TestCommandSource.py (1726 of 2426) PASS: lldb-unit :: Expression/./ExpressionTests/DiagnosticManagerTest.AppendMessageNoDiag (1727 of 2426) PASS: lldb-api :: commands/expression/ignore-artificial-constructors/TestIgnoreArtificialConstructors.py (1728 of 2426) PASS: lldb-unit :: UnwindAssembly/x86/./UnwindAssemblyx86Tests/Testx86AssemblyInspectionEngine.TestSimplei386ugmented (1729 of 2426) PASS: lldb-shell :: Reproducer/TestDriverOptions.test (1730 of 2426) PASS: lldb-api :: functionalities/tail_call_frames/inlining_and_tail_calls/TestInliningAndTailCalls.py (1731 of 2426) PASS: lldb-shell :: SymbolFile/DWARF/x86/dwarf5-split.s (1732 of 2426) PASS: lldb-api :: functionalities/gdb_remote_client/TestThreadSelectionBug.py (1733 of 2426) PASS: lldb-unit :: Expression/./ExpressionTests/DiagnosticManagerTest.PutString (1734 of 2426) PASS: lldb-api :: commands/platform/sdk/TestPlatformSDK.py (1735 of 2426) PASS: lldb-unit :: Signals/./SignalsTests/UnixSignalsTest.GetFilteredSignals (1736 of 2426) PASS: lldb-api :: functionalities/data-formatter/data-formatter-script/TestDataFormatterScript.py (1737 of 2426) PASS: lldb-unit :: Host/./HostTests/NativeProcessProtocolTest.SetBreakpointFailRead (1738 of 2426) PASS: lldb-unit :: Utility/./UtilityTests/RangeTest.Copy (1739 of 2426) PASS: lldb-api :: functionalities/abbreviation/TestCommonShortSpellings.py (1740 of 2426) PASS: lldb-unit :: Editline/./EditlineTests/EditlineTestFixture.EditlineReceivesSingleLineText (1741 of 2426) PASS: lldb-unit :: Symbol/./SymbolTests/PostfixExpression.ParseOneExpression (1742 of 2426) PASS: lldb-unit :: Language/CPlusPlus/./LanguageCPlusPlusTests/CPlusPlusLanguage.GenerateAlternateFunctionManglings (1743 of 2426) PASS: lldb-api :: lang/cpp/bool/TestCPPBool.py (1744 of 2426) PASS: lldb-api :: commands/frame/diagnose/virtual-method-call/TestDiagnoseDereferenceVirtualMethodCall.py (1745 of 2426) PASS: lldb-unit :: ObjectFile/PECOFF/./ObjectFilePECOFFTests/PECallFrameInfoTest.Basic_eh (1746 of 2426) PASS: lldb-unit :: Host/./HostTests/NativeProcessProtocolTest.ReadMemoryWithoutTrap (1747 of 2426) PASS: lldb-api :: macosx/duplicate-archive-members/TestDuplicateMembers.py (1748 of 2426) PASS: lldb-shell :: Settings/TestEchoCommands.test (1749 of 2426) PASS: lldb-api :: commands/expression/call-function/TestCallUserDefinedFunction.py (1750 of 2426) PASS: lldb-api :: commands/expression/import-std-module/weak_ptr-dbg-info-content/TestDbgInfoContentWeakPtrFromStdModule.py (1751 of 2426) PASS: lldb-api :: lang/objc/foundation/TestSymbolTable.py (1752 of 2426) PASS: lldb-unit :: Symbol/./SymbolTests/TestTypeSystemClang.TestUnifyAccessSpecifiers (1753 of 2426) PASS: lldb-api :: functionalities/data-formatter/format-propagation/TestFormatPropagation.py (1754 of 2426) PASS: lldb-unit :: Utility/./UtilityTests/OptionsWithRawTest.EmptyInput (1755 of 2426) UNSUPPORTED: lldb-shell :: Register/x86-64-ymm16-read.test (1756 of 2426) PASS: lldb-unit :: Platform/Android/./AdbClientTests/AdbClientTest.CreateByDeviceId_ByEnvVar (1757 of 2426) PASS: lldb-api :: commands/log/basic/TestLogging.py (1758 of 2426) PASS: lldb-unit :: Breakpoint/./LLDBBreakpointTests/BreakpointIDTest.StringIsBreakpointName (1759 of 2426) PASS: lldb-unit :: Symbol/./SymbolTests/SymbolsTest.TerminateLocateExecutableSymbolFileForUnknownExecutableAndUnknownSymbolFile (1760 of 2426) PASS: lldb-unit :: Utility/./UtilityTests/StringLexerTest.GetUnlexed (1761 of 2426) PASS: lldb-shell :: Minidump/memory-region-from-module.yaml (1762 of 2426) PASS: lldb-unit :: Host/./HostTests/FileSystemTest.OpenErrno (1763 of 2426) PASS: lldb-unit :: debugserver/./debugserverTests/RNBSocket.AnyListen (1764 of 2426) PASS: lldb-api :: functionalities/load_after_attach/TestLoadAfterAttach.py (1765 of 2426) PASS: lldb-shell :: SymbolFile/NativePDB/bitfields.cpp (1766 of 2426) PASS: lldb-unit :: Utility/./UtilityTests/Flags.AllClear (1767 of 2426) PASS: lldb-unit :: Utility/./UtilityTests/DataExtractorTest.GetMaxU64_unchecked (1768 of 2426) PASS: lldb-unit :: Utility/./UtilityTests/StructuredDataTest.StringDump (1769 of 2426) PASS: lldb-shell :: SymbolFile/DWARF/x86/debug_loc.s (1770 of 2426) UNSUPPORTED: lldb-api :: functionalities/unwind/ehframe/TestEhFrameUnwind.py (1771 of 2426) PASS: lldb-api :: lang/c/step-target/TestStepTarget.py (1772 of 2426) PASS: lldb-unit :: Expression/./ExpressionTests/DiagnosticManagerTest.GetStringMultiline (1773 of 2426) PASS: lldb-unit :: Process/minidump/./LLDBMinidumpTests/MinidumpParserTest.GetMemoryRegionInfo (1774 of 2426) PASS: lldb-api :: functionalities/postmortem/elf-core/TestLinuxCore.py (1775 of 2426) PASS: lldb-unit :: Core/./LLDBCoreTests/SourceLocationSpecTest.OperatorBool (1776 of 2426) PASS: lldb-unit :: Core/./LLDBCoreTests/DumpDataExtractorTest.BaseAddress (1777 of 2426) PASS: lldb-unit :: Utility/./UtilityTests/LogTest.LLDB_LOG_nullptr (1778 of 2426) PASS: lldb-unit :: Process/gdb-remote/./ProcessGdbRemoteTests/GDBRemoteClientBaseTest.SendContinueAndInterrupt2PacketBug (1779 of 2426) PASS: lldb-shell :: Process/TestEnvironment.test (1780 of 2426) PASS: lldb-shell :: SymbolFile/NativePDB/global-classes.cpp (1781 of 2426) UNSUPPORTED: lldb-shell :: Register/x86-zmm-read.test (1782 of 2426) PASS: lldb-shell :: SymbolFile/DWARF/x86/find-variable-file.cpp (1783 of 2426) PASS: lldb-unit :: Utility/./UtilityTests/OptionsWithRawTest.EmptyArgsOnlySuffix (1784 of 2426) PASS: lldb-unit :: Utility/./UtilityTests/StreamTest.PutULEB128 (1785 of 2426) UNSUPPORTED: lldb-shell :: SymbolFile/dissassemble-entry-point.s (1786 of 2426) PASS: lldb-shell :: Breakpoint/dummy-target.test (1787 of 2426) PASS: lldb-unit :: Host/./HostTests/MainLoopTest.TerminatesImmediately (1788 of 2426) PASS: lldb-shell :: ObjectFile/ELF/avr-basic-info.yaml (1789 of 2426) PASS: lldb-unit :: UnwindAssembly/x86/./UnwindAssemblyx86Tests/Testx86AssemblyInspectionEngine.TestPushEBX (1790 of 2426) PASS: lldb-shell :: Settings/TestModuleCacheSanity.test (1791 of 2426) PASS: lldb-unit :: ScriptInterpreter/Python/./ScriptInterpreterPythonTests/PythonDataObjectsTest.TestCallable (1792 of 2426) PASS: lldb-api :: functionalities/optimized_code/TestNoASanExceptionAfterEvalOP_piece.py (1793 of 2426) UNSUPPORTED: lldb-shell :: BuildScript/toolchain-clang-cl.test (1794 of 2426) PASS: lldb-unit :: Utility/./UtilityTests/ArchSpecTest.YAML (1795 of 2426) PASS: lldb-api :: python_api/type/TestTypeList.py (1796 of 2426) UNSUPPORTED: lldb-api :: tools/lldb-server/TestGdbRemoteFork.py (1797 of 2426) PASS: lldb-shell :: ObjectFile/ELF/minidebuginfo-find-symbols.yaml (1798 of 2426) UNSUPPORTED: lldb-shell :: SymbolFile/PDB/func-symbols.test (1799 of 2426) PASS: lldb-shell :: SymbolFile/DWARF/x86/inline-function-address-shared.test (1800 of 2426) PASS: lldb-unit :: Core/./LLDBCoreTests/SourceLocationSpecTest.FileLineColumnComponents (1801 of 2426) UNSUPPORTED: lldb-api :: functionalities/breakpoint/breakpoint_callback_command_source/TestBreakpointCallbackCommandSource.py (1802 of 2426) PASS: lldb-api :: tools/lldb-server/TestGdbRemoteRegisterState.py (1803 of 2426) PASS: lldb-api :: commands/expression/import-std-module/no-std-module/TestMissingStdModule.py (1804 of 2426) PASS: lldb-api :: lang/objc/cpp_keyword_identifiers/TestCppKeywordsAsObjCIdentifiers.py (1805 of 2426) UNSUPPORTED: lldb-shell :: SymbolFile/PDB/expressions.test (1806 of 2426) PASS: lldb-unit :: Process/Utility/./ProcessUtilityTests/MemoryTagManagerAArch64MTETest.GetLogicalTag (1807 of 2426) PASS: lldb-unit :: Host/./HostTests/ProcessLaunchInfoTest.Constructor (1808 of 2426) PASS: lldb-unit :: Host/./HostTests/SocketTests/SocketTest.TCPGetConnectURI/ipv6 (1809 of 2426) FAIL: lldb-api :: commands/expression/import_builtin_fileid/TestImportBuiltinFileID.py (1810 of 2426) ******************** TEST 'lldb-api :: commands/expression/import_builtin_fileid/TestImportBuiltinFileID.py' FAILED ******************** Script: -- /Users/buildslave/jenkins/workspace/lldb-cmake-sanitized/lldb-build/lldb-test-build.noindex/copied-python /Users/buildslave/jenkins/workspace/lldb-cmake-sanitized/llvm-project/lldb/test/API/dotest.py -u CXXFLAGS -u CFLAGS --codesign-identity lldb_codesign --arch x86_64 --build-dir /Users/buildslave/jenkins/workspace/lldb-cmake-sanitized/lldb-build/lldb-test-build.noindex -t --env TERM=vt100 --env LLVM_LIBS_DIR=/Users/buildslave/jenkins/workspace/lldb-cmake-sanitized/lldb-build/./lib --inferior-env ASAN_OPTIONS=detect_stack_use_after_return=1 --inferior-env DYLD_INSERT_LIBRARIES=/Users/buildslave/jenkins/workspace/lldb-cmake-sanitized/host-compiler/lib/clang/14.0.99/lib/darwin/libclang_rt.asan_osx_dynamic.dylib --arch x86_64 --build-dir /Users/buildslave/jenkins/workspace/lldb-cmake-sanitized/lldb-build/lldb-test-build.noindex --lldb-module-cache-dir /Users/buildslave/jenkins/workspace/lldb-cmake-sanitized/lldb-build/lldb-test-build.noindex/module-cache-lldb/lldb-api --clang-module-cache-dir /Users/buildslave/jenkins/workspace/lldb-cmake-sanitized/lldb-build/lldb-test-build.noindex/module-cache-clang/lldb-api --executable /Users/buildslave/jenkins/workspace/lldb-cmake-sanitized/lldb-build/./bin/lldb --compiler /Users/buildslave/jenkins/workspace/lldb-cmake-sanitized/host-compiler/bin/clang --dsymutil /Users/buildslave/jenkins/workspace/lldb-cmake-sanitized/lldb-build/./bin/dsymutil --llvm-tools-dir /Users/buildslave/jenkins/workspace/lldb-cmake-sanitized/lldb-build/./bin --lldb-libs-dir /Users/buildslave/jenkins/workspace/lldb-cmake-sanitized/lldb-build/./lib /Users/buildslave/jenkins/workspace/lldb-cmake-sanitized/llvm-project/lldb/test/API/commands/expression/import_builtin_fileid -p TestImportBuiltinFileID.py -- Exit Code: -6

Hide Details

Command Output (stdout): -- lldb version 14.0.99 (http://labmaster3.local/git/llvm-project.git revision ec2029f986d8bb80963c1efd9e5024bfe7ac3d30) clang revision ec2029f986d8bb80963c1efd9e5024bfe7ac3d30 llvm revision ec2029f986d8bb80963c1efd9e5024bfe7ac3d30

Hide Details

-- Command Output (stderr): -- Assertion failed: (0 && "Invalid SLocOffset or bad function choice"), function getFileIDLoaded, file /Users/buildslave/jenkins/workspace/lldb-cmake-sanitized/llvm-project/clang/lib/Basic/SourceManager.cpp, line 867.

Hide Details

--

Hide Details

******************** PASS: lldb-unit :: Process/gdb-remote/./ProcessGdbRemoteTests/PortMapTest.FreePortForProcess (1811 of 2426) PASS: lldb-shell :: ObjectFile/wasm/unified-debug-sections.yaml (1812 of 2426) PASS: lldb-unit :: Utility/./UtilityTests/BinaryStreamTest.PutSLEB128EightBytes (1813 of 2426) PASS: lldb-api :: functionalities/pre_run_dylibs/TestPreRunDylibs.py (1814 of 2426) PASS: lldb-shell :: Register/Core/x86-64-netbsd-multithread.test (1815 of 2426) PASS: lldb-api :: functionalities/thread/step_out/TestThreadStepOut.py (1816 of 2426) PASS: lldb-shell :: ObjectFile/ELF/null-jmprel.yaml (1817 of 2426) PASS: lldb-unit :: Utility/./UtilityTests/AnsiTerminal.Empty (1818 of 2426) PASS: lldb-api :: lang/cpp/multiple-inheritance/TestCppMultipleInheritance.py (1819 of 2426) PASS: lldb-api :: commands/expression/radar_9673664/TestExprHelpExamples.py (1820 of 2426) PASS: lldb-api :: functionalities/stop-on-sharedlibrary-load/TestStopOnSharedlibraryEvents.py (1821 of 2426) PASS: lldb-shell :: SymbolFile/DWARF/x86/DW_OP_piece-struct.s (1822 of 2426) PASS: lldb-api :: commands/expression/timeout/TestCallWithTimeout.py (1823 of 2426) PASS: lldb-unit :: Expression/./ExpressionTests/DWARFExpressionMockProcessTest.DW_OP_deref (1824 of 2426) PASS: lldb-api :: functionalities/thread/concurrent_events/TestConcurrentDelayedCrashWithBreakpointSignal.py (1825 of 2426) PASS: lldb-api :: functionalities/mtc/simple/TestMTCSimple.py (1826 of 2426) PASS: lldb-api :: commands/help/TestHelp.py (1827 of 2426) PASS: lldb-unit :: Target/./TargetTests/DynamicRegisterInfoTest.no_finalize_regs (1828 of 2426) PASS: lldb-api :: functionalities/plugins/python_os_plugin/TestPythonOSPlugin.py (1829 of 2426) PASS: lldb-unit :: Utility/./UtilityTests/AnsiTerminal.WhiteSpace (1830 of 2426) PASS: lldb-unit :: ObjectFile/ELF/./ObjectFileELFTests/ObjectFileELFTest.GetModuleSpecifications_EarlySectionHeaders (1831 of 2426) PASS: lldb-unit :: Utility/./UtilityTests/ConstStringTest.format_provider (1832 of 2426) PASS: lldb-unit :: Utility/./UtilityTests/ScalarTest.GetValue (1833 of 2426) PASS: lldb-api :: functionalities/lazy-loading/TestLazyLoading.py (1834 of 2426) PASS: lldb-api :: functionalities/postmortem/wow64_minidump/TestWow64MiniDump.py (1835 of 2426) PASS: lldb-unit :: Utility/./UtilityTests/RecordReplayTest.InvalidSequence (1836 of 2426) PASS: lldb-unit :: UnwindAssembly/x86/./UnwindAssemblyx86Tests/Testx86AssemblyInspectionEngine.Test32BitOnlyInstruction (1837 of 2426) PASS: lldb-api :: functionalities/thread/concurrent_events/TestConcurrentTwoBreakpointsOneWatchpoint.py (1838 of 2426) PASS: lldb-unit :: Utility/./UtilityTests/BinaryStreamTest.PutSLEB128One (1839 of 2426) PASS: lldb-unit :: Utility/./UtilityTests/StringLexerTest.NextIfList (1840 of 2426) PASS: lldb-api :: commands/expression/persistent_types/TestPersistentTypes.py (1841 of 2426) PASS: lldb-api :: tools/lldb-vscode/runInTerminal/TestVSCode_runInTerminal.py (1842 of 2426) UNSUPPORTED: lldb-api :: functionalities/breakpoint/hardware_breakpoints/write_memory_with_hw_breakpoint/TestWriteMemoryWithHWBreakpoint.py (1843 of 2426) FAIL: lldb-api :: lang/objc/print-obj/TestPrintObj.py (1844 of 2426) ******************** TEST 'lldb-api :: lang/objc/print-obj/TestPrintObj.py' FAILED ******************** Script: -- /Users/buildslave/jenkins/workspace/lldb-cmake-sanitized/lldb-build/lldb-test-build.noindex/copied-python /Users/buildslave/jenkins/workspace/lldb-cmake-sanitized/llvm-project/lldb/test/API/dotest.py -u CXXFLAGS -u CFLAGS --codesign-identity lldb_codesign --arch x86_64 --build-dir /Users/buildslave/jenkins/workspace/lldb-cmake-sanitized/lldb-build/lldb-test-build.noindex -t --env TERM=vt100 --env LLVM_LIBS_DIR=/Users/buildslave/jenkins/workspace/lldb-cmake-sanitized/lldb-build/./lib --inferior-env ASAN_OPTIONS=detect_stack_use_after_return=1 --inferior-env DYLD_INSERT_LIBRARIES=/Users/buildslave/jenkins/workspace/lldb-cmake-sanitized/host-compiler/lib/clang/14.0.99/lib/darwin/libclang_rt.asan_osx_dynamic.dylib --arch x86_64 --build-dir /Users/buildslave/jenkins/workspace/lldb-cmake-sanitized/lldb-build/lldb-test-build.noindex --lldb-module-cache-dir /Users/buildslave/jenkins/workspace/lldb-cmake-sanitized/lldb-build/lldb-test-build.noindex/module-cache-lldb/lldb-api --clang-module-cache-dir /Users/buildslave/jenkins/workspace/lldb-cmake-sanitized/lldb-build/lldb-test-build.noindex/module-cache-clang/lldb-api --executable /Users/buildslave/jenkins/workspace/lldb-cmake-sanitized/lldb-build/./bin/lldb --compiler /Users/buildslave/jenkins/workspace/lldb-cmake-sanitized/host-compiler/bin/clang --dsymutil /Users/buildslave/jenkins/workspace/lldb-cmake-sanitized/lldb-build/./bin/dsymutil --llvm-tools-dir /Users/buildslave/jenkins/workspace/lldb-cmake-sanitized/lldb-build/./bin --lldb-libs-dir /Users/buildslave/jenkins/workspace/lldb-cmake-sanitized/lldb-build/./lib /Users/buildslave/jenkins/workspace/lldb-cmake-sanitized/llvm-project/lldb/test/API/lang/objc/print-obj -p TestPrintObj.py -- Exit Code: -6

Hide Details

Command Output (stdout): -- lldb version 14.0.99 (http://labmaster3.local/git/llvm-project.git revision ec2029f986d8bb80963c1efd9e5024bfe7ac3d30) clang revision ec2029f986d8bb80963c1efd9e5024bfe7ac3d30 llvm revision ec2029f986d8bb80963c1efd9e5024bfe7ac3d30

Hide Details

-- Command Output (stderr): -- Assertion failed: (0 && "Invalid SLocOffset or bad function choice"), function getFileIDLoaded, file /Users/buildslave/jenkins/workspace/lldb-cmake-sanitized/llvm-project/clang/lib/Basic/SourceManager.cpp, line 867.

Hide Details

--

Hide Details

******************** PASS: lldb-shell :: ObjectFile/wasm/embedded-debug-sections.yaml (1845 of 2426) PASS: lldb-unit :: Utility/./UtilityTests/ReproducerTest.SetReplay (1846 of 2426) PASS: lldb-unit :: Utility/./UtilityTests/StringListTest.LongestCommonPrefixDuplicateElement (1847 of 2426) PASS: lldb-unit :: ScriptInterpreter/Python/./ScriptInterpreterPythonTests/PythonDataObjectsTest.TestGlobalNameResolutionWithDot (1848 of 2426) PASS: lldb-unit :: Interpreter/./InterpreterTests/CompletionTest.FileCompletionAbsolute (1849 of 2426) PASS: lldb-api :: tools/lldb-server/TestGdbRemoteKill.py (1850 of 2426) UNSUPPORTED: lldb-api :: functionalities/thread/create_during_step/TestCreateDuringStep.py (1851 of 2426) PASS: lldb-api :: commands/expression/import-std-module/list/TestListFromStdModule.py (1852 of 2426) PASS: lldb-api :: lang/c/register_variables/TestRegisterVariables.py (1853 of 2426) PASS: lldb-unit :: UnwindAssembly/x86/./UnwindAssemblyx86Tests/Testx86AssemblyInspectionEngine.TestPushEDX (1854 of 2426) PASS: lldb-api :: functionalities/gdb_remote_client/TestPartialGPacket.py (1855 of 2426) UNSUPPORTED: lldb-api :: functionalities/gdb_remote_client/TestWasm.py (1856 of 2426) UNSUPPORTED: lldb-api :: functionalities/ptrauth_diagnostics/brkC47x_code/TestPtrauthBRKc47xDiagnostic.py (1857 of 2426) PASS: lldb-shell :: Breakpoint/debug_rnglist_rlestartend.test (1858 of 2426) PASS: lldb-api :: functionalities/thread/concurrent_events/TestConcurrentTwoWatchpointsOneSignal.py (1859 of 2426) PASS: lldb-unit :: Process/Utility/./ProcessUtilityTests/ProcSMapTests/LinuxProcSMapsTestFixture.ParseSMapRegions/9 (1860 of 2426) FAIL: lldb-api :: lang/objc/self/TestObjCSelf.py (1861 of 2426) ******************** TEST 'lldb-api :: lang/objc/self/TestObjCSelf.py' FAILED ******************** Script: -- /Users/buildslave/jenkins/workspace/lldb-cmake-sanitized/lldb-build/lldb-test-build.noindex/copied-python /Users/buildslave/jenkins/workspace/lldb-cmake-sanitized/llvm-project/lldb/test/API/dotest.py -u CXXFLAGS -u CFLAGS --codesign-identity lldb_codesign --arch x86_64 --build-dir /Users/buildslave/jenkins/workspace/lldb-cmake-sanitized/lldb-build/lldb-test-build.noindex -t --env TERM=vt100 --env LLVM_LIBS_DIR=/Users/buildslave/jenkins/workspace/lldb-cmake-sanitized/lldb-build/./lib --inferior-env ASAN_OPTIONS=detect_stack_use_after_return=1 --inferior-env DYLD_INSERT_LIBRARIES=/Users/buildslave/jenkins/workspace/lldb-cmake-sanitized/host-compiler/lib/clang/14.0.99/lib/darwin/libclang_rt.asan_osx_dynamic.dylib --arch x86_64 --build-dir /Users/buildslave/jenkins/workspace/lldb-cmake-sanitized/lldb-build/lldb-test-build.noindex --lldb-module-cache-dir /Users/buildslave/jenkins/workspace/lldb-cmake-sanitized/lldb-build/lldb-test-build.noindex/module-cache-lldb/lldb-api --clang-module-cache-dir /Users/buildslave/jenkins/workspace/lldb-cmake-sanitized/lldb-build/lldb-test-build.noindex/module-cache-clang/lldb-api --executable /Users/buildslave/jenkins/workspace/lldb-cmake-sanitized/lldb-build/./bin/lldb --compiler /Users/buildslave/jenkins/workspace/lldb-cmake-sanitized/host-compiler/bin/clang --dsymutil /Users/buildslave/jenkins/workspace/lldb-cmake-sanitized/lldb-build/./bin/dsymutil --llvm-tools-dir /Users/buildslave/jenkins/workspace/lldb-cmake-sanitized/lldb-build/./bin --lldb-libs-dir /Users/buildslave/jenkins/workspace/lldb-cmake-sanitized/lldb-build/./lib /Users/buildslave/jenkins/workspace/lldb-cmake-sanitized/llvm-project/lldb/test/API/lang/objc/self -p TestObjCSelf.py -- Exit Code: -6

Hide Details

Command Output (stdout): -- lldb version 14.0.99 (http://labmaster3.local/git/llvm-project.git revision ec2029f986d8bb80963c1efd9e5024bfe7ac3d30) clang revision ec2029f986d8bb80963c1efd9e5024bfe7ac3d30 llvm revision ec2029f986d8bb80963c1efd9e5024bfe7ac3d30

Hide Details

-- Command Output (stderr): -- Assertion failed: (0 && "Invalid SLocOffset or bad function choice"), function getFileIDLoaded, file /Users/buildslave/jenkins/workspace/lldb-cmake-sanitized/llvm-project/clang/lib/Basic/SourceManager.cpp, line 867.

Hide Details

--

Hide Details

******************** PASS: lldb-api :: functionalities/target-new-solib-notifications/TestModuleLoadedNotifys.py (1862 of 2426) PASS: lldb-unit :: Expression/./ExpressionTests/DWARFExpression.DW_OP_unknown (1863 of 2426) PASS: lldb-api :: functionalities/data-formatter/nsarraysynth/TestNSArraySynthetic.py (1864 of 2426) PASS: lldb-api :: lang/cpp/struct_with_keyword_name/TestStructWithKeywordName.py (1865 of 2426) PASS: lldb-api :: commands/settings/TestSettings.py (1866 of 2426) PASS: lldb-api :: functionalities/gdb_remote_client/TestJLink6Armv7RegisterDefinition.py (1867 of 2426) PASS: lldb-unit :: Expression/./ExpressionTests/CppModuleConfigurationTest.AmbiguousLibCpp (1868 of 2426) PASS: lldb-api :: functionalities/thread/concurrent_events/TestConcurrentManyCrash.py (1869 of 2426) PASS: lldb-unit :: Utility/./UtilityTests/PassiveReplayTest.InstrumentedBar (1870 of 2426) PASS: lldb-api :: lang/cpp/extern_c/TestExternCSymbols.py (1871 of 2426) UNSUPPORTED: lldb-api :: functionalities/data-formatter/data-formatter-stl/libstdcpp/string/TestDataFormatterStdString.py (1872 of 2426) PASS: lldb-api :: commands/expression/import-std-module/shared_ptr/TestSharedPtrFromStdModule.py (1873 of 2426) PASS: lldb-shell :: SymbolFile/DWARF/x86/debug_ranges-missing-section.s (1874 of 2426) PASS: lldb-api :: lang/cpp/rvalue-references/TestRvalueReferences.py (1875 of 2426) PASS: lldb-unit :: Utility/./UtilityTests/LogTest.Unregister (1876 of 2426) UNSUPPORTED: lldb-api :: functionalities/tsan/thread_numbers/TestTsanThreadNumbers.py (1877 of 2426) PASS: lldb-unit :: Utility/./UtilityTests/StreamTest.PutHex16ByteOrderLittle (1878 of 2426) PASS: lldb-shell :: SymbolFile/DWARF/x86/debug-types-missing-signature.test (1879 of 2426) PASS: lldb-unit :: Utility/./UtilityTests/EnvironmentTest.EnvpConversion (1880 of 2426) PASS: lldb-unit :: Utility/./UtilityTests/ConstStringTest.UpdateMangledCounterpart (1881 of 2426) PASS: lldb-shell :: Breakpoint/debug_rnglist_basic.test (1882 of 2426) UNSUPPORTED: lldb-api :: lang/objc/objc-dynamic-value/TestObjCDynamicValue.py (1883 of 2426) UNSUPPORTED: lldb-shell :: SymbolFile/DWARF/dwarf5-lazy-dwo.c (1884 of 2426) PASS: lldb-shell :: SymbolFile/DWARF/x86/DW_AT_const_value-bitfields.s (1885 of 2426) PASS: lldb-shell :: Reproducer/Functionalities/TestStepping.test (1886 of 2426) PASS: lldb-shell :: VSCode/TestOptions.test (1887 of 2426) PASS: lldb-unit :: Utility/./UtilityTests/XcodeSDKTest.GetCanonicalNameAndConstruct (1888 of 2426) PASS: lldb-unit :: Utility/./UtilityTests/SubsystemRAIITest.SubsystemWithErrorFailure (1889 of 2426) UNSUPPORTED: lldb-shell :: Subprocess/vfork-follow-child-wp.test (1890 of 2426) PASS: lldb-unit :: UnwindAssembly/x86/./UnwindAssemblyx86Tests/Testx86AssemblyInspectionEngine.TestPopR12 (1891 of 2426) PASS: lldb-unit :: ScriptInterpreter/Python/./ScriptInterpreterPythonTests/PythonDataObjectsTest.TestPythonDictionaryManipulation (1892 of 2426) PASS: lldb-unit :: Utility/./UtilityTests/StringExtractorTest.GetU64LittleEndian (1893 of 2426) PASS: lldb-api :: python_api/watchpoint/TestWatchpointIgnoreCount.py (1894 of 2426) PASS: lldb-unit :: Utility/./UtilityTests/StatusTest.Formatv (1895 of 2426) PASS: lldb-unit :: Utility/./UtilityTests/CompletionRequest.Constructor (1896 of 2426) PASS: lldb-unit :: Utility/./UtilityTests/DataExtractorTest.GetMaxU64 (1897 of 2426) PASS: lldb-unit :: Utility/./UtilityTests/FileSpecTest.IsRelative (1898 of 2426) PASS: lldb-api :: lang/cpp/covariant-return-types/TestCovariantReturnTypes.py (1899 of 2426) PASS: lldb-unit :: Utility/./UtilityTests/StreamTest.AddressRangeSize (1900 of 2426) PASS: lldb-shell :: Register/x86-multithread-read.test (1901 of 2426) PASS: lldb-shell :: ObjectFile/ELF/PT_LOAD-overlap-section.yaml (1902 of 2426) PASS: lldb-unit :: Process/Utility/./ProcessUtilityTests/MemoryTagManagerAArch64MTETest.AddressDiff (1903 of 2426) UNSUPPORTED: lldb-api :: functionalities/ptrauth_diagnostics/BRAA_error/TestPtrauthBRAADiagnostic.py (1904 of 2426) PASS: lldb-shell :: ScriptInterpreter/Python/Crashlog/parser_json.test (1905 of 2426) PASS: lldb-shell :: ScriptInterpreter/Python/Crashlog/parser_text.test (1906 of 2426) UNSUPPORTED: lldb-api :: commands/expression/completion-crash-invalid-iterator/TestInvalidIteratorCompletionCrash.py (1907 of 2426) PASS: lldb-shell :: SymbolFile/DWARF/dwo-relative-path.s (1908 of 2426) PASS: lldb-api :: functionalities/postmortem/elf-core/thread_crash/TestLinuxCoreThreads.py (1909 of 2426) UNSUPPORTED: lldb-shell :: SymbolFile/PDB/function-level-linking.test (1910 of 2426) PASS: lldb-unit :: Utility/./UtilityTests/StreamTest.AddressSuffix (1911 of 2426) PASS: lldb-unit :: Process/Utility/./ProcessUtilityTests/ProcSMapTests/LinuxProcSMapsTestFixture.ParseSMapRegions/5 (1912 of 2426) PASS: lldb-api :: functionalities/data-formatter/data-formatter-objc/TestDataFormatterObjCNSBundle.py (1913 of 2426) PASS: lldb-api :: functionalities/memory/tag/TestMemoryTag.py (1914 of 2426) PASS: lldb-shell :: ObjectFile/ELF/PT_LOAD.yaml (1915 of 2426) PASS: lldb-api :: functionalities/data-formatter/data-formatter-objc/cmtime/TestDataFormatterCMTime.py (1916 of 2426) UNSUPPORTED: lldb-shell :: ScriptInterpreter/Lua/independent_state.test (1917 of 2426) PASS: lldb-api :: functionalities/thread/create_after_attach/TestCreateAfterAttach.py (1918 of 2426) PASS: lldb-api :: functionalities/data-formatter/data-formatter-python-synth/TestDataFormatterPythonSynth.py (1919 of 2426) UNSUPPORTED: lldb-shell :: ObjectFile/PECOFF/disassemble-thumb.yaml (1920 of 2426) PASS: lldb-unit :: Utility/./UtilityTests/StreamTeeTest.Write (1921 of 2426) PASS: lldb-api :: functionalities/dead-strip/TestDeadStrip.py (1922 of 2426) PASS: lldb-shell :: Reproducer/TestDiscard.test (1923 of 2426) PASS: lldb-api :: commands/platform/process/list/TestProcessList.py (1924 of 2426) PASS: lldb-api :: driver/batch_mode/TestBatchMode.py (1925 of 2426) PASS: lldb-unit :: Utility/./UtilityTests/AnsiTerminal.AtEnd (1926 of 2426) PASS: lldb-shell :: BuildScript/toolchain-clang.test (1927 of 2426) PASS: lldb-shell :: Commands/command-regex-delete.test (1928 of 2426) PASS: lldb-api :: lang/c/blocks/TestBlocks.py (1929 of 2426) PASS: lldb-api :: tools/lldb-vscode/console/TestVSCode_redirection_to_console.py (1930 of 2426) PASS: lldb-unit :: Utility/./UtilityTests/UriParserTest.SchemeHostSeparator2 (1931 of 2426) PASS: lldb-shell :: SymbolFile/DWARF/x86/split-dwarf-multiple-cu.ll (1932 of 2426) PASS: lldb-unit :: Host/./HostTests/TerminalTest.PipeIsNotATerminal (1933 of 2426) PASS: lldb-api :: functionalities/data-formatter/user-format-vs-summary/TestUserFormatVsSummary.py (1934 of 2426) PASS: lldb-api :: functionalities/gdb_remote_client/TestqOffsets.py (1935 of 2426) PASS: lldb-unit :: Signals/./SignalsTests/UnixSignalsTest.VersionChange (1936 of 2426) PASS: lldb-shell :: Register/Core/x86-32-freebsd-addr.test (1937 of 2426) PASS: lldb-api :: lang/objc/objc-checker/TestObjCCheckers.py (1938 of 2426) PASS: lldb-api :: commands/expression/options/TestExprOptions.py (1939 of 2426) PASS: lldb-unit :: Utility/./UtilityTests/RegularExpression.CopyAssignment (1940 of 2426) UNSUPPORTED: lldb-shell :: SymbolFile/DWARF/x86/dwarf5-line-strp.s (1941 of 2426) PASS: lldb-unit :: Symbol/./SymbolTests/TestTypeSystemClang.TemplateArguments (1942 of 2426) PASS: lldb-unit :: UnwindAssembly/x86/./UnwindAssemblyx86Tests/Testx86AssemblyInspectionEngine.TestSimple32bitFrameFunction (1943 of 2426) PASS: lldb-shell :: ObjectFile/PECOFF/section-types.yaml (1944 of 2426) PASS: lldb-unit :: Utility/./UtilityTests/LogChannelEnabledTest.LogThread (1945 of 2426) PASS: lldb-unit :: SymbolFile/DWARF/./SymbolFileDWARFTests/SymbolFileDWARFTests.TestAbbrevOutOfOrder (1946 of 2426) PASS: lldb-shell :: SymbolFile/Breakpad/stack-cfi-parsing.test (1947 of 2426) PASS: lldb-unit :: Process/Utility/./ProcessUtilityTests/ProcSMapTests/LinuxProcSMapsTestFixture.ParseSMapRegions/6 (1948 of 2426) PASS: lldb-api :: functionalities/gdb_remote_client/TestGDBRemotePlatformFile.py (1949 of 2426) PASS: lldb-unit :: Process/gdb-remote/./ProcessGdbRemoteTests/GDBRemoteCommunicationClientTest.TestPacketSpeedJSON (1950 of 2426) PASS: lldb-unit :: Process/Utility/./ProcessUtilityTests/MemoryTagManagerAArch64MTETest.ExpandToGranule (1951 of 2426) PASS: lldb-unit :: Process/minidump/./LLDBMinidumpTests/MinidumpParserTest.GetMemoryRegionInfoFromMemoryList (1952 of 2426) PASS: lldb-unit :: Core/./LLDBCoreTests/SourceFileCache.FindSourceFileFound (1953 of 2426) PASS: lldb-unit :: Symbol/./SymbolTests/TestTypeSystemClang.TestDisplayNameEmpty (1954 of 2426) PASS: lldb-api :: commands/expression/ir-interpreter-phi-nodes/TestIRInterpreterPHINodes.py (1955 of 2426) PASS: lldb-unit :: UnwindAssembly/x86/./UnwindAssemblyx86Tests/Testx86AssemblyInspectionEngine.TestStackRealign32BitDisp_x86_64 (1956 of 2426) PASS: lldb-unit :: Process/Utility/./ProcessUtilityTests/MemoryTagManagerAArch64MTETest.MakeTaggedRange (1957 of 2426) PASS: lldb-unit :: Utility/./UtilityTests/XcodeSDKTest.MergeTest (1958 of 2426) PASS: lldb-shell :: SymbolFile/DWARF/x86/dwp.s (1959 of 2426) PASS: lldb-unit :: Utility/./UtilityTests/StreamTeeTest.Flush (1960 of 2426) PASS: lldb-api :: lang/cpp/scope/TestCppScope.py (1961 of 2426) PASS: lldb-unit :: Utility/./UtilityTests/UriParserTest.SchemeHostSeparator (1962 of 2426) PASS: lldb-api :: functionalities/data-formatter/data-formatter-stl/libcxx/map/TestDataFormatterLibccMap.py (1963 of 2426) PASS: lldb-shell :: SymbolFile/Breakpad/line-table-edgecases.test (1964 of 2426) PASS: lldb-unit :: ScriptInterpreter/Python/./ScriptInterpreterPythonTests/PythonDataObjectsTest.TestPythonTupleSize (1965 of 2426) PASS: lldb-api :: commands/frame/diagnose/local-variable/TestLocalVariable.py (1966 of 2426) PASS: lldb-unit :: Utility/./UtilityTests/OptionsWithRawTest.WhitespaceInput (1967 of 2426) PASS: lldb-api :: functionalities/gdb_remote_client/TestWriteMemory.py (1968 of 2426) PASS: lldb-shell :: ObjectFile/ELF/compressed-sections.yaml (1969 of 2426) UNSUPPORTED: lldb-shell :: Watchpoint/netbsd-nouserdbregs.test (1970 of 2426) PASS: lldb-unit :: ScriptInterpreter/Python/./ScriptInterpreterPythonTests/PythonDataObjectsTest.TestPythonString (1971 of 2426) PASS: lldb-unit :: Utility/./UtilityTests/StringListTest.JoinEmpty (1972 of 2426) PASS: lldb-api :: commands/expression/radar_9531204/TestPrintfAfterUp.py (1973 of 2426) PASS: lldb-unit :: Utility/./UtilityTests/RangeTest.SizeTypes (1974 of 2426) PASS: lldb-unit :: Utility/./UtilityTests/StringExtractorTest.GetHexBytesAvail (1975 of 2426) PASS: lldb-unit :: Symbol/./SymbolTests/TestCreateClassTemplateDecl.FindExistingTemplates (1976 of 2426) PASS: lldb-unit :: Utility/./UtilityTests/ArgsTest.ReplaceArgumentAtIndexEqual (1977 of 2426) PASS: lldb-unit :: Process/minidump/./LLDBMinidumpTests/MinidumpParserTest.InvalidMinidump (1978 of 2426) PASS: lldb-api :: functionalities/reproducers/attach/TestReproducerAttach.py (1979 of 2426) UNSUPPORTED: lldb-shell :: SymbolFile/target-symbols-add-unwind.test (1980 of 2426) PASS: lldb-unit :: Platform/./LLDBPlatformTests/PlatformDarwinTest.TestParseVersionBuildDir (1981 of 2426) PASS: lldb-api :: functionalities/data-formatter/type_summary_list_arg/TestTypeSummaryListArg.py (1982 of 2426) PASS: lldb-unit :: Utility/./UtilityTests/ArgsTest.StringListConstructor (1983 of 2426) PASS: lldb-shell :: Settings/TestDisableColor.test (1984 of 2426) PASS: lldb-shell :: Reproducer/TestReuseDirectory.test (1985 of 2426) PASS: lldb-api :: python_api/thread/TestThreadAPI.py (1986 of 2426) PASS: lldb-shell :: SymbolFile/DWARF/x86/inline-function-address.ll (1987 of 2426) PASS: lldb-api :: lang/cpp/call-function/TestCallCPPFunction.py (1988 of 2426) PASS: lldb-shell :: Register/Core/x86-64-netbsd-gp.test (1989 of 2426) UNSUPPORTED: lldb-shell :: Register/x86-fp-read.test (1990 of 2426) PASS: lldb-unit :: API/./APITests/SBStructuredDataTest.NullImpl (1991 of 2426) PASS: lldb-api :: functionalities/archives/TestBSDArchives.py (1992 of 2426) PASS: lldb-unit :: Utility/./UtilityTests/StreamTest.PutSLEB128 (1993 of 2426) PASS: lldb-api :: lang/cpp/class_types/TestClassTypes.py (1994 of 2426) PASS: lldb-api :: commands/platform/file/close/TestPlatformFileClose.py (1995 of 2426) PASS: lldb-api :: functionalities/breakpoint/source_regexp/TestSourceRegexBreakpoints.py (1996 of 2426) PASS: lldb-unit :: Symbol/./SymbolTests/TestClangASTImporter.RecordLayout (1997 of 2426) PASS: lldb-api :: functionalities/breakpoint/move_nearest/TestMoveNearest.py (1998 of 2426) PASS: lldb-shell :: ObjectFile/ELF/basic-info.yaml (1999 of 2426) PASS: lldb-unit :: Expression/./ExpressionTests/ClangExpressionDeclMapTest.TestPersistentDeclLookup (2000 of 2426) PASS: lldb-unit :: Utility/./UtilityTests/DataExtractorTest.GetCStrAtNullOffset (2001 of 2426) PASS: lldb-shell :: SymbolFile/DWARF/x86/compilercontext.ll (2002 of 2426) PASS: lldb-api :: functionalities/plugins/command_plugin/TestPluginCommands.py (2003 of 2426) PASS: lldb-api :: functionalities/breakpoint/inlined_breakpoints/TestInlinedBreakpoints.py (2004 of 2426) PASS: lldb-api :: tools/lldb-vscode/variables/TestVSCode_variables.py (2005 of 2426) PASS: lldb-unit :: Utility/./UtilityTests/BinaryStreamTest.PutULEB128ThreeBytes (2006 of 2426) PASS: lldb-shell :: Process/UnsupportedLanguage.test (2007 of 2426) PASS: lldb-unit :: Utility/./UtilityTests/ArgsTest.Yaml (2008 of 2426) UNSUPPORTED: lldb-api :: commands/trace/TestTraceSave.py (2009 of 2426) PASS: lldb-api :: lang/cpp/printf/TestPrintf.py (2010 of 2426) UNSUPPORTED: lldb-api :: functionalities/data-formatter/data-formatter-stl/libstdcpp/tuple/TestDataFormatterStdTuple.py (2011 of 2426) UNSUPPORTED: lldb-shell :: ObjectFile/ELF/minidebuginfo-no-lzma.yaml (2012 of 2426) PASS: lldb-unit :: Utility/./UtilityTests/StreamTeeTest.AppendStream (2013 of 2426) PASS: lldb-unit :: Language/CPlusPlus/./LanguageCPlusPlusTests/CPlusPlusLanguage.CPlusPlusNameParser (2014 of 2426) PASS: lldb-unit :: UnwindAssembly/x86/./UnwindAssemblyx86Tests/Testx86AssemblyInspectionEngine.TestDisassemblyMidFunctionEpilogues (2015 of 2426) PASS: lldb-shell :: SymbolFile/DWARF/x86/gnu-style-compression.cpp (2016 of 2426) UNSUPPORTED: lldb-api :: functionalities/thread/multi_break/TestMultipleBreakpoints.py (2017 of 2426) PASS: lldb-shell :: SymbolFile/NativePDB/disassembly.cpp (2018 of 2426) PASS: lldb-unit :: Symbol/./SymbolTests/TestTypeSystemClang.TestFunctionTemplateInRecordConstruction (2019 of 2426) PASS: lldb-api :: lang/objc/objc-stepping/TestObjCStepping.py (2020 of 2426) PASS: lldb-shell :: Driver/TestUseColor.test (2021 of 2426) PASS: lldb-unit :: Utility/./UtilityTests/StateTest.Formatv (2022 of 2426) PASS: lldb-api :: lang/cpp/subst_template_type_param/TestSubstTemplateTypeParam.py (2023 of 2426) PASS: lldb-api :: commands/expression/context-object-objc/TestContextObjectObjc.py (2024 of 2426) PASS: lldb-unit :: Expression/./ExpressionTests/DWARFExpression.DW_OP_stack_value (2025 of 2426) PASS: lldb-unit :: Process/minidump/./LLDBMinidumpTests/MinidumpParserTest.GetThreadsAndGetThreadContext (2026 of 2426) PASS: lldb-unit :: Utility/./UtilityTests/StringExtractorTest.DecodeHexU8_Exact (2027 of 2426) PASS: lldb-shell :: Register/Core/x86-32-linux-fp.test (2028 of 2426) PASS: lldb-unit :: Utility/./UtilityTests/ScalarTest.ExtractBitfield (2029 of 2426) PASS: lldb-api :: commands/watchpoints/watchpoint_size/TestWatchpointSizes.py (2030 of 2426) PASS: lldb-api :: lang/cpp/pointer_to_member_type_depending_on_parent_size/TestPointerToMemberTypeDependingOnParentSize.py (2031 of 2426) PASS: lldb-unit :: Utility/./UtilityTests/RegisterValueTest.GetSet8 (2032 of 2426) PASS: lldb-unit :: Language/Highlighting/./HighlighterTests/HighlighterTest.Keywords (2033 of 2426) PASS: lldb-unit :: Utility/./UtilityTests/BinaryStreamTest.PutULEB128FourBytes (2034 of 2426) PASS: lldb-api :: commands/expression/persistent_variables/TestPersistentVariables.py (2035 of 2426) UNSUPPORTED: lldb-api :: functionalities/asan/TestMemoryHistory.py (2036 of 2426) PASS: lldb-api :: lang/cpp/typedef/TestCppTypedef.py (2037 of 2426) PASS: lldb-api :: macosx/DBGSourcePathRemapping/TestDSYMSourcePathRemapping.py (2038 of 2426) UNSUPPORTED: lldb-api :: linux/sepdebugsymlink/TestTargetSymbolsSepDebugSymlink.py (2039 of 2426) PASS: lldb-unit :: Platform/./LLDBPlatformTests/PlatformDarwinTest.FindComponentInPath (2040 of 2426) PASS: lldb-api :: lang/cpp/bitfields/TestCppBitfields.py (2041 of 2426) UNSUPPORTED: lldb-api :: tools/lldb-server/TestGdbRemoteModuleInfo.py (2042 of 2426) PASS: lldb-unit :: Process/minidump/./LLDBMinidumpTests/MinidumpParserTest.MinidumpDuplicateModuleMappedSecondHigh (2043 of 2426) PASS: lldb-unit :: Utility/./UtilityTests/StringExtractorGDBRemoteTest.GetPidTidMultipleValues (2044 of 2426) PASS: lldb-unit :: Utility/./UtilityTests/FileSpecTest.GuessPathStyle (2045 of 2426) PASS: lldb-api :: tools/lldb-vscode/module/TestVSCode_module.py (2046 of 2426) PASS: lldb-shell :: Settings/TestLineMarkerColor.test (2047 of 2426) PASS: lldb-unit :: Utility/./UtilityTests/ArgsTest.ReplaceArgumentAtIndexFarOutOfRange (2048 of 2426) PASS: lldb-shell :: ScriptInterpreter/Python/python.test (2049 of 2426) PASS: lldb-unit :: Host/./HostTests/FileSystemTest.EnumerateDirectory (2050 of 2426) FAIL: lldb-api :: lang/objc/objc-static-method/TestObjCStaticMethod.py (2051 of 2426) ******************** TEST 'lldb-api :: lang/objc/objc-static-method/TestObjCStaticMethod.py' FAILED ******************** Script: -- /Users/buildslave/jenkins/workspace/lldb-cmake-sanitized/lldb-build/lldb-test-build.noindex/copied-python /Users/buildslave/jenkins/workspace/lldb-cmake-sanitized/llvm-project/lldb/test/API/dotest.py -u CXXFLAGS -u CFLAGS --codesign-identity lldb_codesign --arch x86_64 --build-dir /Users/buildslave/jenkins/workspace/lldb-cmake-sanitized/lldb-build/lldb-test-build.noindex -t --env TERM=vt100 --env LLVM_LIBS_DIR=/Users/buildslave/jenkins/workspace/lldb-cmake-sanitized/lldb-build/./lib --inferior-env ASAN_OPTIONS=detect_stack_use_after_return=1 --inferior-env DYLD_INSERT_LIBRARIES=/Users/buildslave/jenkins/workspace/lldb-cmake-sanitized/host-compiler/lib/clang/14.0.99/lib/darwin/libclang_rt.asan_osx_dynamic.dylib --arch x86_64 --build-dir /Users/buildslave/jenkins/workspace/lldb-cmake-sanitized/lldb-build/lldb-test-build.noindex --lldb-module-cache-dir /Users/buildslave/jenkins/workspace/lldb-cmake-sanitized/lldb-build/lldb-test-build.noindex/module-cache-lldb/lldb-api --clang-module-cache-dir /Users/buildslave/jenkins/workspace/lldb-cmake-sanitized/lldb-build/lldb-test-build.noindex/module-cache-clang/lldb-api --executable /Users/buildslave/jenkins/workspace/lldb-cmake-sanitized/lldb-build/./bin/lldb --compiler /Users/buildslave/jenkins/workspace/lldb-cmake-sanitized/host-compiler/bin/clang --dsymutil /Users/buildslave/jenkins/workspace/lldb-cmake-sanitized/lldb-build/./bin/dsymutil --llvm-tools-dir /Users/buildslave/jenkins/workspace/lldb-cmake-sanitized/lldb-build/./bin --lldb-libs-dir /Users/buildslave/jenkins/workspace/lldb-cmake-sanitized/lldb-build/./lib /Users/buildslave/jenkins/workspace/lldb-cmake-sanitized/llvm-project/lldb/test/API/lang/objc/objc-static-method -p TestObjCStaticMethod.py -- Exit Code: -6

Hide Details

Command Output (stdout): -- lldb version 14.0.99 (http://labmaster3.local/git/llvm-project.git revision ec2029f986d8bb80963c1efd9e5024bfe7ac3d30) clang revision ec2029f986d8bb80963c1efd9e5024bfe7ac3d30 llvm revision ec2029f986d8bb80963c1efd9e5024bfe7ac3d30

Hide Details

-- Command Output (stderr): -- Assertion failed: (0 && "Invalid SLocOffset or bad function choice"), function getFileIDLoaded, file /Users/buildslave/jenkins/workspace/lldb-cmake-sanitized/llvm-project/clang/lib/Basic/SourceManager.cpp, line 867.

Hide Details

--

Hide Details

******************** PASS: lldb-api :: functionalities/thread/concurrent_events/TestConcurrentSignalDelayWatch.py (2052 of 2426) PASS: lldb-unit :: Utility/./UtilityTests/StringListTest.RemoveBlankLines (2053 of 2426) PASS: lldb-unit :: Utility/./UtilityTests/StringListTest.Assignment (2054 of 2426) PASS: lldb-shell :: Quit/TestQuitExitCodeTooManyArgs.test (2055 of 2426) PASS: lldb-unit :: ScriptInterpreter/Python/./ScriptInterpreterPythonTests/PythonDataObjectsTest.TestPythonDictionaryValueEquality (2056 of 2426) PASS: lldb-api :: lang/objc/modules-inline-functions/TestModulesInlineFunctions.py (2057 of 2426) PASS: lldb-api :: functionalities/data-formatter/data-formatter-stl/libcxx/string/TestDataFormatterLibcxxString.py (2058 of 2426) PASS: lldb-unit :: Editline/./EditlineTests/EditlineTestFixture.EditlineReceivesMultiLineText (2059 of 2426) UNSUPPORTED: lldb-shell :: SymbolFile/PDB/class-layout.test (2060 of 2426) PASS: lldb-unit :: Expression/./ExpressionTests/CppModuleConfigurationTest.LinuxLocalLibCpp (2061 of 2426) PASS: lldb-unit :: Utility/./UtilityTests/UriParserTest.BracketedHostname (2062 of 2426) PASS: lldb-api :: functionalities/breakpoint/breakpoint_names/TestBreakpointNames.py (2063 of 2426) PASS: lldb-shell :: SymbolFile/DWARF/x86/DW_AT_const_value.s (2064 of 2426) UNSUPPORTED: lldb-api :: functionalities/tsan/basic/TestTsanBasic.py (2065 of 2426) PASS: lldb-shell :: SymbolFile/DWARF/x86/DW_TAG_variable-DW_AT_const_value.s (2066 of 2426) PASS: lldb-unit :: SymbolFile/DWARF/./SymbolFileDWARFTests/SymbolFileDWARFTests.TestAbbrevOrder1Start5 (2067 of 2426) PASS: lldb-shell :: SymbolFile/DWARF/x86/find-method-local-struct.cpp (2068 of 2426) PASS: lldb-api :: lang/cpp/template/TestTemplateArgs.py (2069 of 2426) PASS: lldb-api :: commands/expression/import-std-module/stack/TestStackFromStdModule.py (2070 of 2426) UNSUPPORTED: lldb-shell :: Subprocess/fork-follow-child-softbp.test (2071 of 2426) PASS: lldb-api :: lang/cpp/static_member_type_depending_on_parent_size/TestStaticMemberTypeDependingOnParentSize.py (2072 of 2426) PASS: lldb-unit :: Utility/./UtilityTests/StringExtractorTest.DecodeHexU8_Underflow2 (2073 of 2426) PASS: lldb-unit :: Utility/./UtilityTests/ScalarTest.GetBytes (2074 of 2426) PASS: lldb-unit :: Utility/./UtilityTests/StreamTest.PutHex16ByteOrderBig (2075 of 2426) PASS: lldb-unit :: Utility/./UtilityTests/RecordReplayTest.InstrumentedFoo (2076 of 2426) PASS: lldb-api :: commands/watchpoints/multiple_threads/TestWatchpointMultipleThreads.py (2077 of 2426) PASS: lldb-unit :: Language/Highlighting/./HighlighterTests/HighlighterTest.ClangBraces (2078 of 2426) PASS: lldb-unit :: UnwindAssembly/x86/./UnwindAssemblyx86Tests/Testx86AssemblyInspectionEngine.TestPushESI (2079 of 2426) PASS: lldb-shell :: Register/Core/x86-32-freebsd-gp.test (2080 of 2426) UNSUPPORTED: lldb-shell :: Register/x86-64-ymm16-write.test (2081 of 2426) PASS: lldb-shell :: Breakpoint/breakpoint-command.test (2082 of 2426) UNSUPPORTED: lldb-shell :: Unwind/basic-block-sections.test (2083 of 2426) PASS: lldb-unit :: UnwindAssembly/x86/./UnwindAssemblyx86Tests/Testx86AssemblyInspectionEngine.TestPushR15 (2084 of 2426) PASS: lldb-unit :: Utility/./UtilityTests/StreamTest.QuotedCString (2085 of 2426) PASS: lldb-api :: functionalities/tail_call_frames/disambiguate_paths_to_common_sink/TestDisambiguatePathsToCommonSink.py (2086 of 2426) PASS: lldb-unit :: Process/gdb-remote/./ProcessGdbRemoteTests/GDBRemoteCommunicationServerTest.SendErrorResponse_UnimplementedError (2087 of 2426) PASS: lldb-unit :: Utility/./UtilityTests/ReproducerTest.SetCapture (2088 of 2426) PASS: lldb-unit :: Utility/./UtilityTests/RangeTest.LessThanInvalid (2089 of 2426) PASS: lldb-shell :: Quit/TestQuitExitCode0.test (2090 of 2426) PASS: lldb-unit :: Utility/./UtilityTests/UriParserTest.TypicalPortPathIPv6 (2091 of 2426) PASS: lldb-api :: api/command-return-object/TestSBCommandReturnObject.py (2092 of 2426) PASS: lldb-shell :: SymbolFile/DWARF/x86/find-function-regex.cpp (2093 of 2426) PASS: lldb-api :: commands/expression/unwind_expression/TestUnwindExpression.py (2094 of 2426) PASS: lldb-unit :: Symbol/./SymbolTests/TestTypeSystemClang.TestBuiltinTypeForEncodingAndBitSize (2095 of 2426) PASS: lldb-api :: functionalities/tail_call_frames/thread_step_out_or_return/TestSteppingOutWithArtificialFrames.py (2096 of 2426) PASS: lldb-api :: functionalities/data-formatter/pyobjsynthprovider/TestPyObjSynthProvider.py (2097 of 2426) PASS: lldb-api :: functionalities/gdb_remote_client/TestPlatformClient.py (2098 of 2426) PASS: lldb-unit :: Utility/./UtilityTests/VMRange.Clear (2099 of 2426) PASS: lldb-api :: commands/expression/formatters/TestFormatters.py (2100 of 2426) UNSUPPORTED: lldb-api :: commands/trace/TestTraceDumpInfo.py (2101 of 2426) PASS: lldb-unit :: Target/./TargetTests/ModuleCacheTest.GetAndPutStrangeHostname (2102 of 2426) PASS: lldb-api :: functionalities/tail_call_frames/unambiguous_sequence/TestUnambiguousTailCalls.py (2103 of 2426) UNSUPPORTED: lldb-shell :: Register/arm-fp-read.test (2104 of 2426) PASS: lldb-unit :: Utility/./UtilityTests/OptionsWithRawTest.MultiWordSuffix (2105 of 2426) PASS: lldb-api :: lang/cpp/offsetof/TestOffsetofCpp.py (2106 of 2426) PASS: lldb-unit :: Utility/./UtilityTests/StatusTest.ErrorCodeConstructor (2107 of 2426) PASS: lldb-unit :: Core/./LLDBCoreTests/DumpDataExtractorTest.NullStream (2108 of 2426) PASS: lldb-shell :: Driver/TestSingleQuote.test (2109 of 2426) PASS: lldb-unit :: Utility/./UtilityTests/StringExtractorTest.GetHexU8_InvalidHex_NoEof (2110 of 2426) PASS: lldb-api :: commands/apropos/basic/TestApropos.py (2111 of 2426) UNSUPPORTED: lldb-api :: lua_api/TestLuaAPI.py (2112 of 2426) PASS: lldb-unit :: Process/gdb-remote/./ProcessGdbRemoteTests/GDBRemoteCommunicationClientTest.SendSignalsToIgnore (2113 of 2426) PASS: lldb-api :: functionalities/breakpoint/debugbreak/TestDebugBreak.py (2114 of 2426) PASS: lldb-unit :: Utility/./UtilityTests/SerializationRountripTest.SerializeDeserializePodPointers (2115 of 2426) PASS: lldb-unit :: Utility/./UtilityTests/ArgsTest.ReplaceArgumentAtIndexShort (2116 of 2426) PASS: lldb-unit :: Core/./LLDBCoreTests/ModuleSpecTest.TestELFFile (2117 of 2426) PASS: lldb-unit :: Host/./HostTests/ConnectionFileDescriptorTest.TCPGetURIv4 (2118 of 2426) PASS: lldb-unit :: Symbol/./SymbolTests/SymbolsTest.LocateExecutableSymbolFileForUnknownExecutableAndMissingSymbolFile (2119 of 2426) PASS: lldb-api :: commands/watchpoints/watchpoint_count/TestWatchpointCount.py (2120 of 2426) PASS: lldb-api :: commands/process/launch/TestProcessLaunch.py (2121 of 2426) PASS: lldb-shell :: ScriptInterpreter/Python/eof.test (2122 of 2426) FAIL: lldb-api :: lang/objc/objc-optimized/TestObjcOptimized.py (2123 of 2426) ******************** TEST 'lldb-api :: lang/objc/objc-optimized/TestObjcOptimized.py' FAILED ******************** Script: -- /Users/buildslave/jenkins/workspace/lldb-cmake-sanitized/lldb-build/lldb-test-build.noindex/copied-python /Users/buildslave/jenkins/workspace/lldb-cmake-sanitized/llvm-project/lldb/test/API/dotest.py -u CXXFLAGS -u CFLAGS --codesign-identity lldb_codesign --arch x86_64 --build-dir /Users/buildslave/jenkins/workspace/lldb-cmake-sanitized/lldb-build/lldb-test-build.noindex -t --env TERM=vt100 --env LLVM_LIBS_DIR=/Users/buildslave/jenkins/workspace/lldb-cmake-sanitized/lldb-build/./lib --inferior-env ASAN_OPTIONS=detect_stack_use_after_return=1 --inferior-env DYLD_INSERT_LIBRARIES=/Users/buildslave/jenkins/workspace/lldb-cmake-sanitized/host-compiler/lib/clang/14.0.99/lib/darwin/libclang_rt.asan_osx_dynamic.dylib --arch x86_64 --build-dir /Users/buildslave/jenkins/workspace/lldb-cmake-sanitized/lldb-build/lldb-test-build.noindex --lldb-module-cache-dir /Users/buildslave/jenkins/workspace/lldb-cmake-sanitized/lldb-build/lldb-test-build.noindex/module-cache-lldb/lldb-api --clang-module-cache-dir /Users/buildslave/jenkins/workspace/lldb-cmake-sanitized/lldb-build/lldb-test-build.noindex/module-cache-clang/lldb-api --executable /Users/buildslave/jenkins/workspace/lldb-cmake-sanitized/lldb-build/./bin/lldb --compiler /Users/buildslave/jenkins/workspace/lldb-cmake-sanitized/host-compiler/bin/clang --dsymutil /Users/buildslave/jenkins/workspace/lldb-cmake-sanitized/lldb-build/./bin/dsymutil --llvm-tools-dir /Users/buildslave/jenkins/workspace/lldb-cmake-sanitized/lldb-build/./bin --lldb-libs-dir /Users/buildslave/jenkins/workspace/lldb-cmake-sanitized/lldb-build/./lib /Users/buildslave/jenkins/workspace/lldb-cmake-sanitized/llvm-project/lldb/test/API/lang/objc/objc-optimized -p TestObjcOptimized.py -- Exit Code: -6

Hide Details

Command Output (stdout): -- lldb version 14.0.99 (http://labmaster3.local/git/llvm-project.git revision ec2029f986d8bb80963c1efd9e5024bfe7ac3d30) clang revision ec2029f986d8bb80963c1efd9e5024bfe7ac3d30 llvm revision ec2029f986d8bb80963c1efd9e5024bfe7ac3d30 a.out was compiled with optimization - stepping may behave oddly; variables may not be available. a.out was compiled with optimization - stepping may behave oddly; variables may not be available. a.out was compiled with optimization - stepping may behave oddly; variables may not be available.

Hide Details

-- Command Output (stderr): -- Assertion failed: (0 && "Invalid SLocOffset or bad function choice"), function getFileIDLoaded, file /Users/buildslave/jenkins/workspace/lldb-cmake-sanitized/llvm-project/clang/lib/Basic/SourceManager.cpp, line 867.

Hide Details

--

Hide Details

******************** PASS: lldb-api :: lang/cpp/virtual-functions/TestCppVirtualFunctions.py (2124 of 2426) PASS: lldb-shell :: Reproducer/TestRelativePath.test (2125 of 2426) PASS: lldb-api :: commands/watchpoints/watchpoint_set_command/TestWatchLocationWithWatchSet.py (2126 of 2426) PASS: lldb-api :: lang/cpp/signed_types/TestSignedTypes.py (2127 of 2426) PASS: lldb-unit :: Utility/./UtilityTests/ProcessInstanceInfo.DumpTable_invalidUID (2128 of 2426) UNSUPPORTED: lldb-shell :: SymbolFile/PDB/calling-conventions.test (2129 of 2426) PASS: lldb-shell :: Unwind/thread-step-out-ret-addr-check.test (2130 of 2426) PASS: lldb-unit :: Language/Highlighting/./HighlighterTests/HighlighterTest.ClangCommas (2131 of 2426) UNSUPPORTED: lldb-api :: functionalities/exec/TestExec.py (2132 of 2426) PASS: lldb-shell :: SymbolFile/DWARF/DW_AT_range-DW_FORM_sec_offset.s (2133 of 2426) UNSUPPORTED: lldb-api :: commands/gui/basicdebug/TestGuiBasicDebug.py (2134 of 2426) PASS: lldb-unit :: Utility/./UtilityTests/UriParserTest.Empty (2135 of 2426) PASS: lldb-shell :: Reproducer/TestFinalize.test (2136 of 2426) PASS: lldb-api :: commands/expression/class_template_specialization_empty_pack/TestClassTemplateSpecializationParametersHandling.py (2137 of 2426) PASS: lldb-api :: lang/cpp/nested-class-other-compilation-unit/TestNestedClassWithParentInAnotherCU.py (2138 of 2426) UNSUPPORTED: lldb-api :: functionalities/thread/thread_specific_break_plus_condition/TestThreadSpecificBpPlusCondition.py (2139 of 2426) PASS: lldb-shell :: SymbolFile/DWARF/x86/parallel-indexing-stress.s (2140 of 2426) PASS: lldb-unit :: Utility/./UtilityTests/OptionsWithRawTest.SingleWhitespaceInput (2141 of 2426) PASS: lldb-unit :: Utility/./UtilityTests/StringExtractorTest.GetNameColonValueContainsColon (2142 of 2426) PASS: lldb-api :: commands/process/launch-with-shellexpand/TestLaunchWithShellExpand.py (2143 of 2426) FAIL: lldb-api :: commands/expression/namespace_local_var_same_name_obj_c/TestNamespaceLocalVarSameNameObjC.py (2144 of 2426) ******************** TEST 'lldb-api :: commands/expression/namespace_local_var_same_name_obj_c/TestNamespaceLocalVarSameNameObjC.py' FAILED ******************** Script: -- /Users/buildslave/jenkins/workspace/lldb-cmake-sanitized/lldb-build/lldb-test-build.noindex/copied-python /Users/buildslave/jenkins/workspace/lldb-cmake-sanitized/llvm-project/lldb/test/API/dotest.py -u CXXFLAGS -u CFLAGS --codesign-identity lldb_codesign --arch x86_64 --build-dir /Users/buildslave/jenkins/workspace/lldb-cmake-sanitized/lldb-build/lldb-test-build.noindex -t --env TERM=vt100 --env LLVM_LIBS_DIR=/Users/buildslave/jenkins/workspace/lldb-cmake-sanitized/lldb-build/./lib --inferior-env ASAN_OPTIONS=detect_stack_use_after_return=1 --inferior-env DYLD_INSERT_LIBRARIES=/Users/buildslave/jenkins/workspace/lldb-cmake-sanitized/host-compiler/lib/clang/14.0.99/lib/darwin/libclang_rt.asan_osx_dynamic.dylib --arch x86_64 --build-dir /Users/buildslave/jenkins/workspace/lldb-cmake-sanitized/lldb-build/lldb-test-build.noindex --lldb-module-cache-dir /Users/buildslave/jenkins/workspace/lldb-cmake-sanitized/lldb-build/lldb-test-build.noindex/module-cache-lldb/lldb-api --clang-module-cache-dir /Users/buildslave/jenkins/workspace/lldb-cmake-sanitized/lldb-build/lldb-test-build.noindex/module-cache-clang/lldb-api --executable /Users/buildslave/jenkins/workspace/lldb-cmake-sanitized/lldb-build/./bin/lldb --compiler /Users/buildslave/jenkins/workspace/lldb-cmake-sanitized/host-compiler/bin/clang --dsymutil /Users/buildslave/jenkins/workspace/lldb-cmake-sanitized/lldb-build/./bin/dsymutil --llvm-tools-dir /Users/buildslave/jenkins/workspace/lldb-cmake-sanitized/lldb-build/./bin --lldb-libs-dir /Users/buildslave/jenkins/workspace/lldb-cmake-sanitized/lldb-build/./lib /Users/buildslave/jenkins/workspace/lldb-cmake-sanitized/llvm-project/lldb/test/API/commands/expression/namespace_local_var_same_name_obj_c -p TestNamespaceLocalVarSameNameObjC.py -- Exit Code: -6

Hide Details

Command Output (stdout): -- lldb version 14.0.99 (http://labmaster3.local/git/llvm-project.git revision ec2029f986d8bb80963c1efd9e5024bfe7ac3d30) clang revision ec2029f986d8bb80963c1efd9e5024bfe7ac3d30 llvm revision ec2029f986d8bb80963c1efd9e5024bfe7ac3d30

Hide Details

-- Command Output (stderr): -- Assertion failed: (0 && "Invalid SLocOffset or bad function choice"), function getFileIDLoaded, file /Users/buildslave/jenkins/workspace/lldb-cmake-sanitized/llvm-project/clang/lib/Basic/SourceManager.cpp, line 867.

Hide Details

--

Hide Details

******************** UNSUPPORTED: lldb-api :: functionalities/thread/state/TestThreadStates.py (2145 of 2426) UNSUPPORTED: lldb-api :: commands/expression/call-restarts/TestCallThatRestarts.py (2146 of 2426) PASS: lldb-shell :: Breakpoint/jit-loader_rtdyld_elf.test (2147 of 2426) PASS: lldb-api :: commands/expression/import-std-module/sysroot/TestStdModuleSysroot.py (2148 of 2426) PASS: lldb-unit :: UnwindAssembly/x86/./UnwindAssemblyx86Tests/Testx86AssemblyInspectionEngine.TestSpArithx86_64Augmented (2149 of 2426) PASS: lldb-unit :: SymbolFile/DWARF/./SymbolFileDWARFTests/XcodeSDKModuleTests.TestModuleGetXcodeSDK (2150 of 2426) PASS: lldb-unit :: Process/minidump/./LLDBMinidumpTests/MinidumpParserTest.GetThreadContext_x86_64 (2151 of 2426) UNSUPPORTED: lldb-shell :: Minidump/Windows/arm-fp-unwind.test (2152 of 2426) PASS: lldb-unit :: Utility/./UtilityTests/BinaryStreamTest.PutSLEB128ThreeBytes (2153 of 2426) PASS: lldb-unit :: Utility/./UtilityTests/StreamTest.ChangingByteOrder (2154 of 2426) PASS: lldb-unit :: Target/./TargetTests/ModuleCacheTest.GetAndPut (2155 of 2426) PASS: lldb-unit :: Utility/./UtilityTests/StringExtractorTest.GetNameColonValueSuccess (2156 of 2426) UNSUPPORTED: lldb-api :: commands/platform/connect/TestPlatformConnect.py (2157 of 2426) PASS: lldb-shell :: Breakpoint/debug_rnglist_offset_pair.test (2158 of 2426) PASS: lldb-api :: commands/expression/calculator_mode/TestCalculatorMode.py (2159 of 2426) PASS: lldb-shell :: SymbolFile/NativePDB/function-types-classes.cpp (2160 of 2426) UNSUPPORTED: lldb-shell :: ScriptInterpreter/Lua/watchpoint_callback.test (2161 of 2426) PASS: lldb-shell :: SymbolFile/DWARF/x86/debug-types-line-tables.s (2162 of 2426) PASS: lldb-unit :: Utility/./UtilityTests/BinaryStreamTest.PutULEB128One (2163 of 2426) PASS: lldb-api :: commands/command/regex/TestRegexCommand.py (2164 of 2426) PASS: lldb-api :: functionalities/thread/thread_exit/TestThreadExit.py (2165 of 2426) PASS: lldb-api :: functionalities/data-formatter/data-formatter-stl/libcxx/list/loop/TestDataFormatterLibcxxListLoop.py (2166 of 2426) PASS: lldb-unit :: ScriptInterpreter/Python/./ScriptInterpreterPythonTests/PythonDataObjectsTest.TestPythonBoolean (2167 of 2426) UNSUPPORTED: lldb-shell :: ExecControl/StopHook/stop-hook-threads.test (2168 of 2426) PASS: lldb-unit :: Language/Highlighting/./HighlighterTests/HighlighterTest.ClangCursorPosEndOfLine (2169 of 2426) PASS: lldb-unit :: UnwindAssembly/x86/./UnwindAssemblyx86Tests/Testx86AssemblyInspectionEngine.TestSubRSP (2170 of 2426) PASS: lldb-shell :: Minidump/disassemble-no-module.yaml (2171 of 2426) PASS: lldb-api :: functionalities/type_lookup/TestTypeLookup.py (2172 of 2426) PASS: lldb-unit :: Utility/./UtilityTests/DeserializerTest.HasData (2173 of 2426) PASS: lldb-unit :: Utility/./UtilityTests/OptionsWithRawTest.WhitespaceSuffix (2174 of 2426) PASS: lldb-api :: python_api/value/TestValueAPI.py (2175 of 2426) UNSUPPORTED: lldb-api :: iohandler/resize/TestIOHandlerResize.py (2176 of 2426) PASS: lldb-unit :: Utility/./UtilityTests/XcodeSDKTest.ParseTest (2177 of 2426) PASS: lldb-api :: functionalities/thread/concurrent_events/TestConcurrentCrashWithWatchpointBreakpointSignal.py (2178 of 2426) PASS: lldb-unit :: Utility/./UtilityTests/RangeTest.DoesAdjoinOrIntersect (2179 of 2426) PASS: lldb-api :: functionalities/recursion/TestValueObjectRecursion.py (2180 of 2426) PASS: lldb-unit :: Utility/./UtilityTests/RangeDataVector.FindEntryThatContains (2181 of 2426) PASS: lldb-shell :: Register/Core/x86-64-linux-gp.test (2182 of 2426) PASS: lldb-unit :: Expression/./ExpressionTests/CppModuleConfigurationTest.AmbiguousCLib (2183 of 2426) PASS: lldb-shell :: lldb-server/TestGdbserverPort.test (2184 of 2426) PASS: lldb-unit :: Utility/./UtilityTests/BinaryStreamTest.PutSLEB128TwoBytes (2185 of 2426) PASS: lldb-shell :: Settings/TestSettingsWrite.test (2186 of 2426) PASS: lldb-api :: commands/expression/radar_8638051/Test8638051.py (2187 of 2426) PASS: lldb-unit :: Host/./HostTests/SocketTests/SocketTest.TCPListen0GetPort/ipv6 (2188 of 2426) PASS: lldb-unit :: Utility/./UtilityTests/StringListTest.LongestCommonPrefix (2189 of 2426) PASS: lldb-unit :: Utility/./UtilityTests/ScalarTest.RightShiftOperator (2190 of 2426) PASS: lldb-api :: commands/log/invalid-args/TestInvalidArgsLog.py (2191 of 2426) XFAIL: lldb-shell :: SymbolFile/DWARF/find-type-in-function.cpp (2192 of 2426) PASS: lldb-api :: tools/lldb-vscode/console/TestVSCode_console.py (2193 of 2426) PASS: lldb-shell :: SymbolFile/Breakpad/symtab-macho.test (2194 of 2426) UNSUPPORTED: lldb-api :: commands/trace/TestTraceTimestampCounters.py (2195 of 2426) PASS: lldb-shell :: SymbolFile/DWARF/x86/dwarf5_locations.s (2196 of 2426) PASS: lldb-api :: functionalities/signal/TestSendSignal.py (2197 of 2426) PASS: lldb-shell :: Driver/TestNoUseColor.test (2198 of 2426) PASS: lldb-api :: functionalities/thread/concurrent_events/TestConcurrentTwoWatchpointsOneDelayBreakpoint.py (2199 of 2426) PASS: lldb-api :: lang/cpp/function_refs/TestFunctionRefs.py (2200 of 2426) PASS: lldb-unit :: Utility/./UtilityTests/RangeTest.NotEqualInvalid (2201 of 2426) PASS: lldb-unit :: Utility/./UtilityTests/UriParserTest.SchemeHostSeparator4 (2202 of 2426) PASS: lldb-api :: lang/cpp/template-arguments/TestCppTemplateArguments.py (2203 of 2426) PASS: lldb-api :: functionalities/data-formatter/data-formatter-globals/TestDataFormatterGlobals.py (2204 of 2426) PASS: lldb-api :: functionalities/gdb_remote_client/TestArmRegisterDefinition.py (2205 of 2426) UNSUPPORTED: lldb-shell :: SymbolFile/PDB/typedefs.test (2206 of 2426) PASS: lldb-api :: commands/command/script/TestCommandScript.py (2207 of 2426) PASS: lldb-shell :: Driver/TestPositionalArgs.test (2208 of 2426) PASS: lldb-unit :: ScriptInterpreter/Python/./ScriptInterpreterPythonTests/PythonDataObjectsTest.TestPythonTupleValues (2209 of 2426) PASS: lldb-api :: lang/cpp/static_methods/TestCPPStaticMethods.py (2210 of 2426) PASS: lldb-api :: functionalities/data-formatter/data-formatter-stl/libcxx/tuple/TestDataFormatterLibcxxTuple.py (2211 of 2426) PASS: lldb-shell :: Quit/TestQuitExitCodeHexA.test (2212 of 2426) PASS: lldb-unit :: UnwindAssembly/x86/./UnwindAssemblyx86Tests/Testx86AssemblyInspectionEngine.TestPushR12 (2213 of 2426) PASS: lldb-shell :: SymbolFile/NativePDB/tag-types.cpp (2214 of 2426) PASS: lldb-unit :: Utility/./UtilityTests/RangeTest.Constructor (2215 of 2426) PASS: lldb-api :: functionalities/data-formatter/typedef_array/TestTypedefArray.py (2216 of 2426) PASS: lldb-unit :: Host/./HostTests/SocketAddressTest.Set (2217 of 2426) PASS: lldb-unit :: Expression/./ExpressionTests/DiagnosticManagerTest.GetStringMultipleDiags (2218 of 2426) PASS: lldb-unit :: SymbolFile/DWARF/./SymbolFileDWARFTests/SymbolFileDWARFTests.TestAbbrevOrder1Start1 (2219 of 2426) PASS: lldb-unit :: Utility/./UtilityTests/UriParserTest.BracketedHostnameWithPortIPv4 (2220 of 2426) PASS: lldb-unit :: UnwindAssembly/x86/./UnwindAssemblyx86Tests/Testx86AssemblyInspectionEngine.TestPopRBX (2221 of 2426) PASS: lldb-unit :: ScriptInterpreter/Python/./ScriptInterpreterPythonTests/PythonDataObjectsTest.TestPythonIntegerToStructuredInteger (2222 of 2426) PASS: lldb-api :: functionalities/postmortem/elf-core/gcore/TestGCore.py (2223 of 2426) PASS: lldb-unit :: Symbol/./SymbolTests/TestClangASTImporter.CopyDeclTagDecl (2224 of 2426) PASS: lldb-shell :: Register/x86-64-ymm-read.test (2225 of 2426) PASS: lldb-unit :: Utility/./UtilityTests/RegularExpression.Empty (2226 of 2426) PASS: lldb-unit :: Utility/./UtilityTests/CompletionRequest.FakeLastArg (2227 of 2426) PASS: lldb-unit :: Utility/./UtilityTests/RecordReplayTest.InstrumentedBar (2228 of 2426) PASS: lldb-api :: lang/objcxx/hide-runtime-values/TestObjCXXHideRuntimeValues.py (2229 of 2426) PASS: lldb-api :: python_api/value/linked_list/TestValueAPILinkedList.py (2230 of 2426) PASS: lldb-api :: python_api/lldbutil/frame/TestFrameUtils.py (2231 of 2426) PASS: lldb-unit :: Utility/./UtilityTests/VMRange.CollectionContains (2232 of 2426) PASS: lldb-shell :: ObjectFile/ELF/netbsd-core-amd64.test (2233 of 2426) PASS: lldb-unit :: Process/Utility/./ProcessUtilityTests/ProcSMapTests/LinuxProcSMapsTestFixture.ParseSMapRegions/3 (2234 of 2426) PASS: lldb-unit :: Utility/./UtilityTests/BinaryStreamTest.PutULEB128EightBytes (2235 of 2426) FAIL: lldb-api :: functionalities/data-formatter/data-formatter-objc/TestDataFormatterObjCNSDate.py (2236 of 2426) ******************** TEST 'lldb-api :: functionalities/data-formatter/data-formatter-objc/TestDataFormatterObjCNSDate.py' FAILED ******************** Script: -- /Users/buildslave/jenkins/workspace/lldb-cmake-sanitized/lldb-build/lldb-test-build.noindex/copied-python /Users/buildslave/jenkins/workspace/lldb-cmake-sanitized/llvm-project/lldb/test/API/dotest.py -u CXXFLAGS -u CFLAGS --codesign-identity lldb_codesign --arch x86_64 --build-dir /Users/buildslave/jenkins/workspace/lldb-cmake-sanitized/lldb-build/lldb-test-build.noindex -t --env TERM=vt100 --env LLVM_LIBS_DIR=/Users/buildslave/jenkins/workspace/lldb-cmake-sanitized/lldb-build/./lib --inferior-env ASAN_OPTIONS=detect_stack_use_after_return=1 --inferior-env DYLD_INSERT_LIBRARIES=/Users/buildslave/jenkins/workspace/lldb-cmake-sanitized/host-compiler/lib/clang/14.0.99/lib/darwin/libclang_rt.asan_osx_dynamic.dylib --arch x86_64 --build-dir /Users/buildslave/jenkins/workspace/lldb-cmake-sanitized/lldb-build/lldb-test-build.noindex --lldb-module-cache-dir /Users/buildslave/jenkins/workspace/lldb-cmake-sanitized/lldb-build/lldb-test-build.noindex/module-cache-lldb/lldb-api --clang-module-cache-dir /Users/buildslave/jenkins/workspace/lldb-cmake-sanitized/lldb-build/lldb-test-build.noindex/module-cache-clang/lldb-api --executable /Users/buildslave/jenkins/workspace/lldb-cmake-sanitized/lldb-build/./bin/lldb --compiler /Users/buildslave/jenkins/workspace/lldb-cmake-sanitized/host-compiler/bin/clang --dsymutil /Users/buildslave/jenkins/workspace/lldb-cmake-sanitized/lldb-build/./bin/dsymutil --llvm-tools-dir /Users/buildslave/jenkins/workspace/lldb-cmake-sanitized/lldb-build/./bin --lldb-libs-dir /Users/buildslave/jenkins/workspace/lldb-cmake-sanitized/lldb-build/./lib /Users/buildslave/jenkins/workspace/lldb-cmake-sanitized/llvm-project/lldb/test/API/functionalities/data-formatter/data-formatter-objc -p TestDataFormatterObjCNSDate.py -- Exit Code: -6

Hide Details

Command Output (stdout): -- lldb version 14.0.99 (http://labmaster3.local/git/llvm-project.git revision ec2029f986d8bb80963c1efd9e5024bfe7ac3d30) clang revision ec2029f986d8bb80963c1efd9e5024bfe7ac3d30 llvm revision ec2029f986d8bb80963c1efd9e5024bfe7ac3d30

Hide Details

-- Command Output (stderr): -- Change dir to: /Users/buildslave/jenkins/workspace/lldb-cmake-sanitized/llvm-project/lldb/test/API/functionalities/data-formatter/data-formatter-objc runCmd: settings clear -all output:

Hide Details

runCmd: settings set symbols.enable-external-lookup false output:

Hide Details

runCmd: settings set target.inherit-tcc true output:

Hide Details

runCmd: settings set target.detach-on-error false output:

Hide Details

runCmd: settings set target.auto-apply-fixits false output:

Hide Details

runCmd: settings set plugin.process.gdb-remote.packet-timeout 60 output:

Hide Details

runCmd: settings set symbols.clang-modules-cache-path "/Users/buildslave/jenkins/workspace/lldb-cmake-sanitized/lldb-build/lldb-test-build.noindex/module-cache-lldb/lldb-api" output:

Hide Details

runCmd: settings set use-color false output:

Hide Details

runCmd: setting set target.prefer-dynamic-value no-dynamic-values output:

Hide Details

runCmd: settings set target.env-vars ASAN_OPTIONS=detect_stack_use_after_return=1 DYLD_INSERT_LIBRARIES=/Users/buildslave/jenkins/workspace/lldb-cmake-sanitized/host-compiler/lib/clang/14.0.99/lib/darwin/libclang_rt.asan_osx_dynamic.dylib output:

Hide Details

runCmd: settings set target.env-vars ASAN_OPTIONS=detect_stack_use_after_return=1 DYLD_INSERT_LIBRARIES=/Users/buildslave/jenkins/workspace/lldb-cmake-sanitized/host-compiler/lib/clang/14.0.99/lib/darwin/libclang_rt.asan_osx_dynamic.dylib output:

Hide Details

runCmd: thread list output: Process 72017 stopped * thread #1: tid = 0x4fc02, 0x0000000100004800 a.out`main(argc=1, argv=0x00007ffeefbff828) at main.m:795:4, queue = 'com.apple.main-thread', stop reason = breakpoint 1.1 thread #2: tid = 0x4fc31, 0x00007fff72d624ce libsystem_kernel.dylib`__workq_kernreturn + 10 thread #3: tid = 0x4fc32, 0x00007fff72d624ce libsystem_kernel.dylib`__workq_kernreturn + 10

Hide Details

Hide Details

Ran command: "thread list"

Hide Details

Got output: Process 72017 stopped * thread #1: tid = 0x4fc02, 0x0000000100004800 a.out`main(argc=1, argv=0x00007ffeefbff828) at main.m:795:4, queue = 'com.apple.main-thread', stop reason = breakpoint 1.1 thread #2: tid = 0x4fc31, 0x00007fff72d624ce libsystem_kernel.dylib`__workq_kernreturn + 10 thread #3: tid = 0x4fc32, 0x00007fff72d624ce libsystem_kernel.dylib`__workq_kernreturn + 10

Hide Details

Expecting sub string: "stopped" (was found) Expecting sub string: "stop reason = breakpoint" (was found)

Hide Details

Adding tearDown hook: def cleanup(): self.runCmd('type format clear', check=False) self.runCmd('type summary clear', check=False) self.runCmd('type synth clear', check=False)

Hide Details

Hide Details

runCmd: frame variable date1 date2 output: (NSDate *) date1 = 0x4373b62c8739fc3b 1985-04-10 18:00:00 UTC (NSDate *) date2 = 0x0000604000008c50 2011-01-01 08:00:00 UTC

Hide Details

Hide Details

Ran command: "frame variable date1 date2"

Hide Details

Got output: (NSDate *) date1 = 0x4373b62c8739fc3b 1985-04-10 18:00:00 UTC (NSDate *) date2 = 0x0000604000008c50 2011-01-01 08:00:00 UTC

Hide Details

Expecting regex pattern: "(1985-04-10|1985-04-11)" (was found, matched "1985-04-10") Expecting regex pattern: "(2011-01-01|2010-12-31)" (was found, matched "2011-01-01")

Hide Details

runCmd: frame variable date3 output: (NSDate *) date3 = 0xc2924c481bd922eb 2021-10-13 06:29:39 UTC

Hide Details

Hide Details

Ran command: "frame variable date3"

Hide Details

Got output: (NSDate *) date3 = 0xc2924c481bd922eb 2021-10-13 06:29:39 UTC

Hide Details

Expecting sub string: "2021-" (was found)

Hide Details

runCmd: frame variable date4 output: (NSDate *) date4 = 0x42788a528739fc3b 1970-01-02 00:00:00 UTC

Hide Details

Hide Details

Ran command: "frame variable date4"

Hide Details

Got output: (NSDate *) date4 = 0x42788a528739fc3b 1970-01-02 00:00:00 UTC

Hide Details

Expecting sub string: "1970" (was found)

Hide Details

runCmd: frame variable date5 output: (NSDate *) date5 = 0xc2924c481f39fc3b 2021-10-13 06:29:39 UTC

Hide Details

Hide Details

Ran command: "frame variable date5"

Hide Details

Got output: (NSDate *) date5 = 0xc2924c481f39fc3b 2021-10-13 06:29:39 UTC

Hide Details

Expecting sub string: "2021-" (was found)

Hide Details

runCmd: frame variable date1_abs date2_abs output: (CFAbsoluteTime) date1_abs = 1985-04-10 10:00:00 PST (CFAbsoluteTime) date2_abs = 2011-01-01 00:00:00 PST

Hide Details

Hide Details

Ran command: "frame variable date1_abs date2_abs"

Hide Details

Got output: (CFAbsoluteTime) date1_abs = 1985-04-10 10:00:00 PST (CFAbsoluteTime) date2_abs = 2011-01-01 00:00:00 PST

Hide Details

Expecting sub string: "1985-04" (was found) Expecting sub string: "2011-01" (was found)

Hide Details

runCmd: frame variable date3_abs output: (CFAbsoluteTime) date3_abs = 2021-10-12 23:29:39 PDT

Hide Details

Hide Details

Ran command: "frame variable date3_abs"

Hide Details

Got output: (CFAbsoluteTime) date3_abs = 2021-10-12 23:29:39 PDT

Hide Details

Expecting sub string: "2021-" (was found)

Hide Details

runCmd: frame variable date4_abs output: (CFAbsoluteTime) date4_abs = 1970-01-01 16:00:00 PST

Hide Details

Hide Details

Ran command: "frame variable date4_abs"

Hide Details

Got output: (CFAbsoluteTime) date4_abs = 1970-01-01 16:00:00 PST

Hide Details

Expecting sub string: "1970" (was found)

Hide Details

runCmd: frame variable date5_abs output: (CFAbsoluteTime) date5_abs = 2021-10-12 23:29:39 PDT

Hide Details

Hide Details

Ran command: "frame variable date5_abs"

Hide Details

Got output: (CFAbsoluteTime) date5_abs = 2021-10-12 23:29:39 PDT

Hide Details

Expecting sub string: "2021-" (was found)

Hide Details

runCmd: frame variable cupertino home europe output: (CFTimeZoneRef) cupertino = 0x00006080000017a0 @"America/Los_Angeles" (CFTimeZoneRef) home = 0x0000608000001920 @"Europe/Rome" (CFTimeZoneRef) europe = 0x0000608000001aa0 @"Europe/Paris"

Hide Details

Hide Details

Ran command: "frame variable cupertino home europe"

Hide Details

Got output: (CFTimeZoneRef) cupertino = 0x00006080000017a0 @"America/Los_Angeles" (CFTimeZoneRef) home = 0x0000608000001920 @"Europe/Rome" (CFTimeZoneRef) europe = 0x0000608000001aa0 @"Europe/Paris"

Hide Details

Expecting sub string: "@"America/Los_Angeles"" (was found) Expecting sub string: "@"Europe/Rome"" (was found) Expecting sub string: "@"Europe/Paris"" (was found)

Hide Details

runCmd: frame variable cupertino_ns home_ns europe_ns output: (NSTimeZone *) cupertino_ns = 0x00006080000017a0 @"America/Los_Angeles" (NSTimeZone *) home_ns = 0x0000608000001920 @"Europe/Rome" (NSTimeZone *) europe_ns = 0x0000608000001aa0 @"Europe/Paris"

Hide Details

Hide Details

Ran command: "frame variable cupertino_ns home_ns europe_ns"

Hide Details

Got output: (NSTimeZone *) cupertino_ns = 0x00006080000017a0 @"America/Los_Angeles" (NSTimeZone *) home_ns = 0x0000608000001920 @"Europe/Rome" (NSTimeZone *) europe_ns = 0x0000608000001aa0 @"Europe/Paris"

Hide Details

Expecting sub string: "@"America/Los_Angeles"" (was found) Expecting sub string: "@"Europe/Rome"" (was found) Expecting sub string: "@"Europe/Paris"" (was found)

Hide Details

runCmd: frame variable mut_bv output: (CFMutableBitVectorRef) mut_bv = 0x0000604000009250 1110 0110 1011 0000 1101 1010 1000 1111 0011 0101 1101 0001 00

Hide Details

Hide Details

Ran command: "frame variable mut_bv"

Hide Details

Got output: (CFMutableBitVectorRef) mut_bv = 0x0000604000009250 1110 0110 1011 0000 1101 1010 1000 1111 0011 0101 1101 0001 00

Hide Details

Expecting sub string: "(CFMutableBitVectorRef) mut_bv = " (was found) Expecting sub string: "1110 0110 1011 0000 1101 1010 1000 1111 0011 0101 1101 0001 00" (was found)

Hide Details

<bound method SBProcess.Kill of <lldb.SBProcess; proxy of <Swig Object of type 'lldb::SBProcess *' at 0x105d3e540> >>: success

Hide Details

Executing tearDown hook: def cleanup(): self.runCmd('type format clear', check=False) self.runCmd('type summary clear', check=False) self.runCmd('type synth clear', check=False)

Hide Details

Hide Details

runCmd: type format clear check of return status not required output:

Hide Details

runCmd: type summary clear check of return status not required output:

Hide Details

runCmd: type synth clear check of return status not required output:

Hide Details

PASS: LLDB (/Users/buildslave/jenkins/workspace/lldb-cmake-sanitized/host-compiler/bin/clang-x86_64) :: test_nsdate_with_run_command_dsym (TestDataFormatterObjCNSDate.ObjCDataFormatterNSDate) runCmd: settings clear -all output:

Hide Details

runCmd: settings set symbols.enable-external-lookup false output:

Hide Details

runCmd: settings set target.inherit-tcc true output:

Hide Details

runCmd: settings set target.detach-on-error false output:

Hide Details

runCmd: settings set target.auto-apply-fixits false output:

Hide Details

runCmd: settings set plugin.process.gdb-remote.packet-timeout 60 output:

Hide Details

runCmd: settings set symbols.clang-modules-cache-path "/Users/buildslave/jenkins/workspace/lldb-cmake-sanitized/lldb-build/lldb-test-build.noindex/module-cache-lldb/lldb-api" output:

Hide Details

runCmd: settings set use-color false output:

Hide Details

runCmd: setting set target.prefer-dynamic-value no-dynamic-values output:

Hide Details

runCmd: settings set target.env-vars ASAN_OPTIONS=detect_stack_use_after_return=1 DYLD_INSERT_LIBRARIES=/Users/buildslave/jenkins/workspace/lldb-cmake-sanitized/host-compiler/lib/clang/14.0.99/lib/darwin/libclang_rt.asan_osx_dynamic.dylib output: Assertion failed: (0 && "Invalid SLocOffset or bad function choice"), function getFileIDLoaded, file /Users/buildslave/jenkins/workspace/lldb-cmake-sanitized/llvm-project/clang/lib/Basic/SourceManager.cpp, line 867.

Hide Details

--

Hide Details

******************** PASS: lldb-api :: functionalities/plugins/python_os_plugin/stepping_plugin_threads/TestOSPluginStepping.py (2237 of 2426) PASS: lldb-api :: commands/expression/ir-interpreter/TestIRInterpreter.py (2238 of 2426) PASS: lldb-api :: lang/c/unicode/TestUnicodeSymbols.py (2239 of 2426) PASS: lldb-unit :: Utility/./UtilityTests/DataExtractorTest.GetCStr (2240 of 2426) PASS: lldb-unit :: Symbol/./SymbolTests/TestTypeSystemClang.TestGetBasicTypeFromName (2241 of 2426) PASS: lldb-unit :: SymbolFile/DWARF/./SymbolFileDWARFTests/SymbolFileDWARFTests.ParseArangesSkipErrors (2242 of 2426) PASS: lldb-unit :: Process/gdb-remote/./ProcessGdbRemoteTests/GDBRemoteCommunicationClientTest.GetMemoryRegionInfo (2243 of 2426) PASS: lldb-api :: functionalities/jitloader_gdb/TestJITLoaderGDB.py (2244 of 2426) PASS: lldb-shell :: Breakpoint/debug_rnglistx_rlex.test (2245 of 2426) PASS: lldb-unit :: Target/./TargetTests/MCBasedABI.MapRegisterName (2246 of 2426) PASS: lldb-unit :: Utility/./UtilityTests/BinaryStreamTest.PutSLEB128SevenBytes (2247 of 2426) PASS: lldb-unit :: Symbol/./SymbolTests/TestTypeSystemClang.TestGetEnumIntegerTypeUnexpectedType (2248 of 2426) PASS: lldb-unit :: Utility/./UtilityTests/RangeDataVector.FindEntryIndexesThatContain_Overlap (2249 of 2426) PASS: lldb-unit :: Utility/./UtilityTests/StringListTest.JoinNonSpace (2250 of 2426) PASS: lldb-api :: types/TestIntegerType.py (2251 of 2426) PASS: lldb-api :: macosx/safe-to-func-call/TestSafeFuncCalls.py (2252 of 2426) PASS: lldb-api :: functionalities/thread/concurrent_events/TestConcurrentManyWatchpoints.py (2253 of 2426) PASS: lldb-unit :: Language/Highlighting/./HighlighterTests/HighlighterTest.FallbackHighlighter (2254 of 2426) UNSUPPORTED: lldb-api :: tools/lldb-vscode/disconnect/TestVSCode_disconnect.py (2255 of 2426) PASS: lldb-api :: python_api/sbtype_typeclass/TestSBTypeTypeClass.py (2256 of 2426) PASS: lldb-api :: functionalities/target_var/TestTargetVar.py (2257 of 2426) PASS: lldb-api :: commands/settings/use_source_cache/TestUseSourceCache.py (2258 of 2426) PASS: lldb-unit :: Interpreter/./InterpreterTests/OptionArgParserTest.toChar (2259 of 2426) PASS: lldb-unit :: SymbolFile/DWARF/./SymbolFileDWARFTests/SymbolFileDWARFTests.ParseArangesIgnoreEmpty (2260 of 2426) UNSUPPORTED: lldb-api :: functionalities/ubsan/user-expression/TestUbsanUserExpression.py (2261 of 2426) PASS: lldb-unit :: SymbolFile/NativePDB/./SymbolFileNativePDBTests/PDBFPOProgramToDWARFExpressionTests.UnknownOp (2262 of 2426) PASS: lldb-api :: functionalities/data-formatter/cstring-utf8-summary/TestCstringUnicode.py (2263 of 2426) PASS: lldb-shell :: SymbolFile/DWARF/x86/DW_OP_piece-smaller-than-struct.s (2264 of 2426) PASS: lldb-api :: lang/cpp/typeof/TestTypeOfDeclTypeExpr.py (2265 of 2426) PASS: lldb-unit :: Host/./HostTests/MainLoopTest.UnmonitoredSignal (2266 of 2426) PASS: lldb-unit :: Utility/./UtilityTests/StreamTest.AddressRangeInvalidRange (2267 of 2426) PASS: lldb-api :: lang/cpp/this_class_type_mixing/TestThisClassTypeMixing.py (2268 of 2426) PASS: lldb-unit :: Utility/./UtilityTests/OptionsWithRawTest.SingleWordSuffix (2269 of 2426) PASS: lldb-unit :: Utility/./UtilityTests/StringExtractorTest.DecodeHexU8_InvalidHex2 (2270 of 2426) PASS: lldb-unit :: Process/Utility/./ProcessUtilityTests/ProcMapTests/LinuxProcMapsTestFixture.ParseMapRegions/6 (2271 of 2426) PASS: lldb-unit :: Utility/./UtilityTests/LogChannelEnabledTest.LogGetLogThread (2272 of 2426) PASS: lldb-unit :: Utility/./UtilityTests/StringListTest.AppendStringMove (2273 of 2426) PASS: lldb-unit :: ScriptInterpreter/Python/./ScriptInterpreterPythonTests/PythonDataObjectsTest.TestPythonInteger (2274 of 2426) PASS: lldb-api :: tools/lldb-vscode/attach/TestVSCode_attach.py (2275 of 2426) UNSUPPORTED: lldb-shell :: ScriptInterpreter/Lua/partial_statements.test (2276 of 2426) PASS: lldb-api :: functionalities/unwind/noreturn/TestNoreturnUnwind.py (2277 of 2426) PASS: lldb-unit :: Process/minidump/./LLDBMinidumpTests/MinidumpParserTest.GetPid (2278 of 2426) PASS: lldb-unit :: Utility/./UtilityTests/StringExtractorTest.DecodeHexU8_InvalidHex (2279 of 2426) PASS: lldb-shell :: Driver/TestConvenienceVariables.test (2280 of 2426) PASS: lldb-unit :: Utility/./UtilityTests/StreamTest.AddressNoSuffix (2281 of 2426) UNSUPPORTED: lldb-shell :: Register/x86-64-xmm16-write.test (2282 of 2426) PASS: lldb-unit :: Utility/./UtilityTests/ArgsTest.EscapeLLDBCommandArgument (2283 of 2426) PASS: lldb-api :: tools/lldb-server/inferior-crash/TestGdbRemoteAbort.py (2284 of 2426) PASS: lldb-shell :: Commands/CommandScriptImmediateOutput/CommandScriptImmediateOutputFile.test (2285 of 2426) PASS: lldb-shell :: Register/Core/x86-32-linux-gp.test (2286 of 2426) PASS: lldb-api :: functionalities/param_entry_vals/basic_entry_values/TestBasicEntryValues.py (2287 of 2426) PASS: lldb-api :: functionalities/completion/TestCompletion.py (2288 of 2426) PASS: lldb-unit :: Utility/./UtilityTests/TimerTest.CategoryTimesStats (2289 of 2426) PASS: lldb-unit :: Target/./TargetTests/MemoryRegionInfoTest.Formatv (2290 of 2426) UNSUPPORTED: lldb-api :: functionalities/dyld-launch-linux/TestDyldLaunchLinux.py (2291 of 2426) PASS: lldb-unit :: Interpreter/./InterpreterTests/OptionValueArgs.DeepCopy (2292 of 2426) XFAIL: lldb-shell :: Register/x86-64-write.test (2293 of 2426) PASS: lldb-unit :: Utility/./UtilityTests/LogChannelEnabledTest.LLDB_LOG_ERROR (2294 of 2426) PASS: lldb-api :: lang/cpp/stl/TestStdCXXDisassembly.py (2295 of 2426) PASS: lldb-shell :: SymbolFile/NativePDB/function-types-builtins.cpp (2296 of 2426) PASS: lldb-unit :: Process/gdb-remote/./ProcessGdbRemoteTests/GDBRemoteCommunicationClientTest.ReadRegister (2297 of 2426) PASS: lldb-api :: functionalities/tail_call_frames/ambiguous_tail_call_seq1/TestAmbiguousTailCallSeq1.py (2298 of 2426) PASS: lldb-unit :: Process/Utility/./ProcessUtilityTests/ProcMapTests/LinuxProcMapsTestFixture.ParseMapRegions/8 (2299 of 2426) PASS: lldb-unit :: Language/Highlighting/./HighlighterTests/HighlighterTest.ClangPPDirectives (2300 of 2426) PASS: lldb-api :: commands/expression/import-std-module/unique_ptr-dbg-info-content/TestUniquePtrDbgInfoContent.py (2301 of 2426) UNSUPPORTED: lldb-api :: arm/breakpoint-thumb-codesection/TestBreakpointThumbCodesection.py (2302 of 2426) PASS: lldb-unit :: Utility/./UtilityTests/DataExtractorTest.GetMaxS64 (2303 of 2426) UNSUPPORTED: lldb-shell :: Subprocess/clone-follow-parent-wp.test (2304 of 2426) PASS: lldb-api :: macosx/thread-names/TestInterruptThreadNames.py (2305 of 2426) PASS: lldb-shell :: ObjectFile/MachO/symtab.yaml (2306 of 2426) PASS: lldb-unit :: Host/./HostTests/SocketTests/SocketTest.DomainListenConnectAccept/ipv4 (2307 of 2426) PASS: lldb-unit :: Utility/./UtilityTests/ArgsTest.TestInsertArg (2308 of 2426) PASS: lldb-unit :: Language/Highlighting/./HighlighterTests/HighlighterTest.ClangOperators (2309 of 2426) PASS: lldb-api :: functionalities/breakpoint/address_breakpoints/TestAddressBreakpoints.py (2310 of 2426) PASS: lldb-api :: commands/expression/static-initializers/TestStaticInitializers.py (2311 of 2426) PASS: lldb-shell :: Expr/TestMultilineExpr.test (2312 of 2426) UNSUPPORTED: lldb-api :: python_api/event/TestEvents.py (2313 of 2426) PASS: lldb-api :: lang/cpp/std-function-step-into-callable/TestStdFunctionStepIntoCallable.py (2314 of 2426) PASS: lldb-api :: types/TestShortType.py (2315 of 2426) PASS: lldb-unit :: Utility/./UtilityTests/FileSpecTest.Yaml (2316 of 2426) PASS: lldb-api :: python_api/signals/TestSignalsAPI.py (2317 of 2426) PASS: lldb-api :: functionalities/thread/concurrent_events/TestConcurrentTwoBreakpointsOneDelaySignal.py (2318 of 2426) PASS: lldb-unit :: Utility/./UtilityTests/BinaryStreamTest.PutSLEB128FiveBytes (2319 of 2426) UNSUPPORTED: lldb-shell :: SymbolFile/PDB/variables-locations.test (2320 of 2426) PASS: lldb-unit :: Core/./LLDBCoreTests/MangledTest.ResultForBlockInvocation (2321 of 2426) PASS: lldb-unit :: Core/./LLDBCoreTests/RichManglingContextTest.SwitchProvider (2322 of 2426) PASS: lldb-unit :: DataFormatter/./LLDBFormatterTests/StringPrinterTests.CxxUTF8 (2323 of 2426) PASS: lldb-api :: functionalities/thread/thread_specific_break/TestThreadSpecificBreakpoint.py (2324 of 2426) PASS: lldb-unit :: Host/./HostTests/ConnectionFileDescriptorTest.TCPGetURIv6 (2325 of 2426) PASS: lldb-api :: commands/frame/var-scope/TestFrameVariableScope.py (2326 of 2426) PASS: lldb-unit :: Process/gdb-remote/./ProcessGdbRemoteTests/GDBRemoteCommunicationClientTest.WriteMemoryTags (2327 of 2426) PASS: lldb-unit :: Utility/./UtilityTests/ArgsTest.TestSingleArgWithQuotedSpace (2328 of 2426) PASS: lldb-api :: lang/cpp/nsimport/TestCppNsImport.py (2329 of 2426) PASS: lldb-api :: commands/target/create-no-such-arch/TestNoSuchArch.py (2330 of 2426) PASS: lldb-unit :: Utility/./UtilityTests/ArchSpecTest.MergeFrom (2331 of 2426) PASS: lldb-api :: commands/target/modules/search-paths/insert/TestTargetModulesSearchpathsInsert.py (2332 of 2426) PASS: lldb-unit :: Process/gdb-remote/./ProcessGdbRemoteTests/GDBRemoteCommunicationClientTest.GetQOffsets (2333 of 2426) PASS: lldb-shell :: SymbolFile/DWARF/x86/dwp-separate-debug-file.cpp (2334 of 2426) PASS: lldb-api :: lang/objc/objc-dyn-sbtype/TestObjCDynamicSBType.py (2335 of 2426) PASS: lldb-api :: functionalities/breakpoint/address_breakpoints/TestBadAddressBreakpoints.py (2336 of 2426) PASS: lldb-api :: lang/cpp/virtual-overload/TestVirtualOverload.py (2337 of 2426) FAIL: lldb-api :: lang/objc/foundation/TestRuntimeTypes.py (2338 of 2426) ******************** TEST 'lldb-api :: lang/objc/foundation/TestRuntimeTypes.py' FAILED ******************** Script: -- /Users/buildslave/jenkins/workspace/lldb-cmake-sanitized/lldb-build/lldb-test-build.noindex/copied-python /Users/buildslave/jenkins/workspace/lldb-cmake-sanitized/llvm-project/lldb/test/API/dotest.py -u CXXFLAGS -u CFLAGS --codesign-identity lldb_codesign --arch x86_64 --build-dir /Users/buildslave/jenkins/workspace/lldb-cmake-sanitized/lldb-build/lldb-test-build.noindex -t --env TERM=vt100 --env LLVM_LIBS_DIR=/Users/buildslave/jenkins/workspace/lldb-cmake-sanitized/lldb-build/./lib --inferior-env ASAN_OPTIONS=detect_stack_use_after_return=1 --inferior-env DYLD_INSERT_LIBRARIES=/Users/buildslave/jenkins/workspace/lldb-cmake-sanitized/host-compiler/lib/clang/14.0.99/lib/darwin/libclang_rt.asan_osx_dynamic.dylib --arch x86_64 --build-dir /Users/buildslave/jenkins/workspace/lldb-cmake-sanitized/lldb-build/lldb-test-build.noindex --lldb-module-cache-dir /Users/buildslave/jenkins/workspace/lldb-cmake-sanitized/lldb-build/lldb-test-build.noindex/module-cache-lldb/lldb-api --clang-module-cache-dir /Users/buildslave/jenkins/workspace/lldb-cmake-sanitized/lldb-build/lldb-test-build.noindex/module-cache-clang/lldb-api --executable /Users/buildslave/jenkins/workspace/lldb-cmake-sanitized/lldb-build/./bin/lldb --compiler /Users/buildslave/jenkins/workspace/lldb-cmake-sanitized/host-compiler/bin/clang --dsymutil /Users/buildslave/jenkins/workspace/lldb-cmake-sanitized/lldb-build/./bin/dsymutil --llvm-tools-dir /Users/buildslave/jenkins/workspace/lldb-cmake-sanitized/lldb-build/./bin --lldb-libs-dir /Users/buildslave/jenkins/workspace/lldb-cmake-sanitized/lldb-build/./lib /Users/buildslave/jenkins/workspace/lldb-cmake-sanitized/llvm-project/lldb/test/API/lang/objc/foundation -p TestRuntimeTypes.py -- Exit Code: -6

Hide Details

Command Output (stdout): -- lldb version 14.0.99 (http://labmaster3.local/git/llvm-project.git revision ec2029f986d8bb80963c1efd9e5024bfe7ac3d30) clang revision ec2029f986d8bb80963c1efd9e5024bfe7ac3d30 llvm revision ec2029f986d8bb80963c1efd9e5024bfe7ac3d30

Hide Details

-- Command Output (stderr): -- Assertion failed: (0 && "Invalid SLocOffset or bad function choice"), function getFileIDLoaded, file /Users/buildslave/jenkins/workspace/lldb-cmake-sanitized/llvm-project/clang/lib/Basic/SourceManager.cpp, line 867.

Hide Details

--

Hide Details

******************** PASS: lldb-api :: functionalities/breakpoint/breakpoint_hit_count/TestBreakpointHitCount.py (2339 of 2426) PASS: lldb-api :: lang/c/tls_globals/TestTlsGlobals.py (2340 of 2426) PASS: lldb-unit :: Host/./HostTests/Host.GetEnvironment (2341 of 2426) PASS: lldb-unit :: Utility/./UtilityTests/FileSpecTest.EqualDotsPosixRoot (2342 of 2426) PASS: lldb-unit :: Utility/./UtilityTests/StreamTest.PutHex64ByteOrderLittle (2343 of 2426) FAIL: lldb-api :: lang/objcxx/conflicting-names-class-update-utility-expr/TestObjCConflictingNamesForClassUpdateExpr.py (2344 of 2426) ******************** TEST 'lldb-api :: lang/objcxx/conflicting-names-class-update-utility-expr/TestObjCConflictingNamesForClassUpdateExpr.py' FAILED ******************** Script: -- /Users/buildslave/jenkins/workspace/lldb-cmake-sanitized/lldb-build/lldb-test-build.noindex/copied-python /Users/buildslave/jenkins/workspace/lldb-cmake-sanitized/llvm-project/lldb/test/API/dotest.py -u CXXFLAGS -u CFLAGS --codesign-identity lldb_codesign --arch x86_64 --build-dir /Users/buildslave/jenkins/workspace/lldb-cmake-sanitized/lldb-build/lldb-test-build.noindex -t --env TERM=vt100 --env LLVM_LIBS_DIR=/Users/buildslave/jenkins/workspace/lldb-cmake-sanitized/lldb-build/./lib --inferior-env ASAN_OPTIONS=detect_stack_use_after_return=1 --inferior-env DYLD_INSERT_LIBRARIES=/Users/buildslave/jenkins/workspace/lldb-cmake-sanitized/host-compiler/lib/clang/14.0.99/lib/darwin/libclang_rt.asan_osx_dynamic.dylib --arch x86_64 --build-dir /Users/buildslave/jenkins/workspace/lldb-cmake-sanitized/lldb-build/lldb-test-build.noindex --lldb-module-cache-dir /Users/buildslave/jenkins/workspace/lldb-cmake-sanitized/lldb-build/lldb-test-build.noindex/module-cache-lldb/lldb-api --clang-module-cache-dir /Users/buildslave/jenkins/workspace/lldb-cmake-sanitized/lldb-build/lldb-test-build.noindex/module-cache-clang/lldb-api --executable /Users/buildslave/jenkins/workspace/lldb-cmake-sanitized/lldb-build/./bin/lldb --compiler /Users/buildslave/jenkins/workspace/lldb-cmake-sanitized/host-compiler/bin/clang --dsymutil /Users/buildslave/jenkins/workspace/lldb-cmake-sanitized/lldb-build/./bin/dsymutil --llvm-tools-dir /Users/buildslave/jenkins/workspace/lldb-cmake-sanitized/lldb-build/./bin --lldb-libs-dir /Users/buildslave/jenkins/workspace/lldb-cmake-sanitized/lldb-build/./lib /Users/buildslave/jenkins/workspace/lldb-cmake-sanitized/llvm-project/lldb/test/API/lang/objcxx/conflicting-names-class-update-utility-expr -p TestObjCConflictingNamesForClassUpdateExpr.py -- Exit Code: -6

Hide Details

Command Output (stdout): -- lldb version 14.0.99 (http://labmaster3.local/git/llvm-project.git revision ec2029f986d8bb80963c1efd9e5024bfe7ac3d30) clang revision ec2029f986d8bb80963c1efd9e5024bfe7ac3d30 llvm revision ec2029f986d8bb80963c1efd9e5024bfe7ac3d30

Hide Details

-- Command Output (stderr): -- Assertion failed: (0 && "Invalid SLocOffset or bad function choice"), function getFileIDLoaded, file /Users/buildslave/jenkins/workspace/lldb-cmake-sanitized/llvm-project/clang/lib/Basic/SourceManager.cpp, line 867.

Hide Details

--

Hide Details

******************** PASS: lldb-api :: functionalities/process_crash_info/TestProcessCrashInfo.py (2345 of 2426) PASS: lldb-api :: functionalities/step_scripted/TestStepScripted.py (2346 of 2426) PASS: lldb-shell :: Expr/TestIRMemoryMap.test (2347 of 2426) PASS: lldb-api :: lang/cpp/function-qualifiers/TestCppFunctionQualifiers.py (2348 of 2426) UNSUPPORTED: lldb-api :: functionalities/thread/concurrent_events/TestConcurrentManySignals.py (2349 of 2426) PASS: lldb-shell :: Commands/CommandScriptImmediateOutput/CommandScriptImmediateOutputConsole.test (2350 of 2426) PASS: lldb-shell :: ScriptInterpreter/Python/Crashlog/json.test (2351 of 2426) PASS: lldb-api :: lang/c/local_variables/TestLocalVariables.py (2352 of 2426) FAIL: lldb-api :: lang/objc/hidden-ivars/TestHiddenIvars.py (2353 of 2426) ******************** TEST 'lldb-api :: lang/objc/hidden-ivars/TestHiddenIvars.py' FAILED ******************** Script: -- /Users/buildslave/jenkins/workspace/lldb-cmake-sanitized/lldb-build/lldb-test-build.noindex/copied-python /Users/buildslave/jenkins/workspace/lldb-cmake-sanitized/llvm-project/lldb/test/API/dotest.py -u CXXFLAGS -u CFLAGS --codesign-identity lldb_codesign --arch x86_64 --build-dir /Users/buildslave/jenkins/workspace/lldb-cmake-sanitized/lldb-build/lldb-test-build.noindex -t --env TERM=vt100 --env LLVM_LIBS_DIR=/Users/buildslave/jenkins/workspace/lldb-cmake-sanitized/lldb-build/./lib --inferior-env ASAN_OPTIONS=detect_stack_use_after_return=1 --inferior-env DYLD_INSERT_LIBRARIES=/Users/buildslave/jenkins/workspace/lldb-cmake-sanitized/host-compiler/lib/clang/14.0.99/lib/darwin/libclang_rt.asan_osx_dynamic.dylib --arch x86_64 --build-dir /Users/buildslave/jenkins/workspace/lldb-cmake-sanitized/lldb-build/lldb-test-build.noindex --lldb-module-cache-dir /Users/buildslave/jenkins/workspace/lldb-cmake-sanitized/lldb-build/lldb-test-build.noindex/module-cache-lldb/lldb-api --clang-module-cache-dir /Users/buildslave/jenkins/workspace/lldb-cmake-sanitized/lldb-build/lldb-test-build.noindex/module-cache-clang/lldb-api --executable /Users/buildslave/jenkins/workspace/lldb-cmake-sanitized/lldb-build/./bin/lldb --compiler /Users/buildslave/jenkins/workspace/lldb-cmake-sanitized/host-compiler/bin/clang --dsymutil /Users/buildslave/jenkins/workspace/lldb-cmake-sanitized/lldb-build/./bin/dsymutil --llvm-tools-dir /Users/buildslave/jenkins/workspace/lldb-cmake-sanitized/lldb-build/./bin --lldb-libs-dir /Users/buildslave/jenkins/workspace/lldb-cmake-sanitized/lldb-build/./lib /Users/buildslave/jenkins/workspace/lldb-cmake-sanitized/llvm-project/lldb/test/API/lang/objc/hidden-ivars -p TestHiddenIvars.py -- Exit Code: -6

Hide Details

Command Output (stdout): -- lldb version 14.0.99 (http://labmaster3.local/git/llvm-project.git revision ec2029f986d8bb80963c1efd9e5024bfe7ac3d30) clang revision ec2029f986d8bb80963c1efd9e5024bfe7ac3d30 llvm revision ec2029f986d8bb80963c1efd9e5024bfe7ac3d30

Hide Details

-- Command Output (stderr): -- Change dir to: /Users/buildslave/jenkins/workspace/lldb-cmake-sanitized/llvm-project/lldb/test/API/lang/objc/hidden-ivars runCmd: settings clear -all output:

Hide Details

runCmd: settings set symbols.enable-external-lookup false output:

Hide Details

runCmd: settings set target.inherit-tcc true output:

Hide Details

runCmd: settings set target.detach-on-error false output:

Hide Details

runCmd: settings set target.auto-apply-fixits false output:

Hide Details

runCmd: settings set plugin.process.gdb-remote.packet-timeout 60 output:

Hide Details

runCmd: settings set symbols.clang-modules-cache-path "/Users/buildslave/jenkins/workspace/lldb-cmake-sanitized/lldb-build/lldb-test-build.noindex/module-cache-lldb/lldb-api" output:

Hide Details

runCmd: settings set use-color false output:

Hide Details

runCmd: setting set target.prefer-dynamic-value no-dynamic-values output:

Hide Details

runCmd: settings set target.env-vars ASAN_OPTIONS=detect_stack_use_after_return=1 DYLD_INSERT_LIBRARIES=/Users/buildslave/jenkins/workspace/lldb-cmake-sanitized/host-compiler/lib/clang/14.0.99/lib/darwin/libclang_rt.asan_osx_dynamic.dylib output:

Hide Details

runCmd: file /Users/buildslave/jenkins/workspace/lldb-cmake-sanitized/lldb-build/lldb-test-build.noindex/lang/objc/hidden-ivars/TestHiddenIvars.test_expr_dsym/a.out output: Current executable set to '/Users/buildslave/jenkins/workspace/lldb-cmake-sanitized/lldb-build/lldb-test-build.noindex/lang/objc/hidden-ivars/TestHiddenIvars.test_expr_dsym/a.out' (x86_64).

Hide Details

Hide Details

runCmd: breakpoint set -f "main.m" -l 49 output: Breakpoint 1: where = a.out`main + 63 at main.m:49:47, address = 0x0000000100000dcf

Hide Details

Hide Details

Expecting pattern: ^Breakpoint (?P<bpno>[0-9]+): (?P<num_locations>[0-9]+) locations\.$ Not matched

Hide Details

Expecting pattern: ^Breakpoint (?P<bpno>[0-9]+): (?P<num_locations>no) locations \(pending\)\. Not matched

Hide Details

Expecting pattern: ^Breakpoint (?P<bpno>[0-9]+): where = (?P<module>.*)`(?P<symbol>[+\-]{0,1}[^+]+)( \+ (?P<offset>[0-9]+)){0,1}( \[inlined\] (?P<inline_symbol>.*)){0,1} at (?P<file>[^:]+):(?P<line_no>[0-9]+)(?P<column>(:[0-9]+)?), address = (?P<address>0x[0-9a-fA-F]+)$ Matched

Hide Details

runCmd: run output: Process 75565 stopped * thread #1, queue = 'com.apple.main-thread', stop reason = breakpoint 1.1 frame #0: 0x0000000100000dcf a.out`main(argc=1, argv=0x00007ffeefbff8a0) at main.m:49:47 46 Container *j = [[Container alloc] init]; 47 InheritContainer *k = [[InheritContainer alloc] init]; 48 -> 49 printf("ivar value = %u\n", (unsigned)j->_definer->foo); // breakpoint1 ^ 50 printf("ivar value = %u\n", (unsigned)k->foo); 51 } 52 return 0; Process 75565 launched: '/Users/buildslave/jenkins/workspace/lldb-cmake-sanitized/lldb-build/lldb-test-build.noindex/lang/objc/hidden-ivars/TestHiddenIvars.test_expr_dsym/a.out' (x86_64)

Hide Details

Hide Details

runCmd: thread list output: Process 75565 stopped * thread #1: tid = 0x5384d, 0x0000000100000dcf a.out`main(argc=1, argv=0x00007ffeefbff8a0) at main.m:49:47, queue = 'com.apple.main-thread', stop reason = breakpoint 1.1

Hide Details

Hide Details

Ran command: "thread list"

Hide Details

Got output: Process 75565 stopped * thread #1: tid = 0x5384d, 0x0000000100000dcf a.out`main(argc=1, argv=0x00007ffeefbff8a0) at main.m:49:47, queue = 'com.apple.main-thread', stop reason = breakpoint 1.1

Hide Details

Expecting sub string: "stopped" (was found) Expecting sub string: "stop reason = breakpoint" (was found)

Hide Details

runCmd: breakpoint list -f output: Current breakpoints: 1: file = 'main.m', line = 49, exact_match = 0, locations = 1, resolved = 1, hit count = 1 1.1: where = a.out`main + 63 at main.m:49:47, address = 0x0000000100000dcf, resolved, hit count = 1

Hide Details

Hide Details

Hide Details

Ran command: "breakpoint list -f"

Hide Details

Got output: Current breakpoints: 1: file = 'main.m', line = 49, exact_match = 0, locations = 1, resolved = 1, hit count = 1 1.1: where = a.out`main + 63 at main.m:49:47, address = 0x0000000100000dcf, resolved, hit count = 1

Hide Details

Hide Details

Expecting sub string: " resolved, hit count = 1" (was found)

Hide Details

runCmd: expression (j->_definer->foo) output: (uintptr_t) $0 = 4

Hide Details

Hide Details

Ran command: "expression (j->_definer->foo)"

Hide Details

Got output: (uintptr_t) $0 = 4

Hide Details

Expecting sub string: "= 4" (was found)

Hide Details

runCmd: expression (j->_definer->bar) output: (uintptr_t) $1 = 5

Hide Details

Hide Details

Ran command: "expression (j->_definer->bar)"

Hide Details

Got output: (uintptr_t) $1 = 5

Hide Details

Expecting sub string: "= 5" (was found)

Hide Details

runCmd: expression *(j->_definer) output: (InternalDefiner) $2 = { NSObject = { isa = InternalDefiner } foo = 4 bar = 5 }

Hide Details

Hide Details

Ran command: "expression *(j->_definer)"

Hide Details

Got output: (InternalDefiner) $2 = { NSObject = { isa = InternalDefiner } foo = 4 bar = 5 }

Hide Details

Expecting sub string: "foo = 4" (was found) Expecting sub string: "bar = 5" (was found)

Hide Details

runCmd: expression (k->foo) output: (uintptr_t) $3 = 2

Hide Details

Hide Details

Ran command: "expression (k->foo)"

Hide Details

Got output: (uintptr_t) $3 = 2

Hide Details

Expecting sub string: "= 2" (was found)

Hide Details

runCmd: expression (k->bar) output: (uintptr_t) $4 = 3

Hide Details

Hide Details

Ran command: "expression (k->bar)"

Hide Details

Got output: (uintptr_t) $4 = 3

Hide Details

Expecting sub string: "= 3" (was found)

Hide Details

runCmd: expression k.filteredDataSource output: (NSMutableArray *) $5 = 0x0000604000001150 @"2 elements"

Hide Details

Hide Details

Ran command: "expression k.filteredDataSource"

Hide Details

Got output: (NSMutableArray *) $5 = 0x0000604000001150 @"2 elements"

Hide Details

Expecting sub string: " = 0x" (was found) Expecting sub string: ""2 elements"" (was found)

Hide Details

runCmd: expression *(k) output: (InheritContainer) $6 = { InternalDefiner = { NSObject = { isa = InheritContainer } foo = 2 bar = 3 } _filteredDataSource = 0x0000604000001150 @"2 elements" }

Hide Details

Hide Details

Ran command: "expression *(k)"

Hide Details

Got output: (InheritContainer) $6 = { InternalDefiner = { NSObject = { isa = InheritContainer } foo = 2 bar = 3 } _filteredDataSource = 0x0000604000001150 @"2 elements" }

Hide Details

Expecting sub string: "foo = 2" (was found) Expecting sub string: "bar = 3" (was found) Expecting sub string: "_filteredDataSource = 0x" (was found) Expecting sub string: ""2 elements"" (was found)

Hide Details

<bound method SBProcess.Kill of <lldb.SBProcess; proxy of <Swig Object of type 'lldb::SBProcess *' at 0x10d37e750> >>: success

Hide Details

<bound method SBProcess.Kill of <lldb.SBProcess; proxy of <Swig Object of type 'lldb::SBProcess *' at 0x10d37ec90> >>: success

Hide Details

PASS: LLDB (/Users/buildslave/jenkins/workspace/lldb-cmake-sanitized/host-compiler/bin/clang-x86_64) :: test_expr_dsym (TestHiddenIvars.HiddenIvarsTestCase) runCmd: settings clear -all output:

Hide Details

runCmd: settings set symbols.enable-external-lookup false output:

Hide Details

runCmd: settings set target.inherit-tcc true output:

Hide Details

runCmd: settings set target.detach-on-error false output:

Hide Details

runCmd: settings set target.auto-apply-fixits false output:

Hide Details

runCmd: settings set plugin.process.gdb-remote.packet-timeout 60 output:

Hide Details

runCmd: settings set symbols.clang-modules-cache-path "/Users/buildslave/jenkins/workspace/lldb-cmake-sanitized/lldb-build/lldb-test-build.noindex/module-cache-lldb/lldb-api" output:

Hide Details

runCmd: settings set use-color false output:

Hide Details

runCmd: setting set target.prefer-dynamic-value no-dynamic-values output:

Hide Details

runCmd: settings set target.env-vars ASAN_OPTIONS=detect_stack_use_after_return=1 DYLD_INSERT_LIBRARIES=/Users/buildslave/jenkins/workspace/lldb-cmake-sanitized/host-compiler/lib/clang/14.0.99/lib/darwin/libclang_rt.asan_osx_dynamic.dylib output:

Hide Details

runCmd: file /Users/buildslave/jenkins/workspace/lldb-cmake-sanitized/lldb-build/lldb-test-build.noindex/lang/objc/hidden-ivars/TestHiddenIvars.test_expr_dwarf/a.out output: Current executable set to '/Users/buildslave/jenkins/workspace/lldb-cmake-sanitized/lldb-build/lldb-test-build.noindex/lang/objc/hidden-ivars/TestHiddenIvars.test_expr_dwarf/a.out' (x86_64).

Hide Details

Hide Details

runCmd: breakpoint set -f "main.m" -l 49 output: Breakpoint 1: where = a.out`main + 63 at main.m:49:47, address = 0x0000000100000dcf

Hide Details

Hide Details

Expecting pattern: ^Breakpoint (?P<bpno>[0-9]+): (?P<num_locations>[0-9]+) locations\.$ Not matched

Hide Details

Expecting pattern: ^Breakpoint (?P<bpno>[0-9]+): (?P<num_locations>no) locations \(pending\)\. Not matched

Hide Details

Expecting pattern: ^Breakpoint (?P<bpno>[0-9]+): where = (?P<module>.*)`(?P<symbol>[+\-]{0,1}[^+]+)( \+ (?P<offset>[0-9]+)){0,1}( \[inlined\] (?P<inline_symbol>.*)){0,1} at (?P<file>[^:]+):(?P<line_no>[0-9]+)(?P<column>(:[0-9]+)?), address = (?P<address>0x[0-9a-fA-F]+)$ Matched Assertion failed: (0 && "Invalid SLocOffset or bad function choice"), function getFileIDLoaded, file /Users/buildslave/jenkins/workspace/lldb-cmake-sanitized/llvm-project/clang/lib/Basic/SourceManager.cpp, line 867.

Hide Details

--

Hide Details

******************** PASS: lldb-unit :: Utility/./UtilityTests/PassiveReplayTest.InstrumentedBarPtr (2354 of 2426) PASS: lldb-api :: functionalities/data-formatter/data-formatter-advanced/TestDataFormatterAdv.py (2355 of 2426) PASS: lldb-unit :: Host/./HostTests/PipeTest.OpenAsReader (2356 of 2426) PASS: lldb-shell :: SymbolFile/DWARF/x86/DW_AT_data_bit_offset-DW_OP_stack_value.s (2357 of 2426) UNSUPPORTED: lldb-api :: functionalities/data-formatter/data-formatter-stl/libstdcpp/map/TestDataFormatterStdMap.py (2358 of 2426) PASS: lldb-unit :: Utility/./UtilityTests/PassiveReplayTest.InstrumentedBarRef (2359 of 2426) PASS: lldb-api :: commands/expression/import-std-module/retry-with-std-module/TestRetryWithStdModule.py (2360 of 2426) PASS: lldb-unit :: Core/./LLDBCoreTests/FormatEntityTest.DefinitionConstructionNameAndType (2361 of 2426) PASS: lldb-api :: functionalities/reproducers/fs-case-sensitivity/TestReproducerFSCaseSensitivity.py (2362 of 2426) PASS: lldb-unit :: Utility/./UtilityTests/BinaryStreamTest.PutULEB128SixBytes (2363 of 2426) PASS: lldb-unit :: UnwindAssembly/x86/./UnwindAssemblyx86Tests/Testx86AssemblyInspectionEngine.TestSimplex86_64Augmented (2364 of 2426) PASS: lldb-unit :: Process/minidump/./LLDBMinidumpTests/MinidumpParserTest.GetLinuxProcStatus_no_stream (2365 of 2426) PASS: lldb-shell :: SymbolFile/DWARF/anon_class_w_and_wo_export_symbols.ll (2366 of 2426) PASS: lldb-unit :: Utility/./UtilityTests/BinaryStreamTest.PutSLEB128MaxValue (2367 of 2426) PASS: lldb-api :: functionalities/data-formatter/data-formatter-stl/libcxx/set/TestDataFormatterLibcxxSet.py (2368 of 2426) PASS: lldb-unit :: Expression/./ExpressionTests/DWARFExpression.DW_OP_piece (2369 of 2426) PASS: lldb-unit :: Utility/./UtilityTests/Flags.Clear (2370 of 2426) PASS: lldb-unit :: Utility/./UtilityTests/DataExtractorTest.GetCStrEmpty (2371 of 2426) PASS: lldb-unit :: Symbol/./SymbolTests/TestTypeSystemClang.TestIsClangType (2372 of 2426) PASS: lldb-api :: python_api/lldbutil/iter/TestRegistersIterator.py (2373 of 2426) PASS: lldb-api :: types/TestCharTypeExpr.py (2374 of 2426) PASS: lldb-api :: functionalities/thread/concurrent_events/TestConcurrentSignalWatch.py (2375 of 2426) PASS: lldb-shell :: SymbolFile/DWARF/x86/debug_loc_and_loclists.s (2376 of 2426) PASS: lldb-api :: functionalities/load_using_paths/TestLoadUsingPaths.py (2377 of 2426) PASS: lldb-unit :: Utility/./UtilityTests/GeneratorTest.YamlMultiProvider (2378 of 2426) PASS: lldb-unit :: Utility/./UtilityTests/Flags.AnySet (2379 of 2426) PASS: lldb-api :: functionalities/step-vrs-interrupt/TestStepVrsInterruptTimeout.py (2380 of 2426) PASS: lldb-shell :: Register/Core/x86-64-linux-multithread.test (2381 of 2426) PASS: lldb-unit :: ScriptInterpreter/Python/./ScriptInterpreterPythonTests/PythonDataObjectsTest.TestExtractingUInt64ThroughStructuredData (2382 of 2426) PASS: lldb-unit :: Utility/./UtilityTests/BinaryStreamTest.PutULEB128TwoBytes (2383 of 2426) PASS: lldb-unit :: Utility/./UtilityTests/PassiveReplayTest.InstrumentedFooInvalid (2384 of 2426) UNSUPPORTED: lldb-shell :: SymbolFile/NativePDB/local-variables.cpp (2385 of 2426) PASS: lldb-unit :: Utility/./UtilityTests/UriParserTest.MinimalPath (2386 of 2426) PASS: lldb-shell :: Breakpoint/debug_addrx.test (2387 of 2426) PASS: lldb-unit :: UnwindAssembly/x86/./UnwindAssemblyx86Tests/Testx86AssemblyInspectionEngine.TestPushRBPWithREX (2388 of 2426) PASS: lldb-unit :: Interpreter/./InterpreterTests/TestProperties.DeepCopy (2389 of 2426) PASS: lldb-shell :: ScriptInterpreter/Python/sb_address_exception.test (2390 of 2426) PASS: lldb-unit :: Utility/./UtilityTests/TimeoutTest.Construction (2391 of 2426) PASS: lldb-api :: functionalities/inferior-crashing/TestInferiorCrashingStep.py (2392 of 2426) PASS: lldb-api :: commands/settings/quoting/TestQuoting.py (2393 of 2426) PASS: lldb-api :: commands/expression/persistent_ptr_update/TestPersistentPtrUpdate.py (2394 of 2426) PASS: lldb-api :: macosx/load-kext/TestLoadKext.py (2395 of 2426) PASS: lldb-api :: python_api/process/TestProcessAPI.py (2396 of 2426) PASS: lldb-api :: functionalities/var_path/TestVarPath.py (2397 of 2426) PASS: lldb-unit :: Utility/./UtilityTests/XcodeSDKTest.SDKSupportsModules (2398 of 2426) PASS: lldb-api :: tools/lldb-server/TestGdbRemoteAttachWait.py (2399 of 2426) PASS: lldb-api :: lang/cpp/function-local-class/TestCppFunctionLocalClass.py (2400 of 2426) PASS: lldb-unit :: ObjectFile/Breakpad/./ObjectFileBreakpadTests/LineRecord.parse (2401 of 2426) PASS: lldb-unit :: Utility/./UtilityTests/AnsiTerminal.Basic (2402 of 2426) UNSUPPORTED: lldb-shell :: ScriptInterpreter/Lua/io.test (2403 of 2426) PASS: lldb-unit :: Utility/./UtilityTests/NameMatchesTest.Contains (2404 of 2426) UNSUPPORTED: lldb-shell :: Register/x86-zmm-write.test (2405 of 2426) PASS: lldb-unit :: Utility/./UtilityTests/SharedCluster.ClusterManager (2406 of 2426) PASS: lldb-api :: commands/platform/basic/TestPlatformPython.py (2407 of 2426) PASS: lldb-api :: commands/expression/rdar42038760/TestScalarURem.py (2408 of 2426) PASS: lldb-unit :: Utility/./UtilityTests/RecordReplayTest.InstrumentedBarPtr (2409 of 2426) UNSUPPORTED: lldb-shell :: Register/x86-ymm-read.test (2410 of 2426) PASS: lldb-api :: commands/expression/regression-access-function-template-in-record/TestRegressionAccessFunctionTemplateInRecord.py (2411 of 2426) PASS: lldb-unit :: Utility/./UtilityTests/StringListTest.GetSize (2412 of 2426) PASS: lldb-api :: python_api/value/empty_class/TestValueAPIEmptyClass.py (2413 of 2426) PASS: lldb-api :: lang/cpp/type_lookup/TestCppTypeLookup.py (2414 of 2426) PASS: lldb-api :: types/TestFloatTypesExpr.py (2415 of 2426) PASS: lldb-api :: lang/c/sizeof/TestCSizeof.py (2416 of 2426) PASS: lldb-unit :: Utility/./UtilityTests/StringListTest.LongestCommonPrefixSingleElement (2417 of 2426) PASS: lldb-shell :: Register/Core/x86-32-freebsd-fp.test (2418 of 2426) PASS: lldb-api :: functionalities/testid/TestTestId.py (2419 of 2426) PASS: lldb-api :: commands/watchpoints/watchpoint_events/TestWatchpointEvents.py (2420 of 2426) PASS: lldb-shell :: Register/Core/x86-64-freebsd-fp.test (2421 of 2426) PASS: lldb-unit :: Process/gdb-remote/./ProcessGdbRemoteTests/GDBRemoteClientBaseTest.InterruptNoResponse (2422 of 2426) PASS: lldb-api :: lang/cpp/class-template-type-parameter-pack/TestClassTemplateTypeParameterPack.py (2423 of 2426) PASS: lldb-api :: functionalities/thread/concurrent_events/TestConcurrentDelaySignalWatch.py (2424 of 2426) PASS: lldb-shell :: Reproducer/TestMultipleTargets.test (2425 of 2426) PASS: lldb-api :: tools/lldb-server/TestGdbRemoteThreadsInStopReply.py (2426 of 2426) Slowest Tests: -------------------------------------------------------------------------- 267.97s: lldb-api :: tools/lldb-server/TestLldbGdbServer.py 208.53s: lldb-api :: functionalities/memory-region/TestMemoryRegion.py 174.46s: lldb-api :: macosx/skinny-corefile/TestSkinnyCorefile.py 143.42s: lldb-api :: api/multithreaded/TestMultithreaded.py 124.04s: lldb-api :: macosx/stack-corefile/TestStackCorefile.py 91.80s: lldb-api :: functionalities/gdb_remote_client/TestWasm.py 90.13s: lldb-api :: commands/expression/import-std-module/queue/TestQueueFromStdModule.py 86.82s: lldb-api :: types/TestLongTypesExpr.py 73.94s: lldb-api :: lang/objc/exceptions/TestObjCExceptions.py 70.88s: lldb-api :: commands/process/attach/TestProcessAttach.py 70.66s: lldb-api :: commands/expression/import-std-module/stack/TestStackFromStdModule.py 66.04s: lldb-api :: lang/cpp/namespace/TestNamespaceLookup.py 61.51s: lldb-api :: commands/expression/import-std-module/vector/TestVectorFromStdModule.py 54.70s: lldb-api :: types/TestIntegerTypeExpr.py 51.78s: lldb-api :: commands/expression/import-std-module/deque-basic/TestDequeFromStdModule.py 51.42s: lldb-api :: python_api/target/TestTargetAPI.py 50.75s: lldb-api :: tools/lldb-server/TestGdbRemoteThreadsInStopReply.py 48.81s: lldb-api :: types/TestLongTypes.py 47.45s: lldb-api :: commands/expression/import-std-module/vector-dbg-info-content/TestDbgInfoContentVectorFromStdModule.py 47.44s: lldb-api :: types/TestShortTypeExpr.py

Hide Details

Tests Times: -------------------------------------------------------------------------- [ Range ] :: [ Percentage ] :: [ Count ] -------------------------------------------------------------------------- [260s,280s) :: [ ] :: [ 1/2426] [240s,260s) :: [ ] :: [ 0/2426] [220s,240s) :: [ ] :: [ 0/2426] [200s,220s) :: [ ] :: [ 1/2426] [180s,200s) :: [ ] :: [ 1/2426] [160s,180s) :: [ ] :: [ 0/2426] [140s,160s) :: [ ] :: [ 1/2426] [120s,140s) :: [ ] :: [ 1/2426] [100s,120s) :: [ ] :: [ 0/2426] [ 80s,100s) :: [ ] :: [ 3/2426] [ 60s, 80s) :: [ ] :: [ 5/2426] [ 40s, 60s) :: [ ] :: [ 12/2426] [ 20s, 40s) :: [* ] :: [ 71/2426] [ 0s, 20s) :: [************************************** ] :: [2330/2426] -------------------------------------------------------------------------- ******************** Failed Tests (49): lldb-api :: commands/expression/call-throws/TestCallThatThrows.py lldb-api :: commands/expression/diagnostics/TestExprDiagnostics.py lldb-api :: commands/expression/import_builtin_fileid/TestImportBuiltinFileID.py lldb-api :: commands/expression/namespace_local_var_same_name_obj_c/TestNamespaceLocalVarSameNameObjC.py lldb-api :: commands/expression/persist_objc_pointeetype/TestPersistObjCPointeeType.py lldb-api :: commands/expression/po_verbosity/TestPoVerbosity.py lldb-api :: commands/expression/two-files/TestObjCTypeQueryFromOtherCompileUnit.py lldb-api :: functionalities/data-formatter/boolreference/TestFormattersBoolRefPtr.py lldb-api :: functionalities/data-formatter/data-formatter-objc/TestDataFormatterObjCExpr.py lldb-api :: functionalities/data-formatter/data-formatter-objc/TestDataFormatterObjCNSContainer.py lldb-api :: functionalities/data-formatter/data-formatter-objc/TestDataFormatterObjCNSDate.py lldb-api :: functionalities/data-formatter/data-formatter-objc/nsindexpath/TestDataFormatterNSIndexPath.py lldb-api :: functionalities/data-formatter/poarray/TestPrintObjectArray.py lldb-api :: functionalities/data-formatter/synthupdate/TestSyntheticFilterRecompute.py lldb-api :: functionalities/set-data/TestSetData.py lldb-api :: lang/objc/conflicting-class-list-function-from-user/TestObjCClassListFunctionFromUser.py lldb-api :: lang/objc/foundation/TestConstStrings.py lldb-api :: lang/objc/foundation/TestObjCMethods.py lldb-api :: lang/objc/foundation/TestObjCMethodsNSArray.py lldb-api :: lang/objc/foundation/TestObjCMethodsNSError.py lldb-api :: lang/objc/foundation/TestObjCMethodsString.py lldb-api :: lang/objc/foundation/TestRuntimeTypes.py lldb-api :: lang/objc/hidden-ivars/TestHiddenIvars.py lldb-api :: lang/objc/modules-non-objc-target/TestObjCModulesNonObjCTarget.py lldb-api :: lang/objc/modules/TestObjCModules.py lldb-api :: lang/objc/objc++/TestObjCXX.py lldb-api :: lang/objc/objc-class-method/TestObjCClassMethod.py lldb-api :: lang/objc/objc-ivar-protocols/TestIvarProtocols.py lldb-api :: lang/objc/objc-new-syntax/TestObjCNewSyntaxArray.py lldb-api :: lang/objc/objc-new-syntax/TestObjCNewSyntaxDictionary.py lldb-api :: lang/objc/objc-new-syntax/TestObjCNewSyntaxLiteral.py lldb-api :: lang/objc/objc-optimized/TestObjcOptimized.py lldb-api :: lang/objc/objc-property/TestObjCProperty.py lldb-api :: lang/objc/objc-runtime-ivars/TestRuntimeIvars.py lldb-api :: lang/objc/objc-static-method/TestObjCStaticMethod.py lldb-api :: lang/objc/objc-struct-argument/TestObjCStructArgument.py lldb-api :: lang/objc/objc-struct-return/TestObjCStructReturn.py lldb-api :: lang/objc/objc_direct-methods/TestObjCDirectMethods.py lldb-api :: lang/objc/orderedset/TestOrderedSet.py lldb-api :: lang/objc/print-obj/TestPrintObj.py lldb-api :: lang/objc/radar-9691614/TestObjCMethodReturningBOOL.py lldb-api :: lang/objc/rdar-11355592/TestRdar11355592.py lldb-api :: lang/objc/self/TestObjCSelf.py lldb-api :: lang/objc/unicode-string/TestUnicodeString.py lldb-api :: lang/objc/variadic_methods/TestVariadicMethods.py lldb-api :: lang/objcxx/conflicting-names-class-update-utility-expr/TestObjCConflictingNamesForClassUpdateExpr.py lldb-api :: lang/objcxx/cxx-bridged-po/TestObjCXXBridgedPO.py lldb-api :: lang/objcxx/objcxx-ivar-vector/TestIvarVector.py lldb-api :: python_api/exprpath_synthetic/TestExprPathSynthetic.py

Hide Details

Hide Details

Testing Time: 2524.07s Unsupported : 228 Passed : 2139 Expectedly Failed: 10 Failed : 49 FAILED: tools/lldb/test/CMakeFiles/check-lldb cd /Users/buildslave/jenkins/workspace/lldb-cmake-sanitized/lldb-build/tools/lldb/test && /usr/local/Frameworks/Python.framework/Versions/3.7/bin/python3.7 /Users/buildslave/jenkins/workspace/lldb-cmake-sanitized/lldb-build/./bin/llvm-lit -v --time-tests --shuffle --xunit-xml-output=/Users/buildslave/jenkins/workspace/lldb-cmake-sanitized/test/results.xml -v -j 4 --timeout 1200 /Users/buildslave/jenkins/workspace/lldb-cmake-sanitized/lldb-build/tools/lldb/test ninja: build stopped: subcommand failed. Command failed: Command '['/usr/bin/env', 'TERM=vt100', '/usr/local/bin/ninja', '-v', 'check-lldb']' returned non-zero exit status 1. Command: ['/usr/bin/env', 'TERM=vt100', '/usr/local/bin/ninja', '-v', 'check-lldb'] [Pipeline] } [Pipeline] // timeout [Pipeline] } [Pipeline] // stage [Pipeline] stage [Pipeline] { (Declarative: Post Actions) [Pipeline] scanForIssues [Clang] Sleeping for 5 seconds due to JENKINS-32191... [Clang] Parsing console log (workspace: '/Users/buildslave/jenkins/workspace/lldb-cmake-sanitized') [Clang] -> found 4 issues (skipped 0 duplicates) [Clang] Parsing console log (workspace: '/Users/buildslave/jenkins/workspace/lldb-cmake-sanitized') [Clang] -> found 4 issues (skipped 0 duplicates) [Clang] Successfully parsed console log [Clang] -> found 4 issues (skipped 0 duplicates) [Clang] Parsing console log (workspace: '/Users/buildslave/jenkins/workspace/lldb-cmake-sanitized') [Clang] Post processing issues on 'green-dragon-23' with source code encoding 'UTF-8' [Clang] Creating SCM blamer to obtain author and commit information for affected files [Clang] -> No blamer installed yet. You need to install the 'git-forensics' plugin to enable blaming for Git. [Clang] Resolving file names for all issues in source directory '/Users/buildslave/jenkins/workspace/lldb-cmake-sanitized' [Clang] -> resolved paths in source directory (4 found, 0 not found) [Clang] Resolving module names from module definitions (build.xml, pom.xml, or Manifest.mf files) [Clang] -> resolved module names for 4 issues [Clang] Resolving package names (or namespaces) by parsing the affected files [Clang] -> resolved package names of 4 affected files [Clang] No filter has been set, publishing all 4 issues [Clang] Creating fingerprints for all affected code blocks to track issues over different builds [Clang] -> created fingerprints for 4 issues (skipped 0 issues) [Clang] Copying affected files to Jenkins' build folder '/Users/Shared/Jenkins/Home/jobs/lldb-cmake-sanitized/builds/2003/files-with-issues' [Clang] -> 4 copied, 0 not in workspace, 0 not-found, 0 with I/O error [Clang] Repository miner is not configured, skipping repository mining [Pipeline] junit Recording test results [Checks API] No suitable checks publisher found. [Pipeline] } [Pipeline] // stage [Pipeline] } [Pipeline] // withEnv [Pipeline] } [Pipeline] // node [Pipeline] End of Pipeline ERROR: script returned exit code 1 Finished: FAILURE