Console Output

Skipping 9,590 KB.. Full Log
PASS: lldb-api :: functionalities/unwind/noreturn/TestNoreturnUnwind.py (1175 of 2474)
PASS: lldb-api :: functionalities/var_path/TestVarPath.py (1176 of 2474)
PASS: lldb-api :: functionalities/thread/concurrent_events/TestConcurrentWatchpointWithDelayWatchpointThreads.py (1177 of 2474)
PASS: lldb-api :: functionalities/lazy-loading/TestLazyLoading.py (1178 of 2474)
PASS: lldb-api :: macosx/thread-names/TestInterruptThreadNames.py (1179 of 2474)
PASS: lldb-shell :: Reproducer/TestGDBRemoteRepro.test (1180 of 2474)
UNSUPPORTED: lldb-api :: functionalities/thread/concurrent_events/TestConcurrentManySignals.py (1181 of 2474)
PASS: lldb-unit :: Utility/./UtilityTests/StreamTest.PutCharNull (1182 of 2474)
PASS: lldb-unit :: UnwindAssembly/x86/./UnwindAssemblyx86Tests/Testx86AssemblyInspectionEngine.Test64bitFramelessBigStackFrame (1183 of 2474)
PASS: lldb-unit :: Symbol/./SymbolTests/TestClangASTImporter.DeportTypeTagDecl (1184 of 2474)
PASS: lldb-api :: commands/expression/function_template_specialization_temp_args/TestFunctionTemplateSpecializationTempArgs.py (1185 of 2474)
UNSUPPORTED: lldb-api :: linux/aarch64/mte_tag_faults/TestAArch64LinuxMTEMemoryTagFaults.py (1186 of 2474)
PASS: lldb-unit :: Process/gdb-remote/./ProcessGdbRemoteTests/GDBRemoteCommunicationClientTest.GetMemoryRegionInfoInvalidResponse (1187 of 2474)
PASS: lldb-api :: tools/lldb-vscode/breakpoint-events/TestVSCode_breakpointEvents.py (1188 of 2474)
PASS: lldb-shell :: Register/Core/x86-64-linux-gp.test (1189 of 2474)
PASS: lldb-api :: commands/reproducer/invalid-args/TestInvalidArgsReproducer.py (1190 of 2474)
PASS: lldb-shell :: SymbolFile/DWARF/x86/DW_AT_low_pc-addrx.s (1191 of 2474)
PASS: lldb-unit :: SymbolFile/DWARF/./SymbolFileDWARFTests/XcodeSDKModuleTests.TestModuleGetXcodeSDK (1192 of 2474)
PASS: lldb-unit :: Utility/./UtilityTests/FileSpecTest.FileAndDirectoryComponents (1193 of 2474)
UNSUPPORTED: lldb-api :: functionalities/tsan/global_location/TestTsanGlobalLocation.py (1194 of 2474)
PASS: lldb-api :: functionalities/inline-stepping/TestInlineStepping.py (1195 of 2474)
PASS: lldb-api :: lang/cpp/bitfields/TestCppBitfields.py (1196 of 2474)
PASS: lldb-api :: functionalities/thread/concurrent_events/TestConcurrentCrashWithWatchpointBreakpointSignal.py (1197 of 2474)
PASS: lldb-shell :: Breakpoint/jit-loader_jitlink_elf.test (1198 of 2474)
PASS: lldb-unit :: Utility/./UtilityTests/SharedCluster.ClusterManager (1199 of 2474)
PASS: lldb-unit :: DataFormatter/./LLDBFormatterTests/StringPrinterTests.CxxUTF8 (1200 of 2474)
PASS: lldb-shell :: SymbolFile/DWARF/x86/DW_TAG_variable-invalid_location.s (1201 of 2474)
PASS: lldb-api :: commands/expression/deleting-implicit-copy-constructor/TestDeletingImplicitCopyConstructor.py (1202 of 2474)
PASS: lldb-api :: lang/objc/tagged-pointer/TestTaggedPointerCmd.py (1203 of 2474)
PASS: lldb-unit :: Utility/./UtilityTests/UserIDResolver.GetUserName (1204 of 2474)
PASS: lldb-api :: lang/cpp/template-function/TestTemplateFunctions.py (1205 of 2474)
PASS: lldb-unit :: Language/Highlighting/./HighlighterTests/HighlighterTest.ClangCursorPos (1206 of 2474)
PASS: lldb-unit :: Expression/./ExpressionTests/CppModuleConfigurationTest.LinuxLocalLibCpp (1207 of 2474)
PASS: lldb-unit :: Core/./LLDBCoreTests/CommunicationTest.SynchronizeWhileClosing (1208 of 2474)
PASS: lldb-shell :: Minidump/Windows/Sigsegv/sigsegv.test (1209 of 2474)
PASS: lldb-unit :: Process/gdb-remote/./ProcessGdbRemoteTests/PortMapTest.FreePort (1210 of 2474)
PASS: lldb-shell :: ObjectFile/wasm/embedded-debug-sections.yaml (1211 of 2474)
UNSUPPORTED: lldb-api :: lang/objc/foundation/TestFoundationDisassembly.py (1212 of 2474)
PASS: lldb-unit :: Utility/./UtilityTests/DataExtractorTest.GetMaxU64 (1213 of 2474)
PASS: lldb-api :: python_api/sbenvironment/TestSBEnvironment.py (1214 of 2474)
PASS: lldb-unit :: Language/Highlighting/./HighlighterTests/HighlighterTest.ClangStringLiterals (1215 of 2474)
UNSUPPORTED: lldb-api :: commands/trace/TestTraceDumpInstructions.py (1216 of 2474)
PASS: lldb-api :: linux/builtin_trap/TestBuiltinTrap.py (1217 of 2474)
PASS: lldb-api :: commands/expression/argument_passing_restrictions/TestArgumentPassingRestrictions.py (1218 of 2474)
PASS: lldb-api :: functionalities/data-formatter/builtin-formats/TestBuiltinFormats.py (1219 of 2474)
PASS: lldb-unit :: Expression/./ExpressionTests/DWARFExpression.DW_OP_const (1220 of 2474)
PASS: lldb-unit :: Utility/./UtilityTests/ListenerTest.GetEventWait (1221 of 2474)
UNSUPPORTED: lldb-api :: tools/lldb-vscode/disconnect/TestVSCode_disconnect.py (1222 of 2474)
PASS: lldb-api :: commands/expression/unicode-in-variable/TestUnicodeInVariable.py (1223 of 2474)
PASS: lldb-unit :: Utility/./UtilityTests/SubsystemRAIITest.NormalSubsystem (1224 of 2474)
PASS: lldb-api :: functionalities/data-formatter/data-formatter-stl/libstdcpp/unique_ptr/invalid/TestDataFormatterInvalidStdUniquePtr.py (1225 of 2474)
PASS: lldb-api :: functionalities/multiword-commands/TestMultiWordCommands.py (1226 of 2474)
PASS: lldb-shell :: SymbolFile/DWARF/x86/inline-function-address.ll (1227 of 2474)
PASS: lldb-unit :: Utility/./UtilityTests/FileSpecTest.IsRelative (1228 of 2474)
PASS: lldb-api :: lang/cpp/chained-calls/TestCppChainedCalls.py (1229 of 2474)
PASS: lldb-api :: lang/cpp/frame-var-anon-unions/TestFrameVariableAnonymousUnions.py (1230 of 2474)
UNSUPPORTED: lldb-api :: functionalities/thread/state/TestThreadStates.py (1231 of 2474)
PASS: lldb-api :: functionalities/inferior-assert/TestInferiorAssert.py (1232 of 2474)
PASS: lldb-shell :: Unwind/trap_frame_sym_ctx.test (1233 of 2474)
PASS: lldb-api :: macosx/thread_suspend/TestInternalThreadSuspension.py (1234 of 2474)
PASS: lldb-shell :: SymbolFile/DWARF/x86/debug_loclists-dwp.s (1235 of 2474)
UNSUPPORTED: lldb-api :: functionalities/breakpoint/breakpoint_in_delayslot/TestAvoidBreakpointInDelaySlot.py (1236 of 2474)
PASS: lldb-unit :: Utility/./UtilityTests/BinaryStreamTest.PutULEB128FourBytes (1237 of 2474)
PASS: lldb-unit :: Utility/./UtilityTests/StringListTest.AppendStringMove (1238 of 2474)
PASS: lldb-unit :: tools/lldb-server/tests/./LLDBServerTests/TestBase.LaunchModePreservesEnvironment (1239 of 2474)
PASS: lldb-api :: functionalities/tail_call_frames/inlining_and_tail_calls/TestInliningAndTailCalls.py (1240 of 2474)
PASS: lldb-unit :: Utility/./UtilityTests/StringListTest.GetMaxStringLengthEmpty (1241 of 2474)
PASS: lldb-unit :: ScriptInterpreter/Python/./ScriptInterpreterPythonTests/PythonDataObjectsTest.TestPythonListManipulation (1242 of 2474)
PASS: lldb-unit :: Utility/./UtilityTests/FileSpecTest.EqualDotsWindows (1243 of 2474)
PASS: lldb-unit :: Process/Utility/./ProcessUtilityTests/ProcMapTests/LinuxProcMapsTestFixture.ParseMapRegions/6 (1244 of 2474)
PASS: lldb-shell :: Register/Core/x86-32-netbsd-multithread.test (1245 of 2474)
UNSUPPORTED: lldb-api :: lang/cpp/reference-to-outer-type/TestCppReferenceToOuterClass.py (1246 of 2474)
PASS: lldb-api :: commands/thread/select/TestThreadSelect.py (1247 of 2474)
XFAIL: lldb-shell :: Register/x86-64-fp-write.test (1248 of 2474)
PASS: lldb-unit :: Process/gdb-remote/./ProcessGdbRemoteTests/GDBRemoteCommunicationClientTest.WriteMemoryTags (1249 of 2474)
PASS: lldb-api :: functionalities/data-formatter/data-formatter-objc/TestDataFormatterObjCPlain.py (1250 of 2474)
PASS: lldb-api :: commands/command/script_alias/TestCommandScriptAlias.py (1251 of 2474)
PASS: lldb-api :: commands/expression/import-std-module/deque-dbg-info-content/TestDbgInfoContentDequeFromStdModule.py (1252 of 2474)
PASS: lldb-unit :: Utility/./UtilityTests/BinaryStreamTest.PutSLEB128TwoBytes (1253 of 2474)
PASS: lldb-shell :: ObjectFile/wasm/stripped-debug-sections.yaml (1254 of 2474)
PASS: lldb-unit :: Utility/./UtilityTests/BroadcasterTest.EventTypeHasListeners (1255 of 2474)
PASS: lldb-unit :: Expression/./ExpressionTests/ClangHostTest.MacOSX (1256 of 2474)
PASS: lldb-unit :: Process/minidump/./LLDBMinidumpTests/MinidumpParserTest.MinidumpDuplicateModuleMappedSecondHigh (1257 of 2474)
PASS: lldb-api :: macosx/load-kext/TestLoadKext.py (1258 of 2474)
PASS: lldb-api :: commands/expression/static-initializers/TestStaticInitializers.py (1259 of 2474)
PASS: lldb-api :: lang/objc/exceptions/TestObjCExceptions.py (1260 of 2474)
PASS: lldb-api :: functionalities/breakpoint/breakpoint_ids/TestBreakpointIDs.py (1261 of 2474)
PASS: lldb-unit :: Utility/./UtilityTests/TimerTest.CategoryTimes2 (1262 of 2474)
PASS: lldb-unit :: Process/Utility/./ProcessUtilityTests/MemoryTagManagerAArch64MTETest.RemoveNonAddressBits (1263 of 2474)
PASS: lldb-unit :: Platform/Android/./AdbClientTests/AdbClientTest.CreateByDeviceId (1264 of 2474)
PASS: lldb-api :: lang/c/forward/TestForwardDeclaration.py (1265 of 2474)
PASS: lldb-unit :: Expression/./ExpressionTests/DiagnosticManagerTest.PutStringSeverities (1266 of 2474)
PASS: lldb-unit :: Utility/./UtilityTests/ScalarTest.Comparison (1267 of 2474)
PASS: lldb-unit :: Utility/./UtilityTests/StringExtractorTest.GetHexU8_Underflow2_NoEof (1268 of 2474)
PASS: lldb-api :: commands/watchpoints/watchpoint_size/TestWatchpointSizes.py (1269 of 2474)
PASS: lldb-api :: functionalities/thread/concurrent_events/TestConcurrentCrashWithSignal.py (1270 of 2474)
PASS: lldb-unit :: Utility/./UtilityTests/UriParserTest.BracketedHostnameWithColon (1271 of 2474)
PASS: lldb-unit :: Utility/./UtilityTests/BinaryStreamTest.PutULEB128SevenBytes (1272 of 2474)
UNSUPPORTED: lldb-api :: repl/clang/TestClangREPL.py (1273 of 2474)
PASS: lldb-unit :: Target/./TargetTests/ExecutionContextTest.GetByteOrderProcess (1274 of 2474)
UNSUPPORTED: lldb-shell :: SymbolFile/PDB/class-layout.test (1275 of 2474)
PASS: lldb-unit :: Utility/./UtilityTests/StringExtractorTest.GetU32LittleEndian (1276 of 2474)
PASS: lldb-unit :: Utility/./UtilityTests/RangeTest.LessThan (1277 of 2474)
PASS: lldb-unit :: Utility/./UtilityTests/StringListTest.RemoveBlankLines (1278 of 2474)
PASS: lldb-unit :: Utility/./UtilityTests/StringListTest.CopyList (1279 of 2474)
PASS: lldb-unit :: Utility/./UtilityTests/UriParserTest.BracketedHostnameWithPortIPv4 (1280 of 2474)
PASS: lldb-unit :: Utility/./UtilityTests/StringListTest.JoinNonSpace (1281 of 2474)
PASS: lldb-api :: commands/target/select/TestTargetSelect.py (1282 of 2474)
PASS: lldb-api :: functionalities/value_md5_crash/TestValueMD5Crash.py (1283 of 2474)
UNSUPPORTED: lldb-shell :: SymbolFile/DWARF/debug-types-expressions.test (1284 of 2474)
UNSUPPORTED: lldb-api :: linux/aarch64/mte_memory_region/TestAArch64LinuxMTEMemoryRegion.py (1285 of 2474)
PASS: lldb-api :: tools/lldb-server/commandline/TestStubSetSID.py (1286 of 2474)
UNSUPPORTED: lldb-shell :: SymbolFile/PDB/ast-restore.test (1287 of 2474)
PASS: lldb-api :: functionalities/data-formatter/dump_dynamic/TestDumpDynamic.py (1288 of 2474)
PASS: lldb-api :: functionalities/gdb_remote_client/TestMultiprocess.py (1289 of 2474)
PASS: lldb-shell :: Breakpoint/jit-loader_rtdyld_elf.test (1290 of 2474)
PASS: lldb-unit :: Core/./LLDBCoreTests/RichManglingContextTest.FromCxxMethodName (1291 of 2474)
PASS: lldb-unit :: Utility/./UtilityTests/FileSpecTest.CopyByAppendingPathComponent (1292 of 2474)
PASS: lldb-unit :: Symbol/./SymbolTests/TestCreateClassTemplateDecl.FindExistingTemplatesWithParameterPack (1293 of 2474)
PASS: lldb-api :: tools/lldb-server/TestGdbRemoteHostInfo.py (1294 of 2474)
PASS: lldb-shell :: Settings/TestSettingsWrite.test (1295 of 2474)
UNSUPPORTED: lldb-api :: functionalities/longjmp/TestLongjmp.py (1296 of 2474)
PASS: lldb-api :: functionalities/data-formatter/data-formatter-objc/TestDataFormatterObjCNSNumber.py (1297 of 2474)
PASS: lldb-shell :: SymbolFile/DWARF/x86/find-variable-dwo.cpp (1298 of 2474)
UNSUPPORTED: lldb-api :: iohandler/resize/TestIOHandlerResize.py (1299 of 2474)
PASS: lldb-shell :: Commands/command-regex-delete.test (1300 of 2474)
PASS: lldb-api :: functionalities/data-formatter/data-formatter-objc/TestDataFormatterObjCNSDate.py (1301 of 2474)
PASS: lldb-unit :: Symbol/./SymbolTests/TestTypeSystemClang.TestDisplayName (1302 of 2474)
PASS: lldb-api :: commands/target/create-no-such-arch/TestNoSuchArch.py (1303 of 2474)
PASS: lldb-unit :: Utility/./UtilityTests/StreamTest.PutULEB128 (1304 of 2474)
PASS: lldb-unit :: Utility/./UtilityTests/BinaryStreamTest.PutULEB128One (1305 of 2474)
PASS: lldb-api :: lang/c/vla/TestVLA.py (1306 of 2474)
PASS: lldb-api :: commands/help/TestHelp.py (1307 of 2474)
PASS: lldb-api :: functionalities/process_group/TestChangeProcessGroup.py (1308 of 2474)
PASS: lldb-shell :: SymbolFile/Breakpad/unwind-via-raSearch.test (1309 of 2474)
PASS: lldb-api :: commands/expression/import-std-module/vector-bool/TestVectorBoolFromStdModule.py (1310 of 2474)
UNSUPPORTED: lldb-api :: iohandler/autosuggestion/TestAutosuggestion.py (1311 of 2474)
PASS: lldb-shell :: SymbolFile/DWARF/x86/debug_ranges_and_rnglists.test (1312 of 2474)
PASS: lldb-api :: functionalities/unwind/zeroth_frame/TestZerothFrame.py (1313 of 2474)
PASS: lldb-unit :: Core/./LLDBCoreTests/SourceFileCache.FindSourceFileNotFound (1314 of 2474)
PASS: lldb-api :: functionalities/object-file/TestImageListMultiArchitecture.py (1315 of 2474)
PASS: lldb-unit :: UnwindAssembly/x86/./UnwindAssemblyx86Tests/Testx86AssemblyInspectionEngine.TestSimple64bitFrameFunction (1316 of 2474)
PASS: lldb-api :: commands/expression/import-std-module/deque-basic/TestDequeFromStdModule.py (1317 of 2474)
PASS: lldb-unit :: Utility/./UtilityTests/OptionsWithRawTest.EmptyArgsOnlySuffix (1318 of 2474)
UNSUPPORTED: lldb-shell :: SymbolFile/DWARF/split-optimized.c (1319 of 2474)
PASS: lldb-unit :: API/./APITests/SBStructuredDataTest.NullImpl (1320 of 2474)
PASS: lldb-unit :: SymbolFile/DWARF/./SymbolFileDWARFTests/DWARFUnitTest.LLVMGCCProducer (1321 of 2474)
PASS: lldb-unit :: Utility/./UtilityTests/RecordReplayTest.InstrumentedFoo (1322 of 2474)
PASS: lldb-api :: tools/lldb-server/TestGdbRemoteExitCode.py (1323 of 2474)
PASS: lldb-unit :: Process/gdb-remote/./ProcessGdbRemoteTests/GDBRemoteCommunicationServerTest.SendErrorResponse_ErrorNumber (1324 of 2474)
PASS: lldb-api :: functionalities/data-formatter/synthupdate/TestSyntheticFilterRecompute.py (1325 of 2474)
PASS: lldb-shell :: SymbolFile/NativePDB/source-list.cpp (1326 of 2474)
PASS: lldb-unit :: Utility/./UtilityTests/ProcessInstanceInfoMatch.Name (1327 of 2474)
PASS: lldb-unit :: Utility/./UtilityTests/StreamTest.PutMaxHex64ByteOrderBig (1328 of 2474)
PASS: lldb-unit :: Utility/./UtilityTests/NameMatchesTest.StartsWith (1329 of 2474)
PASS: lldb-unit :: SymbolFile/DWARF/./SymbolFileDWARFTests/DWARFUnitTest.ClangProducer (1330 of 2474)
UNSUPPORTED: lldb-api :: functionalities/data-formatter/data-formatter-stl/libstdcpp/map/TestDataFormatterStdMap.py (1331 of 2474)
PASS: lldb-unit :: Utility/./UtilityTests/UriParserTest.SchemeHostSeparator2 (1332 of 2474)
PASS: lldb-api :: lang/objcxx/objc-builtin-types/TestObjCBuiltinTypes.py (1333 of 2474)
PASS: lldb-unit :: Host/./HostTests/NativeProcessProtocolTest.ReadCStringFromMemory_CrossPageBoundary (1334 of 2474)
PASS: lldb-api :: functionalities/breakpoint/breakpoint_ignore_count/TestBreakpointIgnoreCount.py (1335 of 2474)
PASS: lldb-shell :: SymbolFile/Breakpad/line-table.test (1336 of 2474)
PASS: lldb-api :: python_api/function_symbol/TestDisasmAPI.py (1337 of 2474)
PASS: lldb-unit :: Expression/./ExpressionTests/CppModuleConfigurationTest.Xcode (1338 of 2474)
PASS: lldb-api :: commands/watchpoints/hello_watchpoint/TestMyFirstWatchpoint.py (1339 of 2474)
PASS: lldb-unit :: Utility/./UtilityTests/RangeVector.CombineConsecutiveRanges (1340 of 2474)
PASS: lldb-unit :: Process/Utility/./ProcessUtilityTests/ProcSMapTests/LinuxProcSMapsTestFixture.ParseSMapRegions/5 (1341 of 2474)
PASS: lldb-unit :: Expression/./ExpressionTests/DiagnosticManagerTest.GetStringMultipleDiags (1342 of 2474)
PASS: lldb-unit :: Utility/./UtilityTests/OptionsWithRawTest.SingleWhitespaceInput (1343 of 2474)
PASS: lldb-unit :: Core/./LLDBCoreTests/FormatEntityTest.DefinitionConstructionNameTypeData (1344 of 2474)
PASS: lldb-unit :: Utility/./UtilityTests/CompletionRequest.DuplicateFiltering (1345 of 2474)
UNSUPPORTED: lldb-api :: commands/trace/TestTraceSchema.py (1346 of 2474)
UNSUPPORTED: lldb-shell :: SymbolFile/PDB/function-level-linking.test (1347 of 2474)
PASS: lldb-shell :: Commands/command-target-modules-dump-sections.yaml (1348 of 2474)
PASS: lldb-unit :: Expression/./ExpressionTests/DWARFExpression.DW_OP_stack_value (1349 of 2474)
PASS: lldb-api :: macosx/duplicate-archive-members/TestDuplicateMembers.py (1350 of 2474)
PASS: lldb-api :: functionalities/mtc/simple/TestMTCSimple.py (1351 of 2474)
PASS: lldb-unit :: Process/Utility/./ProcessUtilityTests/ProcSMapTests/LinuxProcSMapsTestFixture.ParseSMapRegions/4 (1352 of 2474)
PASS: lldb-api :: commands/frame/language/TestGuessLanguage.py (1353 of 2474)
PASS: lldb-shell :: Register/Core/x86-64-freebsd-fp.test (1354 of 2474)
PASS: lldb-unit :: Utility/./UtilityTests/StringListTest.AppendListCStringArray (1355 of 2474)
PASS: lldb-shell :: ObjectFile/ELF/minidebuginfo-find-symbols.yaml (1356 of 2474)
PASS: lldb-api :: lang/cpp/llvm-style/TestLLVMStyle.py (1357 of 2474)
PASS: lldb-api :: tools/lldb-server/TestAppleSimulatorOSType.py (1358 of 2474)
UNSUPPORTED: lldb-shell :: SymbolFile/NativePDB/ast-functions-msvc.cpp (1359 of 2474)
PASS: lldb-api :: lang/objcxx/hide-runtime-values/TestObjCXXHideRuntimeValues.py (1360 of 2474)
PASS: lldb-unit :: Utility/./UtilityTests/UriParserTest.LongPath (1361 of 2474)
PASS: lldb-api :: commands/target/create-deps/TestTargetCreateDeps.py (1362 of 2474)
PASS: lldb-unit :: Utility/./UtilityTests/EnvironmentTest.EnvpConversion (1363 of 2474)
PASS: lldb-api :: functionalities/breakpoint/dummy_target_breakpoints/TestBreakpointsWithNoTargets.py (1364 of 2474)
PASS: lldb-unit :: Core/./LLDBCoreTests/SourceFileCache.FindSourceFileFound (1365 of 2474)
PASS: lldb-unit :: Symbol/./SymbolTests/TestTypeSystemClang.OnlyPackName (1366 of 2474)
PASS: lldb-unit :: Expression/./ExpressionTests/DWARFExpression.DW_OP_unknown (1367 of 2474)
PASS: lldb-api :: lang/cpp/complete-type-check/TestCppIsTypeComplete.py (1368 of 2474)
PASS: lldb-api :: terminal/TestSTTYBeforeAndAfter.py (1369 of 2474)
PASS: lldb-unit :: debugserver/./debugserverTests/JSON.Parse (1370 of 2474)
UNSUPPORTED: lldb-api :: commands/trace/TestTraceStartStop.py (1371 of 2474)
PASS: lldb-shell :: Quit/TestQuitExitCode-30.test (1372 of 2474)
PASS: lldb-unit :: Symbol/./SymbolTests/DWARFCallFrameInfoTest.Basic_eh (1373 of 2474)
PASS: lldb-unit :: Process/gdb-remote/./ProcessGdbRemoteTests/GDBRemoteClientBaseTest.SendPacketAndReceiveResponseWithOutputSupport (1374 of 2474)
PASS: lldb-api :: lang/c/stepping/TestThreadStepInAvoidRegexp.py (1375 of 2474)
PASS: lldb-shell :: Settings/TestStopCommandSourceOnError.test (1376 of 2474)
PASS: lldb-unit :: Expression/./ExpressionTests/DiagnosticManagerTest.FixedExpression (1377 of 2474)
PASS: lldb-api :: lang/cpp/gmodules-templates/TestGModules.py (1378 of 2474)
UNSUPPORTED: lldb-shell :: ScriptInterpreter/Lua/partial_statements.test (1379 of 2474)
PASS: lldb-unit :: Host/./HostTests/SocketAddressTest.GetAddressInfo (1380 of 2474)
PASS: lldb-unit :: Target/./TargetTests/ModuleCacheTest.GetAndPutUuidExists (1381 of 2474)
PASS: lldb-unit :: Core/./LLDBCoreTests/MangledTest.EmptyForInvalidDLangName (1382 of 2474)
PASS: lldb-api :: functionalities/data-formatter/nsdictionarysynth/TestNSDictionarySynthetic.py (1383 of 2474)
PASS: lldb-unit :: Utility/./UtilityTests/RangeDataVector.FindEntryIndexesThatContain_Overlap (1384 of 2474)
PASS: lldb-unit :: Utility/./UtilityTests/StreamTest.AddressRangeEmptyRange (1385 of 2474)
PASS: lldb-api :: lang/objc/global_ptrs/TestGlobalObjects.py (1386 of 2474)
PASS: lldb-api :: lang/cpp/dynamic-value/TestCppValueCast.py (1387 of 2474)
PASS: lldb-unit :: Utility/./UtilityTests/CompletionRequest.TryCompleteCurrentArgGood (1388 of 2474)
PASS: lldb-unit :: Process/gdb-remote/./ProcessGdbRemoteTests/GDBRemoteCommunicationClientTest.SyncThreadState (1389 of 2474)
PASS: lldb-api :: functionalities/dynamic_value_child_count/TestDynamicValueChildCount.py (1390 of 2474)
PASS: lldb-unit :: Symbol/./SymbolTests/DWARFCallFrameInfoTest.Basic_dwarf4 (1391 of 2474)
PASS: lldb-api :: python_api/watchpoint/TestSetWatchpoint.py (1392 of 2474)
PASS: lldb-api :: functionalities/tail_call_frames/unambiguous_sequence/TestUnambiguousTailCalls.py (1393 of 2474)
PASS: lldb-unit :: Utility/./UtilityTests/UriParserTest.BracketedHostnamePort (1394 of 2474)
PASS: lldb-unit :: Utility/./UtilityTests/StringExtractorTest.GetHexU8_Underflow (1395 of 2474)
PASS: lldb-unit :: Platform/./LLDBPlatformTests/PlatformDarwinTest.GetCompatibleArchARMv7f (1396 of 2474)
PASS: lldb-unit :: Utility/./UtilityTests/XcodeSDKTest.MergeTest (1397 of 2474)
PASS: lldb-unit :: Interpreter/./InterpreterTests/VerifyUserMultiwordCmdPathTest.TestErrors (1398 of 2474)
PASS: lldb-api :: functionalities/breakpoint/auto_continue/TestBreakpointAutoContinue.py (1399 of 2474)
PASS: lldb-shell :: Register/Core/x86-32-freebsd-gp.test (1400 of 2474)
PASS: lldb-api :: commands/expression/dollar-in-variable/TestDollarInVariable.py (1401 of 2474)
PASS: lldb-unit :: Editline/./EditlineTests/EditlineTestFixture.EditlineReceivesMultiLineText (1402 of 2474)
PASS: lldb-unit :: SymbolFile/NativePDB/./SymbolFileNativePDBTests/PDBFPOProgramToDWARFExpressionTests.MissingTargetRegister (1403 of 2474)
PASS: lldb-unit :: Utility/./UtilityTests/ScalarTest.RightShiftOperator (1404 of 2474)
PASS: lldb-unit :: Core/./LLDBCoreTests/ModuleSpecTest.InvalidInMemoryBufferValidFile (1405 of 2474)
PASS: lldb-api :: lang/c/shared_lib/TestSharedLib.py (1406 of 2474)
PASS: lldb-shell :: Breakpoint/breakpoint-command.test (1407 of 2474)
PASS: lldb-api :: python_api/section/TestSectionAPI.py (1408 of 2474)
PASS: lldb-unit :: UnwindAssembly/x86/./UnwindAssemblyx86Tests/Testx86AssemblyInspectionEngine.TestPushESI (1409 of 2474)
PASS: lldb-unit :: Utility/./UtilityTests/StringExtractorTest.GetHexU8_Exact (1410 of 2474)
PASS: lldb-api :: functionalities/tail_call_frames/sbapi_support/TestTailCallFrameSBAPI.py (1411 of 2474)
PASS: lldb-shell :: SymbolFile/DWARF/deterministic-build.cpp (1412 of 2474)
PASS: lldb-api :: lang/objc/modules-compile-error/TestModulesCompileError.py (1413 of 2474)
PASS: lldb-api :: api/command-return-object/TestSBCommandReturnObject.py (1414 of 2474)
PASS: lldb-unit :: Utility/./UtilityTests/ScalarTest.LongLongAssigmentOperator (1415 of 2474)
PASS: lldb-api :: macosx/builtin-debugtrap/TestBuiltinDebugTrap.py (1416 of 2474)
PASS: lldb-unit :: ScriptInterpreter/Python/./ScriptInterpreterPythonTests/PythonDataObjectsTest.TestResetting (1417 of 2474)
PASS: lldb-api :: functionalities/breakpoint/breakpoint_by_line_and_column/TestBreakpointByLineAndColumn.py (1418 of 2474)
PASS: lldb-api :: python_api/type/TestTypeList.py (1419 of 2474)
PASS: lldb-unit :: Utility/./UtilityTests/StringListTest.ShiftMove (1420 of 2474)
PASS: lldb-api :: commands/apropos/basic/TestApropos.py (1421 of 2474)
PASS: lldb-unit :: Core/./LLDBCoreTests/DumpDataExtractorTest.NullStream (1422 of 2474)
PASS: lldb-unit :: Utility/./UtilityTests/ScalarTest.Getters (1423 of 2474)
PASS: lldb-shell :: ObjectFile/PECOFF/uuid.yaml (1424 of 2474)
PASS: lldb-unit :: Utility/./UtilityTests/StringListTest.Assignment (1425 of 2474)
UNSUPPORTED: lldb-api :: commands/register/register/aarch64_dynamic_regset/TestArm64DynamicRegsets.py (1426 of 2474)
PASS: lldb-api :: python_api/lldbutil/iter/TestRegistersIterator.py (1427 of 2474)
PASS: lldb-unit :: Core/./LLDBCoreTests/SourceLocationSpecTest.Compare (1428 of 2474)
PASS: lldb-shell :: Reproducer/Functionalities/TestDataFormatter.test (1429 of 2474)
PASS: lldb-api :: functionalities/float-display/TestFloatDisplay.py (1430 of 2474)
UNSUPPORTED: lldb-api :: benchmarks/libcxxmap/TestBenchmarkLibcxxMap.py (1431 of 2474)
PASS: lldb-api :: commands/breakpoint/set/func-regex/TestBreakpointRegexError.py (1432 of 2474)
PASS: lldb-api :: lang/objc/conflicting-definition/TestConflictingDefinition.py (1433 of 2474)
PASS: lldb-unit :: Process/gdb-remote/./ProcessGdbRemoteTests/GDBRemoteClientBaseTest.SendContinueAndWait (1434 of 2474)
PASS: lldb-unit :: Utility/./UtilityTests/ArgsTest.TestSingleQuotedArgWithSpace (1435 of 2474)
PASS: lldb-shell :: Commands/command-disassemble.s (1436 of 2474)
PASS: lldb-unit :: SymbolFile/NativePDB/./SymbolFileNativePDBTests/PDBFPOProgramToDWARFExpressionTests.InvalidAssignmentSingle (1437 of 2474)
PASS: lldb-unit :: Utility/./UtilityTests/ReproducerTest.SetCapture (1438 of 2474)
PASS: lldb-api :: functionalities/backticks/TestBackticksWithoutATarget.py (1439 of 2474)
PASS: lldb-api :: lang/cpp/exceptions/TestCPPExceptionBreakpoints.py (1440 of 2474)
PASS: lldb-api :: functionalities/thread/exit_during_expression/TestExitDuringExpression.py (1441 of 2474)
PASS: lldb-unit :: Utility/./UtilityTests/RecordReplayTest.InstrumentedBar (1442 of 2474)
PASS: lldb-unit :: Expression/./ExpressionTests/CppModuleConfigurationTest.Linux (1443 of 2474)
PASS: lldb-shell :: SymbolFile/DWARF/clang-ast-from-dwarf-unamed-and-anon-structs.cpp (1444 of 2474)
PASS: lldb-unit :: Utility/./UtilityTests/StringExtractorTest.GetHexBytesAvail_OddPair2 (1445 of 2474)
UNSUPPORTED: lldb-api :: functionalities/data-formatter/data-formatter-stl/libstdcpp/unique_ptr/TestDataFormatterStdUniquePtr.py (1446 of 2474)
PASS: lldb-unit :: Utility/./UtilityTests/PassiveReplayTest.InstrumentedFooInvalid (1447 of 2474)
PASS: lldb-shell :: ScriptInterpreter/Python/silent_command_script_import.test (1448 of 2474)
PASS: lldb-unit :: Expression/./ExpressionTests/CppModuleConfigurationTest.MissingLibCpp (1449 of 2474)
PASS: lldb-unit :: Host/./HostTests/PipeTest.OpenAsReader (1450 of 2474)
PASS: lldb-unit :: Core/./LLDBCoreTests/SourceLocationSpecTest.Equal (1451 of 2474)
PASS: lldb-api :: sample_test/TestSampleTest.py (1452 of 2474)
PASS: lldb-api :: python_api/value/empty_class/TestValueAPIEmptyClass.py (1453 of 2474)
PASS: lldb-unit :: Utility/./UtilityTests/OptionsWithRawTest.EmptyInput (1454 of 2474)
UNSUPPORTED: lldb-api :: functionalities/data-formatter/data-formatter-stl/libstdcpp/vector/TestDataFormatterStdVector.py (1455 of 2474)
PASS: lldb-unit :: UnwindAssembly/x86/./UnwindAssemblyx86Tests/Testx86AssemblyInspectionEngine.TestAddESP (1456 of 2474)
PASS: lldb-api :: tools/lldb-vscode/stackTrace/TestVSCode_stackTrace.py (1457 of 2474)
PASS: lldb-unit :: Utility/./UtilityTests/LogChannelTest.EnableOptions (1458 of 2474)
PASS: lldb-api :: lang/cpp/default-template-args/TestDefaultTemplateArgs.py (1459 of 2474)
PASS: lldb-unit :: Utility/./UtilityTests/DataExtractorTest.GetFloatUnaligned (1460 of 2474)
PASS: lldb-shell :: SymbolFile/DWARF/x86/inline-function-address-shared.test (1461 of 2474)
PASS: lldb-unit :: Host/./HostTests/SocketTests/SocketTest.DomainListenConnectAccept/ipv6 (1462 of 2474)
PASS: lldb-unit :: Utility/./UtilityTests/CompletionRequest.TestCompletionOwnership (1463 of 2474)
PASS: lldb-unit :: Utility/./UtilityTests/StringExtractorTest.GetNameColonValueContainsColon (1464 of 2474)
PASS: lldb-api :: functionalities/thread/create_after_attach/TestCreateAfterAttach.py (1465 of 2474)
PASS: lldb-unit :: Symbol/./SymbolTests/TestTypeSystemClang.TestGetEnumIntegerTypeInvalid (1466 of 2474)
PASS: lldb-unit :: DataFormatter/./LLDBFormatterTests/StringPrinterTests.CxxASCII (1467 of 2474)
PASS: lldb-unit :: Utility/./UtilityTests/StreamTest.PutRawBytesToBigEndian (1468 of 2474)
UNSUPPORTED: lldb-api :: benchmarks/stepping/TestSteppingSpeed.py (1469 of 2474)
PASS: lldb-unit :: Utility/./UtilityTests/StringListTest.LongestCommonPrefixSingleElement (1470 of 2474)
PASS: lldb-api :: functionalities/breakpoint/move_nearest/TestMoveNearest.py (1471 of 2474)
UNSUPPORTED: lldb-api :: functionalities/ptrauth_diagnostics/LDRAA_error/TestPtrauthLDRAADiagnostic.py (1472 of 2474)
PASS: lldb-api :: lang/objc/objc-new-syntax/TestObjCNewSyntaxArray.py (1473 of 2474)
PASS: lldb-api :: types/TestLongTypesExpr.py (1474 of 2474)
PASS: lldb-api :: commands/expression/import-std-module/weak_ptr/TestWeakPtrFromStdModule.py (1475 of 2474)
PASS: lldb-api :: lang/cpp/namespace/TestNamespace.py (1476 of 2474)
PASS: lldb-unit :: Utility/./UtilityTests/DataExtractorTest.GetBitfield (1477 of 2474)
PASS: lldb-api :: functionalities/data-formatter/poarray/TestPrintObjectArray.py (1478 of 2474)
PASS: lldb-unit :: ScriptInterpreter/Python/./ScriptInterpreterPythonTests/PythonDataObjectsTest.TestCallable (1479 of 2474)
PASS: lldb-shell :: Driver/TestUseColor.test (1480 of 2474)
PASS: lldb-unit :: Core/./LLDBCoreTests/MangledTest.ResultForValidDLangName (1481 of 2474)
PASS: lldb-unit :: Utility/./UtilityTests/UriParserTest.TypicalPortPathIPv6 (1482 of 2474)
PASS: lldb-shell :: Error/assert.test (1483 of 2474)
PASS: lldb-api :: tools/lldb-server/TestLldbGdbServer.py (1484 of 2474)
PASS: lldb-unit :: Process/Utility/./ProcessUtilityTests/MemoryTagManagerAArch64MTETest.MakeTaggedRange (1485 of 2474)
PASS: lldb-api :: commands/watchpoints/watchpoint_disable/TestWatchpointDisable.py (1486 of 2474)
PASS: lldb-api :: functionalities/data-formatter/data-formatter-stl/libcxx/vector/TestDataFormatterLibcxxVector.py (1487 of 2474)
PASS: lldb-api :: lang/objc/objc-new-syntax/TestObjCNewSyntaxDictionary.py (1488 of 2474)
PASS: lldb-unit :: Utility/./UtilityTests/OptionsWithRawTest.LeadingSpaceArgs (1489 of 2474)
PASS: lldb-unit :: ScriptInterpreter/Python/./ScriptInterpreterPythonTests/PythonDataObjectsTest.TestPythonBoolean (1490 of 2474)
PASS: lldb-unit :: Utility/./UtilityTests/XcodeSDKTest.GetSDKTypeForTriple (1491 of 2474)
PASS: lldb-shell :: SymbolFile/Breakpad/inline-record.test (1492 of 2474)
PASS: lldb-unit :: Utility/./UtilityTests/RegularExpression.Invalid (1493 of 2474)
PASS: lldb-api :: lang/objc/objc-runtime-ivars/TestRuntimeIvars.py (1494 of 2474)
PASS: lldb-unit :: Utility/./UtilityTests/FileSpecTest.FormatFileSpec (1495 of 2474)
UNSUPPORTED: lldb-shell :: SymbolFile/PDB/calling-conventions.test (1496 of 2474)
PASS: lldb-api :: functionalities/gdb_remote_client/TestGDBRemotePlatformFile.py (1497 of 2474)
PASS: lldb-api :: lang/cpp/this_class_type_mixing/TestThisClassTypeMixing.py (1498 of 2474)
PASS: lldb-api :: lang/cpp/virtual-overload/TestVirtualOverload.py (1499 of 2474)
PASS: lldb-unit :: Platform/./LLDBPlatformTests/PlatformDarwinTest.GetCompatibleArchARM64 (1500 of 2474)
PASS: lldb-api :: functionalities/dlopen_other_executable/TestDlopenOtherExecutable.py (1501 of 2474)
PASS: lldb-api :: test_utils/base/TestBaseTest.py (1502 of 2474)
PASS: lldb-api :: functionalities/process_crash_info/TestProcessCrashInfo.py (1503 of 2474)
UNSUPPORTED: lldb-shell :: Register/x86-zmm-read.test (1504 of 2474)
PASS: lldb-api :: lang/cpp/template/TestTemplateArgs.py (1505 of 2474)
PASS: lldb-api :: macosx/version_zero/TestGetVersionZeroVersion.py (1506 of 2474)
UNSUPPORTED: lldb-api :: tools/lldb-server/vCont-threads/TestGdbRemote_vContThreads.py (1507 of 2474)
PASS: lldb-api :: lang/cpp/class-loading-via-member-typedef/TestClassLoadingViaMemberTypedef.py (1508 of 2474)
PASS: lldb-unit :: Utility/./UtilityTests/ReproducerTest.SetReplay (1509 of 2474)
XFAIL: lldb-shell :: Register/x86-64-ymm-write.test (1510 of 2474)
PASS: lldb-unit :: UnwindAssembly/x86/./UnwindAssemblyx86Tests/Testx86AssemblyInspectionEngine.TestPushEDI (1511 of 2474)
PASS: lldb-api :: functionalities/step-vrs-interrupt/TestStepVrsInterruptTimeout.py (1512 of 2474)
PASS: lldb-api :: commands/target/modules/search-paths/insert/TestTargetModulesSearchpathsInsert.py (1513 of 2474)
PASS: lldb-shell :: SymbolFile/NativePDB/ast-functions.cpp (1514 of 2474)
PASS: lldb-api :: functionalities/gdb_remote_client/TestProcessConnect.py (1515 of 2474)
PASS: lldb-shell :: SymbolFile/NativePDB/locate-pdb.cpp (1516 of 2474)
PASS: lldb-api :: commands/frame/diagnose/local-variable/TestLocalVariable.py (1517 of 2474)
PASS: lldb-unit :: Utility/./UtilityTests/LogTest.LLDB_LOG_nullptr (1518 of 2474)
UNSUPPORTED: lldb-api :: commands/expression/call-restarts/TestCallThatRestarts.py (1519 of 2474)
PASS: lldb-shell :: ObjectFile/ELF/PT_LOAD.yaml (1520 of 2474)
PASS: lldb-unit :: Host/./HostTests/MainLoopTest.Signal (1521 of 2474)
UNSUPPORTED: lldb-shell :: SymbolFile/PDB/func-symbols.test (1522 of 2474)
PASS: lldb-shell :: Reproducer/Functionalities/TestExpressionEvaluation.test (1523 of 2474)
PASS: lldb-unit :: Host/./HostTests/SocketTests/SocketTest.TCPListen0GetPort/ipv4 (1524 of 2474)
PASS: lldb-unit :: Utility/./UtilityTests/DataExtractorTest.GetMaxS64 (1525 of 2474)
UNSUPPORTED: lldb-shell :: Register/x86-64-zmm-write.test (1526 of 2474)
PASS: lldb-unit :: Process/gdb-remote/./ProcessGdbRemoteTests/GDBRemoteCommunicationClientTest.GetMemoryRegionInfo (1527 of 2474)
PASS: lldb-unit :: Utility/./UtilityTests/NameMatchesTest.Contains (1528 of 2474)
PASS: lldb-unit :: Utility/./UtilityTests/DataExtractorTest.GetDoubleUnaligned (1529 of 2474)
PASS: lldb-shell :: SymbolFile/DWARF/x86/parallel-indexing-stress.s (1530 of 2474)
PASS: lldb-api :: commands/apropos/with-process/TestAproposWithProcess.py (1531 of 2474)
PASS: lldb-shell :: ObjectFile/PECOFF/basic-info-arm64.yaml (1532 of 2474)
PASS: lldb-api :: functionalities/thread/concurrent_events/TestConcurrentDelayedCrashWithBreakpointWatchpoint.py (1533 of 2474)
PASS: lldb-api :: functionalities/deleted-executable/TestDeletedExecutable.py (1534 of 2474)
PASS: lldb-api :: commands/expression/no-deadlock/TestExprDoesntBlock.py (1535 of 2474)
PASS: lldb-api :: functionalities/thread_plan/TestThreadPlanCommands.py (1536 of 2474)
PASS: lldb-api :: functionalities/inferior-crashing/TestInferiorCrashingStep.py (1537 of 2474)
PASS: lldb-unit :: Expression/./ExpressionTests/CppModuleConfigurationTest.UnrelatedLibrary (1538 of 2474)
PASS: lldb-unit :: UnwindAssembly/x86/./UnwindAssemblyx86Tests/Testx86AssemblyInspectionEngine.TestPopR13 (1539 of 2474)
PASS: lldb-shell :: SymbolFile/DWARF/x86/gnu-style-compression.cpp (1540 of 2474)
PASS: lldb-unit :: Signals/./SignalsTests/UnixSignalsTest.VersionChange (1541 of 2474)
PASS: lldb-unit :: Utility/./UtilityTests/StreamTest.PutCharWhitespace (1542 of 2474)
PASS: lldb-shell :: VSCode/TestOptions.test (1543 of 2474)
PASS: lldb-api :: lang/cpp/bool/TestCPPBool.py (1544 of 2474)
PASS: lldb-api :: lang/objc/single-entry-dictionary/TestObjCSingleEntryDictionary.py (1545 of 2474)
PASS: lldb-shell :: Settings/TestEchoCommands.test (1546 of 2474)
PASS: lldb-shell :: Register/x86-multithread-write.test (1547 of 2474)
PASS: lldb-api :: functionalities/thread/concurrent_events/TestConcurrentWatchpointDelayWatchpointOneBreakpoint.py (1548 of 2474)
PASS: lldb-api :: functionalities/gdb_remote_client/TestPlatformKill.py (1549 of 2474)
PASS: lldb-shell :: Reproducer/TestDSYM.test (1550 of 2474)
PASS: lldb-unit :: Host/./HostTests/TerminalTest.SetParityCheck (1551 of 2474)
UNSUPPORTED: lldb-shell :: SymbolFile/NativePDB/stack_unwinding01.cpp (1552 of 2474)
PASS: lldb-unit :: Language/Highlighting/./HighlighterTests/HighlighterTest.ClangTrailingBackslashWithWhitespace (1553 of 2474)
PASS: lldb-unit :: Utility/./UtilityTests/RecordReplayTest.InstrumentedBarPtr (1554 of 2474)
UNSUPPORTED: lldb-api :: lang/objc/conflicting-class-list-function-from-user/TestObjCClassListFunctionFromUser.py (1555 of 2474)
PASS: lldb-api :: commands/expression/weak_symbols/TestWeakSymbols.py (1556 of 2474)
UNSUPPORTED: lldb-shell :: Subprocess/clone-follow-parent-wp.test (1557 of 2474)
PASS: lldb-api :: commands/expression/completion/TestExprCompletion.py (1558 of 2474)
PASS: lldb-shell :: Register/x86-multithread-read.test (1559 of 2474)
PASS: lldb-shell :: ObjectFile/ELF/many-sections.s (1560 of 2474)
PASS: lldb-unit :: UnwindAssembly/x86/./UnwindAssemblyx86Tests/Testx86AssemblyInspectionEngine.TestPushR13 (1561 of 2474)
PASS: lldb-api :: functionalities/data-formatter/data-formatter-ptr-to-array/TestPtrToArrayFormatting.py (1562 of 2474)
PASS: lldb-api :: functionalities/limit-debug-info/TestLimitDebugInfo.py (1563 of 2474)
PASS: lldb-api :: python_api/process/read-mem-cstring/TestReadMemCString.py (1564 of 2474)
PASS: lldb-unit :: Utility/./UtilityTests/RangeTest.ContainsRange (1565 of 2474)
PASS: lldb-unit :: SymbolFile/NativePDB/./SymbolFileNativePDBTests/PDBFPOProgramToDWARFExpressionTests.InvalidOpUnary (1566 of 2474)
PASS: lldb-api :: commands/command/script/import/rdar-12586188/TestRdar12586188.py (1567 of 2474)
PASS: lldb-unit :: Process/gdb-remote/./ProcessGdbRemoteTests/GDBRemoteCommunicationClientTest.GetModulesInfo (1568 of 2474)
PASS: lldb-api :: functionalities/thread/concurrent_events/TestConcurrentSignalBreak.py (1569 of 2474)
UNSUPPORTED: lldb-api :: commands/gui/viewlarge/TestGuiViewLarge.py (1570 of 2474)
PASS: lldb-unit :: DataFormatter/./LLDBFormatterTests/TypeMatcherTests.CreatedBySameMatchStringExactNamePrefixes (1571 of 2474)
PASS: lldb-shell :: Settings/TestModuleCacheSanity.test (1572 of 2474)
XFAIL: lldb-shell :: Unwind/prefer-debug-over-eh-frame.test (1573 of 2474)
PASS: lldb-api :: commands/expression/cast_int_to_anonymous_enum/TestCastIntToAnonymousEnum.py (1574 of 2474)
PASS: lldb-unit :: ScriptInterpreter/Python/./ScriptInterpreterPythonTests/PythonDataObjectsTest.TestPythonTupleToStructuredList (1575 of 2474)
PASS: lldb-api :: tools/lldb-server/register-reading/TestGdbRemoteGPacket.py (1576 of 2474)
PASS: lldb-api :: functionalities/data-formatter/summary-string-onfail/Test-rdar-9974002.py (1577 of 2474)
PASS: lldb-unit :: Utility/./UtilityTests/StreamTest.PutBytesAsRawHex8ToLittleEndian (1578 of 2474)
UNSUPPORTED: lldb-shell :: Subprocess/clone-follow-child-softbp.test (1579 of 2474)
PASS: lldb-unit :: UnwindAssembly/x86/./UnwindAssemblyx86Tests/Testx86AssemblyInspectionEngine.TestPopEBP (1580 of 2474)
UNSUPPORTED: lldb-api :: commands/expression/multiline-completion/TestMultilineCompletion.py (1581 of 2474)
PASS: lldb-unit :: Core/./LLDBCoreTests/DumpDataExtractorTest.FormatCharArray (1582 of 2474)
PASS: lldb-api :: python_api/class_members/TestSBTypeClassMembers.py (1583 of 2474)
PASS: lldb-unit :: Utility/./UtilityTests/BinaryStreamTest.PutSLEB128NineBytes (1584 of 2474)
PASS: lldb-unit :: DataFormatter/./LLDBFormatterTests/TypeMatcherTests.ExactName (1585 of 2474)
UNSUPPORTED: lldb-api :: benchmarks/continue/TestBenchmarkContinue.py (1586 of 2474)
PASS: lldb-unit :: Utility/./UtilityTests/ArgsTest.StringListConstructor (1587 of 2474)
PASS: lldb-shell :: SymbolFile/DWARF/x86/DW_AT_loclists_base.s (1588 of 2474)
PASS: lldb-api :: commands/expression/import-std-module/empty-module/TestEmptyStdModule.py (1589 of 2474)
PASS: lldb-shell :: Register/Core/x86-32-freebsd-addr.test (1590 of 2474)
PASS: lldb-api :: functionalities/data-formatter/data-formatter-stl/libcxx/string/TestDataFormatterLibcxxString.py (1591 of 2474)
PASS: lldb-api :: lang/cpp/class_types/TestClassTypes.py (1592 of 2474)
PASS: lldb-shell :: Register/Core/x86-64-linux-addr.test (1593 of 2474)
PASS: lldb-unit :: Utility/./UtilityTests/StreamTest.AddressPrefixAndSuffix (1594 of 2474)
PASS: lldb-api :: functionalities/data-formatter/data-formatter-smart-array/TestDataFormatterSmartArray.py (1595 of 2474)
PASS: lldb-unit :: ObjectFile/PECOFF/./ObjectFilePECOFFTests/PECallFrameInfoTest.Frame_reg_eh (1596 of 2474)
PASS: lldb-shell :: ScriptInterpreter/Python/Crashlog/json.test (1597 of 2474)
PASS: lldb-unit :: Platform/Android/./AdbClientTests/AdbClientTest.CreateByDeviceId_ByEnvVar (1598 of 2474)
PASS: lldb-api :: lang/cpp/pointer_to_member_type_depending_on_parent_size/TestPointerToMemberTypeDependingOnParentSize.py (1599 of 2474)
PASS: lldb-api :: commands/expression/char/TestExprsChar.py (1600 of 2474)
PASS: lldb-api :: commands/platform/sdk/TestPlatformSDK.py (1601 of 2474)
PASS: lldb-unit :: Target/./TargetTests/PathMappingListTest.RemapRoot (1602 of 2474)
UNSUPPORTED: lldb-shell :: SymbolFile/DWARF/x86/DW_TAG_variable-DW_AT_decl_file-DW_AT_abstract_origin-crosscu1.s (1603 of 2474)
PASS: lldb-api :: lang/cpp/break-on-initializers/TestBreakOnCPP11Initializers.py (1604 of 2474)
PASS: lldb-api :: lang/c/set_values/TestSetValues.py (1605 of 2474)
PASS: lldb-shell :: SymbolFile/Breakpad/line-table-missing-file.test (1606 of 2474)
PASS: lldb-shell :: Breakpoint/debug_rnglist_offset_pair.test (1607 of 2474)
PASS: lldb-shell :: Register/Core/x86-64-freebsd-gp.test (1608 of 2474)
PASS: lldb-shell :: Reproducer/TestRelativePath.test (1609 of 2474)
PASS: lldb-api :: functionalities/tail_call_frames/thread_step_out_message/TestArtificialFrameStepOutMessage.py (1610 of 2474)
PASS: lldb-unit :: Process/minidump/./LLDBMinidumpTests/MinidumpParserTest.GetMemoryRegionInfo (1611 of 2474)
PASS: lldb-shell :: Breakpoint/debug_rnglistx_rlex.test (1612 of 2474)
PASS: lldb-unit :: UnwindAssembly/x86/./UnwindAssemblyx86Tests/Testx86AssemblyInspectionEngine.TestStackRealignMSVC_i386 (1613 of 2474)
PASS: lldb-api :: functionalities/thread/concurrent_events/TestConcurrentWatchBreakDelay.py (1614 of 2474)
PASS: lldb-unit :: Platform/./LLDBPlatformTests/PlatformDarwinTest.TestParseVersionBuildDir (1615 of 2474)
PASS: lldb-unit :: Symbol/./SymbolTests/SymbolsTest.LocateExecutableSymbolFileForUnknownExecutableAndMissingSymbolFile (1616 of 2474)
PASS: lldb-unit :: Interpreter/./InterpreterTests/OptionValueString.DeepCopy (1617 of 2474)
PASS: lldb-unit :: UnwindAssembly/x86/./UnwindAssemblyx86Tests/Testx86AssemblyInspectionEngine.TestSimplei386ugmented (1618 of 2474)
PASS: lldb-unit :: UnwindAssembly/x86/./UnwindAssemblyx86Tests/Testx86AssemblyInspectionEngine.Test64bitFramelessSmallStackFrame (1619 of 2474)
PASS: lldb-shell :: SymbolFile/DWARF/x86/dwarf5-split.s (1620 of 2474)
PASS: lldb-api :: functionalities/gdb_remote_client/TestJLink6Armv7RegisterDefinition.py (1621 of 2474)
PASS: lldb-unit :: Interpreter/./InterpreterTests/CompletionTest.DirCompletionAbsolute (1622 of 2474)
UNSUPPORTED: lldb-shell :: Subprocess/clone-follow-child-wp.test (1623 of 2474)
PASS: lldb-api :: commands/watchpoints/multiple_hits/TestMultipleHits.py (1624 of 2474)
PASS: lldb-unit :: Utility/./UtilityTests/TimeoutTest.Construction (1625 of 2474)
PASS: lldb-unit :: Utility/./UtilityTests/StringExtractorTest.DecodeHexU8_Underflow (1626 of 2474)
PASS: lldb-api :: functionalities/data-formatter/data-formatter-globals/TestDataFormatterGlobals.py (1627 of 2474)
PASS: lldb-api :: functionalities/thread/concurrent_events/TestConcurrentTwoWatchpointsOneBreakpoint.py (1628 of 2474)
PASS: lldb-api :: commands/settings/quoting/TestQuoting.py (1629 of 2474)
PASS: lldb-unit :: Utility/./UtilityTests/UriParserTest.PortOverflow (1630 of 2474)
PASS: lldb-unit :: Utility/./UtilityTests/ArchSpecTest.TestSetTriple (1631 of 2474)
PASS: lldb-unit :: Process/Utility/./ProcessUtilityTests/ProcSMapTests/LinuxProcSMapsTestFixture.ParseSMapRegions/8 (1632 of 2474)
PASS: lldb-unit :: Utility/./UtilityTests/ArchSpecTest.OperatorBool (1633 of 2474)
PASS: lldb-shell :: Breakpoint/split-dwarf-5-addrbase.test (1634 of 2474)
PASS: lldb-unit :: Utility/./UtilityTests/StringExtractorTest.GetHexU8_InvalidHex_NoEof (1635 of 2474)
PASS: lldb-unit :: Core/./LLDBCoreTests/RichManglingContextTest.SwitchProvider (1636 of 2474)
PASS: lldb-unit :: UnwindAssembly/x86/./UnwindAssemblyx86Tests/Testx86AssemblyInspectionEngine.TestPushRBX (1637 of 2474)
UNSUPPORTED: lldb-shell :: SymbolFile/PDB/pointers.test (1638 of 2474)
PASS: lldb-api :: commands/expression/context-object-objc/TestContextObjectObjc.py (1639 of 2474)
PASS: lldb-shell :: ScriptInterpreter/Python/Crashlog/text.test (1640 of 2474)
PASS: lldb-unit :: Symbol/./SymbolTests/TestTypeSystemClang.TestFunctionTemplateConstruction (1641 of 2474)
PASS: lldb-api :: lang/cpp/thread_local/TestThreadLocal.py (1642 of 2474)
PASS: lldb-shell :: Register/Core/x86-64-linux-fp.test (1643 of 2474)
PASS: lldb-unit :: Target/./TargetTests/ModuleCacheTest.GetAndPut (1644 of 2474)
PASS: lldb-api :: functionalities/recursion/TestValueObjectRecursion.py (1645 of 2474)
PASS: lldb-unit :: Platform/./LLDBPlatformTests/PlatformDarwinTest.GetCompatibleArchARMv6m (1646 of 2474)
UNSUPPORTED: lldb-api :: functionalities/thread/multi_break/TestMultipleBreakpoints.py (1647 of 2474)
PASS: lldb-shell :: Minidump/disassemble-no-module.yaml (1648 of 2474)
PASS: lldb-unit :: Process/minidump/./LLDBMinidumpTests/MinidumpParserTest.GetFilteredModuleList (1649 of 2474)
PASS: lldb-api :: functionalities/thread/concurrent_events/TestConcurrentTwoBreakpointsOneDelaySignal.py (1650 of 2474)
PASS: lldb-unit :: Utility/./UtilityTests/StreamTeeTest.DefaultConstructor (1651 of 2474)
PASS: lldb-api :: commands/expression/import-std-module/shared_ptr/TestSharedPtrFromStdModule.py (1652 of 2474)
PASS: lldb-shell :: Subprocess/vfork-follow-parent.test (1653 of 2474)
PASS: lldb-unit :: Platform/./LLDBPlatformTests/PlatformDarwinTest.GetCompatibleArchARMv6 (1654 of 2474)
PASS: lldb-unit :: Target/./TargetTests/ModuleCacheTest.GetAndPutStrangeHostname (1655 of 2474)
PASS: lldb-api :: lang/objc/modules-hash-mismatch/TestClangModulesHashMismatch.py (1656 of 2474)
UNSUPPORTED: lldb-shell :: SymbolFile/NativePDB/typedefs.cpp (1657 of 2474)
PASS: lldb-unit :: Host/./HostTests/FileSystemTest.EmptyTest (1658 of 2474)
PASS: lldb-shell :: SymbolFile/DWARF/x86/childless-compile-unit.s (1659 of 2474)
PASS: lldb-api :: lang/cpp/alignas_base_class/TestAlignAsBaseClass.py (1660 of 2474)
PASS: lldb-api :: functionalities/data-formatter/data-formatter-stl/libcxx/function/TestLibCxxFunction.py (1661 of 2474)
PASS: lldb-shell :: Reproducer/TestMultipleTargets.test (1662 of 2474)
UNSUPPORTED: lldb-shell :: Register/x86-64-xmm16-read.test (1663 of 2474)
PASS: lldb-shell :: Reproducer/TestHomeDir.test (1664 of 2474)
PASS: lldb-shell :: ObjectFile/ELF/section-overlap.yaml (1665 of 2474)
PASS: lldb-api :: lang/cpp/non-type-template-param/TestCppNonTypeTemplateParam.py (1666 of 2474)
PASS: lldb-unit :: SymbolFile/DWARF/./SymbolFileDWARFTests/SymbolFileDWARFTests.ParseArangesWithMultipleTerminators (1667 of 2474)
PASS: lldb-api :: python_api/sberror/TestSBError.py (1668 of 2474)
PASS: lldb-api :: commands/target/dump-symtab-demangle/TestDumpSymtabDemangle.py (1669 of 2474)
PASS: lldb-api :: lang/c/complex/TestComplexC99.py (1670 of 2474)
PASS: lldb-api :: commands/expression/import-std-module/conflicts/TestStdModuleWithConflicts.py (1671 of 2474)
PASS: lldb-unit :: SymbolFile/DWARF/./SymbolFileDWARFTests/SymbolFileDWARFTests.TestAbbrevOrder1Start5 (1672 of 2474)
PASS: lldb-shell :: Reproducer/Functionalities/TestImageList.test (1673 of 2474)
UNSUPPORTED: lldb-shell :: SymbolFile/PDB/vbases.test (1674 of 2474)
PASS: lldb-unit :: Utility/./UtilityTests/EventTest.DumpEventDataBytes (1675 of 2474)
PASS: lldb-unit :: Utility/./UtilityTests/RecordReplayTest.InstrumentedBarRef (1676 of 2474)
PASS: lldb-unit :: Expression/./ExpressionTests/DWARFExpression.DW_OP_piece (1677 of 2474)
PASS: lldb-api :: commands/frame/diagnose/virtual-method-call/TestDiagnoseDereferenceVirtualMethodCall.py (1678 of 2474)
PASS: lldb-api :: functionalities/data-formatter/cstring-utf8-summary/TestCstringUnicode.py (1679 of 2474)
PASS: lldb-api :: lang/objc/direct-dispatch-step/TestObjCDirectDispatchStepping.py (1680 of 2474)
PASS: lldb-shell :: Reproducer/TestFileRepro.test (1681 of 2474)
PASS: lldb-shell :: ObjectFile/PECOFF/symbol.yaml (1682 of 2474)
PASS: lldb-shell :: ExecControl/StopHook/stop-hook.test (1683 of 2474)
PASS: lldb-api :: lang/objc/ivar-IMP/TestObjCiVarIMP.py (1684 of 2474)
PASS: lldb-unit :: Core/./LLDBCoreTests/FormatEntity.LookupAllEntriesInTree (1685 of 2474)
PASS: lldb-unit :: Utility/./UtilityTests/StateTest.Formatv (1686 of 2474)
PASS: lldb-api :: commands/process/attach/attach_denied/TestAttachDenied.py (1687 of 2474)
UNSUPPORTED: lldb-shell :: ObjectFile/ELF/minidebuginfo-no-lzma.yaml (1688 of 2474)
PASS: lldb-unit :: Utility/./UtilityTests/ArgsTest.ReplaceArgumentAtIndexLonger (1689 of 2474)
PASS: lldb-api :: tools/lldb-vscode/module/TestVSCode_module.py (1690 of 2474)
PASS: lldb-unit :: Thread/./ThreadTests/ThreadTest.GetPrivateStopInfo (1691 of 2474)
PASS: lldb-unit :: Symbol/./SymbolTests/TestClangASTImporter.ImportInvalidType (1692 of 2474)
PASS: lldb-unit :: Utility/./UtilityTests/ArchSpecTest.MergeFromMachOUnknown (1693 of 2474)
PASS: lldb-unit :: ScriptInterpreter/Python/./ScriptInterpreterPythonTests/PythonDataObjectsTest.TestPythonTupleInitializerList (1694 of 2474)
PASS: lldb-api :: tools/lldb-vscode/console/TestVSCode_redirection_to_console.py (1695 of 2474)
PASS: lldb-unit :: Target/./TargetTests/PathMappingListTest.RelativeTests (1696 of 2474)
PASS: lldb-unit :: Symbol/./SymbolTests/PostfixExpression.ToDWARF (1697 of 2474)
PASS: lldb-api :: commands/platform/basic/TestPlatformPython.py (1698 of 2474)
PASS: lldb-api :: tools/lldb-vscode/step/TestVSCode_step.py (1699 of 2474)
PASS: lldb-unit :: Utility/./UtilityTests/ConstStringTest.CompareConstString (1700 of 2474)
PASS: lldb-api :: types/TestLongTypes.py (1701 of 2474)
PASS: lldb-unit :: Language/Highlighting/./HighlighterTests/HighlighterTest.HighlighterSelectionPath (1702 of 2474)
PASS: lldb-unit :: Utility/./UtilityTests/RegularExpression.Match (1703 of 2474)
PASS: lldb-unit :: Utility/./UtilityTests/FileSpecTest.RemoveLastPathComponent (1704 of 2474)
PASS: lldb-unit :: Language/Highlighting/./HighlighterTests/HighlighterTest.DefaultHighlighterWithCursor (1705 of 2474)
PASS: lldb-unit :: UnwindAssembly/x86/./UnwindAssemblyx86Tests/Testx86AssemblyInspectionEngine.Test32bitFramelessBigStackFrame (1706 of 2474)
PASS: lldb-shell :: Reproducer/TestCrash.test (1707 of 2474)
PASS: lldb-shell :: SymbolFile/DWARF/x86/find-basic-function.cpp (1708 of 2474)
PASS: lldb-unit :: Utility/./UtilityTests/StringListTest.GetSize (1709 of 2474)
PASS: lldb-shell :: Settings/TestFrameFormatColor.test (1710 of 2474)
PASS: lldb-unit :: Symbol/./SymbolTests/TestTypeSystemClang.TestGetEnumIntegerTypeBasicTypes (1711 of 2474)
PASS: lldb-unit :: Language/Highlighting/./HighlighterTests/HighlighterTest.ClangCursorPosEndOfLine (1712 of 2474)
PASS: lldb-api :: functionalities/thread/exit_during_step/TestExitDuringStep.py (1713 of 2474)
PASS: lldb-unit :: Host/./HostTests/TerminalTest.SetHardwareFlowControl (1714 of 2474)
PASS: lldb-api :: python_api/value/change_values/TestChangeValueAPI.py (1715 of 2474)
PASS: lldb-api :: commands/expression/persistent_types/TestNestedPersistentTypes.py (1716 of 2474)
PASS: lldb-api :: functionalities/breakpoint/breakpoint_command/TestRegexpBreakCommand.py (1717 of 2474)
PASS: lldb-api :: functionalities/data-formatter/data-formatter-stl/libcxx/optional/TestDataFormatterLibcxxOptional.py (1718 of 2474)
PASS: lldb-shell :: Register/Core/x86-32-linux-multithread.test (1719 of 2474)
PASS: lldb-shell :: Driver/LocalLLDBInit.test (1720 of 2474)
UNSUPPORTED: lldb-shell :: ScriptInterpreter/Lua/quit.test (1721 of 2474)
PASS: lldb-unit :: Symbol/./SymbolTests/TestClangASTImporter.MetadataPropagation (1722 of 2474)
PASS: lldb-api :: functionalities/gdb_remote_client/TestMemoryRegionDirtyPages.py (1723 of 2474)
PASS: lldb-api :: functionalities/thread/concurrent_events/TestConcurrentTwoBreakpointsOneSignal.py (1724 of 2474)
PASS: lldb-api :: lang/objc/rdar-10967107/TestRdar10967107.py (1725 of 2474)
PASS: lldb-api :: functionalities/jitloader_gdb/TestJITLoaderGDB.py (1726 of 2474)
PASS: lldb-shell :: Breakpoint/dummy-target.test (1727 of 2474)
UNSUPPORTED: lldb-api :: iohandler/unicode/TestUnicode.py (1728 of 2474)
PASS: lldb-shell :: SymbolFile/DWARF/x86/dwarf5_tu_index_abbrev_offset.s (1729 of 2474)
PASS: lldb-unit :: Utility/./UtilityTests/StringExtractorTest.GetHexBytes_OddPair (1730 of 2474)
PASS: lldb-api :: tools/lldb-server/inferior-crash/TestGdbRemoteAbort.py (1731 of 2474)
UNSUPPORTED: lldb-api :: arm/breakpoint-thumb-codesection/TestBreakpointThumbCodesection.py (1732 of 2474)
PASS: lldb-api :: lang/objc/modules/TestObjCModules.py (1733 of 2474)
UNSUPPORTED: lldb-shell :: SymbolFile/DWARF/split-dwarf-expression-eval-bug.cpp (1734 of 2474)
PASS: lldb-shell :: SymbolFile/DWARF/DW_AT_range-DW_FORM_sec_offset.s (1735 of 2474)
PASS: lldb-unit :: Language/CPlusPlus/./LanguageCPlusPlusTests/CPlusPlusLanguage.MethodNameParsing (1736 of 2474)
UNSUPPORTED: lldb-api :: commands/expression/macros/TestMacros.py (1737 of 2474)
PASS: lldb-unit :: Symbol/./SymbolTests/LineEntryTest.GetSameLineContiguousAddressRangeNestedInline (1738 of 2474)
PASS: lldb-shell :: lldb-server/TestErrorMessages.test (1739 of 2474)
PASS: lldb-api :: functionalities/data-formatter/data-formatter-proper-plurals/TestFormattersOneIsSingular.py (1740 of 2474)
PASS: lldb-unit :: Host/./HostTests/FileSystemTest.EnumerateDirectory (1741 of 2474)
PASS: lldb-api :: commands/disassemble/basic/TestDisassembleBreakpoint.py (1742 of 2474)
PASS: lldb-unit :: Process/gdb-remote/./ProcessGdbRemoteTests/GDBRemoteClientBaseTest.SendContinueDelegateInterface (1743 of 2474)
PASS: lldb-api :: lang/objcxx/conflicting-names-class-update-utility-expr/TestObjCConflictingNamesForClassUpdateExpr.py (1744 of 2474)
PASS: lldb-unit :: Language/Highlighting/./HighlighterTests/HighlighterTest.HighlighterSelectionType (1745 of 2474)
PASS: lldb-unit :: DataFormatter/./LLDBFormatterTests/TypeMatcherTests.GetMatchStringExactName (1746 of 2474)
UNSUPPORTED: lldb-shell :: Register/x86-gp-write.test (1747 of 2474)
PASS: lldb-unit :: Symbol/./SymbolTests/TestTypeSystemClang.TemplateArguments (1748 of 2474)
PASS: lldb-unit :: Process/gdb-remote/./ProcessGdbRemoteTests/PortMapTest.FreePortForProcess (1749 of 2474)
PASS: lldb-unit :: Expression/./ExpressionTests/DWARFExpression.DW_OP_pick (1750 of 2474)
UNSUPPORTED: lldb-api :: commands/gui/basic/TestGuiBasic.py (1751 of 2474)
PASS: lldb-unit :: Language/Highlighting/./HighlighterTests/HighlighterTest.ClangBraces (1752 of 2474)
PASS: lldb-shell :: SymbolFile/DWARF/x86/dir-separator-no-comp-dir-relative-name.s (1753 of 2474)
PASS: lldb-unit :: Utility/./UtilityTests/Predicate.WaitForValueNotEqualTo (1754 of 2474)
PASS: lldb-api :: python_api/lldbutil/process/TestPrintStackTraces.py (1755 of 2474)
PASS: lldb-unit :: SymbolFile/DWARF/./SymbolFileDWARFTests/DWARFUnitTest.MissingSentinel (1756 of 2474)
UNSUPPORTED: lldb-api :: functionalities/tsan/cpp_global_location/TestTsanCPPGlobalLocation.py (1757 of 2474)
PASS: lldb-unit :: Host/./HostTests/TerminalTest.SetStopBits (1758 of 2474)
PASS: lldb-unit :: Utility/./UtilityTests/RangeTest.Constructor (1759 of 2474)
PASS: lldb-api :: commands/expression/import_builtin_fileid/TestImportBuiltinFileID.py (1760 of 2474)
PASS: lldb-shell :: SymbolFile/DWARF/x86/DW_AT_declaration-with-children.s (1761 of 2474)
PASS: lldb-unit :: Language/Highlighting/./HighlighterTests/HighlighterTest.ClangEmptyInput (1762 of 2474)
PASS: lldb-unit :: Process/Utility/./ProcessUtilityTests/ProcMapTests/LinuxProcMapsTestFixture.ParseMapRegions/0 (1763 of 2474)
PASS: lldb-api :: functionalities/gdb_remote_client/TestStopPCs.py (1764 of 2474)
PASS: lldb-api :: lang/c/strings/TestCStrings.py (1765 of 2474)
PASS: lldb-unit :: Symbol/./SymbolTests/TestTypeSystemClang.GetExeModuleWhenMissingSymbolFile (1766 of 2474)
PASS: lldb-api :: commands/quit/TestQuit.py (1767 of 2474)
PASS: lldb-api :: lang/cpp/multiple-inheritance/TestCppMultipleInheritance.py (1768 of 2474)
PASS: lldb-unit :: Utility/./UtilityTests/CompletionRequest.TryCompleteCurrentArgBad (1769 of 2474)
PASS: lldb-api :: functionalities/data-formatter/data-formatter-skip-summary/TestDataFormatterSkipSummary.py (1770 of 2474)
UNSUPPORTED: lldb-shell :: Subprocess/clone-follow-parent.test (1771 of 2474)
PASS: lldb-unit :: Language/Highlighting/./HighlighterTests/HighlighterTest.ClangCursorPosInOtherToken (1772 of 2474)
PASS: lldb-api :: python_api/watchpoint/watchlocation/TestSetWatchlocation.py (1773 of 2474)
PASS: lldb-unit :: Utility/./UtilityTests/SerializationRountripTest.SerializeDeserializeObjectPointer (1774 of 2474)
PASS: lldb-unit :: Process/Utility/./ProcessUtilityTests/ProcMapTests/LinuxProcMapsTestFixture.ParseMapRegions/3 (1775 of 2474)
PASS: lldb-unit :: Process/gdb-remote/./ProcessGdbRemoteTests/PortMapTest.Constructors (1776 of 2474)
PASS: lldb-unit :: Utility/./UtilityTests/CompletionRequest.DuplicateFilteringWithComments (1777 of 2474)
PASS: lldb-api :: lang/objc/foundation/TestRuntimeTypes.py (1778 of 2474)
PASS: lldb-api :: functionalities/thread/state_after_expression/TestStateAfterExpression.py (1779 of 2474)
PASS: lldb-unit :: Interpreter/./InterpreterTests/CompletionTest.DirCompletionUsername (1780 of 2474)
PASS: lldb-shell :: ObjectFile/PDB/object.test (1781 of 2474)
PASS: lldb-api :: commands/expression/import-std-module/iterator/TestIteratorFromStdModule.py (1782 of 2474)
PASS: lldb-api :: tools/lldb-server/TestGdbRemoteAttachOrWait.py (1783 of 2474)
PASS: lldb-api :: lang/c/blocks/TestBlocks.py (1784 of 2474)
PASS: lldb-unit :: Interpreter/./InterpreterTests/CompletionTest.FileCompletionAbsolute (1785 of 2474)
PASS: lldb-api :: commands/expression/ir-interpreter/TestIRInterpreter.py (1786 of 2474)
PASS: lldb-unit :: Utility/./UtilityTests/ArgsTest.Yaml (1787 of 2474)
PASS: lldb-shell :: Driver/TestRepl.test (1788 of 2474)
PASS: lldb-unit :: Utility/./UtilityTests/LogTest.Unregister (1789 of 2474)
PASS: lldb-unit :: Platform/./LLDBPlatformTests/PlatformDarwinTest.GetCompatibleArchARMv7k (1790 of 2474)
PASS: lldb-unit :: Process/gdb-remote/./ProcessGdbRemoteTests/GDBRemoteCommunicationClientTest.ReadMemoryTags (1791 of 2474)
PASS: lldb-unit :: Utility/./UtilityTests/ScalarTest.GetValue (1792 of 2474)
PASS: lldb-unit :: Expression/./ExpressionTests/DiagnosticManagerTest.PutStringMultiple (1793 of 2474)
PASS: lldb-unit :: Host/./HostTests/FileSystemTest.Exists (1794 of 2474)
PASS: lldb-shell :: Register/Core/x86-64-freebsd-addr.test (1795 of 2474)
PASS: lldb-api :: lang/cpp/stl/TestSTL.py (1796 of 2474)
PASS: lldb-unit :: Utility/./UtilityTests/TimerTest.CategoryTimes (1797 of 2474)
UNSUPPORTED: lldb-shell :: Register/x86-64-zmm-read.test (1798 of 2474)
PASS: lldb-unit :: Utility/./UtilityTests/StringExtractorTest.GetU64LittleEndian (1799 of 2474)
PASS: lldb-unit :: Process/minidump/./LLDBMinidumpTests/MinidumpParserTest.GetMemoryRegionInfoLinuxMaps (1800 of 2474)
PASS: lldb-unit :: Process/Utility/./ProcessUtilityTests/ProcSMapTests/LinuxProcSMapsTestFixture.ParseSMapRegions/0 (1801 of 2474)
PASS: lldb-unit :: Utility/./UtilityTests/ArgsTest.EscapeLLDBCommandArgument (1802 of 2474)
PASS: lldb-api :: lang/cpp/gmodules/TestWithModuleDebugging.py (1803 of 2474)
PASS: lldb-api :: lang/objc/forward-decl/TestForwardDecl.py (1804 of 2474)
PASS: lldb-unit :: UnwindAssembly/x86/./UnwindAssemblyx86Tests/Testx86AssemblyInspectionEngine.Testi386IgnoredRegisters (1805 of 2474)
PASS: lldb-unit :: ObjectFile/Breakpad/./ObjectFileBreakpadTests/StackWinRecord.parse (1806 of 2474)
PASS: lldb-unit :: Utility/./UtilityTests/StringListTest.CopyListEmpty (1807 of 2474)
PASS: lldb-unit :: Process/minidump/./LLDBMinidumpTests/MinidumpParserTest.GetThreadContext_x86_64 (1808 of 2474)
PASS: lldb-api :: lang/c/global_variables/TestGlobalVariables.py (1809 of 2474)
PASS: lldb-unit :: SymbolFile/NativePDB/./SymbolFileNativePDBTests/PDBFPOProgramToDWARFExpressionTests.MultipleIndependentAssignments (1810 of 2474)
PASS: lldb-api :: functionalities/step-avoids-no-debug/TestStepNoDebug.py (1811 of 2474)
PASS: lldb-unit :: Platform/./LLDBPlatformTests/PlatformDarwinTest.GetCompatibleArchARMv4 (1812 of 2474)
PASS: lldb-unit :: Utility/./UtilityTests/ProcessInstanceInfo.Yaml (1813 of 2474)
PASS: lldb-unit :: Host/./HostTests/FileActionTest.Open (1814 of 2474)
PASS: lldb-api :: commands/settings/TestSettings.py (1815 of 2474)
PASS: lldb-api :: commands/expression/import-std-module/non-module-type-separation/TestNonModuleTypeSeparation.py (1816 of 2474)
PASS: lldb-unit :: Utility/./UtilityTests/RangeTest.NotEqual (1817 of 2474)
PASS: lldb-api :: python_api/symbol-context/TestSymbolContext.py (1818 of 2474)
UNSUPPORTED: lldb-api :: functionalities/ptrauth_diagnostics/BLRAA_error/TestPtrauthBLRAADiagnostic.py (1819 of 2474)
PASS: lldb-unit :: Host/./HostTests/TerminalTest.SaveRestore (1820 of 2474)
PASS: lldb-api :: commands/frame/select/TestFrameSelect.py (1821 of 2474)
PASS: lldb-unit :: Utility/./UtilityTests/SerializationRountripTest.SerializeDeserializeCStringNull (1822 of 2474)
PASS: lldb-api :: python_api/sbvalue_persist/TestSBValuePersist.py (1823 of 2474)
UNSUPPORTED: lldb-api :: commands/platform/connect/TestPlatformConnect.py (1824 of 2474)
PASS: lldb-unit :: Interpreter/./InterpreterTests/TestProperties.DeepCopy (1825 of 2474)
PASS: lldb-api :: commands/expression/result_numbering/TestResultNumbering.py (1826 of 2474)
PASS: lldb-api :: lang/cpp/nested-class-other-compilation-unit/TestNestedClassWithParentInAnotherCU.py (1827 of 2474)
UNSUPPORTED: lldb-shell :: Register/arm-fp-read.test (1828 of 2474)
PASS: lldb-unit :: ScriptInterpreter/Python/./ScriptInterpreterPythonTests/PythonDataObjectsTest.TestPythonDictionaryValueEquality (1829 of 2474)
UNSUPPORTED: lldb-api :: commands/watchpoints/watch_tagged_addr/TestWatchTaggedAddress.py (1830 of 2474)
PASS: lldb-api :: functionalities/data-formatter/data-formatter-stl/generic/multimap/TestDataFormatterGenericMultiMap.py (1831 of 2474)
PASS: lldb-unit :: Utility/./UtilityTests/StreamTest.Indent (1832 of 2474)
PASS: lldb-shell :: SymbolFile/DWARF/x86/find-variable-file.cpp (1833 of 2474)
PASS: lldb-unit :: Utility/./UtilityTests/StringLexerTest.HasAtLeast (1834 of 2474)
PASS: lldb-api :: macosx/find-dsym/bundle-with-dot-in-filename/TestBundleWithDotInFilename.py (1835 of 2474)
PASS: lldb-shell :: Reproducer/TestSynchronous.test (1836 of 2474)
PASS: lldb-api :: python_api/target/TestTargetAPI.py (1837 of 2474)
PASS: lldb-shell :: SymbolFile/NativePDB/globals-bss.cpp (1838 of 2474)
PASS: lldb-unit :: ScriptInterpreter/Python/./ScriptInterpreterPythonTests/PythonDataObjectsTest.TestPythonDictionaryManipulation (1839 of 2474)
PASS: lldb-shell :: Minidump/Windows/find-module.test (1840 of 2474)
PASS: lldb-unit :: Utility/./UtilityTests/FileSpecTest.Yaml (1841 of 2474)
PASS: lldb-api :: functionalities/thread/concurrent_events/TestConcurrentDelayedCrashWithBreakpointSignal.py (1842 of 2474)
PASS: lldb-api :: functionalities/data-formatter/data-formatter-stl/generic/multiset/TestDataFormatterGenericMultiSet.py (1843 of 2474)
PASS: lldb-api :: functionalities/thread/concurrent_events/TestConcurrentTwoWatchpointsOneSignal.py (1844 of 2474)
PASS: lldb-unit :: Process/./ProcessEventDataTests/ProcessEventDataTest.DoOnRemoval (1845 of 2474)
UNSUPPORTED: lldb-api :: linux/aarch64/tagged_memory_region/TestAArch64LinuxTaggedMemoryRegion.py (1846 of 2474)
PASS: lldb-api :: python_api/debugger/TestDebuggerAPI.py (1847 of 2474)
PASS: lldb-unit :: Language/Highlighting/./HighlighterTests/HighlighterTest.ClangCursorPosBeforeOtherToken (1848 of 2474)
PASS: lldb-unit :: Utility/./UtilityTests/Flags.AllClear (1849 of 2474)
PASS: lldb-unit :: Utility/./UtilityTests/StringExtractorTest.InitMisc (1850 of 2474)
PASS: lldb-api :: lang/cpp/keywords_enabled/TestCppKeywordsEnabled.py (1851 of 2474)
PASS: lldb-api :: tools/lldb-server/commandline/TestGdbRemoteConnection.py (1852 of 2474)
PASS: lldb-api :: types/TestIntegerType.py (1853 of 2474)
PASS: lldb-unit :: Expression/./ExpressionTests/DiagnosticManagerTest.GetStringMultiline (1854 of 2474)
PASS: lldb-unit :: UnwindAssembly/x86/./UnwindAssemblyx86Tests/Testx86AssemblyInspectionEngine.TestPopEDI (1855 of 2474)
PASS: lldb-api :: lang/objc/objc-ivar-offsets/TestObjCIvarOffsets.py (1856 of 2474)
PASS: lldb-unit :: Process/Utility/./ProcessUtilityTests/MemoryTagManagerAArch64MTETest.GetLogicalTag (1857 of 2474)
PASS: lldb-api :: lang/objc/blocks/TestObjCIvarsInBlocks.py (1858 of 2474)
PASS: lldb-api :: functionalities/return-value/TestReturnValue.py (1859 of 2474)
PASS: lldb-unit :: Utility/./UtilityTests/FileSpecTest.EqualSeparator (1860 of 2474)
PASS: lldb-shell :: Register/Core/x86-64-netbsd-addr.test (1861 of 2474)
PASS: lldb-api :: lang/c/shared_lib_stripped_symbols/TestSharedLibStrippedSymbols.py (1862 of 2474)
PASS: lldb-unit :: Host/./HostTests/SocketTests/SocketTest.TCPGetAddress/ipv4 (1863 of 2474)
UNSUPPORTED: lldb-api :: functionalities/data-formatter/data-formatter-stl/libstdcpp/smart_ptr/TestDataFormatterStdSmartPtr.py (1864 of 2474)
PASS: lldb-api :: functionalities/data-formatter/data-formatter-stl/libcxx/queue/TestDataFormatterLibcxxQueue.py (1865 of 2474)
PASS: lldb-shell :: Driver/TestQuiet.test (1866 of 2474)
PASS: lldb-api :: lang/c/anonymous/TestAnonymous.py (1867 of 2474)
PASS: lldb-api :: api/check_public_api_headers/TestPublicAPIHeaders.py (1868 of 2474)
PASS: lldb-unit :: Utility/./UtilityTests/ScalarTest.GetBytes (1869 of 2474)
PASS: lldb-shell :: SymbolFile/DWARF/x86/dwarf5-debug_line.s (1870 of 2474)
PASS: lldb-unit :: Utility/./UtilityTests/StreamTest.PutBytesAsRawHex8ToBigEndian (1871 of 2474)
UNSUPPORTED: lldb-shell :: SymbolFile/PDB/type-quals.test (1872 of 2474)
PASS: lldb-unit :: Utility/./UtilityTests/StreamTeeTest.GetStreamAtIndexOutOfBounds (1873 of 2474)
PASS: lldb-api :: commands/expression/import-std-module/vector-of-vectors/TestVectorOfVectorsFromStdModule.py (1874 of 2474)
PASS: lldb-unit :: Utility/./UtilityTests/StringListTest.SetSize (1875 of 2474)
PASS: lldb-api :: functionalities/breakpoint/break_in_loaded_dylib/TestBreakInLoadedDylib.py (1876 of 2474)
PASS: lldb-api :: functionalities/rerun/TestRerun.py (1877 of 2474)
PASS: lldb-api :: functionalities/data-formatter/frameformat_smallstruct/TestFrameFormatSmallStruct.py (1878 of 2474)
PASS: lldb-api :: functionalities/data-formatter/setvaluefromcstring/TestSetValueFromCString.py (1879 of 2474)
UNSUPPORTED: lldb-shell :: Subprocess/fork-follow-child-softbp.test (1880 of 2474)
PASS: lldb-unit :: ScriptInterpreter/Python/./ScriptInterpreterPythonTests/PythonDataObjectsTest.TestPythonString (1881 of 2474)
PASS: lldb-api :: functionalities/data-formatter/ptr_ref_typedef/TestPtrRef2Typedef.py (1882 of 2474)
PASS: lldb-unit :: Utility/./UtilityTests/NameMatchesTest.RegularExpression (1883 of 2474)
PASS: lldb-api :: functionalities/thread/step_out/TestThreadStepOut.py (1884 of 2474)
PASS: lldb-unit :: Utility/./UtilityTests/StreamTest.ShiftOperatorPtr (1885 of 2474)
PASS: lldb-unit :: Process/gdb-remote/./ProcessGdbRemoteTests/GDBRemoteCommunicationClientTest.TestPacketSpeedJSON (1886 of 2474)
PASS: lldb-unit :: Utility/./UtilityTests/StringListTest.ForRangeEmpty (1887 of 2474)
PASS: lldb-api :: functionalities/breakpoint/breakpoint_options/TestBreakpointOptions.py (1888 of 2474)
PASS: lldb-unit :: UnwindAssembly/x86/./UnwindAssemblyx86Tests/Testx86AssemblyInspectionEngine.TestPopRBX (1889 of 2474)
PASS: lldb-unit :: Process/minidump/./LLDBMinidumpTests/MinidumpParserTest.GetMemory (1890 of 2474)
PASS: lldb-shell :: SymbolFile/NativePDB/lookup-by-address.cpp (1891 of 2474)
PASS: lldb-api :: tools/lldb-vscode/attach/TestVSCode_attach.py (1892 of 2474)
PASS: lldb-shell :: SymbolFile/DWARF/dwo-relative-path.s (1893 of 2474)
PASS: lldb-unit :: Process/gdb-remote/./ProcessGdbRemoteTests/GDBRemoteClientBaseTest.InterruptNoResponse (1894 of 2474)
PASS: lldb-shell :: Reproducer/TestReuseDirectory.test (1895 of 2474)
PASS: lldb-unit :: UnwindAssembly/x86/./UnwindAssemblyx86Tests/Testx86AssemblyInspectionEngine.TestDisassemblyMidFunctionEpilogues (1896 of 2474)
PASS: lldb-unit :: Expression/./ExpressionTests/CppModuleConfigurationTest.UnknownLibCppFile (1897 of 2474)
PASS: lldb-shell :: ScriptInterpreter/Python/Crashlog/parser_text.test (1898 of 2474)
PASS: lldb-unit :: Target/./TargetTests/ExecutionContextTest.GetByteOrder (1899 of 2474)
PASS: lldb-unit :: Process/Utility/./ProcessUtilityTests/ProcMapTests/LinuxProcMapsTestFixture.ParseMapRegions/5 (1900 of 2474)
PASS: lldb-unit :: Utility/./UtilityTests/StreamTest.ChangingByteOrder (1901 of 2474)
PASS: lldb-api :: lang/cpp/const_this/TestConstThis.py (1902 of 2474)
PASS: lldb-unit :: Process/gdb-remote/./ProcessGdbRemoteTests/GDBRemoteCommunicationServerTest.SendErrorResponse_ErrorList (1903 of 2474)
PASS: lldb-api :: commands/version/TestVersion.py (1904 of 2474)
PASS: lldb-unit :: Host/./HostTests/HostInfoTest.GetXcodeSDK (1905 of 2474)
UNSUPPORTED: lldb-api :: macosx/simulator/TestSimulatorPlatform.py (1906 of 2474)
PASS: lldb-api :: functionalities/thread/concurrent_events/TestConcurrentCrashWithWatchpoint.py (1907 of 2474)
PASS: lldb-shell :: SymbolFile/DWARF/x86/debug-types-line-tables.s (1908 of 2474)
PASS: lldb-unit :: UnwindAssembly/x86/./UnwindAssemblyx86Tests/Testx86AssemblyInspectionEngine.TestPopEBX (1909 of 2474)
PASS: lldb-shell :: ObjectFile/PECOFF/sections.yaml (1910 of 2474)
PASS: lldb-unit :: Utility/./UtilityTests/RecordReplayTest.ValidSequence (1911 of 2474)
PASS: lldb-unit :: Host/./HostTests/SocketTests/SocketTest.TCPListen0GetPort/ipv6 (1912 of 2474)
PASS: lldb-shell :: ObjectFile/ELF/null-jmprel.yaml (1913 of 2474)
PASS: lldb-unit :: Language/Highlighting/./HighlighterTests/HighlighterTest.DefaultHighlighterWithCursorOutOfBounds (1914 of 2474)
PASS: lldb-unit :: Platform/./LLDBPlatformTests/PlatformDarwinTest.GetCompatibleArchARMv5 (1915 of 2474)
PASS: lldb-unit :: Utility/./UtilityTests/ProcessInstanceInfo.DumpTable_invalidUID (1916 of 2474)
PASS: lldb-api :: lang/c/calling-conventions/TestCCallingConventions.py (1917 of 2474)
PASS: lldb-api :: lang/c/cpp_keyword_identifiers/TestCppKeywordsAsCIdentifiers.py (1918 of 2474)
PASS: lldb-shell :: Register/Core/x86-64-netbsd-fp.test (1919 of 2474)
UNSUPPORTED: lldb-api :: commands/expression/import-std-module/pair/TestPairFromStdModule.py (1920 of 2474)
PASS: lldb-api :: api/multithreaded/TestMultithreaded.py (1921 of 2474)
PASS: lldb-api :: commands/frame/diagnose/inheritance/TestDiagnoseInheritance.py (1922 of 2474)
PASS: lldb-api :: macosx/order/TestOrderFile.py (1923 of 2474)
PASS: lldb-api :: functionalities/avoids-fd-leak/TestFdLeak.py (1924 of 2474)
UNSUPPORTED: lldb-api :: commands/gui/breakpoints/TestGuiBreakpoints.py (1925 of 2474)
PASS: lldb-api :: api/multiple-targets/TestMultipleTargets.py (1926 of 2474)
UNSUPPORTED: lldb-shell :: Subprocess/fork-follow-child-wp.test (1927 of 2474)
PASS: lldb-unit :: ScriptInterpreter/Python/./ScriptInterpreterPythonTests/PythonDataObjectsTest.TestRun (1928 of 2474)
PASS: lldb-unit :: Expression/./ExpressionTests/CppModuleConfigurationTest.IgnoreLibStdCpp (1929 of 2474)
PASS: lldb-unit :: ScriptInterpreter/Python/./ScriptInterpreterPythonTests/PythonDataObjectsTest.TestScript (1930 of 2474)
PASS: lldb-api :: commands/expression/import-std-module/vector-dbg-info-content/TestDbgInfoContentVectorFromStdModule.py (1931 of 2474)
PASS: lldb-unit :: Core/./LLDBCoreTests/ModuleSpecTest.TestMachOFile (1932 of 2474)
PASS: lldb-unit :: SymbolFile/DWARF/./SymbolFileDWARFTests/SymbolFileDWARFTests.ParseAranges (1933 of 2474)
UNSUPPORTED: lldb-api :: functionalities/process_save_core/TestProcessSaveCore.py (1934 of 2474)
UNSUPPORTED: lldb-api :: benchmarks/turnaround/TestCompileRunToBreakpointTurnaround.py (1935 of 2474)
PASS: lldb-unit :: Core/./LLDBCoreTests/StreamCallbackTest.Callback (1936 of 2474)
PASS: lldb-unit :: Expression/./ExpressionTests/DWARFExpression.DW_OP_implicit_value (1937 of 2474)
PASS: lldb-unit :: Language/Highlighting/./HighlighterTests/HighlighterTest.Colons (1938 of 2474)
PASS: lldb-api :: lang/cpp/covariant-return-types/TestCovariantReturnTypes.py (1939 of 2474)
PASS: lldb-api :: python_api/file_handle/TestFileHandle.py (1940 of 2474)
PASS: lldb-unit :: Utility/./UtilityTests/FileSpecTest.OperatorBool (1941 of 2474)
PASS: lldb-unit :: Utility/./UtilityTests/StringListTest.SplitIntoLines (1942 of 2474)
PASS: lldb-unit :: Host/./HostTests/Host.GetEnvironment (1943 of 2474)
PASS: lldb-api :: functionalities/data-formatter/data-formatter-stl/generic/set/TestDataFormatterGenericSet.py (1944 of 2474)
PASS: lldb-shell :: ScriptInterpreter/Python/python.test (1945 of 2474)
PASS: lldb-unit :: Expression/./ExpressionTests/DiagnosticManagerTest.GetStringBasic (1946 of 2474)
PASS: lldb-shell :: SymbolFile/DWARF/x86/debug_ranges-missing-section.s (1947 of 2474)
PASS: lldb-unit :: Symbol/./SymbolTests/TestTypeSystemClang.TestGetTypeClassDeclType (1948 of 2474)
PASS: lldb-unit :: Utility/./UtilityTests/ScalarTest.APIntConstructor (1949 of 2474)
PASS: lldb-unit :: Utility/./UtilityTests/OptionsWithRawTest.TerminatedQuote (1950 of 2474)
PASS: lldb-api :: functionalities/thread/concurrent_events/TestConcurrentManyCrash.py (1951 of 2474)
PASS: lldb-unit :: Platform/./LLDBPlatformTests/PlatformDarwinTest.GetCompatibleArchARMv7 (1952 of 2474)
PASS: lldb-api :: functionalities/data-formatter/type_summary_list_script/TestTypeSummaryListScript.py (1953 of 2474)
PASS: lldb-api :: tools/lldb-server/TestGdbRemoteProcessInfo.py (1954 of 2474)
PASS: lldb-api :: commands/expression/import-std-module/no-std-module/TestMissingStdModule.py (1955 of 2474)
PASS: lldb-api :: functionalities/paths/TestPaths.py (1956 of 2474)
PASS: lldb-api :: commands/watchpoints/watchpoint_events/TestWatchpointEvents.py (1957 of 2474)
UNSUPPORTED: lldb-api :: commands/trace/TestTraceLoad.py (1958 of 2474)
PASS: lldb-unit :: Utility/./UtilityTests/ArgsTest.DoubleQuotedItem (1959 of 2474)
PASS: lldb-unit :: Utility/./UtilityTests/UriParserTest.MinimalPort (1960 of 2474)
UNSUPPORTED: lldb-api :: tools/lldb-server/memory-tagging/TestGdbRemoteMemoryTagging.py (1961 of 2474)
PASS: lldb-unit :: Process/gdb-remote/./ProcessGdbRemoteTests/GDBRemoteCommunicationClientTest.ReadRegister (1962 of 2474)
PASS: lldb-unit :: SymbolFile/DWARF/./SymbolFileDWARFTests/SymbolFileDWARFTests.TestAbbrevOutOfOrder (1963 of 2474)
UNSUPPORTED: lldb-shell :: Unwind/eh-frame-small-fde.test (1964 of 2474)
PASS: lldb-unit :: Utility/./UtilityTests/StringExtractorTest.GetHexBytes (1965 of 2474)
PASS: lldb-api :: functionalities/data-formatter/data-formatter-enum-format/TestDataFormatterEnumFormat.py (1966 of 2474)
PASS: lldb-api :: functionalities/data-formatter/data-formatter-stl/libcxx/list/TestDataFormatterLibcxxList.py (1967 of 2474)
PASS: lldb-api :: macosx/stack-corefile/TestStackCorefile.py (1968 of 2474)
PASS: lldb-unit :: Utility/./UtilityTests/RangeTest.ContainsRangeStartingFromZero (1969 of 2474)
PASS: lldb-unit :: Utility/./UtilityTests/StreamTest.PutNHex8 (1970 of 2474)
PASS: lldb-shell :: Quit/TestQuitExitCode30.test (1971 of 2474)
PASS: lldb-unit :: SymbolFile/DWARF/./SymbolFileDWARFTests/SymbolFileDWARFTests.TestAbilitiesForDWARF (1972 of 2474)
PASS: lldb-unit :: Utility/./UtilityTests/ScalarTest.Scalar_512 (1973 of 2474)
PASS: lldb-api :: macosx/DBGSourcePathRemapping/TestDSYMSourcePathRemapping.py (1974 of 2474)
PASS: lldb-api :: functionalities/tail_call_frames/disambiguate_call_site/TestDisambiguateCallSite.py (1975 of 2474)
XFAIL: lldb-shell :: Register/x86-64-write.test (1976 of 2474)
PASS: lldb-shell :: Process/Optimization.test (1977 of 2474)
PASS: lldb-api :: commands/expression/import-std-module/weak_ptr-dbg-info-content/TestDbgInfoContentWeakPtrFromStdModule.py (1978 of 2474)
PASS: lldb-api :: commands/expression/import-std-module/unique_ptr-dbg-info-content/TestUniquePtrDbgInfoContent.py (1979 of 2474)
PASS: lldb-api :: tools/lldb-server/memory-allocation/TestGdbRemoteMemoryAllocation.py (1980 of 2474)
PASS: lldb-unit :: Editline/./EditlineTests/EditlineTestFixture.EditlineReceivesSingleLineText (1981 of 2474)
PASS: lldb-api :: commands/expression/import-std-module/stack/TestStackFromStdModule.py (1982 of 2474)
PASS: lldb-unit :: Host/./HostTests/SocketTests/SocketTest.DomainGetConnectURI/ipv4 (1983 of 2474)
PASS: lldb-shell :: SymbolFile/Breakpad/line-table-edgecases.test (1984 of 2474)
PASS: lldb-shell :: ScriptInterpreter/None/import_module.test (1985 of 2474)
PASS: lldb-unit :: Utility/./UtilityTests/ArgsTest.ReplaceArgumentAtIndexEqual (1986 of 2474)
PASS: lldb-api :: functionalities/thread/concurrent_events/TestConcurrentBreakpointDelayBreakpointOneSignal.py (1987 of 2474)
PASS: lldb-api :: functionalities/pointer_num_children/TestPointerNumChildren.py (1988 of 2474)
PASS: lldb-unit :: Utility/./UtilityTests/StreamTest.QuotedCString (1989 of 2474)
PASS: lldb-api :: functionalities/thread/jump/TestThreadJump.py (1990 of 2474)
PASS: lldb-unit :: Utility/./UtilityTests/RangeTest.ContainsAddr (1991 of 2474)
PASS: lldb-shell :: SymbolFile/DWARF/x86/find-function-regex.cpp (1992 of 2474)
PASS: lldb-unit :: SymbolFile/NativePDB/./SymbolFileNativePDBTests/PDBFPOProgramToDWARFExpressionTests.InvalidAssignmentMultiple (1993 of 2474)
UNSUPPORTED: lldb-api :: benchmarks/expression/TestRepeatedExprs.py (1994 of 2474)
PASS: lldb-api :: commands/frame/diagnose/dereference-this/TestDiagnoseDereferenceThis.py (1995 of 2474)
PASS: lldb-unit :: Utility/./UtilityTests/StringLexerTest.NextIf (1996 of 2474)
PASS: lldb-api :: functionalities/target_var/TestTargetVar.py (1997 of 2474)
PASS: lldb-shell :: Register/Core/x86-32-freebsd-fp.test (1998 of 2474)
PASS: lldb-api :: functionalities/thread/concurrent_events/TestConcurrentNWatchNBreak.py (1999 of 2474)
PASS: lldb-unit :: ObjectFile/Breakpad/./ObjectFileBreakpadTests/InfoRecord.parse (2000 of 2474)
PASS: lldb-shell :: Reproducer/TestDebugSymbols.test (2001 of 2474)
PASS: lldb-unit :: Process/minidump/./LLDBMinidumpTests/MinidumpParserTest.GetArchitectureWindows (2002 of 2474)
PASS: lldb-api :: functionalities/pre_run_dylibs/TestPreRunDylibs.py (2003 of 2474)
PASS: lldb-api :: functionalities/thread/backtrace_limit/TestBacktraceLimit.py (2004 of 2474)
PASS: lldb-api :: functionalities/data-formatter/data-formatter-stl/libcxx/variant/TestDataFormatterLibcxxVariant.py (2005 of 2474)
PASS: lldb-api :: commands/frame/diagnose/dereference-function-return/TestDiagnoseDereferenceFunctionReturn.py (2006 of 2474)
PASS: lldb-unit :: ObjectFile/Breakpad/./ObjectFileBreakpadTests/ModuleRecord.parse (2007 of 2474)
PASS: lldb-api :: lang/c/stepping/TestStepAndBreakpoints.py (2008 of 2474)
PASS: lldb-unit :: Utility/./UtilityTests/StringListTest.CopyListSingle (2009 of 2474)
PASS: lldb-shell :: SymbolFile/DWARF/x86/debug-types-signature-loop.s (2010 of 2474)
PASS: lldb-shell :: Commands/CommandScriptImmediateOutput/CommandScriptImmediateOutputConsole.test (2011 of 2474)
PASS: lldb-api :: macosx/lc-note/kern-ver-str/TestKernVerStrLCNOTE.py (2012 of 2474)
PASS: lldb-unit :: Symbol/./SymbolTests/TestTypeSystemMap.GetTypeSystemForLanguageWithNoTarget (2013 of 2474)
PASS: lldb-shell :: Driver/TestHelp.test (2014 of 2474)
PASS: lldb-unit :: Process/gdb-remote/./ProcessGdbRemoteTests/GDBRemoteClientBaseTest.SendContinueAndAsyncSignal (2015 of 2474)
PASS: lldb-api :: lang/cpp/incomplete-types/TestCppIncompleteTypes.py (2016 of 2474)
PASS: lldb-unit :: Utility/./UtilityTests/StreamTeeTest.Write (2017 of 2474)
PASS: lldb-api :: functionalities/completion/TestCompletion.py (2018 of 2474)
PASS: lldb-unit :: Utility/./UtilityTests/LogChannelTest.List (2019 of 2474)
UNSUPPORTED: lldb-api :: macosx/macCatalystAppMacOSFramework/TestMacCatalystAppWithMacOSFramework.py (2020 of 2474)
PASS: lldb-unit :: Utility/./UtilityTests/ScalarTest.Division (2021 of 2474)
PASS: lldb-api :: commands/expression/class_template_specialization_empty_pack/TestClassTemplateSpecializationParametersHandling.py (2022 of 2474)
PASS: lldb-unit :: Utility/./UtilityTests/VMRange.ContainsRange (2023 of 2474)
PASS: lldb-unit :: Utility/./UtilityTests/ArchSpecTest.YAML (2024 of 2474)
PASS: lldb-api :: lang/objc/unicode-string/TestUnicodeString.py (2025 of 2474)
UNSUPPORTED: lldb-api :: functionalities/disassemble/aarch64-adrp-add/TestAArch64AdrpAdd.py (2026 of 2474)
PASS: lldb-api :: functionalities/dead-strip/TestDeadStrip.py (2027 of 2474)
UNSUPPORTED: lldb-api :: lang/c/typedef/Testtypedef.py (2028 of 2474)
PASS: lldb-unit :: SymbolFile/NativePDB/./SymbolFileNativePDBTests/PDBFPOProgramToDWARFExpressionTests.UnresolvedCyclicRegisterAssignmentReference (2029 of 2474)
PASS: lldb-unit :: Utility/./UtilityTests/ConstStringTest.MangledCounterpart (2030 of 2474)
PASS: lldb-unit :: Utility/./UtilityTests/StringExtractorTest.GetHexU8_InvalidHex (2031 of 2474)
PASS: lldb-api :: functionalities/data-formatter/data-formatter-objc/TestDataFormatterObjCNSBundle.py (2032 of 2474)
PASS: lldb-api :: commands/process/signal/TestProcessSignal.py (2033 of 2474)
PASS: lldb-unit :: ObjectFile/Breakpad/./ObjectFileBreakpadTests/FuncRecord.parse (2034 of 2474)
PASS: lldb-unit :: Platform/./LLDBPlatformTests/PlatformDarwinTest.GetCompatibleArchARMv7s (2035 of 2474)
PASS: lldb-api :: commands/expression/dont_allow_jit/TestAllowJIT.py (2036 of 2474)
PASS: lldb-unit :: Process/minidump/./LLDBMinidumpTests/MinidumpParserTest.GetThreadContext_x86_32_wow64 (2037 of 2474)
PASS: lldb-api :: lang/objc/foundation/TestObjCMethodsNSArray.py (2038 of 2474)
PASS: lldb-api :: commands/expression/radar_9531204/TestPrintfAfterUp.py (2039 of 2474)
UNSUPPORTED: lldb-shell :: ScriptInterpreter/Lua/nested_sessions.test (2040 of 2474)
PASS: lldb-unit :: SymbolFile/DWARF/./SymbolFileDWARFTests/DWARFUnitTest.NullUnitDie (2041 of 2474)
PASS: lldb-api :: commands/expression/entry-bp/TestExprEntryBP.py (2042 of 2474)
PASS: lldb-shell :: Commands/command-backtrace-parser-2.test (2043 of 2474)
PASS: lldb-api :: lang/cpp/operator-overload/TestOperatorOverload.py (2044 of 2474)
PASS: lldb-api :: functionalities/gdb_remote_client/TestRestartBug.py (2045 of 2474)
PASS: lldb-unit :: Utility/./UtilityTests/StringListTest.Clear (2046 of 2474)
PASS: lldb-api :: functionalities/data-formatter/data-formatter-objc/TestDataFormatterObjCKVO.py (2047 of 2474)
PASS: lldb-api :: functionalities/tail_call_frames/cross_object/TestCrossObjectTailCalls.py (2048 of 2474)
UNSUPPORTED: lldb-api :: functionalities/tsan/thread_leak/TestTsanThreadLeak.py (2049 of 2474)
PASS: lldb-shell :: ObjectFile/ELF/netbsd-exec-8.99.30-amd64.yaml (2050 of 2474)
PASS: lldb-unit :: Host/./HostTests/File.GetStreamFromDescriptor (2051 of 2474)
PASS: lldb-api :: commands/target/stop-hook/enable/TestTargetStopHookEnable.py (2052 of 2474)
PASS: lldb-unit :: Process/minidump/./LLDBMinidumpTests/MinidumpParserTest.MinidumpModuleOrder (2053 of 2474)
UNSUPPORTED: lldb-shell :: Unwind/basic-block-sections.test (2054 of 2474)
PASS: lldb-shell :: ObjectFile/MachO/lc_build_version_notools.yaml (2055 of 2474)
UNSUPPORTED: lldb-api :: benchmarks/frame_variable/TestFrameVariableResponse.py (2056 of 2474)
UNSUPPORTED: lldb-api :: tools/lldb-server/TestGdbRemoteModuleInfo.py (2057 of 2474)
UNSUPPORTED: lldb-shell :: SymbolFile/PDB/enums-layout.test (2058 of 2474)
PASS: lldb-api :: commands/disassemble/basic/TestFrameDisassemble.py (2059 of 2474)
PASS: lldb-api :: python_api/lldbutil/frame/TestFrameUtils.py (2060 of 2474)
UNSUPPORTED: lldb-api :: tools/lldb-server/TestGdbRemotePlatformFile.py (2061 of 2474)
PASS: lldb-shell :: Register/Core/x86-32-netbsd-addr.test (2062 of 2474)
PASS: lldb-unit :: Utility/./UtilityTests/StreamTest.AddressRange (2063 of 2474)
PASS: lldb-unit :: Interpreter/./InterpreterTests/OptionArgParserTest.toScriptLanguage (2064 of 2474)
XFAIL: lldb-shell :: Register/x86-mm-xmm-read.test (2065 of 2474)
PASS: lldb-api :: lang/objc/radar-9691614/TestObjCMethodReturningBOOL.py (2066 of 2474)
PASS: lldb-unit :: ScriptInterpreter/Python/./ScriptInterpreterPythonTests/PythonDataObjectsTest.TestPythonCallableCheck (2067 of 2474)
PASS: lldb-unit :: Utility/./UtilityTests/OptionsWithRawTest.UnterminatedQuote (2068 of 2474)
PASS: lldb-unit :: Utility/./UtilityTests/StringListTest.AppendStringStdString (2069 of 2474)
PASS: lldb-unit :: tools/lldb-server/tests/./LLDBServerTests/TestBase.DebugserverEnv (2070 of 2474)
PASS: lldb-unit :: Utility/./UtilityTests/StreamTeeTest.GetStreamAtIndexOutOfBoundsEmpty (2071 of 2474)
XFAIL: lldb-shell :: Register/x86-mm-xmm-write.test (2072 of 2474)
PASS: lldb-unit :: Utility/./UtilityTests/ArchSpecTest.MergeFrom (2073 of 2474)
UNSUPPORTED: lldb-api :: functionalities/thread/thread_specific_break_plus_condition/TestThreadSpecificBpPlusCondition.py (2074 of 2474)
PASS: lldb-unit :: Utility/./UtilityTests/DataExtractorTest.GetSLEB128_bit63 (2075 of 2474)
PASS: lldb-api :: lang/objc/foundation/TestObjCMethodsNSError.py (2076 of 2474)
PASS: lldb-unit :: Utility/./UtilityTests/BroadcasterTest.BroadcastEvent (2077 of 2474)
PASS: lldb-unit :: Process/gdb-remote/./ProcessGdbRemoteTests/GDBRemoteCommunicationClientTest.SendTraceSupportedPacket (2078 of 2474)
PASS: lldb-api :: commands/source/info/TestSourceInfo.py (2079 of 2474)
UNSUPPORTED: lldb-shell :: ScriptInterpreter/Lua/breakpoint_function_callback.test (2080 of 2474)
PASS: lldb-api :: functionalities/thread/thread_exit/TestThreadExit.py (2081 of 2474)
PASS: lldb-api :: commands/expression/radar_9673664/TestExprHelpExamples.py (2082 of 2474)
PASS: lldb-unit :: Utility/./UtilityTests/VMRange.Clear (2083 of 2474)
PASS: lldb-unit :: Utility/./UtilityTests/ConstStringTest.UpdateMangledCounterpart (2084 of 2474)
PASS: lldb-api :: commands/expression/pr35310/TestExprsBug35310.py (2085 of 2474)
PASS: lldb-api :: functionalities/data-formatter/hexcaps/TestDataFormatterHexCaps.py (2086 of 2474)
PASS: lldb-unit :: ScriptInterpreter/Python/./ScriptInterpreterPythonTests/PythonDataObjectsTest.TestPythonDictionaryToStructuredDictionary (2087 of 2474)
PASS: lldb-shell :: SymbolFile/Breakpad/stack-cfi-parsing.test (2088 of 2474)
PASS: lldb-api :: functionalities/inferior-crashing/TestInferiorCrashing.py (2089 of 2474)
PASS: lldb-api :: python_api/interpreter/TestRunCommandInterpreterAPI.py (2090 of 2474)
PASS: lldb-api :: functionalities/abbreviation/TestCommonShortSpellings.py (2091 of 2474)
PASS: lldb-unit :: Core/./LLDBCoreTests/DumpDataExtractorTest.StartOffset (2092 of 2474)
PASS: lldb-api :: types/TestRecursiveTypes.py (2093 of 2474)
PASS: lldb-shell :: SymbolFile/DWARF/x86/debug_loc.s (2094 of 2474)
PASS: lldb-shell :: SymbolFile/DWARF/x86/debug-types-dwo-cross-reference.cpp (2095 of 2474)
PASS: lldb-unit :: Process/minidump/./LLDBMinidumpTests/MinidumpParserTest.GetLinuxProcStatus_no_stream (2096 of 2474)
PASS: lldb-unit :: Utility/./UtilityTests/StreamTest.PutRawBytesToLittleEndian (2097 of 2474)
UNSUPPORTED: lldb-api :: commands/trace/TestTraceExport.py (2098 of 2474)
PASS: lldb-api :: lang/objc/foundation/TestObjCMethodsString.py (2099 of 2474)
PASS: lldb-unit :: Utility/./UtilityTests/StringListTest.ShiftStdString (2100 of 2474)
PASS: lldb-shell :: Driver/TestCore.test (2101 of 2474)
PASS: lldb-api :: functionalities/data-formatter/data-formatter-categories/TestDataFormatterCategories.py (2102 of 2474)
PASS: lldb-unit :: Symbol/./SymbolTests/TestTypeSystemClang.TestGetEnumIntegerTypeUnexpectedType (2103 of 2474)
PASS: lldb-unit :: Process/Utility/./ProcessUtilityTests/ProcMapTests/LinuxProcMapsTestFixture.ParseMapRegions/8 (2104 of 2474)
PASS: lldb-unit :: ScriptInterpreter/Python/./ScriptInterpreterPythonTests/PythonDataObjectsTest.TestPythonByteArray (2105 of 2474)
PASS: lldb-unit :: Utility/./UtilityTests/SerializationRountripTest.SerializeDeserializePod (2106 of 2474)
PASS: lldb-unit :: Utility/./UtilityTests/StringExtractorTest.GetHexU8_Extra (2107 of 2474)
PASS: lldb-shell :: Commands/command-backtrace-parser-1.test (2108 of 2474)
PASS: lldb-unit :: Utility/./UtilityTests/RegularExpression.CopyAssignment (2109 of 2474)
PASS: lldb-shell :: SymbolFile/DWARF/x86/DW_OP_piece-struct.s (2110 of 2474)
PASS: lldb-unit :: Host/./HostTests/SocketTests/SocketTest.DomainListenConnectAccept/ipv4 (2111 of 2474)
PASS: lldb-api :: tools/lldb-vscode/console/TestVSCode_console.py (2112 of 2474)
PASS: lldb-api :: commands/platform/process/list/TestProcessList.py (2113 of 2474)
PASS: lldb-api :: functionalities/breakpoint/scripted_bkpt/TestScriptedResolver.py (2114 of 2474)
PASS: lldb-api :: functionalities/thread/concurrent_events/TestConcurrentCrashWithBreak.py (2115 of 2474)
PASS: lldb-unit :: Utility/./UtilityTests/StreamTest.PutChar (2116 of 2474)
PASS: lldb-unit :: Utility/./UtilityTests/StringExtractorTest.InitEmpty (2117 of 2474)
UNSUPPORTED: lldb-api :: macosx/corefile-exception-reason/TestCorefileExceptionReason.py (2118 of 2474)
PASS: lldb-shell :: SymbolFile/NativePDB/ast-methods.cpp (2119 of 2474)
PASS: lldb-unit :: Host/./HostTests/NativeProcessProtocolTest.ReadCStringFromMemory_MaxSize (2120 of 2474)
PASS: lldb-shell :: Commands/command-source.test (2121 of 2474)
PASS: lldb-unit :: Host/./HostTests/TerminalTest.PipeIsNotATerminal (2122 of 2474)
UNSUPPORTED: lldb-api :: linux/mix-dwo-and-regular-objects/TestMixedDwarfBinary.py (2123 of 2474)
PASS: lldb-unit :: ScriptInterpreter/Python/./ScriptInterpreterPythonTests/PythonDataObjectsTest.TestPythonCallableInvoke (2124 of 2474)
PASS: lldb-unit :: Utility/./UtilityTests/StringExtractorTest.GetHexBytesAvail_Partial (2125 of 2474)
PASS: lldb-unit :: Breakpoint/./LLDBBreakpointTests/BreakpointIDTest.StringIsBreakpointName (2126 of 2474)
PASS: lldb-unit :: Utility/./UtilityTests/RegisterValueTest.GetScalarValue (2127 of 2474)
PASS: lldb-shell :: Settings/TestSettingsSet.test (2128 of 2474)
PASS: lldb-unit :: Utility/./UtilityTests/StringListTest.SplitIntoLinesEmpty (2129 of 2474)
PASS: lldb-shell :: ObjectFile/PECOFF/basic-info-arm.yaml (2130 of 2474)
PASS: lldb-unit :: Utility/./UtilityTests/ArgsTest.ReplaceArgumentAtIndexShort (2131 of 2474)
PASS: lldb-shell :: Reproducer/TestVerify.test (2132 of 2474)
PASS: lldb-unit :: Host/./HostTests/PipeTest.CreateWithUniqueName (2133 of 2474)
XFAIL: lldb-shell :: Expr/nodefaultlib.cpp (2134 of 2474)
PASS: lldb-unit :: Host/./HostTests/SocketTests/SocketTest.TCPGetConnectURI/ipv4 (2135 of 2474)
PASS: lldb-unit :: Platform/./LLDBPlatformTests/PlatformAppleSimulatorTest.TestHostPlatformToSim (2136 of 2474)
UNSUPPORTED: lldb-api :: commands/trace/TestTraceSave.py (2137 of 2474)
PASS: lldb-shell :: SymbolFile/DWARF/x86/find-basic-type.cpp (2138 of 2474)
PASS: lldb-unit :: Host/./HostTests/MainLoopTest.UnmonitoredSignal (2139 of 2474)
PASS: lldb-unit :: Utility/./UtilityTests/XcodeSDKTest.FindXcodeContentsDirectoryInPath (2140 of 2474)
PASS: lldb-api :: functionalities/plugins/python_os_plugin/stepping_plugin_threads/TestOSPluginStepping.py (2141 of 2474)
PASS: lldb-shell :: SymbolFile/DWARF/x86/split-dwarf-inlining.cpp (2142 of 2474)
PASS: lldb-shell :: ObjectFile/ELF/PT_TLS-overlap-PT_LOAD.yaml (2143 of 2474)
PASS: lldb-unit :: Process/minidump/./LLDBMinidumpTests/MinidumpParserTest.MinidumpDuplicateModuleMappedSecond (2144 of 2474)
PASS: lldb-api :: functionalities/breakpoint/address_breakpoints/TestAddressBreakpoints.py (2145 of 2474)
PASS: lldb-api :: functionalities/data-formatter/data-formatter-stl/libcxx/map/TestDataFormatterLibccMap.py (2146 of 2474)
PASS: lldb-api :: lang/mixed/TestMixedLanguages.py (2147 of 2474)
PASS: lldb-api :: python_api/function_symbol/TestSymbolAPI.py (2148 of 2474)
UNSUPPORTED: lldb-api :: benchmarks/expression/TestExpressionCmd.py (2149 of 2474)
PASS: lldb-api :: commands/platform/basic/TestPlatformCommand.py (2150 of 2474)
PASS: lldb-shell :: SymbolFile/Breakpad/unwind-via-stack-win.test (2151 of 2474)
PASS: lldb-shell :: Register/Core/x86-64-freebsd-multithread.test (2152 of 2474)
PASS: lldb-unit :: SymbolFile/NativePDB/./SymbolFileNativePDBTests/PDBFPOProgramToDWARFExpressionTests.InvalidOpBinary (2153 of 2474)
PASS: lldb-unit :: Host/./HostTests/SocketTests/SocketTest.UDPGetConnectURI/ipv4 (2154 of 2474)
PASS: lldb-unit :: Target/./TargetTests/PathMappingListTest.CrossPlatformTests (2155 of 2474)
PASS: lldb-unit :: Utility/./UtilityTests/SerializationRountripTest.SerializeDeserializeCString (2156 of 2474)
PASS: lldb-api :: lang/objc/objc-new-syntax/TestObjCNewSyntaxLiteral.py (2157 of 2474)
PASS: lldb-unit :: Process/gdb-remote/./ProcessGdbRemoteTests/GDBRemoteClientBaseTest.SendContinueAndInterrupt (2158 of 2474)
PASS: lldb-shell :: Minidump/memory-region-from-module.yaml (2159 of 2474)
PASS: lldb-shell :: SymbolFile/DWARF/x86/apple-index-is-used.cpp (2160 of 2474)
PASS: lldb-api :: macosx/profile_vrs_detach/TestDetachVrsProfile.py (2161 of 2474)
PASS: lldb-api :: commands/expression/call-throws/TestCallThatThrows.py (2162 of 2474)
PASS: lldb-unit :: Host/./HostTests/HostInfoTestInitialization.InitTwice (2163 of 2474)
UNSUPPORTED: lldb-shell :: Register/x86-db-read.test (2164 of 2474)
PASS: lldb-unit :: SymbolFile/DWARF/./SymbolFileDWARFTests/DWARFASTParserClangTests.TestCallingConventionParsing (2165 of 2474)
PASS: lldb-unit :: Utility/./UtilityTests/ArgsTest.BareSingleQuote (2166 of 2474)
PASS: lldb-api :: lang/cpp/auto/TestCPPAuto.py (2167 of 2474)
PASS: lldb-unit :: Process/minidump/./LLDBMinidumpTests/MinidumpParserTest.GetMiscInfo_no_stream (2168 of 2474)
PASS: lldb-shell :: Commands/command-stop-hook-output.test (2169 of 2474)
PASS: lldb-api :: commands/expression/invalid-args/TestInvalidArgsExpression.py (2170 of 2474)
PASS: lldb-api :: commands/expression/completion-crash-incomplete-record/TestCompletionCrashIncompleteRecord.py (2171 of 2474)
PASS: lldb-unit :: Symbol/./SymbolTests/TestTypeSystemClang.TestUnifyAccessSpecifiers (2172 of 2474)
PASS: lldb-api :: functionalities/postmortem/minidump-new/TestMiniDumpNew.py (2173 of 2474)
PASS: lldb-api :: python_api/sbdata/TestSBData.py (2174 of 2474)
PASS: lldb-api :: lang/objc/warnings-in-expr-parser/TestObjCWarningsInExprParser.py (2175 of 2474)
PASS: lldb-unit :: Utility/./UtilityTests/Flags.Clear (2176 of 2474)
UNSUPPORTED: lldb-api :: functionalities/ptrauth_diagnostics/brkC47x_code/TestPtrauthBRKc47xDiagnostic.py (2177 of 2474)
PASS: lldb-unit :: Utility/./UtilityTests/AnsiTerminal.AtStart (2178 of 2474)
PASS: lldb-unit :: Utility/./UtilityTests/UriParserTest.TypicalPortPathIPv4 (2179 of 2474)
PASS: lldb-unit :: Utility/./UtilityTests/DataExtractorTest.GetCStrUnterminated (2180 of 2474)
PASS: lldb-api :: commands/frame/var-scope/TestFrameVariableScope.py (2181 of 2474)
PASS: lldb-api :: functionalities/breakpoint/inlined_breakpoints/TestInlinedBreakpoints.py (2182 of 2474)
PASS: lldb-unit :: Utility/./UtilityTests/XcodeSDKTest.GetCanonicalNameAndConstruct (2183 of 2474)
PASS: lldb-unit :: Language/Highlighting/./HighlighterTests/HighlighterTest.ClangComments (2184 of 2474)
PASS: lldb-unit :: Process/minidump/./LLDBMinidumpTests/MinidumpParserTest.InvalidMinidump (2185 of 2474)
PASS: lldb-api :: lang/cpp/global_variables/TestCPPGlobalVariables.py (2186 of 2474)
PASS: lldb-api :: commands/frame/recognizer/TestFrameRecognizer.py (2187 of 2474)
PASS: lldb-api :: functionalities/thread/thread_specific_break/TestThreadSpecificBreakpoint.py (2188 of 2474)
PASS: lldb-unit :: Utility/./UtilityTests/DataExtractorTest.GetCStrAtEnd (2189 of 2474)
PASS: lldb-shell :: ObjectFile/ELF/build-id-case.yaml (2190 of 2474)
PASS: lldb-unit :: Utility/./UtilityTests/BinaryStreamTest.PutSLEB128OneByte (2191 of 2474)
PASS: lldb-shell :: Minidump/Windows/broken-unwind.test (2192 of 2474)
PASS: lldb-shell :: Register/Core/x86-32-freebsd-multithread.test (2193 of 2474)
PASS: lldb-api :: functionalities/unused-inlined-parameters/TestUnusedInlinedParameters.py (2194 of 2474)
PASS: lldb-unit :: UnwindAssembly/x86/./UnwindAssemblyx86Tests/Testx86AssemblyInspectionEngine.TestReturnDetect (2195 of 2474)
PASS: lldb-unit :: Interpreter/./InterpreterTests/OptionArgParserTest.toChar (2196 of 2474)
PASS: lldb-api :: functionalities/data-formatter/data-formatter-named-summaries/TestDataFormatterNamedSummaries.py (2197 of 2474)
PASS: lldb-api :: functionalities/load_lazy/TestLoadUsingLazyBind.py (2198 of 2474)
PASS: lldb-unit :: Utility/./UtilityTests/StreamTest.PutSLEB128 (2199 of 2474)
PASS: lldb-unit :: Process/Utility/./ProcessUtilityTests/ProcSMapTests/LinuxProcSMapsTestFixture.ParseSMapRegions/9 (2200 of 2474)
PASS: lldb-unit :: Utility/./UtilityTests/StringListTest.PopBack (2201 of 2474)
PASS: lldb-shell :: Quit/TestQuitExitCodeNonInt.test (2202 of 2474)
UNSUPPORTED: lldb-api :: linux/aarch64/unwind_signal/TestUnwindSignal.py (2203 of 2474)
PASS: lldb-unit :: Symbol/./SymbolTests/TestTypeSystemClang.TestRemoveFastQualifiers (2204 of 2474)
PASS: lldb-unit :: Target/./TargetTests/StackFrameRecognizerTest.NullModuleRegex (2205 of 2474)
PASS: lldb-api :: commands/process/launch/TestProcessLaunch.py (2206 of 2474)
PASS: lldb-unit :: Utility/./UtilityTests/StringListTest.JoinEmpty (2207 of 2474)
PASS: lldb-api :: commands/frame/var/TestFrameVar.py (2208 of 2474)
PASS: lldb-unit :: Symbol/./SymbolTests/TestClangASTImporter.DeportDeclTagDecl (2209 of 2474)
PASS: lldb-unit :: Utility/./UtilityTests/ProcessInstanceInfo.DumpTable (2210 of 2474)
PASS: lldb-unit :: Core/./LLDBCoreTests/DumpDataExtractorTest.BaseAddress (2211 of 2474)
PASS: lldb-unit :: Utility/./UtilityTests/StringExtractorTest.GetHexU8_Underflow_NoEof (2212 of 2474)
PASS: lldb-unit :: Utility/./UtilityTests/SubsystemRAIITest.SubsystemWithErrorFailure (2213 of 2474)
PASS: lldb-api :: arm/emulation/TestEmulations.py (2214 of 2474)
PASS: lldb-api :: lang/cpp/operators/TestCppOperators.py (2215 of 2474)
PASS: lldb-unit :: Host/./HostTests/NativeProcessProtocolTest.ReadMemoryWithoutTrap (2216 of 2474)
PASS: lldb-unit :: Utility/./UtilityTests/Predicate.WaitForValueEqualTo (2217 of 2474)
PASS: lldb-unit :: Language/Highlighting/./HighlighterTests/HighlighterTest.ClangCursorPosAfterOtherToken (2218 of 2474)
PASS: lldb-api :: commands/expression/persistent_ptr_update/TestPersistentPtrUpdate.py (2219 of 2474)
PASS: lldb-shell :: SymbolFile/NativePDB/disassembly.cpp (2220 of 2474)
PASS: lldb-api :: lang/cpp/unique-types/TestUniqueTypes.py (2221 of 2474)
PASS: lldb-unit :: Utility/./UtilityTests/StreamTest.PutHex8 (2222 of 2474)
PASS: lldb-unit :: Utility/./UtilityTests/ListenerTest.GetEventImmediate (2223 of 2474)
UNSUPPORTED: lldb-shell :: SymbolFile/PDB/typedefs.test (2224 of 2474)
PASS: lldb-unit :: Target/./TargetTests/PathMappingListTest.AbsoluteTests (2225 of 2474)
PASS: lldb-unit :: Utility/./UtilityTests/AnsiTerminal.Twice (2226 of 2474)
PASS: lldb-api :: lang/cpp/namespace_conflicts/TestNamespaceConflicts.py (2227 of 2474)
PASS: lldb-api :: commands/target/auto-install-main-executable/TestAutoInstallMainExecutable.py (2228 of 2474)
PASS: lldb-api :: lang/c/local_types/TestUseClosestType.py (2229 of 2474)
UNSUPPORTED: lldb-shell :: SymbolFile/PDB/variables.test (2230 of 2474)
PASS: lldb-shell :: ObjectFile/Breakpad/sections-trailing-func.test (2231 of 2474)
PASS: lldb-unit :: Utility/./UtilityTests/RangeTest.ContainsEndInclusive (2232 of 2474)
PASS: lldb-unit :: Process/minidump/./LLDBMinidumpTests/RegisterContextMinidump.ConvertMinidumpContext_x86_64 (2233 of 2474)
PASS: lldb-api :: python_api/exprpath_synthetic/TestExprPathSynthetic.py (2234 of 2474)
PASS: lldb-unit :: Utility/./UtilityTests/VMRange.Comparison (2235 of 2474)
PASS: lldb-unit :: Process/gdb-remote/./ProcessGdbRemoteTests/GDBRemoteCommunicationServerTest.SendErrorResponse_Status (2236 of 2474)
PASS: lldb-unit :: Utility/./UtilityTests/VASprintfTest.EncodingError (2237 of 2474)
PASS: lldb-unit :: ScriptInterpreter/Python/./ScriptInterpreterPythonTests/PythonDataObjectsTest.TestGlobalNameResolutionWithDot (2238 of 2474)
UNSUPPORTED: lldb-api :: lang/objc/ptr_refs/TestPtrRefsObjC.py (2239 of 2474)
PASS: lldb-api :: lang/cpp/stl/TestStdCXXDisassembly.py (2240 of 2474)
PASS: lldb-api :: functionalities/plugins/python_os_plugin/TestPythonOSPlugin.py (2241 of 2474)
PASS: lldb-unit :: Symbol/./SymbolTests/TestClangASTImporter.RecordLayout (2242 of 2474)
PASS: lldb-api :: commands/expression/save_jit_objects/TestSaveJITObjects.py (2243 of 2474)
PASS: lldb-shell :: SymbolFile/DWARF/x86/debug_rnglists-dwp.s (2244 of 2474)
PASS: lldb-unit :: Utility/./UtilityTests/StreamTeeTest.Constructor1Stream (2245 of 2474)
PASS: lldb-api :: commands/expression/import-std-module/queue/TestQueueFromStdModule.py (2246 of 2474)
PASS: lldb-api :: python_api/signals/TestSignalsAPI.py (2247 of 2474)
PASS: lldb-shell :: Minidump/fb-dump.test (2248 of 2474)
PASS: lldb-api :: lang/cpp/class-template-type-parameter-pack/TestClassTemplateTypeParameterPack.py (2249 of 2474)
PASS: lldb-unit :: ObjectFile/Breakpad/./ObjectFileBreakpadTests/InlineRecord.parse (2250 of 2474)
PASS: lldb-unit :: Utility/./UtilityTests/StringExtractorTest.GetHexBytes_Underflow (2251 of 2474)
PASS: lldb-api :: test_utils/TestPExpectTest.py (2252 of 2474)
PASS: lldb-unit :: Utility/./UtilityTests/TimeoutTest.Format (2253 of 2474)
PASS: lldb-unit :: Symbol/./SymbolTests/TestTypeSystemClang.TestGetTypeClassNested (2254 of 2474)
PASS: lldb-api :: python_api/frame/inlines/TestInlinedFrame.py (2255 of 2474)
PASS: lldb-api :: functionalities/data-formatter/data-formatter-objc/TestDataFormatterObjCNSContainer.py (2256 of 2474)
PASS: lldb-unit :: SymbolFile/DWARF/./SymbolFileDWARFTests/SymbolFileDWARFTests.TestAbbrevInvalidNULLTag (2257 of 2474)
PASS: lldb-unit :: Core/./LLDBCoreTests/MangledTest.EmptyForInvalidRustV0Name (2258 of 2474)
PASS: lldb-api :: lang/cpp/breakpoint-commands/TestCPPBreakpointCommands.py (2259 of 2474)
PASS: lldb-unit :: SymbolFile/DWARF/./SymbolFileDWARFTests/SymbolFileDWARFTests.TestAbbrevValidAttrNullForm (2260 of 2474)
PASS: lldb-api :: functionalities/breakpoint/objc/TestObjCBreakpoints.py (2261 of 2474)
PASS: lldb-unit :: Utility/./UtilityTests/VMRange.CollectionContains (2262 of 2474)
PASS: lldb-api :: lang/cpp/scope/TestCppScope.py (2263 of 2474)
PASS: lldb-shell :: SymbolFile/DWARF/x86/debug_aranges-empty-section.s (2264 of 2474)
PASS: lldb-api :: functionalities/data-formatter/data-formatter-objc/TestDataFormatterObjCNSData.py (2265 of 2474)
PASS: lldb-unit :: SymbolFile/NativePDB/./SymbolFileNativePDBTests/PDBFPOProgramToDWARFExpressionTests.MultipleDependentAssignments (2266 of 2474)
PASS: lldb-unit :: Utility/./UtilityTests/StringLexerTest.Next (2267 of 2474)
PASS: lldb-shell :: SymbolFile/DWARF/x86/debug_ranges.s (2268 of 2474)
UNSUPPORTED: lldb-shell :: ExecControl/StopHook/stop-hook-threads.test (2269 of 2474)
PASS: lldb-unit :: Platform/./LLDBPlatformTests/PlatformDarwinTest.GetCompatibleArchARMv7em (2270 of 2474)
PASS: lldb-unit :: Utility/./UtilityTests/RangeTest.ContainsEndInclusiveInvalid (2271 of 2474)
PASS: lldb-api :: functionalities/thread/concurrent_events/TestConcurrentTwoBreakpointThreads.py (2272 of 2474)
PASS: lldb-api :: lang/c/array_types/TestArrayTypes.py (2273 of 2474)
PASS: lldb-api :: python_api/sbstructureddata/TestStructuredDataAPI.py (2274 of 2474)
UNSUPPORTED: lldb-shell :: ScriptInterpreter/Lua/watchpoint_callback.test (2275 of 2474)
PASS: lldb-api :: tools/lldb-server/TestGdbRemoteAttachWait.py (2276 of 2474)
PASS: lldb-unit :: Target/./TargetTests/ExecutionContextTest.GetByteOrderTarget (2277 of 2474)
PASS: lldb-unit :: ScriptInterpreter/Python/./ScriptInterpreterPythonTests/PythonDataObjectsTest.TestPythonIntegerToStr (2278 of 2474)
PASS: lldb-shell :: Commands/command-disassemble-process.yaml (2279 of 2474)
UNSUPPORTED: lldb-api :: functionalities/tsan/thread_numbers/TestTsanThreadNumbers.py (2280 of 2474)
PASS: lldb-unit :: Utility/./UtilityTests/StreamTest.PutHex64ByteOrderLittle (2281 of 2474)
UNSUPPORTED: lldb-shell :: Subprocess/clone-follow-child.test (2282 of 2474)
PASS: lldb-shell :: ObjectFile/ELF/section-types-edgecases.yaml (2283 of 2474)
PASS: lldb-unit :: Utility/./UtilityTests/Flags.AllSet (2284 of 2474)
PASS: lldb-api :: commands/settings/use_source_cache/TestUseSourceCache.py (2285 of 2474)
PASS: lldb-unit :: Language/Highlighting/./HighlighterTests/HighlighterTest.ClangScalarLiterals (2286 of 2474)
UNSUPPORTED: lldb-shell :: Register/x86-ymm-read.test (2287 of 2474)
PASS: lldb-api :: functionalities/gdb_remote_client/TestGDBRemoteDiskFileCompletion.py (2288 of 2474)
PASS: lldb-shell :: Driver/TestConvenienceVariables.test (2289 of 2474)
PASS: lldb-unit :: Expression/./ExpressionTests/DWARFExpression.DW_OP_convert (2290 of 2474)
PASS: lldb-api :: functionalities/postmortem/elf-core/thread_crash/TestLinuxCoreThreads.py (2291 of 2474)
PASS: lldb-shell :: ObjectFile/ELF/eh_frame-symbols.yaml (2292 of 2474)
PASS: lldb-api :: functionalities/reproducers/attach/TestReproducerAttach.py (2293 of 2474)
UNSUPPORTED: lldb-api :: tools/lldb-server/registers-target-xml-reading/TestGdbRemoteTargetXmlPacket.py (2294 of 2474)
PASS: lldb-unit :: Utility/./UtilityTests/CompletionRequest.ShiftArguments (2295 of 2474)
PASS: lldb-unit :: Symbol/./SymbolTests/TestTypeSystemClang.TestDisplayNameEmpty (2296 of 2474)
PASS: lldb-unit :: Host/./HostTests/TerminalTest.SetRaw (2297 of 2474)
PASS: lldb-unit :: Utility/./UtilityTests/BinaryStreamTest.PutSLEB128FourBytes (2298 of 2474)
PASS: lldb-api :: functionalities/non-overlapping-index-variable-i/TestIndexVariable.py (2299 of 2474)
PASS: lldb-api :: commands/expression/regression-access-function-template-in-record/TestRegressionAccessFunctionTemplateInRecord.py (2300 of 2474)
PASS: lldb-unit :: Host/./HostTests/Host.WaitStatusFormat (2301 of 2474)
PASS: lldb-api :: lang/objc/orderedset/TestOrderedSet.py (2302 of 2474)
PASS: lldb-api :: lang/objc/rdar-11355592/TestRdar11355592.py (2303 of 2474)
PASS: lldb-unit :: Process/Utility/./ProcessUtilityTests/ProcSMapTests/LinuxProcSMapsTestFixture.ParseSMapRegions/3 (2304 of 2474)
PASS: lldb-unit :: DataFormatter/./LLDBFormatterTests/TypeMatcherTests.GetMatchStringRegex (2305 of 2474)
PASS: lldb-unit :: Utility/./UtilityTests/LogChannelTest.Enable (2306 of 2474)
PASS: lldb-api :: lang/objc/objc-ivar-stripped/TestObjCIvarStripped.py (2307 of 2474)
PASS: lldb-unit :: Utility/./UtilityTests/FileSpecTest.GetPath (2308 of 2474)
UNSUPPORTED: lldb-api :: lang/cpp/function-template-parameter-pack/TestFunctionTemplateParameterPack.py (2309 of 2474)
PASS: lldb-shell :: ObjectFile/PECOFF/basic-info.yaml (2310 of 2474)
PASS: lldb-unit :: SymbolFile/DWARF/./SymbolFileDWARFTests/SymbolFileDWARFTests.TestAbbrevNullAttrValidForm (2311 of 2474)
PASS: lldb-unit :: Host/./HostTests/FileSystemTest.Readable (2312 of 2474)
PASS: lldb-unit :: Utility/./UtilityTests/CompletionRequest.TryCompleteCurrentArgMode (2313 of 2474)
PASS: lldb-unit :: Host/./HostTests/SocketTests/SocketTest.TCPListen0ConnectAccept/ipv4 (2314 of 2474)
PASS: lldb-unit :: Utility/./UtilityTests/StringExtractorGDBRemoteTest.GetPidTid (2315 of 2474)
PASS: lldb-unit :: Utility/./UtilityTests/StreamTest.AddressPrefix (2316 of 2474)
FAIL: lldb-api :: functionalities/scripted_process/TestScriptedProcess.py (2317 of 2474)
******************** TEST 'lldb-api :: functionalities/scripted_process/TestScriptedProcess.py' FAILED ********************
Script:
--
/Users/buildslave/jenkins/workspace/lldb-cmake-sanitized/lldb-build/lldb-test-build.noindex/copied-python /Users/buildslave/jenkins/workspace/lldb-cmake-sanitized/llvm-project/lldb/test/API/dotest.py -u CXXFLAGS -u CFLAGS --codesign-identity lldb_codesign --arch x86_64 --build-dir /Users/buildslave/jenkins/workspace/lldb-cmake-sanitized/lldb-build/lldb-test-build.noindex -t --env TERM=vt100 --env LLVM_LIBS_DIR=/Users/buildslave/jenkins/workspace/lldb-cmake-sanitized/lldb-build/./lib --inferior-env ASAN_OPTIONS=detect_stack_use_after_return=1 --inferior-env DYLD_INSERT_LIBRARIES=/Users/buildslave/jenkins/workspace/lldb-cmake-sanitized/host-compiler/lib/clang/14.0.99/lib/darwin/libclang_rt.asan_osx_dynamic.dylib --arch x86_64 --build-dir /Users/buildslave/jenkins/workspace/lldb-cmake-sanitized/lldb-build/lldb-test-build.noindex --lldb-module-cache-dir /Users/buildslave/jenkins/workspace/lldb-cmake-sanitized/lldb-build/lldb-test-build.noindex/module-cache-lldb/lldb-api --clang-module-cache-dir /Users/buildslave/jenkins/workspace/lldb-cmake-sanitized/lldb-build/lldb-test-build.noindex/module-cache-clang/lldb-api --executable /Users/buildslave/jenkins/workspace/lldb-cmake-sanitized/lldb-build/./bin/lldb --compiler /Users/buildslave/jenkins/workspace/lldb-cmake-sanitized/host-compiler/bin/clang --dsymutil /Users/buildslave/jenkins/workspace/lldb-cmake-sanitized/lldb-build/./bin/dsymutil --llvm-tools-dir /Users/buildslave/jenkins/workspace/lldb-cmake-sanitized/lldb-build/./bin --lldb-libs-dir /Users/buildslave/jenkins/workspace/lldb-cmake-sanitized/lldb-build/./lib /Users/buildslave/jenkins/workspace/lldb-cmake-sanitized/llvm-project/lldb/test/API/functionalities/scripted_process -p TestScriptedProcess.py
--
Exit Code: -6

Hide Details

Command Output (stdout): -- lldb version 14.0.99 (http://labmaster3.local/git/llvm-project.git revision dca681fee93e12d1e06733b607dec9f11d538151) clang revision dca681fee93e12d1e06733b607dec9f11d538151 llvm revision dca681fee93e12d1e06733b607dec9f11d538151 Name of the class that will manage the scripted process: 'stack_core_scripted_process.StackCoreScriptedProcess' Saving 69632 bytes of data for memory region at 0x7ffeefbef000

Hide Details

-- Command Output (stderr): -- ================================================================= ==71510==ERROR: AddressSanitizer: heap-use-after-free on address 0x6160002508a0 at pc 0x00010ef3ea30 bp 0x700009314cf0 sp 0x7000093144b8 READ of size 512 at 0x6160002508a0 thread T6 #0 0x10ef3ea2f in __asan_memcpy+0x1af (libclang_rt.asan_osx_dynamic.dylib:x86_64+0x44a2f) #1 0x1151682c8 in lldb_private::DataExtractor::CopyByteOrderedData(unsigned long long, unsigned long long, void*, unsigned long long, lldb::ByteOrder) const DataExtractor.cpp:742 #2 0x1156f505b in lldb_private::ScriptedProcess::DoReadMemory(unsigned long long, void*, unsigned long, lldb_private::Status&) ScriptedProcess.cpp:237 #3 0x114f8d51c in lldb_private::Process::ReadMemoryFromInferior(unsigned long long, void*, unsigned long, lldb_private::Status&) Process.cpp:2047 #4 0x114f4598f in lldb_private::MemoryCache::Read(unsigned long long, void*, unsigned long, lldb_private::Status&) Memory.cpp:229 #5 0x114fce971 in lldb_private::RegisterContext::ReadRegisterValueFromMemory(lldb_private::RegisterInfo const*, unsigned long long, unsigned int, lldb_private::RegisterValue&) RegisterContext.cpp:343 #6 0x114fe0696 in lldb_private::RegisterContextUnwind::ReadRegisterValueFromRegisterLocation(lldb_private::UnwindLLDB::RegisterLocation, lldb_private::RegisterInfo const*, lldb_private::RegisterValue&) RegisterContextUnwind.cpp:1138 #7 0x114fde023 in lldb_private::RegisterContextUnwind::ReadGPRValue(lldb::RegisterKind, unsigned int, unsigned long long&) RegisterContextUnwind.cpp:2143 #8 0x114fd27a5 in lldb_private::RegisterContextUnwind::InitializeNonZerothFrame() RegisterContextUnwind.cpp:343 #9 0x114fcfb10 in lldb_private::RegisterContextUnwind::RegisterContextUnwind(lldb_private::Thread&, std::__1::shared_ptr<lldb_private::RegisterContextUnwind> const&, lldb_private::SymbolContext&, unsigned int, lldb_private::UnwindLLDB&) RegisterContextUnwind.cpp:72 #10 0x11512a700 in lldb_private::UnwindLLDB::GetOneMoreFrame(lldb_private::ABI*) UnwindLLDB.cpp:128 #11 0x115129369 in lldb_private::UnwindLLDB::AddOneMoreFrame(lldb_private::ABI*) UnwindLLDB.cpp:332 #12 0x11512a035 in lldb_private::UnwindLLDB::UpdateUnwindPlanForFirstFrameIfInvalid(lldb_private::ABI*) UnwindLLDB.cpp:305 #13 0x115128ecd in lldb_private::UnwindLLDB::AddFirstFrame() UnwindLLDB.cpp:99 #14 0x11512c1bd in lldb_private::UnwindLLDB::DoGetFrameInfoAtIndex(unsigned int, unsigned long long&, unsigned long long&, bool&) UnwindLLDB.cpp:395 #15 0x11501adfa in lldb_private::Unwind::GetFrameInfoAtIndex(unsigned int, unsigned long long&, unsigned long long&, bool&) Unwind.h:53 #16 0x1150176bc in lldb_private::StackFrameList::GetFramesUpTo(unsigned int) StackFrameList.cpp:484 #17 0x1150157b7 in lldb_private::StackFrameList::ResetCurrentInlinedDepth() StackFrameList.cpp:86 #18 0x1150b5613 in lldb_private::Thread::ShouldStop(lldb_private::Event*) Thread.cpp:805 #19 0x1150cee18 in lldb_private::ThreadList::ShouldStop(lldb_private::Event*) ThreadList.cpp:330 #20 0x114f9b2e0 in lldb_private::Process::ShouldBroadcastEvent(lldb_private::Event*) Process.cpp:3405 #21 0x114f92204 in lldb_private::Process::HandlePrivateEvent(std::__1::shared_ptr<lldb_private::Event>&) Process.cpp:3630 #22 0x114f9cf5a in lldb_private::Process::RunPrivateStateThread(bool) Process.cpp:3824 #23 0x114f9b90d in lldb_private::Process::PrivateStateThread(void*) Process.cpp:3722 #24 0x114cfb210 in lldb_private::HostNativeThreadBase::ThreadCreateTrampoline(void*) HostNativeThreadBase.cpp:65 #25 0x7fff70dac108 in _pthread_start+0x93 (libsystem_pthread.dylib:x86_64+0x6108) #26 0x7fff70da7b8a in thread_start+0xe (libsystem_pthread.dylib:x86_64+0x1b8a)

Hide Details

0x6160002508a0 is located 32 bytes inside of 545-byte region [0x616000250880,0x616000250aa1) freed by thread T6 here: #0 0x10ef40ac9 in wrap_free+0xa9 (libclang_rt.asan_osx_dynamic.dylib:x86_64+0x46ac9) #1 0x10fa44af2 in frame_dealloc+0xa0 (Python:x86_64+0x2aaf2) #2 0x10fa33d2a in function_code_fastcall+0xf8 (Python:x86_64+0x19d2a) #3 0x10fa34624 in _PyObject_Call_Prepend+0x95 (Python:x86_64+0x1a624) #4 0x10fa332d2 in _PyObject_FastCallDict+0x107 (Python:x86_64+0x192d2) #5 0x10fa347d2 in _PyObject_CallFunctionVa+0xd0 (Python:x86_64+0x1a7d2) #6 0x10fa34a00 in PyObject_CallMethod+0xa8 (Python:x86_64+0x1aa00) #7 0x11588ba20 in std::__1::shared_ptr<lldb_private::DataExtractor> lldb_private::ScriptedPythonInterface::Dispatch<std::__1::shared_ptr<lldb_private::DataExtractor>, unsigned long long, unsigned long>(llvm::StringRef, lldb_private::Status&, unsigned long long, unsigned long) ScriptedPythonInterface.h:93 #8 0x11588ae74 in lldb_private::ScriptedProcessPythonInterface::ReadMemoryAtAddress(unsigned long long, unsigned long, lldb_private::Status&) ScriptedProcessPythonInterface.cpp:120 #9 0x1156f4e35 in lldb_private::ScriptedProcess::DoReadMemory(unsigned long long, void*, unsigned long, lldb_private::Status&) ScriptedProcess.cpp:232 #10 0x114f8d51c in lldb_private::Process::ReadMemoryFromInferior(unsigned long long, void*, unsigned long, lldb_private::Status&) Process.cpp:2047 #11 0x114f4598f in lldb_private::MemoryCache::Read(unsigned long long, void*, unsigned long, lldb_private::Status&) Memory.cpp:229 #12 0x114fce971 in lldb_private::RegisterContext::ReadRegisterValueFromMemory(lldb_private::RegisterInfo const*, unsigned long long, unsigned int, lldb_private::RegisterValue&) RegisterContext.cpp:343 #13 0x114fe0696 in lldb_private::RegisterContextUnwind::ReadRegisterValueFromRegisterLocation(lldb_private::UnwindLLDB::RegisterLocation, lldb_private::RegisterInfo const*, lldb_private::RegisterValue&) RegisterContextUnwind.cpp:1138 #14 0x114fde023 in lldb_private::RegisterContextUnwind::ReadGPRValue(lldb::RegisterKind, unsigned int, unsigned long long&) RegisterContextUnwind.cpp:2143 #15 0x114fd27a5 in lldb_private::RegisterContextUnwind::InitializeNonZerothFrame() RegisterContextUnwind.cpp:343 #16 0x114fcfb10 in lldb_private::RegisterContextUnwind::RegisterContextUnwind(lldb_private::Thread&, std::__1::shared_ptr<lldb_private::RegisterContextUnwind> const&, lldb_private::SymbolContext&, unsigned int, lldb_private::UnwindLLDB&) RegisterContextUnwind.cpp:72 #17 0x11512a700 in lldb_private::UnwindLLDB::GetOneMoreFrame(lldb_private::ABI*) UnwindLLDB.cpp:128 #18 0x115129369 in lldb_private::UnwindLLDB::AddOneMoreFrame(lldb_private::ABI*) UnwindLLDB.cpp:332 #19 0x11512a035 in lldb_private::UnwindLLDB::UpdateUnwindPlanForFirstFrameIfInvalid(lldb_private::ABI*) UnwindLLDB.cpp:305 #20 0x115128ecd in lldb_private::UnwindLLDB::AddFirstFrame() UnwindLLDB.cpp:99 #21 0x11512c1bd in lldb_private::UnwindLLDB::DoGetFrameInfoAtIndex(unsigned int, unsigned long long&, unsigned long long&, bool&) UnwindLLDB.cpp:395 #22 0x11501adfa in lldb_private::Unwind::GetFrameInfoAtIndex(unsigned int, unsigned long long&, unsigned long long&, bool&) Unwind.h:53 #23 0x1150176bc in lldb_private::StackFrameList::GetFramesUpTo(unsigned int) StackFrameList.cpp:484 #24 0x1150157b7 in lldb_private::StackFrameList::ResetCurrentInlinedDepth() StackFrameList.cpp:86 #25 0x1150b5613 in lldb_private::Thread::ShouldStop(lldb_private::Event*) Thread.cpp:805 #26 0x1150cee18 in lldb_private::ThreadList::ShouldStop(lldb_private::Event*) ThreadList.cpp:330 #27 0x114f9b2e0 in lldb_private::Process::ShouldBroadcastEvent(lldb_private::Event*) Process.cpp:3405 #28 0x114f92204 in lldb_private::Process::HandlePrivateEvent(std::__1::shared_ptr<lldb_private::Event>&) Process.cpp:3630 #29 0x114f9cf5a in lldb_private::Process::RunPrivateStateThread(bool) Process.cpp:3824

Hide Details

previously allocated by thread T6 here: #0 0x10ef40980 in wrap_malloc+0xa0 (libclang_rt.asan_osx_dynamic.dylib:x86_64+0x46980) #1 0x10fa6228b in _PyObject_Malloc+0x37 (Python:x86_64+0x4828b) #2 0x10fa2becc in _PyBytes_FromSize+0x63 (Python:x86_64+0x11ecc) #3 0x10fa2be09 in PyBytes_FromStringAndSize+0x3d (Python:x86_64+0x11e09) #4 0x11583d437 in lldb_private::python::PythonBytes::PythonBytes(unsigned char const*, unsigned long) PythonDataObjects.cpp:290 #5 0x1148c45b1 in _wrap_SBProcess_ReadMemory(_object*, _object*) LLDBWrapPython.cpp:45781 #6 0x10fa34226 in _PyMethodDef_RawFastCallKeywords+0xeb (Python:x86_64+0x1a226) #7 0x10fa338c6 in _PyCFunction_FastCallKeywords+0x2b (Python:x86_64+0x198c6) #8 0x10fac9905 in call_function+0x1de (Python:x86_64+0xaf905) #9 0x10fac25ee in _PyEval_EvalFrameDefault+0x1b51 (Python:x86_64+0xa85ee) #10 0x10fa33ca1 in function_code_fastcall+0x6f (Python:x86_64+0x19ca1) #11 0x10fac997d in call_function+0x256 (Python:x86_64+0xaf97d) #12 0x10fac25d5 in _PyEval_EvalFrameDefault+0x1b38 (Python:x86_64+0xa85d5) #13 0x10fa33ca1 in function_code_fastcall+0x6f (Python:x86_64+0x19ca1) #14 0x10fa34624 in _PyObject_Call_Prepend+0x95 (Python:x86_64+0x1a624) #15 0x10fa332d2 in _PyObject_FastCallDict+0x107 (Python:x86_64+0x192d2) #16 0x10fa347d2 in _PyObject_CallFunctionVa+0xd0 (Python:x86_64+0x1a7d2) #17 0x10fa34a00 in PyObject_CallMethod+0xa8 (Python:x86_64+0x1aa00) #18 0x11588ba20 in std::__1::shared_ptr<lldb_private::DataExtractor> lldb_private::ScriptedPythonInterface::Dispatch<std::__1::shared_ptr<lldb_private::DataExtractor>, unsigned long long, unsigned long>(llvm::StringRef, lldb_private::Status&, unsigned long long, unsigned long) ScriptedPythonInterface.h:93 #19 0x11588ae74 in lldb_private::ScriptedProcessPythonInterface::ReadMemoryAtAddress(unsigned long long, unsigned long, lldb_private::Status&) ScriptedProcessPythonInterface.cpp:120 #20 0x1156f4e35 in lldb_private::ScriptedProcess::DoReadMemory(unsigned long long, void*, unsigned long, lldb_private::Status&) ScriptedProcess.cpp:232 #21 0x114f8d51c in lldb_private::Process::ReadMemoryFromInferior(unsigned long long, void*, unsigned long, lldb_private::Status&) Process.cpp:2047 #22 0x114f4598f in lldb_private::MemoryCache::Read(unsigned long long, void*, unsigned long, lldb_private::Status&) Memory.cpp:229 #23 0x114fce971 in lldb_private::RegisterContext::ReadRegisterValueFromMemory(lldb_private::RegisterInfo const*, unsigned long long, unsigned int, lldb_private::RegisterValue&) RegisterContext.cpp:343 #24 0x114fe0696 in lldb_private::RegisterContextUnwind::ReadRegisterValueFromRegisterLocation(lldb_private::UnwindLLDB::RegisterLocation, lldb_private::RegisterInfo const*, lldb_private::RegisterValue&) RegisterContextUnwind.cpp:1138 #25 0x114fde023 in lldb_private::RegisterContextUnwind::ReadGPRValue(lldb::RegisterKind, unsigned int, unsigned long long&) RegisterContextUnwind.cpp:2143 #26 0x114fd27a5 in lldb_private::RegisterContextUnwind::InitializeNonZerothFrame() RegisterContextUnwind.cpp:343 #27 0x114fcfb10 in lldb_private::RegisterContextUnwind::RegisterContextUnwind(lldb_private::Thread&, std::__1::shared_ptr<lldb_private::RegisterContextUnwind> const&, lldb_private::SymbolContext&, unsigned int, lldb_private::UnwindLLDB&) RegisterContextUnwind.cpp:72 #28 0x11512a700 in lldb_private::UnwindLLDB::GetOneMoreFrame(lldb_private::ABI*) UnwindLLDB.cpp:128 #29 0x115129369 in lldb_private::UnwindLLDB::AddOneMoreFrame(lldb_private::ABI*) UnwindLLDB.cpp:332

Hide Details

Thread T6 created by T0 here: #0 0x10ef3a45c in wrap_pthread_create+0x5c (libclang_rt.asan_osx_dynamic.dylib:x86_64+0x4045c) #1 0x114d1ec41 in lldb_private::ThreadLauncher::LaunchThread(llvm::StringRef, void* (*)(void*), void*, unsigned long) ThreadLauncher.cpp:65 #2 0x114f9418f in lldb_private::Process::StartPrivateStateThread(bool) Process.cpp:3501 #3 0x114f9398a in lldb_private::Process::Launch(lldb_private::ProcessLaunchInfo&) Process.cpp:2547 #4 0x11507413b in lldb_private::Target::Launch(lldb_private::ProcessLaunchInfo&, lldb_private::Stream*) Target.cpp:3063 #5 0x1144481b0 in lldb::SBTarget::Launch(lldb::SBLaunchInfo&, lldb::SBError&) SBTarget.cpp:439 #6 0x1149023ea in _wrap_SBTarget_Launch(_object*, _object*) LLDBWrapPython.cpp:54084 #7 0x10fa33bda in PyCFunction_Call+0x140 (Python:x86_64+0x19bda) #8 0x10fac29e2 in _PyEval_EvalFrameDefault+0x1f45 (Python:x86_64+0xa89e2) #9 0x10faca2da in _PyEval_EvalCodeWithName+0x72a (Python:x86_64+0xb02da) #10 0x10fa3388b in _PyFunction_FastCallKeywords+0xe0 (Python:x86_64+0x1988b) #11 0x10fac997d in call_function+0x256 (Python:x86_64+0xaf97d) #12 0x10fac25d5 in _PyEval_EvalFrameDefault+0x1b38 (Python:x86_64+0xa85d5) #13 0x10fa33ca1 in function_code_fastcall+0x6f (Python:x86_64+0x19ca1) #14 0x10fac2905 in _PyEval_EvalFrameDefault+0x1e68 (Python:x86_64+0xa8905) #15 0x10faca2da in _PyEval_EvalCodeWithName+0x72a (Python:x86_64+0xb02da) #16 0x10fa334f4 in _PyFunction_FastCallDict+0x1b8 (Python:x86_64+0x194f4) #17 0x10fac2905 in _PyEval_EvalFrameDefault+0x1e68 (Python:x86_64+0xa8905) #18 0x10faca2da in _PyEval_EvalCodeWithName+0x72a (Python:x86_64+0xb02da) #19 0x10fa3388b in _PyFunction_FastCallKeywords+0xe0 (Python:x86_64+0x1988b) #20 0x10fac997d in call_function+0x256 (Python:x86_64+0xaf97d) #21 0x10fac268c in _PyEval_EvalFrameDefault+0x1bef (Python:x86_64+0xa868c) #22 0x10faca2da in _PyEval_EvalCodeWithName+0x72a (Python:x86_64+0xb02da) #23 0x10fa3388b in _PyFunction_FastCallKeywords+0xe0 (Python:x86_64+0x1988b) #24 0x10fac997d in call_function+0x256 (Python:x86_64+0xaf97d) #25 0x10fac268c in _PyEval_EvalFrameDefault+0x1bef (Python:x86_64+0xa868c) #26 0x10fa33ca1 in function_code_fastcall+0x6f (Python:x86_64+0x19ca1) #27 0x10fac997d in call_function+0x256 (Python:x86_64+0xaf97d) #28 0x10fac25d5 in _PyEval_EvalFrameDefault+0x1b38 (Python:x86_64+0xa85d5) #29 0x10faca2da in _PyEval_EvalCodeWithName+0x72a (Python:x86_64+0xb02da) #30 0x10fa334f4 in _PyFunction_FastCallDict+0x1b8 (Python:x86_64+0x194f4) #31 0x10fa34624 in _PyObject_Call_Prepend+0x95 (Python:x86_64+0x1a624) #32 0x10fa339d4 in PyObject_Call+0x87 (Python:x86_64+0x199d4) #33 0x10fac2905 in _PyEval_EvalFrameDefault+0x1e68 (Python:x86_64+0xa8905) #34 0x10faca2da in _PyEval_EvalCodeWithName+0x72a (Python:x86_64+0xb02da) #35 0x10fa334f4 in _PyFunction_FastCallDict+0x1b8 (Python:x86_64+0x194f4) #36 0x10fa34624 in _PyObject_Call_Prepend+0x95 (Python:x86_64+0x1a624) #37 0x10fa714af in slot_tp_call+0x46 (Python:x86_64+0x574af) #38 0x10fa3372c in _PyObject_FastCallKeywords+0x166 (Python:x86_64+0x1972c) #39 0x10fac9976 in call_function+0x24f (Python:x86_64+0xaf976) #40 0x10fac268c in _PyEval_EvalFrameDefault+0x1bef (Python:x86_64+0xa868c) #41 0x10faca2da in _PyEval_EvalCodeWithName+0x72a (Python:x86_64+0xb02da) #42 0x10fa3388b in _PyFunction_FastCallKeywords+0xe0 (Python:x86_64+0x1988b) #43 0x10fac997d in call_function+0x256 (Python:x86_64+0xaf97d) #44 0x10fac25d5 in _PyEval_EvalFrameDefault+0x1b38 (Python:x86_64+0xa85d5) #45 0x10faca2da in _PyEval_EvalCodeWithName+0x72a (Python:x86_64+0xb02da) #46 0x10fa3388b in _PyFunction_FastCallKeywords+0xe0 (Python:x86_64+0x1988b) #47 0x10fac997d in call_function+0x256 (Python:x86_64+0xaf97d) #48 0x10fac25d5 in _PyEval_EvalFrameDefault+0x1b38 (Python:x86_64+0xa85d5) #49 0x10fa33ca1 in function_code_fastcall+0x6f (Python:x86_64+0x19ca1) #50 0x10fa34624 in _PyObject_Call_Prepend+0x95 (Python:x86_64+0x1a624) #51 0x10fa339d4 in PyObject_Call+0x87 (Python:x86_64+0x199d4) #52 0x10fac2905 in _PyEval_EvalFrameDefault+0x1e68 (Python:x86_64+0xa8905) #53 0x10faca2da in _PyEval_EvalCodeWithName+0x72a (Python:x86_64+0xb02da) #54 0x10fa334f4 in _PyFunction_FastCallDict+0x1b8 (Python:x86_64+0x194f4) #55 0x10fa34624 in _PyObject_Call_Prepend+0x95 (Python:x86_64+0x1a624) #56 0x10fa714af in slot_tp_call+0x46 (Python:x86_64+0x574af) #57 0x10fa3372c in _PyObject_FastCallKeywords+0x166 (Python:x86_64+0x1972c) #58 0x10fac9976 in call_function+0x24f (Python:x86_64+0xaf976) #59 0x10fac268c in _PyEval_EvalFrameDefault+0x1bef (Python:x86_64+0xa868c) #60 0x10fa33ca1 in function_code_fastcall+0x6f (Python:x86_64+0x19ca1) #61 0x10fac997d in call_function+0x256 (Python:x86_64+0xaf97d) #62 0x10fac25d5 in _PyEval_EvalFrameDefault+0x1b38 (Python:x86_64+0xa85d5) #63 0x10fa33ca1 in function_code_fastcall+0x6f (Python:x86_64+0x19ca1) #64 0x10fac997d in call_function+0x256 (Python:x86_64+0xaf97d) #65 0x10fac25ee in _PyEval_EvalFrameDefault+0x1b51 (Python:x86_64+0xa85ee) #66 0x10faca2da in _PyEval_EvalCodeWithName+0x72a (Python:x86_64+0xb02da) #67 0x10fac0a14 in PyEval_EvalCode+0x29 (Python:x86_64+0xa6a14) #68 0x10faef2aa in run_mod+0x35 (Python:x86_64+0xd52aa) #69 0x10faee2c5 in PyRun_FileExFlags+0xa3 (Python:x86_64+0xd42c5) #70 0x10faed9a4 in PyRun_SimpleFileExFlags+0x114 (Python:x86_64+0xd39a4) #71 0x10fb05010 in pymain_main+0x13de (Python:x86_64+0xeb010) #72 0x10fb057b7 in _Py_UnixMain+0x67 (Python:x86_64+0xeb7b7) #73 0x7fff70ba3cc8 in start+0x0 (libdyld.dylib:x86_64+0x1acc8)

Hide Details

SUMMARY: AddressSanitizer: heap-use-after-free (libclang_rt.asan_osx_dynamic.dylib:x86_64+0x44a2f) in __asan_memcpy+0x1af Shadow bytes around the buggy address: 0x1c2c0004a0c0: fd fd fd fd fd fd fd fd fd fd fd fd fd fd fd fd 0x1c2c0004a0d0: fd fd fd fd fd fd fd fd fd fd fd fd fd fd fd fd 0x1c2c0004a0e0: fd fd fd fd fd fd fd fd fd fd fd fd fd fd fd fd 0x1c2c0004a0f0: fd fd fd fd fd fd fd fd fa fa fa fa fa fa fa fa 0x1c2c0004a100: fa fa fa fa fa fa fa fa fa fa fa fa fa fa fa fa =>0x1c2c0004a110: fd fd fd fd[fd]fd fd fd fd fd fd fd fd fd fd fd 0x1c2c0004a120: fd fd fd fd fd fd fd fd fd fd fd fd fd fd fd fd 0x1c2c0004a130: fd fd fd fd fd fd fd fd fd fd fd fd fd fd fd fd 0x1c2c0004a140: fd fd fd fd fd fd fd fd fd fd fd fd fd fd fd fd 0x1c2c0004a150: fd fd fd fd fd fa fa fa fa fa fa fa fa fa fa fa 0x1c2c0004a160: fa fa fa fa fa fa fa fa fa fa fa fa fa fa fa fa Shadow byte legend (one shadow byte represents 8 application bytes): Addressable: 00 Partially addressable: 01 02 03 04 05 06 07 Heap left redzone: fa Freed heap region: fd Stack left redzone: f1 Stack mid redzone: f2 Stack right redzone: f3 Stack after return: f5 Stack use after scope: f8 Global redzone: f9 Global init order: f6 Poisoned by user: f7 Container overflow: fc Array cookie: ac Intra object redzone: bb ASan internal: fe Left alloca redzone: ca Right alloca redzone: cb ==71510==ABORTING Fatal Python error: Aborted

Hide Details

Thread 0x0000000113db7dc0 (most recent call first): File "/Users/buildslave/jenkins/workspace/lldb-cmake-sanitized/lldb-build/lib/python3.7/site-packages/lldb/__init__.py", line 10301 in Launch File "/Users/buildslave/jenkins/workspace/lldb-cmake-sanitized/llvm-project/lldb/test/API/functionalities/scripted_process/TestScriptedProcess.py", line 149 in test_launch_scripted_process_stack_frames File "/Users/buildslave/jenkins/workspace/lldb-cmake-sanitized/llvm-project/lldb/packages/Python/lldbsuite/test/decorators.py", line 149 in wrapper File "/Users/buildslave/jenkins/workspace/lldb-cmake-sanitized/llvm-project/lldb/packages/Python/lldbsuite/test/decorators.py", line 149 in wrapper File "/Users/buildslave/jenkins/workspace/lldb-cmake-sanitized/llvm-project/lldb/packages/Python/lldbsuite/test/lldbtest.py", line 1715 in test_method File "/Users/buildslave/jenkins/workspace/lldb-cmake-sanitized/llvm-project/lldb/third_party/Python/module/unittest2/unittest2/case.py", line 413 in runMethod File "/Users/buildslave/jenkins/workspace/lldb-cmake-sanitized/llvm-project/lldb/third_party/Python/module/unittest2/unittest2/case.py", line 383 in run File "/Users/buildslave/jenkins/workspace/lldb-cmake-sanitized/llvm-project/lldb/third_party/Python/module/unittest2/unittest2/case.py", line 458 in __call__ File "/Users/buildslave/jenkins/workspace/lldb-cmake-sanitized/llvm-project/lldb/third_party/Python/module/unittest2/unittest2/suite.py", line 117 in _wrapped_run File "/Users/buildslave/jenkins/workspace/lldb-cmake-sanitized/llvm-project/lldb/third_party/Python/module/unittest2/unittest2/suite.py", line 115 in _wrapped_run File "/Users/buildslave/jenkins/workspace/lldb-cmake-sanitized/llvm-project/lldb/third_party/Python/module/unittest2/unittest2/suite.py", line 85 in run File "/Users/buildslave/jenkins/workspace/lldb-cmake-sanitized/llvm-project/lldb/third_party/Python/module/unittest2/unittest2/suite.py", line 66 in __call__ File "/Users/buildslave/jenkins/workspace/lldb-cmake-sanitized/llvm-project/lldb/third_party/Python/module/unittest2/unittest2/runner.py", line 165 in run File "/Users/buildslave/jenkins/workspace/lldb-cmake-sanitized/llvm-project/lldb/packages/Python/lldbsuite/test/dotest.py", line 996 in run_suite File "/Users/buildslave/jenkins/workspace/lldb-cmake-sanitized/llvm-project/lldb/test/API/dotest.py", line 7 in <module>

Hide Details

--

Hide Details

******************** PASS: lldb-api :: lang/objcxx/cxx-bridged-po/TestObjCXXBridgedPO.py (2318 of 2474) PASS: lldb-unit :: Utility/./UtilityTests/RangeDataVector.CustomSort (2319 of 2474) PASS: lldb-shell :: Register/Core/x86-64-netbsd-multithread.test (2320 of 2474) PASS: lldb-unit :: Utility/./UtilityTests/RangeTest.NotEqualInvalid (2321 of 2474) PASS: lldb-api :: commands/platform/file/read/TestPlatformFileRead.py (2322 of 2474) PASS: lldb-shell :: SymbolFile/DWARF/x86/limit-debug-info.s (2323 of 2474) PASS: lldb-unit :: Process/gdb-remote/./ProcessGdbRemoteTests/GDBRemoteCommunicationClientTest.GetModulesInfoInvalidResponse (2324 of 2474) PASS: lldb-api :: python_api/thread/TestThreadAPI.py (2325 of 2474) PASS: lldb-unit :: Utility/./UtilityTests/StreamTest.PutCString (2326 of 2474) PASS: lldb-shell :: Settings/TestFrameFormatNoColor.test (2327 of 2474) PASS: lldb-api :: commands/expression/import-std-module/forward_list/TestForwardListFromStdModule.py (2328 of 2474) PASS: lldb-unit :: Process/minidump/./LLDBMinidumpTests/MinidumpParserTest.FindMemoryRangeWithFullMemoryMinidump (2329 of 2474) PASS: lldb-api :: commands/expression/import-std-module/array/TestArrayFromStdModule.py (2330 of 2474) PASS: lldb-api :: tools/lldb-server/inferior-crash/TestGdbRemoteSegFault.py (2331 of 2474) PASS: lldb-api :: functionalities/data-formatter/data-formatter-objc/TestDataFormatterObjCNSError.py (2332 of 2474) PASS: lldb-api :: lang/objc/bitfield_ivars/TestBitfieldIvars.py (2333 of 2474) PASS: lldb-shell :: SymbolFile/DWARF/x86/debug_line-tombstone.s (2334 of 2474) PASS: lldb-api :: lang/cpp/class-template-non-type-parameter-pack/TestClassTemplateNonTypeParameterPack.py (2335 of 2474) PASS: lldb-shell :: ObjectFile/ELF/PT_LOAD-overlap-PT_INTERP.yaml (2336 of 2474) PASS: lldb-unit :: Utility/./UtilityTests/RegisterValueTest.GetSet8 (2337 of 2474) PASS: lldb-unit :: Utility/./UtilityTests/VMRange.Reset (2338 of 2474) PASS: lldb-api :: functionalities/conditional_break/TestConditionalBreak.py (2339 of 2474) UNSUPPORTED: lldb-shell :: ScriptInterpreter/Lua/persistent_state.test (2340 of 2474) PASS: lldb-api :: driver/batch_mode/TestBatchMode.py (2341 of 2474) PASS: lldb-shell :: SymbolFile/DWARF/x86/dir-separator-no-comp-dir.s (2342 of 2474) PASS: lldb-api :: commands/register/register/register_command/TestRegisters.py (2343 of 2474) PASS: lldb-unit :: Host/./HostTests/NativeProcessProtocolTest.SetBreakpoint (2344 of 2474) PASS: lldb-unit :: Host/./HostTests/SocketTests/SocketTest.TCPGetConnectURI/ipv6 (2345 of 2474) PASS: lldb-api :: lang/c/conflicting-symbol/TestConflictingSymbol.py (2346 of 2474) PASS: lldb-unit :: Host/./HostTests/NativeProcessProtocolTest.ReadCStringFromMemory (2347 of 2474) PASS: lldb-api :: python_api/watchpoint/watchlocation/TestTargetWatchAddress.py (2348 of 2474) PASS: lldb-unit :: Target/./TargetTests/DynamicRegisterInfoRegisterTest.SetRegisterInfo (2349 of 2474) PASS: lldb-unit :: Process/gdb-remote/./ProcessGdbRemoteTests/GDBRemoteClientBaseTest.SendContinueAndAsyncPacket (2350 of 2474) PASS: lldb-unit :: UnwindAssembly/x86/./UnwindAssemblyx86Tests/Testx86AssemblyInspectionEngine.TestSimple32bitFrameFunction (2351 of 2474) PASS: lldb-unit :: Utility/./UtilityTests/ArgsTest.GetQuotedCommandString (2352 of 2474) PASS: lldb-unit :: Utility/./UtilityTests/StringExtractorTest.DecodeHexU8_Underflow2 (2353 of 2474) PASS: lldb-unit :: Utility/./UtilityTests/XcodeSDKTest.SDKSupportsSwift (2354 of 2474) PASS: lldb-shell :: Register/Core/x86-32-netbsd-gp.test (2355 of 2474) PASS: lldb-unit :: Expression/./ExpressionTests/ClangExpressionDeclMapTest.TestPersistentDeclLookup (2356 of 2474) PASS: lldb-shell :: ObjectFile/wasm/basic.yaml (2357 of 2474) PASS: lldb-api :: commands/expression/import-std-module/module-build-errors/TestStdModuleBuildErrors.py (2358 of 2474) PASS: lldb-unit :: Host/./HostTests/SocketAddressTest.Set (2359 of 2474) PASS: lldb-api :: functionalities/thread/concurrent_events/TestConcurrentTwoBreakpointsOneWatchpoint.py (2360 of 2474) PASS: lldb-unit :: Process/minidump/./LLDBMinidumpTests/MinidumpParserTest.GetPidWindows (2361 of 2474) PASS: lldb-api :: functionalities/thread/concurrent_events/TestConcurrentSignalDelayWatch.py (2362 of 2474) PASS: lldb-api :: lang/c/const_variables/TestConstVariables.py (2363 of 2474) PASS: lldb-api :: lang/c/modules/TestCModules.py (2364 of 2474) PASS: lldb-shell :: Commands/CommandScriptImmediateOutput/CommandScriptImmediateOutputFile.test (2365 of 2474) UNSUPPORTED: lldb-shell :: Subprocess/fork-follow-parent-softbp.test (2366 of 2474) PASS: lldb-api :: lang/cpp/template-arguments/TestCppTemplateArguments.py (2367 of 2474) PASS: lldb-api :: lang/cpp/elaborated-types/TestElaboratedTypes.py (2368 of 2474) PASS: lldb-api :: lang/cpp/call-function/TestCallCPPFunction.py (2369 of 2474) PASS: lldb-unit :: Symbol/./SymbolTests/LineEntryTest.GetSameLineContiguousAddressRangeOneInline (2370 of 2474) PASS: lldb-api :: functionalities/thread/backtrace_all/TestBacktraceAll.py (2371 of 2474) PASS: lldb-api :: lang/objc/modules-non-objc-target/TestObjCModulesNonObjCTarget.py (2372 of 2474) PASS: lldb-api :: lang/objcxx/objcxx-ivar-vector/TestIvarVector.py (2373 of 2474) PASS: lldb-unit :: Process/gdb-remote/./ProcessGdbRemoteTests/GDBRemoteClientBaseTest.SendContinueAndInterrupt2PacketBug (2374 of 2474) PASS: lldb-unit :: Utility/./UtilityTests/LogChannelEnabledTest.LogGetLogThread (2375 of 2474) PASS: lldb-unit :: Signals/./SignalsTests/UnixSignalsTest.GetFilteredSignals (2376 of 2474) PASS: lldb-api :: functionalities/breakpoint/debugbreak/TestDebugBreak.py (2377 of 2474) PASS: lldb-api :: commands/expression/import-std-module/forward_decl_from_module/TestForwardDeclFromStdModule.py (2378 of 2474) PASS: lldb-api :: lang/objc/modules-objc-property/TestModulesObjCProperty.py (2379 of 2474) PASS: lldb-shell :: SymbolFile/DWARF/x86/debug_loclists-dwo.s (2380 of 2474) PASS: lldb-shell :: SymbolFile/DWARF/x86/win-i386-line-table.s (2381 of 2474) PASS: lldb-api :: functionalities/data-formatter/data-formatter-stl/libcxx/vbool/TestDataFormatterLibcxxVBool.py (2382 of 2474) PASS: lldb-unit :: tools/lldb-server/tests/./LLDBServerTests/StandardStartupTest.TestStopReplyContainsThreadPcs (2383 of 2474) UNSUPPORTED: lldb-api :: functionalities/exec/TestExec.py (2384 of 2474) PASS: lldb-api :: types/TestShortType.py (2385 of 2474) PASS: lldb-api :: commands/process/attach-resume/TestAttachResume.py (2386 of 2474) PASS: lldb-unit :: Utility/./UtilityTests/ArgsTest.TestSingleArgWithQuotedSpace (2387 of 2474) PASS: lldb-unit :: Symbol/./SymbolTests/TestTypeSystemClang.TestDeletingImplicitCopyCstrDueToMoveCStr (2388 of 2474) PASS: lldb-unit :: Utility/./UtilityTests/RangeTest.SlideZero (2389 of 2474) PASS: lldb-unit :: Utility/./UtilityTests/DataExtractorTest.GetFloat (2390 of 2474) PASS: lldb-shell :: Quit/TestQuitExitCodeHexA.test (2391 of 2474) PASS: lldb-api :: python_api/symbol-context/two-files/TestSymbolContextTwoFiles.py (2392 of 2474) PASS: lldb-api :: functionalities/data-formatter/data-formatter-stl/libcxx/iterator/TestDataFormatterLibccIterator.py (2393 of 2474) PASS: lldb-api :: lang/objc/objc-struct-argument/TestObjCStructArgument.py (2394 of 2474) PASS: lldb-api :: commands/expression/namespace_local_var_same_name_obj_c/TestNamespaceLocalVarSameNameObjC.py (2395 of 2474) UNSUPPORTED: lldb-api :: tools/lldb-server/libraries-svr4/TestGdbRemoteLibrariesSvr4Support.py (2396 of 2474) UNSUPPORTED: lldb-api :: functionalities/tsan/basic/TestTsanBasic.py (2397 of 2474) PASS: lldb-shell :: SymbolFile/DWARF/x86/compilercontext.ll (2398 of 2474) PASS: lldb-unit :: Utility/./UtilityTests/UserIDResolver.GetGroupName (2399 of 2474) PASS: lldb-unit :: Symbol/./SymbolTests/TestTypeSystemClang.TestNotDeletingUserCopyCstrDueToMoveCStr (2400 of 2474) PASS: lldb-unit :: Utility/./UtilityTests/StreamTest.AddressNoSuffix (2401 of 2474) PASS: lldb-api :: commands/expression/ignore-artificial-constructors/TestIgnoreArtificialConstructors.py (2402 of 2474) PASS: lldb-api :: lang/c/unicode/TestUnicodeSymbols.py (2403 of 2474) PASS: lldb-shell :: SymbolFile/DWARF/x86/dwarf5-atomic.s (2404 of 2474) PASS: lldb-api :: lang/objc/objc-super/TestObjCSuper.py (2405 of 2474) PASS: lldb-unit :: Utility/./UtilityTests/NameMatchesTest.Equals (2406 of 2474) PASS: lldb-shell :: Reproducer/TestPythonImport.test (2407 of 2474) PASS: lldb-api :: functionalities/load_after_attach/TestLoadAfterAttach.py (2408 of 2474) PASS: lldb-api :: functionalities/thread/concurrent_events/TestConcurrentTwoWatchpointsOneDelayBreakpoint.py (2409 of 2474) UNSUPPORTED: lldb-api :: linux/add-symbols/TestTargetSymbolsAddCommand.py (2410 of 2474) PASS: lldb-unit :: Utility/./UtilityTests/RangeTest.DefaultConstructor (2411 of 2474) PASS: lldb-api :: commands/target/stop-hooks/TestStopHookScripted.py (2412 of 2474) UNSUPPORTED: lldb-api :: functionalities/breakpoint/breakpoint_callback_command_source/TestBreakpointCallbackCommandSource.py (2413 of 2474) PASS: lldb-unit :: Host/./HostTests/SocketTests/SocketTest.DomainGetConnectURI/ipv6 (2414 of 2474) PASS: lldb-shell :: Register/x86-64-ymm-read.test (2415 of 2474) PASS: lldb-unit :: Utility/./UtilityTests/FileSpecTest.EqualDotsPosix (2416 of 2474) PASS: lldb-unit :: debugserver/./debugserverTests/RNBSocket.AnyListen (2417 of 2474) PASS: lldb-api :: lang/c/complex_int/TestComplexInt.py (2418 of 2474) PASS: lldb-unit :: Utility/./UtilityTests/ArgsTest.TestSingleArg (2419 of 2474) PASS: lldb-api :: tools/lldb-server/TestGdbRemoteKill.py (2420 of 2474) PASS: lldb-api :: functionalities/data-formatter/array_typedef/TestArrayTypedef.py (2421 of 2474) PASS: lldb-unit :: Utility/./UtilityTests/OptionsWithRawTest.EmptySuffix (2422 of 2474) PASS: lldb-unit :: Utility/./UtilityTests/OptionsWithRawTest.MultiWordSuffix (2423 of 2474) PASS: lldb-unit :: Utility/./UtilityTests/StatusTest.ErrorConstructor (2424 of 2474) PASS: lldb-api :: functionalities/gdb_remote_client/TestGDBServerTargetXML.py (2425 of 2474) PASS: lldb-unit :: Utility/./UtilityTests/ScalarTest.CastOperations (2426 of 2474) PASS: lldb-unit :: Utility/./UtilityTests/RecordReplayTest.InvalidSequence (2427 of 2474) PASS: lldb-api :: types/TestDoubleTypes.py (2428 of 2474) PASS: lldb-shell :: ObjectFile/ELF/minidebuginfo-corrupt-xz.yaml (2429 of 2474) PASS: lldb-unit :: Utility/./UtilityTests/StringListTest.ForRange (2430 of 2474) PASS: lldb-unit :: Utility/./UtilityTests/ArgsTest.AppendArguments (2431 of 2474) PASS: lldb-unit :: Utility/./UtilityTests/StringExtractorTest.GetHexU8_Extra_NoEof (2432 of 2474) PASS: lldb-unit :: Expression/./ExpressionTests/CppModuleConfigurationTest.Sysroot (2433 of 2474) UNSUPPORTED: lldb-api :: functionalities/gdb_remote_client/TestWasm.py (2434 of 2474) PASS: lldb-unit :: Utility/./UtilityTests/BinaryStreamTest.PutSLEB128MaxValue (2435 of 2474) PASS: lldb-shell :: SymbolFile/DWARF/x86/debug-names-compressed.cpp (2436 of 2474) UNSUPPORTED: lldb-api :: functionalities/ptrauth_diagnostics/BRAA_error/TestPtrauthBRAADiagnostic.py (2437 of 2474) PASS: lldb-shell :: Register/Core/x86-32-linux-fp.test (2438 of 2474) UNSUPPORTED: lldb-api :: android/platform/TestDefaultCacheLineSize.py (2439 of 2474) PASS: lldb-api :: lang/cpp/function-local-class/TestCppFunctionLocalClass.py (2440 of 2474) PASS: lldb-api :: functionalities/gdb_remote_client/TestThreadInfoTrailingComma.py (2441 of 2474) PASS: lldb-unit :: ScriptInterpreter/Python/./ScriptInterpreterPythonTests/PythonDataObjectsTest.TestPythonIntegerToStructuredInteger (2442 of 2474) PASS: lldb-unit :: Utility/./UtilityTests/BinaryStreamTest.PutULEB128SixBytes (2443 of 2474) PASS: lldb-shell :: Breakpoint/debug_rnglist_basic.test (2444 of 2474) PASS: lldb-unit :: Utility/./UtilityTests/TildeExpressionResolver.ResolveFullPath (2445 of 2474) PASS: lldb-unit :: Utility/./UtilityTests/StringExtractorTest.GetHexBytes_Partial (2446 of 2474) PASS: lldb-api :: commands/target/stop-hook/delete/TestTargetStopHookDelete.py (2447 of 2474) PASS: lldb-api :: functionalities/gdb_remote_client/TestIOSSimulator.py (2448 of 2474) PASS: lldb-unit :: Utility/./UtilityTests/StreamTest.PutHex16ByteOrderBig (2449 of 2474) PASS: lldb-api :: functionalities/data-formatter/data-formatter-objc/nsstring/TestDataFormatterNSString.py (2450 of 2474) PASS: lldb-api :: commands/target/basic/TestTargetCommand.py (2451 of 2474) UNSUPPORTED: lldb-shell :: Expr/TestIRMemoryMapWindows.test (2452 of 2474) PASS: lldb-shell :: SymbolFile/Breakpad/line-table-mixed-path-styles.test (2453 of 2474) PASS: lldb-unit :: DataFormatter/./LLDBFormatterTests/TypeMatcherTests.RegexMatchPart (2454 of 2474) PASS: lldb-api :: commands/expression/call-function/TestCallStopAndContinue.py (2455 of 2474) PASS: lldb-shell :: SymbolFile/DWARF/x86/dwarf5-implicit-const.s (2456 of 2474) PASS: lldb-shell :: SymbolFile/DWARF/x86/DW_AT_data_bit_offset-DW_OP_stack_value.s (2457 of 2474) PASS: lldb-api :: functionalities/gdb_remote_client/TestRecognizeBreakpoint.py (2458 of 2474) PASS: lldb-api :: lang/cpp/nsimport/TestCppNsImport.py (2459 of 2474) PASS: lldb-unit :: Utility/./UtilityTests/ArgsTest.TestInsertArg (2460 of 2474) PASS: lldb-unit :: Utility/./UtilityTests/StringExtractorTest.GetU32BigEndian (2461 of 2474) PASS: lldb-unit :: Utility/./UtilityTests/DataExtractorTest.GetCStrEmpty (2462 of 2474) UNSUPPORTED: lldb-shell :: Register/arm-gp-read.test (2463 of 2474) UNSUPPORTED: lldb-shell :: SymbolFile/PDB/variables-locations.test (2464 of 2474) PASS: lldb-unit :: Utility/./UtilityTests/FileSpecTest.EqualDotsPosixRoot (2465 of 2474) PASS: lldb-unit :: Core/./LLDBCoreTests/ModuleSpecTest.TestCOFFFile (2466 of 2474) PASS: lldb-unit :: UnwindAssembly/x86/./UnwindAssemblyx86Tests/Testx86AssemblyInspectionEngine.TestSpArithx86_64Augmented (2467 of 2474) PASS: lldb-shell :: ObjectFile/PECOFF/export-dllfunc.yaml (2468 of 2474) PASS: lldb-api :: commands/watchpoints/multiple_threads/TestWatchpointMultipleThreads.py (2469 of 2474) PASS: lldb-unit :: Utility/./UtilityTests/StringLexerTest.PutBack (2470 of 2474) PASS: lldb-unit :: Utility/./UtilityTests/StringListTest.InsertStringAtIndexOutOfBounds (2471 of 2474) PASS: lldb-api :: commands/expression/import-std-module/missing-module-sources/TestStdModuleSourcesMissing.py (2472 of 2474) PASS: lldb-api :: functionalities/data-formatter/data-formatter-stl/libcxx/shared_ptr/TestDataFormatterLibcxxSharedPtr.py (2473 of 2474) PASS: lldb-api :: macosx/save_crashlog/TestSaveCrashlog.py (2474 of 2474) Slowest Tests: -------------------------------------------------------------------------- 266.37s: lldb-api :: tools/lldb-server/TestLldbGdbServer.py 246.15s: lldb-api :: functionalities/scripted_process/TestScriptedProcess.py 198.70s: lldb-api :: macosx/stack-corefile/TestStackCorefile.py 159.54s: lldb-api :: functionalities/memory-region/TestMemoryRegion.py 145.55s: lldb-api :: macosx/skinny-corefile/TestSkinnyCorefile.py 141.04s: lldb-api :: api/multithreaded/TestMultithreaded.py 91.53s: lldb-api :: functionalities/gdb_remote_client/TestWasm.py 82.41s: lldb-api :: types/TestLongTypesExpr.py 75.65s: lldb-api :: commands/expression/import-std-module/vector/TestVectorFromStdModule.py 72.36s: lldb-api :: lang/objc/exceptions/TestObjCExceptions.py 71.90s: lldb-api :: commands/expression/import-std-module/queue/TestQueueFromStdModule.py 70.82s: lldb-api :: commands/expression/import-std-module/stack/TestStackFromStdModule.py 70.41s: lldb-api :: commands/process/attach/TestProcessAttach.py 67.95s: lldb-api :: lang/cpp/namespace/TestNamespaceLookup.py 67.82s: lldb-api :: lang/objc/hidden-ivars/TestHiddenIvars.py 63.10s: lldb-api :: lang/objc/objc-new-syntax/TestObjCNewSyntaxLiteral.py 56.21s: lldb-api :: lang/objc/foundation/TestObjCMethods.py 50.71s: lldb-api :: python_api/target/TestTargetAPI.py 50.68s: lldb-api :: types/TestIntegerTypeExpr.py 50.58s: lldb-api :: tools/lldb-server/TestGdbRemoteThreadsInStopReply.py

Hide Details

Tests Times: -------------------------------------------------------------------------- [ Range ] :: [ Percentage ] :: [ Count ] -------------------------------------------------------------------------- [260s,280s) :: [ ] :: [ 1/2474] [240s,260s) :: [ ] :: [ 1/2474] [220s,240s) :: [ ] :: [ 0/2474] [200s,220s) :: [ ] :: [ 1/2474] [180s,200s) :: [ ] :: [ 0/2474] [160s,180s) :: [ ] :: [ 1/2474] [140s,160s) :: [ ] :: [ 2/2474] [120s,140s) :: [ ] :: [ 0/2474] [100s,120s) :: [ ] :: [ 0/2474] [ 80s,100s) :: [ ] :: [ 2/2474] [ 60s, 80s) :: [ ] :: [ 8/2474] [ 40s, 60s) :: [ ] :: [ 18/2474] [ 20s, 40s) :: [* ] :: [ 83/2474] [ 0s, 20s) :: [************************************** ] :: [2357/2474] -------------------------------------------------------------------------- ******************** Failed Tests (1): lldb-api :: functionalities/scripted_process/TestScriptedProcess.py

Hide Details

Hide Details

Testing Time: 2686.10s Unsupported : 232 Passed : 2231 Expectedly Failed: 10 Failed : 1 FAILED: tools/lldb/test/CMakeFiles/check-lldb cd /Users/buildslave/jenkins/workspace/lldb-cmake-sanitized/lldb-build/tools/lldb/test && /usr/local/Frameworks/Python.framework/Versions/3.7/bin/python3.7 /Users/buildslave/jenkins/workspace/lldb-cmake-sanitized/lldb-build/./bin/llvm-lit -v --time-tests --shuffle --xunit-xml-output=/Users/buildslave/jenkins/workspace/lldb-cmake-sanitized/test/results.xml -v -j 4 --timeout 1200 /Users/buildslave/jenkins/workspace/lldb-cmake-sanitized/lldb-build/tools/lldb/test ninja: build stopped: subcommand failed. Command failed: Command '['/usr/bin/env', 'TERM=vt100', '/usr/local/bin/ninja', '-v', 'check-lldb']' returned non-zero exit status 1. Command: ['/usr/bin/env', 'TERM=vt100', '/usr/local/bin/ninja', '-v', 'check-lldb'] [Pipeline] } [Pipeline] // timeout [Pipeline] } [Pipeline] // stage [Pipeline] stage [Pipeline] { (Declarative: Post Actions) [Pipeline] scanForIssues [Clang] Sleeping for 5 seconds due to JENKINS-32191... [Clang] Parsing console log (workspace: '/Users/buildslave/jenkins/workspace/lldb-cmake-sanitized') [Clang] -> found 0 issues (skipped 0 duplicates) [Clang] Parsing console log (workspace: '/Users/buildslave/jenkins/workspace/lldb-cmake-sanitized') [Clang] -> found 0 issues (skipped 0 duplicates) [Clang] Successfully parsed console log [Clang] -> found 0 issues (skipped 0 duplicates) [Clang] Parsing console log (workspace: '/Users/buildslave/jenkins/workspace/lldb-cmake-sanitized') [Clang] Skipping post processing [Clang] No filter has been set, publishing all 0 issues [Clang] Repository miner is not configured, skipping repository mining [Pipeline] junit Recording test results [Checks API] No suitable checks publisher found. [Pipeline] } [Pipeline] // stage [Pipeline] } [Pipeline] // withEnv [Pipeline] } [Pipeline] // node [Pipeline] End of Pipeline ERROR: script returned exit code 1 Finished: FAILURE