Console Output

Skipping 3,978 KB.. Full Log
output: 

Hide Details

runCmd: settings set symbols.clang-modules-cache-path "/Users/buildslave/jenkins/workspace/lldb-cmake-sanitized/lldb-build/lldb-test-build.noindex/module-cache-lldb/lldb-api" output:

Hide Details

runCmd: settings set use-color false output:

Hide Details

Adding tearDown hook: def shutdown_named_pipe(): # Close the pipe. try: named_pipe.close() except: print("failed to close named pipe") None

Hide Details

# Delete the pipe. try: os.remove(named_pipe_path) except: print("failed to delete named pipe: {}".format(named_pipe_path)) None

Hide Details

# Delete the temp directory. try: os.rmdir(temp_dir) except: print( "failed to delete temp dir: {}, directory contents: '{}'".format( temp_dir, os.listdir(temp_dir))) None

Hide Details

Hide Details

Adding tearDown hook: def cleanupSubprocesses(self): # Ensure any subprocesses are cleaned up for p in self.subprocesses: p.terminate() del p del self.subprocesses[:] # Ensure any forked processes are cleaned up for pid in self.forkedProcessPids: if os.path.exists("/proc/" + str(pid)): os.kill(pid, signal.SIGTERM)

Hide Details

Hide Details

Adding tearDown hook: def shutdown_debug_monitor(): try: server.terminate() except: logger.warning( "failed to terminate server for debug monitor: {}; ignoring".format( sys.exc_info()[0]))

Hide Details

Hide Details

Adding tearDown hook: def shutdown_socket(): if sock: try: # send the kill packet so lldb-server shuts down gracefully sock.sendall(GdbRemoteTestCaseBase._GDBREMOTE_KILL_PACKET) except: logger.warning( "failed to send kill packet to debug monitor: {}; ignoring".format( sys.exc_info()[0]))

Hide Details

try: sock.close() except: logger.warning( "failed to close socket to debug monitor: {}; ignoring".format( sys.exc_info()[0]))

Hide Details

Hide Details

Executing tearDown hook: def shutdown_socket(): if sock: try: # send the kill packet so lldb-server shuts down gracefully sock.sendall(GdbRemoteTestCaseBase._GDBREMOTE_KILL_PACKET) except: logger.warning( "failed to send kill packet to debug monitor: {}; ignoring".format( sys.exc_info()[0]))

Hide Details

try: sock.close() except: logger.warning( "failed to close socket to debug monitor: {}; ignoring".format( sys.exc_info()[0]))

Hide Details

Hide Details

2019-12-05 21:47:28,536 WARNING failed to send kill packet to debug monitor: <class 'TypeError'>; ignoring Executing tearDown hook: def shutdown_debug_monitor(): try: server.terminate() except: logger.warning( "failed to terminate server for debug monitor: {}; ignoring".format( sys.exc_info()[0]))

Hide Details

Hide Details

Executing tearDown hook: def cleanupSubprocesses(self): # Ensure any subprocesses are cleaned up for p in self.subprocesses: p.terminate() del p del self.subprocesses[:] # Ensure any forked processes are cleaned up for pid in self.forkedProcessPids: if os.path.exists("/proc/" + str(pid)): os.kill(pid, signal.SIGTERM)

Hide Details

Hide Details

Executing tearDown hook: def shutdown_named_pipe(): # Close the pipe. try: named_pipe.close() except: print("failed to close named pipe") None

Hide Details

# Delete the pipe. try: os.remove(named_pipe_path) except: print("failed to delete named pipe: {}".format(named_pipe_path)) None

Hide Details

# Delete the temp directory. try: os.rmdir(temp_dir) except: print( "failed to delete temp dir: {}, directory contents: '{}'".format( temp_dir, os.listdir(temp_dir))) None

Hide Details

Hide Details

PASS: LLDB (/Users/buildslave/jenkins/workspace/lldb-cmake-sanitized/lldb-build/bin/clang-10-x86_64) :: test_p_returns_correct_data_size_for_each_qRegisterInfo_launch_debugserver (TestLldbGdbServer.LldbGdbServerTestCase) runCmd: settings set symbols.enable-external-lookup false output:

Hide Details

runCmd: settings set plugin.process.gdb-remote.packet-timeout 60 output:

Hide Details

runCmd: settings set symbols.clang-modules-cache-path "/Users/buildslave/jenkins/workspace/lldb-cmake-sanitized/lldb-build/lldb-test-build.noindex/module-cache-lldb/lldb-api" output:

Hide Details

runCmd: settings set use-color false output:

Hide Details

UNSUPPORTED: LLDB (/Users/buildslave/jenkins/workspace/lldb-cmake-sanitized/lldb-build/bin/clang-10-x86_64) :: test_p_returns_correct_data_size_for_each_qRegisterInfo_launch_llgs (TestLldbGdbServer.LldbGdbServerTestCase) (llgs tests) runCmd: settings set symbols.enable-external-lookup false output:

Hide Details

runCmd: settings set plugin.process.gdb-remote.packet-timeout 60 output:

Hide Details

runCmd: settings set symbols.clang-modules-cache-path "/Users/buildslave/jenkins/workspace/lldb-cmake-sanitized/lldb-build/lldb-test-build.noindex/module-cache-lldb/lldb-api" output:

Hide Details

runCmd: settings set use-color false output:

Hide Details

Adding tearDown hook: def shutdown_named_pipe(): # Close the pipe. try: named_pipe.close() except: print("failed to close named pipe") None

Hide Details

# Delete the pipe. try: os.remove(named_pipe_path) except: print("failed to delete named pipe: {}".format(named_pipe_path)) None

Hide Details

# Delete the temp directory. try: os.rmdir(temp_dir) except: print( "failed to delete temp dir: {}, directory contents: '{}'".format( temp_dir, os.listdir(temp_dir))) None

Hide Details

Hide Details

Adding tearDown hook: def cleanupSubprocesses(self): # Ensure any subprocesses are cleaned up for p in self.subprocesses: p.terminate() del p del self.subprocesses[:] # Ensure any forked processes are cleaned up for pid in self.forkedProcessPids: if os.path.exists("/proc/" + str(pid)): os.kill(pid, signal.SIGTERM)

Hide Details

Hide Details

Adding tearDown hook: def shutdown_debug_monitor(): try: server.terminate() except: logger.warning( "failed to terminate server for debug monitor: {}; ignoring".format( sys.exc_info()[0]))

Hide Details

Hide Details

Adding tearDown hook: def shutdown_socket(): if sock: try: # send the kill packet so lldb-server shuts down gracefully sock.sendall(GdbRemoteTestCaseBase._GDBREMOTE_KILL_PACKET) except: logger.warning( "failed to send kill packet to debug monitor: {}; ignoring".format( sys.exc_info()[0]))

Hide Details

try: sock.close() except: logger.warning( "failed to close socket to debug monitor: {}; ignoring".format( sys.exc_info()[0]))

Hide Details

Hide Details

Executing tearDown hook: def shutdown_socket(): if sock: try: # send the kill packet so lldb-server shuts down gracefully sock.sendall(GdbRemoteTestCaseBase._GDBREMOTE_KILL_PACKET) except: logger.warning( "failed to send kill packet to debug monitor: {}; ignoring".format( sys.exc_info()[0]))

Hide Details

try: sock.close() except: logger.warning( "failed to close socket to debug monitor: {}; ignoring".format( sys.exc_info()[0]))

Hide Details

Hide Details

2019-12-05 21:47:55,801 WARNING failed to send kill packet to debug monitor: <class 'TypeError'>; ignoring Executing tearDown hook: def shutdown_debug_monitor(): try: server.terminate() except: logger.warning( "failed to terminate server for debug monitor: {}; ignoring".format( sys.exc_info()[0]))

Hide Details

Hide Details

Executing tearDown hook: def cleanupSubprocesses(self): # Ensure any subprocesses are cleaned up for p in self.subprocesses: p.terminate() del p del self.subprocesses[:] # Ensure any forked processes are cleaned up for pid in self.forkedProcessPids: if os.path.exists("/proc/" + str(pid)): os.kill(pid, signal.SIGTERM)

Hide Details

Hide Details

Executing tearDown hook: def shutdown_named_pipe(): # Close the pipe. try: named_pipe.close() except: print("failed to close named pipe") None

Hide Details

# Delete the pipe. try: os.remove(named_pipe_path) except: print("failed to delete named pipe: {}".format(named_pipe_path)) None

Hide Details

# Delete the temp directory. try: os.rmdir(temp_dir) except: print( "failed to delete temp dir: {}, directory contents: '{}'".format( temp_dir, os.listdir(temp_dir))) None

Hide Details

Hide Details

PASS: LLDB (/Users/buildslave/jenkins/workspace/lldb-cmake-sanitized/lldb-build/bin/clang-10-x86_64) :: test_qMemoryRegionInfo_is_supported_debugserver (TestLldbGdbServer.LldbGdbServerTestCase) runCmd: settings set symbols.enable-external-lookup false output:

Hide Details

runCmd: settings set plugin.process.gdb-remote.packet-timeout 60 output:

Hide Details

runCmd: settings set symbols.clang-modules-cache-path "/Users/buildslave/jenkins/workspace/lldb-cmake-sanitized/lldb-build/lldb-test-build.noindex/module-cache-lldb/lldb-api" output:

Hide Details

runCmd: settings set use-color false output:

Hide Details

UNSUPPORTED: LLDB (/Users/buildslave/jenkins/workspace/lldb-cmake-sanitized/lldb-build/bin/clang-10-x86_64) :: test_qMemoryRegionInfo_is_supported_llgs (TestLldbGdbServer.LldbGdbServerTestCase) (llgs tests) runCmd: settings set symbols.enable-external-lookup false output:

Hide Details

runCmd: settings set plugin.process.gdb-remote.packet-timeout 60 output:

Hide Details

runCmd: settings set symbols.clang-modules-cache-path "/Users/buildslave/jenkins/workspace/lldb-cmake-sanitized/lldb-build/lldb-test-build.noindex/module-cache-lldb/lldb-api" output:

Hide Details

runCmd: settings set use-color false output:

Hide Details

Adding tearDown hook: def shutdown_named_pipe(): # Close the pipe. try: named_pipe.close() except: print("failed to close named pipe") None

Hide Details

# Delete the pipe. try: os.remove(named_pipe_path) except: print("failed to delete named pipe: {}".format(named_pipe_path)) None

Hide Details

# Delete the temp directory. try: os.rmdir(temp_dir) except: print( "failed to delete temp dir: {}, directory contents: '{}'".format( temp_dir, os.listdir(temp_dir))) None

Hide Details

Hide Details

Adding tearDown hook: def cleanupSubprocesses(self): # Ensure any subprocesses are cleaned up for p in self.subprocesses: p.terminate() del p del self.subprocesses[:] # Ensure any forked processes are cleaned up for pid in self.forkedProcessPids: if os.path.exists("/proc/" + str(pid)): os.kill(pid, signal.SIGTERM)

Hide Details

Hide Details

Adding tearDown hook: def shutdown_debug_monitor(): try: server.terminate() except: logger.warning( "failed to terminate server for debug monitor: {}; ignoring".format( sys.exc_info()[0]))

Hide Details

Hide Details

Adding tearDown hook: def shutdown_socket(): if sock: try: # send the kill packet so lldb-server shuts down gracefully sock.sendall(GdbRemoteTestCaseBase._GDBREMOTE_KILL_PACKET) except: logger.warning( "failed to send kill packet to debug monitor: {}; ignoring".format( sys.exc_info()[0]))

Hide Details

try: sock.close() except: logger.warning( "failed to close socket to debug monitor: {}; ignoring".format( sys.exc_info()[0]))

Hide Details

Hide Details

Executing tearDown hook: def shutdown_socket(): if sock: try: # send the kill packet so lldb-server shuts down gracefully sock.sendall(GdbRemoteTestCaseBase._GDBREMOTE_KILL_PACKET) except: logger.warning( "failed to send kill packet to debug monitor: {}; ignoring".format( sys.exc_info()[0]))

Hide Details

try: sock.close() except: logger.warning( "failed to close socket to debug monitor: {}; ignoring".format( sys.exc_info()[0]))

Hide Details

Hide Details

2019-12-05 21:48:25,837 WARNING failed to send kill packet to debug monitor: <class 'TypeError'>; ignoring Executing tearDown hook: def shutdown_debug_monitor(): try: server.terminate() except: logger.warning( "failed to terminate server for debug monitor: {}; ignoring".format( sys.exc_info()[0]))

Hide Details

Hide Details

Executing tearDown hook: def cleanupSubprocesses(self): # Ensure any subprocesses are cleaned up for p in self.subprocesses: p.terminate() del p del self.subprocesses[:] # Ensure any forked processes are cleaned up for pid in self.forkedProcessPids: if os.path.exists("/proc/" + str(pid)): os.kill(pid, signal.SIGTERM)

Hide Details

Hide Details

Executing tearDown hook: def shutdown_named_pipe(): # Close the pipe. try: named_pipe.close() except: print("failed to close named pipe") None

Hide Details

# Delete the pipe. try: os.remove(named_pipe_path) except: print("failed to delete named pipe: {}".format(named_pipe_path)) None

Hide Details

# Delete the temp directory. try: os.rmdir(temp_dir) except: print( "failed to delete temp dir: {}, directory contents: '{}'".format( temp_dir, os.listdir(temp_dir))) None

Hide Details

Hide Details

PASS: LLDB (/Users/buildslave/jenkins/workspace/lldb-cmake-sanitized/lldb-build/bin/clang-10-x86_64) :: test_qMemoryRegionInfo_reports_code_address_as_executable_debugserver (TestLldbGdbServer.LldbGdbServerTestCase) runCmd: settings set symbols.enable-external-lookup false output:

Hide Details

runCmd: settings set plugin.process.gdb-remote.packet-timeout 60 output:

Hide Details

runCmd: settings set symbols.clang-modules-cache-path "/Users/buildslave/jenkins/workspace/lldb-cmake-sanitized/lldb-build/lldb-test-build.noindex/module-cache-lldb/lldb-api" output:

Hide Details

runCmd: settings set use-color false output:

Hide Details

UNSUPPORTED: LLDB (/Users/buildslave/jenkins/workspace/lldb-cmake-sanitized/lldb-build/bin/clang-10-x86_64) :: test_qMemoryRegionInfo_reports_code_address_as_executable_llgs (TestLldbGdbServer.LldbGdbServerTestCase) (llgs tests) runCmd: settings set symbols.enable-external-lookup false output:

Hide Details

runCmd: settings set plugin.process.gdb-remote.packet-timeout 60 output:

Hide Details

runCmd: settings set symbols.clang-modules-cache-path "/Users/buildslave/jenkins/workspace/lldb-cmake-sanitized/lldb-build/lldb-test-build.noindex/module-cache-lldb/lldb-api" output:

Hide Details

runCmd: settings set use-color false output:

Hide Details

Adding tearDown hook: def shutdown_named_pipe(): # Close the pipe. try: named_pipe.close() except: print("failed to close named pipe") None

Hide Details

# Delete the pipe. try: os.remove(named_pipe_path) except: print("failed to delete named pipe: {}".format(named_pipe_path)) None

Hide Details

# Delete the temp directory. try: os.rmdir(temp_dir) except: print( "failed to delete temp dir: {}, directory contents: '{}'".format( temp_dir, os.listdir(temp_dir))) None

Hide Details

Hide Details

Adding tearDown hook: def cleanupSubprocesses(self): # Ensure any subprocesses are cleaned up for p in self.subprocesses: p.terminate() del p del self.subprocesses[:] # Ensure any forked processes are cleaned up for pid in self.forkedProcessPids: if os.path.exists("/proc/" + str(pid)): os.kill(pid, signal.SIGTERM)

Hide Details

Hide Details

Adding tearDown hook: def shutdown_debug_monitor(): try: server.terminate() except: logger.warning( "failed to terminate server for debug monitor: {}; ignoring".format( sys.exc_info()[0]))

Hide Details

Hide Details

Adding tearDown hook: def shutdown_socket(): if sock: try: # send the kill packet so lldb-server shuts down gracefully sock.sendall(GdbRemoteTestCaseBase._GDBREMOTE_KILL_PACKET) except: logger.warning( "failed to send kill packet to debug monitor: {}; ignoring".format( sys.exc_info()[0]))

Hide Details

try: sock.close() except: logger.warning( "failed to close socket to debug monitor: {}; ignoring".format( sys.exc_info()[0]))

Hide Details

Hide Details

Executing tearDown hook: def shutdown_socket(): if sock: try: # send the kill packet so lldb-server shuts down gracefully sock.sendall(GdbRemoteTestCaseBase._GDBREMOTE_KILL_PACKET) except: logger.warning( "failed to send kill packet to debug monitor: {}; ignoring".format( sys.exc_info()[0]))

Hide Details

try: sock.close() except: logger.warning( "failed to close socket to debug monitor: {}; ignoring".format( sys.exc_info()[0]))

Hide Details

Hide Details

2019-12-05 21:48:52,853 WARNING failed to send kill packet to debug monitor: <class 'TypeError'>; ignoring Executing tearDown hook: def shutdown_debug_monitor(): try: server.terminate() except: logger.warning( "failed to terminate server for debug monitor: {}; ignoring".format( sys.exc_info()[0]))

Hide Details

Hide Details

Executing tearDown hook: def cleanupSubprocesses(self): # Ensure any subprocesses are cleaned up for p in self.subprocesses: p.terminate() del p del self.subprocesses[:] # Ensure any forked processes are cleaned up for pid in self.forkedProcessPids: if os.path.exists("/proc/" + str(pid)): os.kill(pid, signal.SIGTERM)

Hide Details

Hide Details

Executing tearDown hook: def shutdown_named_pipe(): # Close the pipe. try: named_pipe.close() except: print("failed to close named pipe") None

Hide Details

# Delete the pipe. try: os.remove(named_pipe_path) except: print("failed to delete named pipe: {}".format(named_pipe_path)) None

Hide Details

# Delete the temp directory. try: os.rmdir(temp_dir) except: print( "failed to delete temp dir: {}, directory contents: '{}'".format( temp_dir, os.listdir(temp_dir))) None

Hide Details

Hide Details

PASS: LLDB (/Users/buildslave/jenkins/workspace/lldb-cmake-sanitized/lldb-build/bin/clang-10-x86_64) :: test_qMemoryRegionInfo_reports_heap_address_as_readable_writeable_debugserver (TestLldbGdbServer.LldbGdbServerTestCase) runCmd: settings set symbols.enable-external-lookup false output:

Hide Details

runCmd: settings set plugin.process.gdb-remote.packet-timeout 60 output:

Hide Details

runCmd: settings set symbols.clang-modules-cache-path "/Users/buildslave/jenkins/workspace/lldb-cmake-sanitized/lldb-build/lldb-test-build.noindex/module-cache-lldb/lldb-api" output:

Hide Details

runCmd: settings set use-color false output:

Hide Details

UNSUPPORTED: LLDB (/Users/buildslave/jenkins/workspace/lldb-cmake-sanitized/lldb-build/bin/clang-10-x86_64) :: test_qMemoryRegionInfo_reports_heap_address_as_readable_writeable_llgs (TestLldbGdbServer.LldbGdbServerTestCase) (llgs tests) runCmd: settings set symbols.enable-external-lookup false output:

Hide Details

runCmd: settings set plugin.process.gdb-remote.packet-timeout 60 output:

Hide Details

runCmd: settings set symbols.clang-modules-cache-path "/Users/buildslave/jenkins/workspace/lldb-cmake-sanitized/lldb-build/lldb-test-build.noindex/module-cache-lldb/lldb-api" output:

Hide Details

runCmd: settings set use-color false output:

Hide Details

Adding tearDown hook: def shutdown_named_pipe(): # Close the pipe. try: named_pipe.close() except: print("failed to close named pipe") None

Hide Details

# Delete the pipe. try: os.remove(named_pipe_path) except: print("failed to delete named pipe: {}".format(named_pipe_path)) None

Hide Details

# Delete the temp directory. try: os.rmdir(temp_dir) except: print( "failed to delete temp dir: {}, directory contents: '{}'".format( temp_dir, os.listdir(temp_dir))) None

Hide Details

Hide Details

Adding tearDown hook: def cleanupSubprocesses(self): # Ensure any subprocesses are cleaned up for p in self.subprocesses: p.terminate() del p del self.subprocesses[:] # Ensure any forked processes are cleaned up for pid in self.forkedProcessPids: if os.path.exists("/proc/" + str(pid)): os.kill(pid, signal.SIGTERM)

Hide Details

Hide Details

Adding tearDown hook: def shutdown_debug_monitor(): try: server.terminate() except: logger.warning( "failed to terminate server for debug monitor: {}; ignoring".format( sys.exc_info()[0]))

Hide Details

Hide Details

Adding tearDown hook: def shutdown_socket(): if sock: try: # send the kill packet so lldb-server shuts down gracefully sock.sendall(GdbRemoteTestCaseBase._GDBREMOTE_KILL_PACKET) except: logger.warning( "failed to send kill packet to debug monitor: {}; ignoring".format( sys.exc_info()[0]))

Hide Details

try: sock.close() except: logger.warning( "failed to close socket to debug monitor: {}; ignoring".format( sys.exc_info()[0]))

Hide Details

Hide Details

Executing tearDown hook: def shutdown_socket(): if sock: try: # send the kill packet so lldb-server shuts down gracefully sock.sendall(GdbRemoteTestCaseBase._GDBREMOTE_KILL_PACKET) except: logger.warning( "failed to send kill packet to debug monitor: {}; ignoring".format( sys.exc_info()[0]))

Hide Details

try: sock.close() except: logger.warning( "failed to close socket to debug monitor: {}; ignoring".format( sys.exc_info()[0]))

Hide Details

Hide Details

2019-12-05 21:49:19,531 WARNING failed to send kill packet to debug monitor: <class 'TypeError'>; ignoring Executing tearDown hook: def shutdown_debug_monitor(): try: server.terminate() except: logger.warning( "failed to terminate server for debug monitor: {}; ignoring".format( sys.exc_info()[0]))

Hide Details

Hide Details

Executing tearDown hook: def cleanupSubprocesses(self): # Ensure any subprocesses are cleaned up for p in self.subprocesses: p.terminate() del p del self.subprocesses[:] # Ensure any forked processes are cleaned up for pid in self.forkedProcessPids: if os.path.exists("/proc/" + str(pid)): os.kill(pid, signal.SIGTERM)

Hide Details

Hide Details

Executing tearDown hook: def shutdown_named_pipe(): # Close the pipe. try: named_pipe.close() except: print("failed to close named pipe") None

Hide Details

# Delete the pipe. try: os.remove(named_pipe_path) except: print("failed to delete named pipe: {}".format(named_pipe_path)) None

Hide Details

# Delete the temp directory. try: os.rmdir(temp_dir) except: print( "failed to delete temp dir: {}, directory contents: '{}'".format( temp_dir, os.listdir(temp_dir))) None

Hide Details

Hide Details

PASS: LLDB (/Users/buildslave/jenkins/workspace/lldb-cmake-sanitized/lldb-build/bin/clang-10-x86_64) :: test_qMemoryRegionInfo_reports_stack_address_as_readable_writeable_debugserver (TestLldbGdbServer.LldbGdbServerTestCase) runCmd: settings set symbols.enable-external-lookup false output:

Hide Details

runCmd: settings set plugin.process.gdb-remote.packet-timeout 60 output:

Hide Details

runCmd: settings set symbols.clang-modules-cache-path "/Users/buildslave/jenkins/workspace/lldb-cmake-sanitized/lldb-build/lldb-test-build.noindex/module-cache-lldb/lldb-api" output:

Hide Details

runCmd: settings set use-color false output:

Hide Details

UNSUPPORTED: LLDB (/Users/buildslave/jenkins/workspace/lldb-cmake-sanitized/lldb-build/bin/clang-10-x86_64) :: test_qMemoryRegionInfo_reports_stack_address_as_readable_writeable_llgs (TestLldbGdbServer.LldbGdbServerTestCase) (llgs tests) runCmd: settings set symbols.enable-external-lookup false output:

Hide Details

runCmd: settings set plugin.process.gdb-remote.packet-timeout 60 output:

Hide Details

runCmd: settings set symbols.clang-modules-cache-path "/Users/buildslave/jenkins/workspace/lldb-cmake-sanitized/lldb-build/lldb-test-build.noindex/module-cache-lldb/lldb-api" output:

Hide Details

runCmd: settings set use-color false output:

Hide Details

Adding tearDown hook: def shutdown_named_pipe(): # Close the pipe. try: named_pipe.close() except: print("failed to close named pipe") None

Hide Details

# Delete the pipe. try: os.remove(named_pipe_path) except: print("failed to delete named pipe: {}".format(named_pipe_path)) None

Hide Details

# Delete the temp directory. try: os.rmdir(temp_dir) except: print( "failed to delete temp dir: {}, directory contents: '{}'".format( temp_dir, os.listdir(temp_dir))) None

Hide Details

Hide Details

Adding tearDown hook: def cleanupSubprocesses(self): # Ensure any subprocesses are cleaned up for p in self.subprocesses: p.terminate() del p del self.subprocesses[:] # Ensure any forked processes are cleaned up for pid in self.forkedProcessPids: if os.path.exists("/proc/" + str(pid)): os.kill(pid, signal.SIGTERM)

Hide Details

Hide Details

Adding tearDown hook: def shutdown_debug_monitor(): try: server.terminate() except: logger.warning( "failed to terminate server for debug monitor: {}; ignoring".format( sys.exc_info()[0]))

Hide Details

Hide Details

Adding tearDown hook: def shutdown_socket(): if sock: try: # send the kill packet so lldb-server shuts down gracefully sock.sendall(GdbRemoteTestCaseBase._GDBREMOTE_KILL_PACKET) except: logger.warning( "failed to send kill packet to debug monitor: {}; ignoring".format( sys.exc_info()[0]))

Hide Details

try: sock.close() except: logger.warning( "failed to close socket to debug monitor: {}; ignoring".format( sys.exc_info()[0]))

Hide Details

Hide Details

Executing tearDown hook: def shutdown_socket(): if sock: try: # send the kill packet so lldb-server shuts down gracefully sock.sendall(GdbRemoteTestCaseBase._GDBREMOTE_KILL_PACKET) except: logger.warning( "failed to send kill packet to debug monitor: {}; ignoring".format( sys.exc_info()[0]))

Hide Details

try: sock.close() except: logger.warning( "failed to close socket to debug monitor: {}; ignoring".format( sys.exc_info()[0]))

Hide Details

Hide Details

2019-12-05 21:49:45,825 WARNING failed to send kill packet to debug monitor: <class 'TypeError'>; ignoring Executing tearDown hook: def shutdown_debug_monitor(): try: server.terminate() except: logger.warning( "failed to terminate server for debug monitor: {}; ignoring".format( sys.exc_info()[0]))

Hide Details

Hide Details

Executing tearDown hook: def cleanupSubprocesses(self): # Ensure any subprocesses are cleaned up for p in self.subprocesses: p.terminate() del p del self.subprocesses[:] # Ensure any forked processes are cleaned up for pid in self.forkedProcessPids: if os.path.exists("/proc/" + str(pid)): os.kill(pid, signal.SIGTERM)

Hide Details

Hide Details

Executing tearDown hook: def shutdown_named_pipe(): # Close the pipe. try: named_pipe.close() except: print("failed to close named pipe") None

Hide Details

# Delete the pipe. try: os.remove(named_pipe_path) except: print("failed to delete named pipe: {}".format(named_pipe_path)) None

Hide Details

# Delete the temp directory. try: os.rmdir(temp_dir) except: print( "failed to delete temp dir: {}, directory contents: '{}'".format( temp_dir, os.listdir(temp_dir))) None

Hide Details

Hide Details

PASS: LLDB (/Users/buildslave/jenkins/workspace/lldb-cmake-sanitized/lldb-build/bin/clang-10-x86_64) :: test_qRegisterInfo_contains_at_least_one_register_set_debugserver (TestLldbGdbServer.LldbGdbServerTestCase) runCmd: settings set symbols.enable-external-lookup false output:

Hide Details

runCmd: settings set plugin.process.gdb-remote.packet-timeout 60 output:

Hide Details

runCmd: settings set symbols.clang-modules-cache-path "/Users/buildslave/jenkins/workspace/lldb-cmake-sanitized/lldb-build/lldb-test-build.noindex/module-cache-lldb/lldb-api" output:

Hide Details

runCmd: settings set use-color false output:

Hide Details

UNSUPPORTED: LLDB (/Users/buildslave/jenkins/workspace/lldb-cmake-sanitized/lldb-build/bin/clang-10-x86_64) :: test_qRegisterInfo_contains_at_least_one_register_set_llgs (TestLldbGdbServer.LldbGdbServerTestCase) (llgs tests) runCmd: settings set symbols.enable-external-lookup false output:

Hide Details

runCmd: settings set plugin.process.gdb-remote.packet-timeout 60 output:

Hide Details

runCmd: settings set symbols.clang-modules-cache-path "/Users/buildslave/jenkins/workspace/lldb-cmake-sanitized/lldb-build/lldb-test-build.noindex/module-cache-lldb/lldb-api" output:

Hide Details

runCmd: settings set use-color false output:

Hide Details

UNSUPPORTED: LLDB (/Users/buildslave/jenkins/workspace/lldb-cmake-sanitized/lldb-build/bin/clang-10-x86_64) :: test_qRegisterInfo_contains_avx_registers_llgs (TestLldbGdbServer.LldbGdbServerTestCase) (llgs tests) runCmd: settings set symbols.enable-external-lookup false output:

Hide Details

runCmd: settings set plugin.process.gdb-remote.packet-timeout 60 output:

Hide Details

runCmd: settings set symbols.clang-modules-cache-path "/Users/buildslave/jenkins/workspace/lldb-cmake-sanitized/lldb-build/lldb-test-build.noindex/module-cache-lldb/lldb-api" output:

Hide Details

runCmd: settings set use-color false output:

Hide Details

Adding tearDown hook: def shutdown_named_pipe(): # Close the pipe. try: named_pipe.close() except: print("failed to close named pipe") None

Hide Details

# Delete the pipe. try: os.remove(named_pipe_path) except: print("failed to delete named pipe: {}".format(named_pipe_path)) None

Hide Details

# Delete the temp directory. try: os.rmdir(temp_dir) except: print( "failed to delete temp dir: {}, directory contents: '{}'".format( temp_dir, os.listdir(temp_dir))) None

Hide Details

Hide Details

Adding tearDown hook: def cleanupSubprocesses(self): # Ensure any subprocesses are cleaned up for p in self.subprocesses: p.terminate() del p del self.subprocesses[:] # Ensure any forked processes are cleaned up for pid in self.forkedProcessPids: if os.path.exists("/proc/" + str(pid)): os.kill(pid, signal.SIGTERM)

Hide Details

Hide Details

Adding tearDown hook: def shutdown_debug_monitor(): try: server.terminate() except: logger.warning( "failed to terminate server for debug monitor: {}; ignoring".format( sys.exc_info()[0]))

Hide Details

Hide Details

Adding tearDown hook: def shutdown_socket(): if sock: try: # send the kill packet so lldb-server shuts down gracefully sock.sendall(GdbRemoteTestCaseBase._GDBREMOTE_KILL_PACKET) except: logger.warning( "failed to send kill packet to debug monitor: {}; ignoring".format( sys.exc_info()[0]))

Hide Details

try: sock.close() except: logger.warning( "failed to close socket to debug monitor: {}; ignoring".format( sys.exc_info()[0]))

Hide Details

Hide Details

Executing tearDown hook: def shutdown_socket(): if sock: try: # send the kill packet so lldb-server shuts down gracefully sock.sendall(GdbRemoteTestCaseBase._GDBREMOTE_KILL_PACKET) except: logger.warning( "failed to send kill packet to debug monitor: {}; ignoring".format( sys.exc_info()[0]))

Hide Details

try: sock.close() except: logger.warning( "failed to close socket to debug monitor: {}; ignoring".format( sys.exc_info()[0]))

Hide Details

Hide Details

2019-12-05 21:50:11,114 WARNING failed to send kill packet to debug monitor: <class 'TypeError'>; ignoring Executing tearDown hook: def shutdown_debug_monitor(): try: server.terminate() except: logger.warning( "failed to terminate server for debug monitor: {}; ignoring".format( sys.exc_info()[0]))

Hide Details

Hide Details

Executing tearDown hook: def cleanupSubprocesses(self): # Ensure any subprocesses are cleaned up for p in self.subprocesses: p.terminate() del p del self.subprocesses[:] # Ensure any forked processes are cleaned up for pid in self.forkedProcessPids: if os.path.exists("/proc/" + str(pid)): os.kill(pid, signal.SIGTERM)

Hide Details

Hide Details

Executing tearDown hook: def shutdown_named_pipe(): # Close the pipe. try: named_pipe.close() except: print("failed to close named pipe") None

Hide Details

# Delete the pipe. try: os.remove(named_pipe_path) except: print("failed to delete named pipe: {}".format(named_pipe_path)) None

Hide Details

# Delete the temp directory. try: os.rmdir(temp_dir) except: print( "failed to delete temp dir: {}, directory contents: '{}'".format( temp_dir, os.listdir(temp_dir))) None

Hide Details

Hide Details

PASS: LLDB (/Users/buildslave/jenkins/workspace/lldb-cmake-sanitized/lldb-build/bin/clang-10-x86_64) :: test_qRegisterInfo_contains_required_generics_debugserver (TestLldbGdbServer.LldbGdbServerTestCase) runCmd: settings set symbols.enable-external-lookup false output:

Hide Details

runCmd: settings set plugin.process.gdb-remote.packet-timeout 60 output:

Hide Details

runCmd: settings set symbols.clang-modules-cache-path "/Users/buildslave/jenkins/workspace/lldb-cmake-sanitized/lldb-build/lldb-test-build.noindex/module-cache-lldb/lldb-api" output:

Hide Details

runCmd: settings set use-color false output:

Hide Details

UNSUPPORTED: LLDB (/Users/buildslave/jenkins/workspace/lldb-cmake-sanitized/lldb-build/bin/clang-10-x86_64) :: test_qRegisterInfo_contains_required_generics_llgs (TestLldbGdbServer.LldbGdbServerTestCase) (llgs tests) runCmd: settings set symbols.enable-external-lookup false output:

Hide Details

runCmd: settings set plugin.process.gdb-remote.packet-timeout 60 output:

Hide Details

runCmd: settings set symbols.clang-modules-cache-path "/Users/buildslave/jenkins/workspace/lldb-cmake-sanitized/lldb-build/lldb-test-build.noindex/module-cache-lldb/lldb-api" output:

Hide Details

runCmd: settings set use-color false output:

Hide Details

Adding tearDown hook: def shutdown_named_pipe(): # Close the pipe. try: named_pipe.close() except: print("failed to close named pipe") None

Hide Details

# Delete the pipe. try: os.remove(named_pipe_path) except: print("failed to delete named pipe: {}".format(named_pipe_path)) None

Hide Details

# Delete the temp directory. try: os.rmdir(temp_dir) except: print( "failed to delete temp dir: {}, directory contents: '{}'".format( temp_dir, os.listdir(temp_dir))) None

Hide Details

Hide Details

Adding tearDown hook: def cleanupSubprocesses(self): # Ensure any subprocesses are cleaned up for p in self.subprocesses: p.terminate() del p del self.subprocesses[:] # Ensure any forked processes are cleaned up for pid in self.forkedProcessPids: if os.path.exists("/proc/" + str(pid)): os.kill(pid, signal.SIGTERM)

Hide Details

Hide Details

Adding tearDown hook: def shutdown_debug_monitor(): try: server.terminate() except: logger.warning( "failed to terminate server for debug monitor: {}; ignoring".format( sys.exc_info()[0]))

Hide Details

Hide Details

Adding tearDown hook: def shutdown_socket(): if sock: try: # send the kill packet so lldb-server shuts down gracefully sock.sendall(GdbRemoteTestCaseBase._GDBREMOTE_KILL_PACKET) except: logger.warning( "failed to send kill packet to debug monitor: {}; ignoring".format( sys.exc_info()[0]))

Hide Details

try: sock.close() except: logger.warning( "failed to close socket to debug monitor: {}; ignoring".format( sys.exc_info()[0]))

Hide Details

Hide Details

Executing tearDown hook: def shutdown_socket(): if sock: try: # send the kill packet so lldb-server shuts down gracefully sock.sendall(GdbRemoteTestCaseBase._GDBREMOTE_KILL_PACKET) except: logger.warning( "failed to send kill packet to debug monitor: {}; ignoring".format( sys.exc_info()[0]))

Hide Details

try: sock.close() except: logger.warning( "failed to close socket to debug monitor: {}; ignoring".format( sys.exc_info()[0]))

Hide Details

Hide Details

2019-12-05 21:50:38,332 WARNING failed to send kill packet to debug monitor: <class 'TypeError'>; ignoring Executing tearDown hook: def shutdown_debug_monitor(): try: server.terminate() except: logger.warning( "failed to terminate server for debug monitor: {}; ignoring".format( sys.exc_info()[0]))

Hide Details

Hide Details

Executing tearDown hook: def cleanupSubprocesses(self): # Ensure any subprocesses are cleaned up for p in self.subprocesses: p.terminate() del p del self.subprocesses[:] # Ensure any forked processes are cleaned up for pid in self.forkedProcessPids: if os.path.exists("/proc/" + str(pid)): os.kill(pid, signal.SIGTERM)

Hide Details

Hide Details

Executing tearDown hook: def shutdown_named_pipe(): # Close the pipe. try: named_pipe.close() except: print("failed to close named pipe") None

Hide Details

# Delete the pipe. try: os.remove(named_pipe_path) except: print("failed to delete named pipe: {}".format(named_pipe_path)) None

Hide Details

# Delete the temp directory. try: os.rmdir(temp_dir) except: print( "failed to delete temp dir: {}, directory contents: '{}'".format( temp_dir, os.listdir(temp_dir))) None

Hide Details

Hide Details

PASS: LLDB (/Users/buildslave/jenkins/workspace/lldb-cmake-sanitized/lldb-build/bin/clang-10-x86_64) :: test_qRegisterInfo_returns_all_valid_results_debugserver (TestLldbGdbServer.LldbGdbServerTestCase) runCmd: settings set symbols.enable-external-lookup false output:

Hide Details

runCmd: settings set plugin.process.gdb-remote.packet-timeout 60 output:

Hide Details

runCmd: settings set symbols.clang-modules-cache-path "/Users/buildslave/jenkins/workspace/lldb-cmake-sanitized/lldb-build/lldb-test-build.noindex/module-cache-lldb/lldb-api" output:

Hide Details

runCmd: settings set use-color false output:

Hide Details

UNSUPPORTED: LLDB (/Users/buildslave/jenkins/workspace/lldb-cmake-sanitized/lldb-build/bin/clang-10-x86_64) :: test_qRegisterInfo_returns_all_valid_results_llgs (TestLldbGdbServer.LldbGdbServerTestCase) (llgs tests) runCmd: settings set symbols.enable-external-lookup false output:

Hide Details

runCmd: settings set plugin.process.gdb-remote.packet-timeout 60 output:

Hide Details

runCmd: settings set symbols.clang-modules-cache-path "/Users/buildslave/jenkins/workspace/lldb-cmake-sanitized/lldb-build/lldb-test-build.noindex/module-cache-lldb/lldb-api" output:

Hide Details

runCmd: settings set use-color false output:

Hide Details

Adding tearDown hook: def shutdown_named_pipe(): # Close the pipe. try: named_pipe.close() except: print("failed to close named pipe") None

Hide Details

# Delete the pipe. try: os.remove(named_pipe_path) except: print("failed to delete named pipe: {}".format(named_pipe_path)) None

Hide Details

# Delete the temp directory. try: os.rmdir(temp_dir) except: print( "failed to delete temp dir: {}, directory contents: '{}'".format( temp_dir, os.listdir(temp_dir))) None

Hide Details

Hide Details

Adding tearDown hook: def cleanupSubprocesses(self): # Ensure any subprocesses are cleaned up for p in self.subprocesses: p.terminate() del p del self.subprocesses[:] # Ensure any forked processes are cleaned up for pid in self.forkedProcessPids: if os.path.exists("/proc/" + str(pid)): os.kill(pid, signal.SIGTERM)

Hide Details

Hide Details

Adding tearDown hook: def shutdown_debug_monitor(): try: server.terminate() except: logger.warning( "failed to terminate server for debug monitor: {}; ignoring".format( sys.exc_info()[0]))

Hide Details

Hide Details

Adding tearDown hook: def shutdown_socket(): if sock: try: # send the kill packet so lldb-server shuts down gracefully sock.sendall(GdbRemoteTestCaseBase._GDBREMOTE_KILL_PACKET) except: logger.warning( "failed to send kill packet to debug monitor: {}; ignoring".format( sys.exc_info()[0]))

Hide Details

try: sock.close() except: logger.warning( "failed to close socket to debug monitor: {}; ignoring".format( sys.exc_info()[0]))

Hide Details

Hide Details

Executing tearDown hook: def shutdown_socket(): if sock: try: # send the kill packet so lldb-server shuts down gracefully sock.sendall(GdbRemoteTestCaseBase._GDBREMOTE_KILL_PACKET) except: logger.warning( "failed to send kill packet to debug monitor: {}; ignoring".format( sys.exc_info()[0]))

Hide Details

try: sock.close() except: logger.warning( "failed to close socket to debug monitor: {}; ignoring".format( sys.exc_info()[0]))

Hide Details

Hide Details

2019-12-05 21:51:04,423 WARNING failed to send kill packet to debug monitor: <class 'TypeError'>; ignoring Executing tearDown hook: def shutdown_debug_monitor(): try: server.terminate() except: logger.warning( "failed to terminate server for debug monitor: {}; ignoring".format( sys.exc_info()[0]))

Hide Details

Hide Details

Executing tearDown hook: def cleanupSubprocesses(self): # Ensure any subprocesses are cleaned up for p in self.subprocesses: p.terminate() del p del self.subprocesses[:] # Ensure any forked processes are cleaned up for pid in self.forkedProcessPids: if os.path.exists("/proc/" + str(pid)): os.kill(pid, signal.SIGTERM)

Hide Details

Hide Details

Executing tearDown hook: def shutdown_named_pipe(): # Close the pipe. try: named_pipe.close() except: print("failed to close named pipe") None

Hide Details

# Delete the pipe. try: os.remove(named_pipe_path) except: print("failed to delete named pipe: {}".format(named_pipe_path)) None

Hide Details

# Delete the temp directory. try: os.rmdir(temp_dir) except: print( "failed to delete temp dir: {}, directory contents: '{}'".format( temp_dir, os.listdir(temp_dir))) None

Hide Details

Hide Details

PASS: LLDB (/Users/buildslave/jenkins/workspace/lldb-cmake-sanitized/lldb-build/bin/clang-10-x86_64) :: test_qRegisterInfo_returns_one_valid_result_debugserver (TestLldbGdbServer.LldbGdbServerTestCase) runCmd: settings set symbols.enable-external-lookup false output:

Hide Details

runCmd: settings set plugin.process.gdb-remote.packet-timeout 60 output:

Hide Details

runCmd: settings set symbols.clang-modules-cache-path "/Users/buildslave/jenkins/workspace/lldb-cmake-sanitized/lldb-build/lldb-test-build.noindex/module-cache-lldb/lldb-api" output:

Hide Details

runCmd: settings set use-color false output:

Hide Details

UNSUPPORTED: LLDB (/Users/buildslave/jenkins/workspace/lldb-cmake-sanitized/lldb-build/bin/clang-10-x86_64) :: test_qRegisterInfo_returns_one_valid_result_llgs (TestLldbGdbServer.LldbGdbServerTestCase) (llgs tests) runCmd: settings set symbols.enable-external-lookup false output:

Hide Details

runCmd: settings set plugin.process.gdb-remote.packet-timeout 60 output:

Hide Details

runCmd: settings set symbols.clang-modules-cache-path "/Users/buildslave/jenkins/workspace/lldb-cmake-sanitized/lldb-build/lldb-test-build.noindex/module-cache-lldb/lldb-api" output:

Hide Details

runCmd: settings set use-color false output:

Hide Details

Adding tearDown hook: def shutdown_named_pipe(): # Close the pipe. try: named_pipe.close() except: print("failed to close named pipe") None

Hide Details

# Delete the pipe. try: os.remove(named_pipe_path) except: print("failed to delete named pipe: {}".format(named_pipe_path)) None

Hide Details

# Delete the temp directory. try: os.rmdir(temp_dir) except: print( "failed to delete temp dir: {}, directory contents: '{}'".format( temp_dir, os.listdir(temp_dir))) None

Hide Details

Hide Details

Adding tearDown hook: def cleanupSubprocesses(self): # Ensure any subprocesses are cleaned up for p in self.subprocesses: p.terminate() del p del self.subprocesses[:] # Ensure any forked processes are cleaned up for pid in self.forkedProcessPids: if os.path.exists("/proc/" + str(pid)): os.kill(pid, signal.SIGTERM)

Hide Details

Hide Details

Adding tearDown hook: def shutdown_debug_monitor(): try: server.terminate() except: logger.warning( "failed to terminate server for debug monitor: {}; ignoring".format( sys.exc_info()[0]))

Hide Details

Hide Details

Adding tearDown hook: def shutdown_socket(): if sock: try: # send the kill packet so lldb-server shuts down gracefully sock.sendall(GdbRemoteTestCaseBase._GDBREMOTE_KILL_PACKET) except: logger.warning( "failed to send kill packet to debug monitor: {}; ignoring".format( sys.exc_info()[0]))

Hide Details

try: sock.close() except: logger.warning( "failed to close socket to debug monitor: {}; ignoring".format( sys.exc_info()[0]))

Hide Details

Hide Details

Executing tearDown hook: def shutdown_socket(): if sock: try: # send the kill packet so lldb-server shuts down gracefully sock.sendall(GdbRemoteTestCaseBase._GDBREMOTE_KILL_PACKET) except: logger.warning( "failed to send kill packet to debug monitor: {}; ignoring".format( sys.exc_info()[0]))

Hide Details

try: sock.close() except: logger.warning( "failed to close socket to debug monitor: {}; ignoring".format( sys.exc_info()[0]))

Hide Details

Hide Details

2019-12-05 21:51:33,817 WARNING failed to send kill packet to debug monitor: <class 'TypeError'>; ignoring Executing tearDown hook: def shutdown_debug_monitor(): try: server.terminate() except: logger.warning( "failed to terminate server for debug monitor: {}; ignoring".format( sys.exc_info()[0]))

Hide Details

Hide Details

Executing tearDown hook: def cleanupSubprocesses(self): # Ensure any subprocesses are cleaned up for p in self.subprocesses: p.terminate() del p del self.subprocesses[:] # Ensure any forked processes are cleaned up for pid in self.forkedProcessPids: if os.path.exists("/proc/" + str(pid)): os.kill(pid, signal.SIGTERM)

Hide Details

Hide Details

Executing tearDown hook: def shutdown_named_pipe(): # Close the pipe. try: named_pipe.close() except: print("failed to close named pipe") None

Hide Details

# Delete the pipe. try: os.remove(named_pipe_path) except: print("failed to delete named pipe: {}".format(named_pipe_path)) None

Hide Details

# Delete the temp directory. try: os.rmdir(temp_dir) except: print( "failed to delete temp dir: {}, directory contents: '{}'".format( temp_dir, os.listdir(temp_dir))) None

Hide Details

Hide Details

PASS: LLDB (/Users/buildslave/jenkins/workspace/lldb-cmake-sanitized/lldb-build/bin/clang-10-x86_64) :: test_qSupported_returns_known_stub_features_debugserver (TestLldbGdbServer.LldbGdbServerTestCase) runCmd: settings set symbols.enable-external-lookup false output:

Hide Details

runCmd: settings set plugin.process.gdb-remote.packet-timeout 60 output:

Hide Details

runCmd: settings set symbols.clang-modules-cache-path "/Users/buildslave/jenkins/workspace/lldb-cmake-sanitized/lldb-build/lldb-test-build.noindex/module-cache-lldb/lldb-api" output:

Hide Details

runCmd: settings set use-color false output:

Hide Details

UNSUPPORTED: LLDB (/Users/buildslave/jenkins/workspace/lldb-cmake-sanitized/lldb-build/bin/clang-10-x86_64) :: test_qSupported_returns_known_stub_features_llgs (TestLldbGdbServer.LldbGdbServerTestCase) (llgs tests) runCmd: settings set symbols.enable-external-lookup false output:

Hide Details

runCmd: settings set plugin.process.gdb-remote.packet-timeout 60 output:

Hide Details

runCmd: settings set symbols.clang-modules-cache-path "/Users/buildslave/jenkins/workspace/lldb-cmake-sanitized/lldb-build/lldb-test-build.noindex/module-cache-lldb/lldb-api" output:

Hide Details

runCmd: settings set use-color false output:

Hide Details

Adding tearDown hook: def shutdown_named_pipe(): # Close the pipe. try: named_pipe.close() except: print("failed to close named pipe") None

Hide Details

# Delete the pipe. try: os.remove(named_pipe_path) except: print("failed to delete named pipe: {}".format(named_pipe_path)) None

Hide Details

# Delete the temp directory. try: os.rmdir(temp_dir) except: print( "failed to delete temp dir: {}, directory contents: '{}'".format( temp_dir, os.listdir(temp_dir))) None

Hide Details

Hide Details

Adding tearDown hook: def shutdown_process_for_attach(): try: inferior.terminate() except: logger.warning( "failed to terminate inferior process for attach: {}; ignoring".format( sys.exc_info()[0]))

Hide Details

Hide Details

Adding tearDown hook: def cleanupSubprocesses(self): # Ensure any subprocesses are cleaned up for p in self.subprocesses: p.terminate() del p del self.subprocesses[:] # Ensure any forked processes are cleaned up for pid in self.forkedProcessPids: if os.path.exists("/proc/" + str(pid)): os.kill(pid, signal.SIGTERM)

Hide Details

Hide Details

Adding tearDown hook: def shutdown_debug_monitor(): try: server.terminate() except: logger.warning( "failed to terminate server for debug monitor: {}; ignoring".format( sys.exc_info()[0]))

Hide Details

Hide Details

Adding tearDown hook: def shutdown_socket(): if sock: try: # send the kill packet so lldb-server shuts down gracefully sock.sendall(GdbRemoteTestCaseBase._GDBREMOTE_KILL_PACKET) except: logger.warning( "failed to send kill packet to debug monitor: {}; ignoring".format( sys.exc_info()[0]))

Hide Details

try: sock.close() except: logger.warning( "failed to close socket to debug monitor: {}; ignoring".format( sys.exc_info()[0]))

Hide Details

Hide Details

Executing tearDown hook: def shutdown_socket(): if sock: try: # send the kill packet so lldb-server shuts down gracefully sock.sendall(GdbRemoteTestCaseBase._GDBREMOTE_KILL_PACKET) except: logger.warning( "failed to send kill packet to debug monitor: {}; ignoring".format( sys.exc_info()[0]))

Hide Details

try: sock.close() except: logger.warning( "failed to close socket to debug monitor: {}; ignoring".format( sys.exc_info()[0]))

Hide Details

Hide Details

2019-12-05 21:52:04,144 WARNING failed to send kill packet to debug monitor: <class 'TypeError'>; ignoring Executing tearDown hook: def shutdown_debug_monitor(): try: server.terminate() except: logger.warning( "failed to terminate server for debug monitor: {}; ignoring".format( sys.exc_info()[0]))

Hide Details

Hide Details

Executing tearDown hook: def cleanupSubprocesses(self): # Ensure any subprocesses are cleaned up for p in self.subprocesses: p.terminate() del p del self.subprocesses[:] # Ensure any forked processes are cleaned up for pid in self.forkedProcessPids: if os.path.exists("/proc/" + str(pid)): os.kill(pid, signal.SIGTERM)

Hide Details

Hide Details

Executing tearDown hook: def shutdown_process_for_attach(): try: inferior.terminate() except: logger.warning( "failed to terminate inferior process for attach: {}; ignoring".format( sys.exc_info()[0]))

Hide Details

Hide Details

Executing tearDown hook: def shutdown_named_pipe(): # Close the pipe. try: named_pipe.close() except: print("failed to close named pipe") None

Hide Details

# Delete the pipe. try: os.remove(named_pipe_path) except: print("failed to delete named pipe: {}".format(named_pipe_path)) None

Hide Details

# Delete the temp directory. try: os.rmdir(temp_dir) except: print( "failed to delete temp dir: {}, directory contents: '{}'".format( temp_dir, os.listdir(temp_dir))) None

Hide Details

Hide Details

PASS: LLDB (/Users/buildslave/jenkins/workspace/lldb-cmake-sanitized/lldb-build/bin/clang-10-x86_64) :: test_qThreadInfo_contains_thread_attach_debugserver (TestLldbGdbServer.LldbGdbServerTestCase) runCmd: settings set symbols.enable-external-lookup false output:

Hide Details

runCmd: settings set plugin.process.gdb-remote.packet-timeout 60 output:

Hide Details

runCmd: settings set symbols.clang-modules-cache-path "/Users/buildslave/jenkins/workspace/lldb-cmake-sanitized/lldb-build/lldb-test-build.noindex/module-cache-lldb/lldb-api" output:

Hide Details

runCmd: settings set use-color false output:

Hide Details

UNSUPPORTED: LLDB (/Users/buildslave/jenkins/workspace/lldb-cmake-sanitized/lldb-build/bin/clang-10-x86_64) :: test_qThreadInfo_contains_thread_attach_llgs (TestLldbGdbServer.LldbGdbServerTestCase) (llgs tests) runCmd: settings set symbols.enable-external-lookup false output:

Hide Details

runCmd: settings set plugin.process.gdb-remote.packet-timeout 60 output:

Hide Details

runCmd: settings set symbols.clang-modules-cache-path "/Users/buildslave/jenkins/workspace/lldb-cmake-sanitized/lldb-build/lldb-test-build.noindex/module-cache-lldb/lldb-api" output:

Hide Details

runCmd: settings set use-color false output:

Hide Details

Adding tearDown hook: def shutdown_named_pipe(): # Close the pipe. try: named_pipe.close() except: print("failed to close named pipe") None

Hide Details

# Delete the pipe. try: os.remove(named_pipe_path) except: print("failed to delete named pipe: {}".format(named_pipe_path)) None

Hide Details

# Delete the temp directory. try: os.rmdir(temp_dir) except: print( "failed to delete temp dir: {}, directory contents: '{}'".format( temp_dir, os.listdir(temp_dir))) None

Hide Details

Hide Details

Adding tearDown hook: def cleanupSubprocesses(self): # Ensure any subprocesses are cleaned up for p in self.subprocesses: p.terminate() del p del self.subprocesses[:] # Ensure any forked processes are cleaned up for pid in self.forkedProcessPids: if os.path.exists("/proc/" + str(pid)): os.kill(pid, signal.SIGTERM)

Hide Details

Hide Details

Adding tearDown hook: def shutdown_debug_monitor(): try: server.terminate() except: logger.warning( "failed to terminate server for debug monitor: {}; ignoring".format( sys.exc_info()[0]))

Hide Details

Hide Details

Adding tearDown hook: def shutdown_socket(): if sock: try: # send the kill packet so lldb-server shuts down gracefully sock.sendall(GdbRemoteTestCaseBase._GDBREMOTE_KILL_PACKET) except: logger.warning( "failed to send kill packet to debug monitor: {}; ignoring".format( sys.exc_info()[0]))

Hide Details

try: sock.close() except: logger.warning( "failed to close socket to debug monitor: {}; ignoring".format( sys.exc_info()[0]))

Hide Details

Hide Details

Executing tearDown hook: def shutdown_socket(): if sock: try: # send the kill packet so lldb-server shuts down gracefully sock.sendall(GdbRemoteTestCaseBase._GDBREMOTE_KILL_PACKET) except: logger.warning( "failed to send kill packet to debug monitor: {}; ignoring".format( sys.exc_info()[0]))

Hide Details

try: sock.close() except: logger.warning( "failed to close socket to debug monitor: {}; ignoring".format( sys.exc_info()[0]))

Hide Details

Hide Details

2019-12-05 21:52:31,703 WARNING failed to send kill packet to debug monitor: <class 'TypeError'>; ignoring Executing tearDown hook: def shutdown_debug_monitor(): try: server.terminate() except: logger.warning( "failed to terminate server for debug monitor: {}; ignoring".format( sys.exc_info()[0]))

Hide Details

Hide Details

Executing tearDown hook: def cleanupSubprocesses(self): # Ensure any subprocesses are cleaned up for p in self.subprocesses: p.terminate() del p del self.subprocesses[:] # Ensure any forked processes are cleaned up for pid in self.forkedProcessPids: if os.path.exists("/proc/" + str(pid)): os.kill(pid, signal.SIGTERM)

Hide Details

Hide Details

Executing tearDown hook: def shutdown_named_pipe(): # Close the pipe. try: named_pipe.close() except: print("failed to close named pipe") None

Hide Details

# Delete the pipe. try: os.remove(named_pipe_path) except: print("failed to delete named pipe: {}".format(named_pipe_path)) None

Hide Details

# Delete the temp directory. try: os.rmdir(temp_dir) except: print( "failed to delete temp dir: {}, directory contents: '{}'".format( temp_dir, os.listdir(temp_dir))) None

Hide Details

Hide Details

PASS: LLDB (/Users/buildslave/jenkins/workspace/lldb-cmake-sanitized/lldb-build/bin/clang-10-x86_64) :: test_qThreadInfo_contains_thread_launch_debugserver (TestLldbGdbServer.LldbGdbServerTestCase) runCmd: settings set symbols.enable-external-lookup false output:

Hide Details

runCmd: settings set plugin.process.gdb-remote.packet-timeout 60 output:

Hide Details

runCmd: settings set symbols.clang-modules-cache-path "/Users/buildslave/jenkins/workspace/lldb-cmake-sanitized/lldb-build/lldb-test-build.noindex/module-cache-lldb/lldb-api" output:

Hide Details

runCmd: settings set use-color false output:

Hide Details

UNSUPPORTED: LLDB (/Users/buildslave/jenkins/workspace/lldb-cmake-sanitized/lldb-build/bin/clang-10-x86_64) :: test_qThreadInfo_contains_thread_launch_llgs (TestLldbGdbServer.LldbGdbServerTestCase) (llgs tests) runCmd: settings set symbols.enable-external-lookup false output:

Hide Details

runCmd: settings set plugin.process.gdb-remote.packet-timeout 60 output:

Hide Details

runCmd: settings set symbols.clang-modules-cache-path "/Users/buildslave/jenkins/workspace/lldb-cmake-sanitized/lldb-build/lldb-test-build.noindex/module-cache-lldb/lldb-api" output:

Hide Details

runCmd: settings set use-color false output:

Hide Details

Adding tearDown hook: def shutdown_named_pipe(): # Close the pipe. try: named_pipe.close() except: print("failed to close named pipe") None

Hide Details

# Delete the pipe. try: os.remove(named_pipe_path) except: print("failed to delete named pipe: {}".format(named_pipe_path)) None

Hide Details

# Delete the temp directory. try: os.rmdir(temp_dir) except: print( "failed to delete temp dir: {}, directory contents: '{}'".format( temp_dir, os.listdir(temp_dir))) None

Hide Details

Hide Details

Adding tearDown hook: def shutdown_process_for_attach(): try: inferior.terminate() except: logger.warning( "failed to terminate inferior process for attach: {}; ignoring".format( sys.exc_info()[0]))

Hide Details

Hide Details

Adding tearDown hook: def cleanupSubprocesses(self): # Ensure any subprocesses are cleaned up for p in self.subprocesses: p.terminate() del p del self.subprocesses[:] # Ensure any forked processes are cleaned up for pid in self.forkedProcessPids: if os.path.exists("/proc/" + str(pid)): os.kill(pid, signal.SIGTERM)

Hide Details

Hide Details

Adding tearDown hook: def shutdown_debug_monitor(): try: server.terminate() except: logger.warning( "failed to terminate server for debug monitor: {}; ignoring".format( sys.exc_info()[0]))

Hide Details

Hide Details

Adding tearDown hook: def shutdown_socket(): if sock: try: # send the kill packet so lldb-server shuts down gracefully sock.sendall(GdbRemoteTestCaseBase._GDBREMOTE_KILL_PACKET) except: logger.warning( "failed to send kill packet to debug monitor: {}; ignoring".format( sys.exc_info()[0]))

Hide Details

try: sock.close() except: logger.warning( "failed to close socket to debug monitor: {}; ignoring".format( sys.exc_info()[0]))

Hide Details

Hide Details

Executing tearDown hook: def shutdown_socket(): if sock: try: # send the kill packet so lldb-server shuts down gracefully sock.sendall(GdbRemoteTestCaseBase._GDBREMOTE_KILL_PACKET) except: logger.warning( "failed to send kill packet to debug monitor: {}; ignoring".format( sys.exc_info()[0]))

Hide Details

try: sock.close() except: logger.warning( "failed to close socket to debug monitor: {}; ignoring".format( sys.exc_info()[0]))

Hide Details

Hide Details

2019-12-05 21:53:00,358 WARNING failed to send kill packet to debug monitor: <class 'TypeError'>; ignoring Executing tearDown hook: def shutdown_debug_monitor(): try: server.terminate() except: logger.warning( "failed to terminate server for debug monitor: {}; ignoring".format( sys.exc_info()[0]))

Hide Details

Hide Details

Executing tearDown hook: def cleanupSubprocesses(self): # Ensure any subprocesses are cleaned up for p in self.subprocesses: p.terminate() del p del self.subprocesses[:] # Ensure any forked processes are cleaned up for pid in self.forkedProcessPids: if os.path.exists("/proc/" + str(pid)): os.kill(pid, signal.SIGTERM)

Hide Details

Hide Details

Executing tearDown hook: def shutdown_process_for_attach(): try: inferior.terminate() except: logger.warning( "failed to terminate inferior process for attach: {}; ignoring".format( sys.exc_info()[0]))

Hide Details

Hide Details

Executing tearDown hook: def shutdown_named_pipe(): # Close the pipe. try: named_pipe.close() except: print("failed to close named pipe") None

Hide Details

# Delete the pipe. try: os.remove(named_pipe_path) except: print("failed to delete named pipe: {}".format(named_pipe_path)) None

Hide Details

# Delete the temp directory. try: os.rmdir(temp_dir) except: print( "failed to delete temp dir: {}, directory contents: '{}'".format( temp_dir, os.listdir(temp_dir))) None

Hide Details

Hide Details

PASS: LLDB (/Users/buildslave/jenkins/workspace/lldb-cmake-sanitized/lldb-build/bin/clang-10-x86_64) :: test_qThreadInfo_matches_qC_attach_debugserver (TestLldbGdbServer.LldbGdbServerTestCase) runCmd: settings set symbols.enable-external-lookup false output:

Hide Details

runCmd: settings set plugin.process.gdb-remote.packet-timeout 60 output:

Hide Details

runCmd: settings set symbols.clang-modules-cache-path "/Users/buildslave/jenkins/workspace/lldb-cmake-sanitized/lldb-build/lldb-test-build.noindex/module-cache-lldb/lldb-api" output:

Hide Details

runCmd: settings set use-color false output:

Hide Details

UNSUPPORTED: LLDB (/Users/buildslave/jenkins/workspace/lldb-cmake-sanitized/lldb-build/bin/clang-10-x86_64) :: test_qThreadInfo_matches_qC_attach_llgs (TestLldbGdbServer.LldbGdbServerTestCase) (llgs tests) runCmd: settings set symbols.enable-external-lookup false output:

Hide Details

runCmd: settings set plugin.process.gdb-remote.packet-timeout 60 output:

Hide Details

runCmd: settings set symbols.clang-modules-cache-path "/Users/buildslave/jenkins/workspace/lldb-cmake-sanitized/lldb-build/lldb-test-build.noindex/module-cache-lldb/lldb-api" output:

Hide Details

runCmd: settings set use-color false output:

Hide Details

Adding tearDown hook: def shutdown_named_pipe(): # Close the pipe. try: named_pipe.close() except: print("failed to close named pipe") None

Hide Details

# Delete the pipe. try: os.remove(named_pipe_path) except: print("failed to delete named pipe: {}".format(named_pipe_path)) None

Hide Details

# Delete the temp directory. try: os.rmdir(temp_dir) except: print( "failed to delete temp dir: {}, directory contents: '{}'".format( temp_dir, os.listdir(temp_dir))) None

Hide Details

Hide Details

Adding tearDown hook: def cleanupSubprocesses(self): # Ensure any subprocesses are cleaned up for p in self.subprocesses: p.terminate() del p del self.subprocesses[:] # Ensure any forked processes are cleaned up for pid in self.forkedProcessPids: if os.path.exists("/proc/" + str(pid)): os.kill(pid, signal.SIGTERM)

Hide Details

Hide Details

Adding tearDown hook: def shutdown_debug_monitor(): try: server.terminate() except: logger.warning( "failed to terminate server for debug monitor: {}; ignoring".format( sys.exc_info()[0]))

Hide Details

Hide Details

Adding tearDown hook: def shutdown_socket(): if sock: try: # send the kill packet so lldb-server shuts down gracefully sock.sendall(GdbRemoteTestCaseBase._GDBREMOTE_KILL_PACKET) except: logger.warning( "failed to send kill packet to debug monitor: {}; ignoring".format( sys.exc_info()[0]))

Hide Details

try: sock.close() except: logger.warning( "failed to close socket to debug monitor: {}; ignoring".format( sys.exc_info()[0]))

Hide Details

Hide Details

Executing tearDown hook: def shutdown_socket(): if sock: try: # send the kill packet so lldb-server shuts down gracefully sock.sendall(GdbRemoteTestCaseBase._GDBREMOTE_KILL_PACKET) except: logger.warning( "failed to send kill packet to debug monitor: {}; ignoring".format( sys.exc_info()[0]))

Hide Details

try: sock.close() except: logger.warning( "failed to close socket to debug monitor: {}; ignoring".format( sys.exc_info()[0]))

Hide Details

Hide Details

2019-12-05 21:53:27,173 WARNING failed to send kill packet to debug monitor: <class 'TypeError'>; ignoring Executing tearDown hook: def shutdown_debug_monitor(): try: server.terminate() except: logger.warning( "failed to terminate server for debug monitor: {}; ignoring".format( sys.exc_info()[0]))

Hide Details

Hide Details

Executing tearDown hook: def cleanupSubprocesses(self): # Ensure any subprocesses are cleaned up for p in self.subprocesses: p.terminate() del p del self.subprocesses[:] # Ensure any forked processes are cleaned up for pid in self.forkedProcessPids: if os.path.exists("/proc/" + str(pid)): os.kill(pid, signal.SIGTERM)

Hide Details

Hide Details

Executing tearDown hook: def shutdown_named_pipe(): # Close the pipe. try: named_pipe.close() except: print("failed to close named pipe") None

Hide Details

# Delete the pipe. try: os.remove(named_pipe_path) except: print("failed to delete named pipe: {}".format(named_pipe_path)) None

Hide Details

# Delete the temp directory. try: os.rmdir(temp_dir) except: print( "failed to delete temp dir: {}, directory contents: '{}'".format( temp_dir, os.listdir(temp_dir))) None

Hide Details

Hide Details

PASS: LLDB (/Users/buildslave/jenkins/workspace/lldb-cmake-sanitized/lldb-build/bin/clang-10-x86_64) :: test_qThreadInfo_matches_qC_launch_debugserver (TestLldbGdbServer.LldbGdbServerTestCase) runCmd: settings set symbols.enable-external-lookup false output:

Hide Details

runCmd: settings set plugin.process.gdb-remote.packet-timeout 60 output:

Hide Details

runCmd: settings set symbols.clang-modules-cache-path "/Users/buildslave/jenkins/workspace/lldb-cmake-sanitized/lldb-build/lldb-test-build.noindex/module-cache-lldb/lldb-api" output:

Hide Details

runCmd: settings set use-color false output:

Hide Details

UNSUPPORTED: LLDB (/Users/buildslave/jenkins/workspace/lldb-cmake-sanitized/lldb-build/bin/clang-10-x86_64) :: test_qThreadInfo_matches_qC_launch_llgs (TestLldbGdbServer.LldbGdbServerTestCase) (llgs tests) runCmd: settings set symbols.enable-external-lookup false output:

Hide Details

runCmd: settings set plugin.process.gdb-remote.packet-timeout 60 output:

Hide Details

runCmd: settings set symbols.clang-modules-cache-path "/Users/buildslave/jenkins/workspace/lldb-cmake-sanitized/lldb-build/lldb-test-build.noindex/module-cache-lldb/lldb-api" output:

Hide Details

runCmd: settings set use-color false output:

Hide Details

Adding tearDown hook: def shutdown_named_pipe(): # Close the pipe. try: named_pipe.close() except: print("failed to close named pipe") None

Hide Details

# Delete the pipe. try: os.remove(named_pipe_path) except: print("failed to delete named pipe: {}".format(named_pipe_path)) None

Hide Details

# Delete the temp directory. try: os.rmdir(temp_dir) except: print( "failed to delete temp dir: {}, directory contents: '{}'".format( temp_dir, os.listdir(temp_dir))) None

Hide Details

Hide Details

Adding tearDown hook: def cleanupSubprocesses(self): # Ensure any subprocesses are cleaned up for p in self.subprocesses: p.terminate() del p del self.subprocesses[:] # Ensure any forked processes are cleaned up for pid in self.forkedProcessPids: if os.path.exists("/proc/" + str(pid)): os.kill(pid, signal.SIGTERM)

Hide Details

Hide Details

Adding tearDown hook: def shutdown_debug_monitor(): try: server.terminate() except: logger.warning( "failed to terminate server for debug monitor: {}; ignoring".format( sys.exc_info()[0]))

Hide Details

Hide Details

Adding tearDown hook: def shutdown_socket(): if sock: try: # send the kill packet so lldb-server shuts down gracefully sock.sendall(GdbRemoteTestCaseBase._GDBREMOTE_KILL_PACKET) except: logger.warning( "failed to send kill packet to debug monitor: {}; ignoring".format( sys.exc_info()[0]))

Hide Details

try: sock.close() except: logger.warning( "failed to close socket to debug monitor: {}; ignoring".format( sys.exc_info()[0]))

Hide Details

Hide Details

Executing tearDown hook: def shutdown_socket(): if sock: try: # send the kill packet so lldb-server shuts down gracefully sock.sendall(GdbRemoteTestCaseBase._GDBREMOTE_KILL_PACKET) except: logger.warning( "failed to send kill packet to debug monitor: {}; ignoring".format( sys.exc_info()[0]))

Hide Details

try: sock.close() except: logger.warning( "failed to close socket to debug monitor: {}; ignoring".format( sys.exc_info()[0]))

Hide Details

Hide Details

2019-12-05 21:53:53,451 WARNING failed to send kill packet to debug monitor: <class 'TypeError'>; ignoring Executing tearDown hook: def shutdown_debug_monitor(): try: server.terminate() except: logger.warning( "failed to terminate server for debug monitor: {}; ignoring".format( sys.exc_info()[0]))

Hide Details

Hide Details

Executing tearDown hook: def cleanupSubprocesses(self): # Ensure any subprocesses are cleaned up for p in self.subprocesses: p.terminate() del p del self.subprocesses[:] # Ensure any forked processes are cleaned up for pid in self.forkedProcessPids: if os.path.exists("/proc/" + str(pid)): os.kill(pid, signal.SIGTERM)

Hide Details

Hide Details

Executing tearDown hook: def shutdown_named_pipe(): # Close the pipe. try: named_pipe.close() except: print("failed to close named pipe") None

Hide Details

# Delete the pipe. try: os.remove(named_pipe_path) except: print("failed to delete named pipe: {}".format(named_pipe_path)) None

Hide Details

# Delete the temp directory. try: os.rmdir(temp_dir) except: print( "failed to delete temp dir: {}, directory contents: '{}'".format( temp_dir, os.listdir(temp_dir))) None

Hide Details

Hide Details

PASS: LLDB (/Users/buildslave/jenkins/workspace/lldb-cmake-sanitized/lldb-build/bin/clang-10-x86_64) :: test_software_breakpoint_set_and_remove_work_debugserver (TestLldbGdbServer.LldbGdbServerTestCase) runCmd: settings set symbols.enable-external-lookup false output:

Hide Details

runCmd: settings set plugin.process.gdb-remote.packet-timeout 60 output:

Hide Details

runCmd: settings set symbols.clang-modules-cache-path "/Users/buildslave/jenkins/workspace/lldb-cmake-sanitized/lldb-build/lldb-test-build.noindex/module-cache-lldb/lldb-api" output:

Hide Details

runCmd: settings set use-color false output:

Hide Details

UNSUPPORTED: LLDB (/Users/buildslave/jenkins/workspace/lldb-cmake-sanitized/lldb-build/bin/clang-10-x86_64) :: test_software_breakpoint_set_and_remove_work_llgs (TestLldbGdbServer.LldbGdbServerTestCase) (llgs tests) runCmd: settings set symbols.enable-external-lookup false output:

Hide Details

runCmd: settings set plugin.process.gdb-remote.packet-timeout 60 output:

Hide Details

runCmd: settings set symbols.clang-modules-cache-path "/Users/buildslave/jenkins/workspace/lldb-cmake-sanitized/lldb-build/lldb-test-build.noindex/module-cache-lldb/lldb-api" output:

Hide Details

runCmd: settings set use-color false output:

Hide Details

Adding tearDown hook: def shutdown_named_pipe(): # Close the pipe. try: named_pipe.close() except: print("failed to close named pipe") None

Hide Details

# Delete the pipe. try: os.remove(named_pipe_path) except: print("failed to delete named pipe: {}".format(named_pipe_path)) None

Hide Details

# Delete the temp directory. try: os.rmdir(temp_dir) except: print( "failed to delete temp dir: {}, directory contents: '{}'".format( temp_dir, os.listdir(temp_dir))) None

Hide Details

Hide Details

Adding tearDown hook: def cleanupSubprocesses(self): # Ensure any subprocesses are cleaned up for p in self.subprocesses: p.terminate() del p del self.subprocesses[:] # Ensure any forked processes are cleaned up for pid in self.forkedProcessPids: if os.path.exists("/proc/" + str(pid)): os.kill(pid, signal.SIGTERM)

Hide Details

Hide Details

Adding tearDown hook: def shutdown_debug_monitor(): try: server.terminate() except: logger.warning( "failed to terminate server for debug monitor: {}; ignoring".format( sys.exc_info()[0]))

Hide Details

Hide Details

Adding tearDown hook: def shutdown_socket(): if sock: try: # send the kill packet so lldb-server shuts down gracefully sock.sendall(GdbRemoteTestCaseBase._GDBREMOTE_KILL_PACKET) except: logger.warning( "failed to send kill packet to debug monitor: {}; ignoring".format( sys.exc_info()[0]))

Hide Details

try: sock.close() except: logger.warning( "failed to close socket to debug monitor: {}; ignoring".format( sys.exc_info()[0]))

Hide Details

Hide Details

Executing tearDown hook: def shutdown_socket(): if sock: try: # send the kill packet so lldb-server shuts down gracefully sock.sendall(GdbRemoteTestCaseBase._GDBREMOTE_KILL_PACKET) except: logger.warning( "failed to send kill packet to debug monitor: {}; ignoring".format( sys.exc_info()[0]))

Hide Details

try: sock.close() except: logger.warning( "failed to close socket to debug monitor: {}; ignoring".format( sys.exc_info()[0]))

Hide Details

Hide Details

2019-12-05 21:53:55,853 WARNING failed to send kill packet to debug monitor: <class 'TypeError'>; ignoring Executing tearDown hook: def shutdown_debug_monitor(): try: server.terminate() except: logger.warning( "failed to terminate server for debug monitor: {}; ignoring".format( sys.exc_info()[0]))

Hide Details

Hide Details

Executing tearDown hook: def cleanupSubprocesses(self): # Ensure any subprocesses are cleaned up for p in self.subprocesses: p.terminate() del p del self.subprocesses[:] # Ensure any forked processes are cleaned up for pid in self.forkedProcessPids: if os.path.exists("/proc/" + str(pid)): os.kill(pid, signal.SIGTERM)

Hide Details

Hide Details

Executing tearDown hook: def shutdown_named_pipe(): # Close the pipe. try: named_pipe.close() except: print("failed to close named pipe") None

Hide Details

# Delete the pipe. try: os.remove(named_pipe_path) except: print("failed to delete named pipe: {}".format(named_pipe_path)) None

Hide Details

# Delete the temp directory. try: os.rmdir(temp_dir) except: print( "failed to delete temp dir: {}, directory contents: '{}'".format( temp_dir, os.listdir(temp_dir))) None

Hide Details

Hide Details

PASS: LLDB (/Users/buildslave/jenkins/workspace/lldb-cmake-sanitized/lldb-build/bin/clang-10-x86_64) :: test_start_no_ack_mode_debugserver (TestLldbGdbServer.LldbGdbServerTestCase) runCmd: settings set symbols.enable-external-lookup false output:

Hide Details

runCmd: settings set plugin.process.gdb-remote.packet-timeout 60 output:

Hide Details

runCmd: settings set symbols.clang-modules-cache-path "/Users/buildslave/jenkins/workspace/lldb-cmake-sanitized/lldb-build/lldb-test-build.noindex/module-cache-lldb/lldb-api" output:

Hide Details

runCmd: settings set use-color false output:

Hide Details

UNSUPPORTED: LLDB (/Users/buildslave/jenkins/workspace/lldb-cmake-sanitized/lldb-build/bin/clang-10-x86_64) :: test_start_no_ack_mode_llgs (TestLldbGdbServer.LldbGdbServerTestCase) (llgs tests) runCmd: settings set symbols.enable-external-lookup false output:

Hide Details

runCmd: settings set plugin.process.gdb-remote.packet-timeout 60 output:

Hide Details

runCmd: settings set symbols.clang-modules-cache-path "/Users/buildslave/jenkins/workspace/lldb-cmake-sanitized/lldb-build/lldb-test-build.noindex/module-cache-lldb/lldb-api" output:

Hide Details

runCmd: settings set use-color false output:

Hide Details

Adding tearDown hook: def shutdown_named_pipe(): # Close the pipe. try: named_pipe.close() except: print("failed to close named pipe") None

Hide Details

# Delete the pipe. try: os.remove(named_pipe_path) except: print("failed to delete named pipe: {}".format(named_pipe_path)) None

Hide Details

# Delete the temp directory. try: os.rmdir(temp_dir) except: print( "failed to delete temp dir: {}, directory contents: '{}'".format( temp_dir, os.listdir(temp_dir))) None

Hide Details

Hide Details

Adding tearDown hook: def cleanupSubprocesses(self): # Ensure any subprocesses are cleaned up for p in self.subprocesses: p.terminate() del p del self.subprocesses[:] # Ensure any forked processes are cleaned up for pid in self.forkedProcessPids: if os.path.exists("/proc/" + str(pid)): os.kill(pid, signal.SIGTERM)

Hide Details

Hide Details

Adding tearDown hook: def shutdown_debug_monitor(): try: server.terminate() except: logger.warning( "failed to terminate server for debug monitor: {}; ignoring".format( sys.exc_info()[0]))

Hide Details

Hide Details

Adding tearDown hook: def shutdown_socket(): if sock: try: # send the kill packet so lldb-server shuts down gracefully sock.sendall(GdbRemoteTestCaseBase._GDBREMOTE_KILL_PACKET) except: logger.warning( "failed to send kill packet to debug monitor: {}; ignoring".format( sys.exc_info()[0]))

Hide Details

try: sock.close() except: logger.warning( "failed to close socket to debug monitor: {}; ignoring".format( sys.exc_info()[0]))

Hide Details

Hide Details

Executing tearDown hook: def shutdown_socket(): if sock: try: # send the kill packet so lldb-server shuts down gracefully sock.sendall(GdbRemoteTestCaseBase._GDBREMOTE_KILL_PACKET) except: logger.warning( "failed to send kill packet to debug monitor: {}; ignoring".format( sys.exc_info()[0]))

Hide Details

try: sock.close() except: logger.warning( "failed to close socket to debug monitor: {}; ignoring".format( sys.exc_info()[0]))

Hide Details

Hide Details

2019-12-05 21:53:58,588 WARNING failed to send kill packet to debug monitor: <class 'TypeError'>; ignoring Executing tearDown hook: def shutdown_debug_monitor(): try: server.terminate() except: logger.warning( "failed to terminate server for debug monitor: {}; ignoring".format( sys.exc_info()[0]))

Hide Details

Hide Details

Executing tearDown hook: def cleanupSubprocesses(self): # Ensure any subprocesses are cleaned up for p in self.subprocesses: p.terminate() del p del self.subprocesses[:] # Ensure any forked processes are cleaned up for pid in self.forkedProcessPids: if os.path.exists("/proc/" + str(pid)): os.kill(pid, signal.SIGTERM)

Hide Details

Hide Details

Executing tearDown hook: def shutdown_named_pipe(): # Close the pipe. try: named_pipe.close() except: print("failed to close named pipe") None

Hide Details

# Delete the pipe. try: os.remove(named_pipe_path) except: print("failed to delete named pipe: {}".format(named_pipe_path)) None

Hide Details

# Delete the temp directory. try: os.rmdir(temp_dir) except: print( "failed to delete temp dir: {}, directory contents: '{}'".format( temp_dir, os.listdir(temp_dir))) None

Hide Details

Hide Details

PASS: LLDB (/Users/buildslave/jenkins/workspace/lldb-cmake-sanitized/lldb-build/bin/clang-10-x86_64) :: test_thread_suffix_supported_debugserver (TestLldbGdbServer.LldbGdbServerTestCase) runCmd: settings set symbols.enable-external-lookup false output:

Hide Details

runCmd: settings set plugin.process.gdb-remote.packet-timeout 60 output:

Hide Details

runCmd: settings set symbols.clang-modules-cache-path "/Users/buildslave/jenkins/workspace/lldb-cmake-sanitized/lldb-build/lldb-test-build.noindex/module-cache-lldb/lldb-api" output:

Hide Details

runCmd: settings set use-color false output:

Hide Details

UNSUPPORTED: LLDB (/Users/buildslave/jenkins/workspace/lldb-cmake-sanitized/lldb-build/bin/clang-10-x86_64) :: test_thread_suffix_supported_llgs (TestLldbGdbServer.LldbGdbServerTestCase) (llgs tests) runCmd: settings set symbols.enable-external-lookup false output:

Hide Details

runCmd: settings set plugin.process.gdb-remote.packet-timeout 60 output:

Hide Details

runCmd: settings set symbols.clang-modules-cache-path "/Users/buildslave/jenkins/workspace/lldb-cmake-sanitized/lldb-build/lldb-test-build.noindex/module-cache-lldb/lldb-api" output:

Hide Details

runCmd: settings set use-color false output:

Hide Details

Adding tearDown hook: def shutdown_named_pipe(): # Close the pipe. try: named_pipe.close() except: print("failed to close named pipe") None

Hide Details

# Delete the pipe. try: os.remove(named_pipe_path) except: print("failed to delete named pipe: {}".format(named_pipe_path)) None

Hide Details

# Delete the temp directory. try: os.rmdir(temp_dir) except: print( "failed to delete temp dir: {}, directory contents: '{}'".format( temp_dir, os.listdir(temp_dir))) None

Hide Details

Hide Details

Adding tearDown hook: def cleanupSubprocesses(self): # Ensure any subprocesses are cleaned up for p in self.subprocesses: p.terminate() del p del self.subprocesses[:] # Ensure any forked processes are cleaned up for pid in self.forkedProcessPids: if os.path.exists("/proc/" + str(pid)): os.kill(pid, signal.SIGTERM)

Hide Details

Hide Details

Adding tearDown hook: def shutdown_debug_monitor(): try: server.terminate() except: logger.warning( "failed to terminate server for debug monitor: {}; ignoring".format( sys.exc_info()[0]))

Hide Details

Hide Details

Adding tearDown hook: def shutdown_socket(): if sock: try: # send the kill packet so lldb-server shuts down gracefully sock.sendall(GdbRemoteTestCaseBase._GDBREMOTE_KILL_PACKET) except: logger.warning( "failed to send kill packet to debug monitor: {}; ignoring".format( sys.exc_info()[0]))

Hide Details

try: sock.close() except: logger.warning( "failed to close socket to debug monitor: {}; ignoring".format( sys.exc_info()[0]))

Hide Details

Hide Details

Executing tearDown hook: def shutdown_socket(): if sock: try: # send the kill packet so lldb-server shuts down gracefully sock.sendall(GdbRemoteTestCaseBase._GDBREMOTE_KILL_PACKET) except: logger.warning( "failed to send kill packet to debug monitor: {}; ignoring".format( sys.exc_info()[0]))

Hide Details

try: sock.close() except: logger.warning( "failed to close socket to debug monitor: {}; ignoring".format( sys.exc_info()[0]))

Hide Details

Hide Details

2019-12-05 21:54:24,458 WARNING failed to send kill packet to debug monitor: <class 'TypeError'>; ignoring Executing tearDown hook: def shutdown_debug_monitor(): try: server.terminate() except: logger.warning( "failed to terminate server for debug monitor: {}; ignoring".format( sys.exc_info()[0]))

Hide Details

Hide Details

Executing tearDown hook: def cleanupSubprocesses(self): # Ensure any subprocesses are cleaned up for p in self.subprocesses: p.terminate() del p del self.subprocesses[:] # Ensure any forked processes are cleaned up for pid in self.forkedProcessPids: if os.path.exists("/proc/" + str(pid)): os.kill(pid, signal.SIGTERM)

Hide Details

Hide Details

Executing tearDown hook: def shutdown_named_pipe(): # Close the pipe. try: named_pipe.close() except: print("failed to close named pipe") None

Hide Details

# Delete the pipe. try: os.remove(named_pipe_path) except: print("failed to delete named pipe: {}".format(named_pipe_path)) None

Hide Details

# Delete the temp directory. try: os.rmdir(temp_dir) except: print( "failed to delete temp dir: {}, directory contents: '{}'".format( temp_dir, os.listdir(temp_dir))) None

Hide Details

Hide Details

PASS: LLDB (/Users/buildslave/jenkins/workspace/lldb-cmake-sanitized/lldb-build/bin/clang-10-x86_64) :: test_written_M_content_reads_back_correctly_debugserver (TestLldbGdbServer.LldbGdbServerTestCase) runCmd: settings set symbols.enable-external-lookup false output:

Hide Details

runCmd: settings set plugin.process.gdb-remote.packet-timeout 60 output:

Hide Details

runCmd: settings set symbols.clang-modules-cache-path "/Users/buildslave/jenkins/workspace/lldb-cmake-sanitized/lldb-build/lldb-test-build.noindex/module-cache-lldb/lldb-api" output:

Hide Details

runCmd: settings set use-color false output:

Hide Details

UNSUPPORTED: LLDB (/Users/buildslave/jenkins/workspace/lldb-cmake-sanitized/lldb-build/bin/clang-10-x86_64) :: test_written_M_content_reads_back_correctly_llgs (TestLldbGdbServer.LldbGdbServerTestCase) (llgs tests) Restore dir to: /Users/buildslave/jenkins/workspace/lldb-cmake-sanitized/lldb-build/tools/lldb/test ====================================================================== FAIL: test_p_returns_correct_data_size_for_each_qRegisterInfo_attach_debugserver (TestLldbGdbServer.LldbGdbServerTestCase) ---------------------------------------------------------------------- Traceback (most recent call last): File "/Users/buildslave/jenkins/workspace/lldb-cmake-sanitized/llvm-project/lldb/packages/Python/lldbsuite/test/decorators.py", line 141, in wrapper func(*args, **kwargs) File "/Users/buildslave/jenkins/workspace/lldb-cmake-sanitized/llvm-project/lldb/packages/Python/lldbsuite/test/tools/lldb-server/TestLldbGdbServer.py", line 626, in test_p_returns_correct_data_size_for_each_qRegisterInfo_attach_debugserver self.p_returns_correct_data_size_for_each_qRegisterInfo() File "/Users/buildslave/jenkins/workspace/lldb-cmake-sanitized/llvm-project/lldb/packages/Python/lldbsuite/test/tools/lldb-server/TestLldbGdbServer.py", line 555, in p_returns_correct_data_size_for_each_qRegisterInfo procs = self.prep_debug_monitor_and_inferior() File "/Users/buildslave/jenkins/workspace/lldb-cmake-sanitized/llvm-project/lldb/packages/Python/lldbsuite/test/tools/lldb-server/gdbremote_testcase.py", line 584, in prep_debug_monitor_and_inferior server = self.connect_to_debug_monitor(attach_pid=attach_pid) File "/Users/buildslave/jenkins/workspace/lldb-cmake-sanitized/llvm-project/lldb/packages/Python/lldbsuite/test/tools/lldb-server/gdbremote_testcase.py", line 418, in connect_to_debug_monitor server = self.launch_debug_monitor(attach_pid=attach_pid) File "/Users/buildslave/jenkins/workspace/lldb-cmake-sanitized/llvm-project/lldb/packages/Python/lldbsuite/test/tools/lldb-server/gdbremote_testcase.py", line 411, in launch_debug_monitor self.port = self.get_stub_port_from_named_socket(self._READ_TIMEOUT) File "/Users/buildslave/jenkins/workspace/lldb-cmake-sanitized/llvm-project/lldb/packages/Python/lldbsuite/test/tools/lldb-server/gdbremote_testcase.py", line 217, in get_stub_port_from_named_socket "write side of pipe has not written anything - stub isn't writing to pipe.") AssertionError: 0 == 0 : write side of pipe has not written anything - stub isn't writing to pipe. Config=x86_64-/Users/buildslave/jenkins/workspace/lldb-cmake-sanitized/lldb-build/bin/clang-10 ---------------------------------------------------------------------- Ran 65 tests in 880.808s

Hide Details

RESULT: FAILED (29 passes, 1 failures, 0 errors, 34 skipped, 1 expected failures, 0 unexpected successes)

Hide Details

******************** XFAIL: lldb-shell :: SymbolFile/DWARF/find-type-in-function.cpp (1446 of 1839) PASS: lldb-api :: functionalities/modern-type-lookup/objc-modules/TestObjModulesModernTypeLookup.py (1447 of 1839) PASS: lldb-shell :: Reproducer/TestSynchronous.test (1448 of 1839) PASS: lldb-api :: functionalities/data-formatter/data-formatter-stl/libcxx/bitset/TestDataFormatterLibcxxBitset.py (1449 of 1839) PASS: lldb-api :: macosx/duplicate-archive-members/TestDuplicateMembers.py (1450 of 1839) PASS: lldb-api :: functionalities/unwind/noreturn/module-end/TestNoReturnModuleEnd.py (1451 of 1839) PASS: lldb-api :: functionalities/data-formatter/data-formatter-proper-plurals/TestFormattersOneIsSingular.py (1452 of 1839) PASS: lldb-unit :: Utility/./UtilityTests/StreamTest.PutRawBytesToLittleEndian (1453 of 1839) PASS: lldb-unit :: Host/./HostTests/SocketTest.UDPConnect (1454 of 1839) UNSUPPORTED: lldb-api :: functionalities/data-formatter/data-formatter-stl/libstdcpp/vector/TestDataFormatterStdVector.py (1455 of 1839) PASS: lldb-unit :: Host/./HostTests/SocketAddressTest.GetAddressInfo (1456 of 1839) PASS: lldb-unit :: Utility/./UtilityTests/UUIDTest.StringConverion (1457 of 1839) PASS: lldb-unit :: Utility/./UtilityTests/StringExtractorTest.GetU32LittleEndian (1458 of 1839) UNSUPPORTED: lldb-api :: python_api/disassemble-raw-data/TestDisassemble_VST1_64.py (1459 of 1839) PASS: lldb-unit :: Utility/./UtilityTests/UriParserTest.Empty (1460 of 1839) PASS: lldb-api :: python_api/sbdata/TestSBData.py (1461 of 1839) PASS: lldb-unit :: Process/minidump/./LLDBMinidumpTests/RegisterContextMinidump.ConvertMinidumpContext_x86_32 (1462 of 1839) PASS: lldb-api :: lang/c/find_struct_type/TestFindStructTypes.py (1463 of 1839) PASS: lldb-unit :: Utility/./UtilityTests/DataExtractorTest.GetMaxU64_unchecked (1464 of 1839) PASS: lldb-unit :: Utility/./UtilityTests/ScalarTest.SetValueFromCString (1465 of 1839) PASS: lldb-api :: lang/c/enum_types/TestEnumTypes.py (1466 of 1839) PASS: lldb-api :: commands/expression/persistent_types/TestNestedPersistentTypes.py (1467 of 1839) UNSUPPORTED: lldb-api :: benchmarks/turnaround/TestCompileRunToBreakpointTurnaround.py (1468 of 1839) PASS: lldb-shell :: ObjectFile/ELF/PT_LOAD-overlap-PT_INTERP.yaml (1469 of 1839) PASS: lldb-shell :: SymbolFile/DWARF/dir-separator-windows.s (1470 of 1839) PASS: lldb-unit :: Utility/./UtilityTests/StringExtractorTest.GetHexU8_Underflow2_NoEof (1471 of 1839) PASS: lldb-api :: lang/c/offsetof/TestOffsetof.py (1472 of 1839) PASS: lldb-unit :: Utility/./UtilityTests/UriParserTest.BadPort (1473 of 1839) PASS: lldb-unit :: Utility/./UtilityTests/ArgsTest.ReplaceArgumentAtIndexFarOutOfRange (1474 of 1839) UNSUPPORTED: lldb-api :: functionalities/tsan/thread_numbers/TestTsanThreadNumbers.py (1475 of 1839) PASS: lldb-unit :: Utility/./UtilityTests/RangeTest.LessThan (1476 of 1839) UNSUPPORTED: lldb-api :: functionalities/exec/TestExec.py (1477 of 1839) PASS: lldb-shell :: SymbolFile/DWARF/array-sizes.s (1478 of 1839) PASS: lldb-api :: commands/expression/call-function/TestCallStopAndContinue.py (1479 of 1839) PASS: lldb-api :: lang/objcxx/objcxx-ivar-vector/TestIvarVector.py (1480 of 1839) UNSUPPORTED: lldb-api :: arm/breakpoint-thumb-codesection/TestBreakpointThumbCodesection.py (1481 of 1839) PASS: lldb-unit :: Utility/./UtilityTests/UriParserTest.PortOverflow (1482 of 1839) PASS: lldb-api :: commands/expression/ir-interpreter-phi-nodes/TestIRInterpreterPHINodes.py (1483 of 1839) UNSUPPORTED: lldb-api :: functionalities/darwin_log/source/debug/TestDarwinLogSourceDebug.py (1484 of 1839) PASS: lldb-api :: lang/cpp/limit-debug-info/TestWithLimitDebugInfo.py (1485 of 1839) PASS: lldb-unit :: Expression/./ExpressionTests/DiagnosticManagerTest.PutStringSeverities (1486 of 1839) PASS: lldb-api :: lang/cpp/global_operators/TestCppGlobalOperators.py (1487 of 1839) PASS: lldb-api :: python_api/file_handle/TestFileHandle.py (1488 of 1839) PASS: lldb-unit :: Interpreter/./InterpreterTests/CompletionTest.DirCompletionUsername (1489 of 1839) PASS: lldb-api :: commands/command/nested_alias/TestNestedAlias.py (1490 of 1839) PASS: lldb-shell :: ObjectFile/PECOFF/uuid.yaml (1491 of 1839) PASS: lldb-unit :: Expression/./ExpressionTests/CppModuleConfigurationTest.MissingLibCpp (1492 of 1839) PASS: lldb-api :: lang/cpp/bool/TestCPPBool.py (1493 of 1839) PASS: lldb-unit :: Utility/./UtilityTests/GeneratorTest.Create (1494 of 1839) PASS: lldb-shell :: SymbolFile/DWARF/debug-types-dwo-cross-reference.cpp (1495 of 1839) PASS: lldb-api :: functionalities/data-formatter/nsarraysynth/TestNSArraySynthetic.py (1496 of 1839) PASS: lldb-unit :: Process/gdb-remote/./ProcessGdbRemoteTests/GDBRemoteCommunicationClientTest.SendGetDataPacket (1497 of 1839) PASS: lldb-unit :: Language/Highlighting/./HighlighterTests/HighlighterTest.HighlighterSelectionType (1498 of 1839) UNSUPPORTED: lldb-api :: functionalities/data-formatter/data-formatter-stl/libstdcpp/string/TestDataFormatterStdString.py (1499 of 1839) PASS: lldb-api :: lang/cpp/scope/TestCppScope.py (1500 of 1839) PASS: lldb-shell :: Host/TestCustomShell.test (1501 of 1839) PASS: lldb-unit :: SymbolFile/NativePDB/./SymbolFileNativePDBTests/PDBFPOProgramToDWARFExpressionTests.UnresolvedCyclicRegisterAssignmentReference (1502 of 1839) PASS: lldb-api :: tools/lldb-server/TestGdbRemoteRegisterState.py (1503 of 1839) PASS: lldb-api :: lang/objc/modules-update/TestClangModulesUpdate.py (1504 of 1839) PASS: lldb-shell :: SymbolFile/DWARF/find-basic-namespace.cpp (1505 of 1839) PASS: lldb-api :: commands/frame/diagnose/dereference-function-return/TestDiagnoseDereferenceFunctionReturn.py (1506 of 1839) UNSUPPORTED: lldb-api :: benchmarks/stepping/TestSteppingSpeed.py (1507 of 1839) PASS: lldb-unit :: Utility/./UtilityTests/StringListTest.Join (1508 of 1839) PASS: lldb-unit :: Utility/./UtilityTests/ArgsTest.BareSingleQuote (1509 of 1839) PASS: lldb-unit :: Utility/./UtilityTests/VMRange.Ordering (1510 of 1839) PASS: lldb-unit :: Process/minidump/./LLDBMinidumpTests/MinidumpParserTest.GetLinuxProcStatus_no_stream (1511 of 1839) PASS: lldb-api :: commands/platform/basic/TestPlatformCommand.py (1512 of 1839) PASS: lldb-unit :: Utility/./UtilityTests/StringExtractorTest.GetHexU8_InvalidHex (1513 of 1839) PASS: lldb-shell :: SymbolFile/DWARF/anon_class_w_and_wo_export_symbols.ll (1514 of 1839) PASS: lldb-api :: functionalities/thread/concurrent_events/TestConcurrentManyBreakpoints.py (1515 of 1839) UNSUPPORTED: lldb-shell :: Register/x86-gp-write.test (1516 of 1839) PASS: lldb-api :: commands/expression/import-std-module/weak_ptr-dbg-info-content/TestDbgInfoContentWeakPtr.py (1517 of 1839) PASS: lldb-api :: functionalities/data-formatter/data-formatter-objc/TestDataFormatterObjCNSContainer.py (1518 of 1839) PASS: lldb-shell :: Unwind/trap_frame_sym_ctx.test (1519 of 1839) UNSUPPORTED: lldb-api :: lang/objc/bitfield_ivars/TestBitfieldIvars.py (1520 of 1839) PASS: lldb-api :: functionalities/return-value/TestReturnValue.py (1521 of 1839) PASS: lldb-unit :: UnwindAssembly/x86/./UnwindAssemblyx86Tests/Testx86AssemblyInspectionEngine.Testi386IgnoredRegisters (1522 of 1839) PASS: lldb-unit :: ScriptInterpreter/Python/./ScriptInterpreterPythonTests/PythonDataObjectsTest.TestPythonIntegerToStr (1523 of 1839) PASS: lldb-api :: commands/reproducer/invalid-args/TestInvalidArgsReproducer.py (1524 of 1839) PASS: lldb-api :: python_api/target/TestTargetAPI.py (1525 of 1839) PASS: lldb-unit :: Utility/./UtilityTests/StringExtractorTest.GetHexBytesAvail_FullString (1526 of 1839) UNSUPPORTED: lldb-api :: linux/thread/create_during_instruction_step/TestCreateDuringInstructionStep.py (1527 of 1839) PASS: lldb-api :: functionalities/thread/crash_during_step/TestCrashDuringStep.py (1528 of 1839) PASS: lldb-unit :: UnwindAssembly/x86/./UnwindAssemblyx86Tests/Testx86AssemblyInspectionEngine.TestPushEBX (1529 of 1839) UNSUPPORTED: lldb-api :: commands/expression/completion-crash1/TestCompletionCrash1.py (1530 of 1839) PASS: lldb-api :: functionalities/breakpoint/consecutive_breakpoints/TestConsecutiveBreakpoints.py (1531 of 1839) PASS: lldb-unit :: ScriptInterpreter/Python/./ScriptInterpreterPythonTests/PythonDataObjectsTest.TestDictionaryResolutionWithDot (1532 of 1839) UNSUPPORTED: lldb-api :: commands/expression/multiline-completion/TestMultilineCompletion.py (1533 of 1839) PASS: lldb-api :: commands/expression/persistent_variables/TestPersistentVariables.py (1534 of 1839) PASS: lldb-api :: functionalities/thread/concurrent_events/TestConcurrentSignalWatch.py (1535 of 1839) PASS: lldb-unit :: Breakpoint/./LLDBBreakpointTests/BreakpointIDTest.StringIsBreakpointName (1536 of 1839) PASS: lldb-api :: lang/cpp/wchar_t/TestCxxWCharT.py (1537 of 1839) PASS: lldb-unit :: UnwindAssembly/x86/./UnwindAssemblyx86Tests/Testx86AssemblyInspectionEngine.TestPushEDI (1538 of 1839) PASS: lldb-unit :: Host/./HostTests/SocketTest.DomainGetConnectURI (1539 of 1839) PASS: lldb-unit :: Utility/./UtilityTests/ConstStringTest.FromMidOfBufferStringRef (1540 of 1839) PASS: lldb-unit :: Utility/./UtilityTests/FileSpecTest.GetPath (1541 of 1839) PASS: lldb-api :: lang/objc/objc-property/TestObjCProperty.py (1542 of 1839) PASS: lldb-unit :: Utility/./UtilityTests/LogChannelEnabledTest.log_options (1543 of 1839) PASS: lldb-api :: macosx/safe-to-func-call/TestSafeFuncCalls.py (1544 of 1839) PASS: lldb-api :: python_api/value/change_values/TestChangeValueAPI.py (1545 of 1839) PASS: lldb-api :: lang/objcxx/hide-runtime-values/TestObjCXXHideRuntimeValues.py (1546 of 1839) PASS: lldb-shell :: SymbolFile/Breakpad/symtab.test (1547 of 1839) PASS: lldb-shell :: ObjectFile/ELF/section-addresses.yaml (1548 of 1839) PASS: lldb-shell :: SymbolFile/DWARF/find-basic-variable.cpp (1549 of 1839) PASS: lldb-api :: commands/watchpoints/multiple_hits/TestMultipleHits.py (1550 of 1839) PASS: lldb-unit :: Utility/./UtilityTests/VMRange.Reset (1551 of 1839) PASS: lldb-unit :: UnwindAssembly/x86/./UnwindAssemblyx86Tests/Testx86AssemblyInspectionEngine.TestPopR15 (1552 of 1839) PASS: lldb-api :: commands/settings/quoting/TestQuoting.py (1553 of 1839) PASS: lldb-shell :: Reproducer/TestDiscard.test (1554 of 1839) PASS: lldb-unit :: Utility/./UtilityTests/RecordReplayTest.InstrumentedFoo (1555 of 1839) PASS: lldb-api :: types/TestFloatTypesExpr.py (1556 of 1839) PASS: lldb-unit :: Utility/./UtilityTests/ArgsTest.TestQuotedTrailingBackslash (1557 of 1839) PASS: lldb-api :: lang/objc/hidden-ivars/TestHiddenIvars.py (1558 of 1839) PASS: lldb-unit :: Core/./LLDBCoreTests/RichManglingContextTest.IPDRealloc (1559 of 1839) PASS: lldb-unit :: Utility/./UtilityTests/StreamTest.PutCharWhitespace (1560 of 1839) PASS: lldb-unit :: SymbolFile/NativePDB/./SymbolFileNativePDBTests/PDBFPOProgramToDWARFExpressionTests.MissingTargetRegister (1561 of 1839) PASS: lldb-shell :: Breakpoint/debug_rnglistx_rlex.test (1562 of 1839) UNSUPPORTED: lldb-shell :: Breakpoint/ppc64-localentry.test (1563 of 1839) PASS: lldb-api :: macosx/order/TestOrderFile.py (1564 of 1839) PASS: lldb-unit :: Symbol/./SymbolTests/LineEntryTest.GetSameLineContiguousAddressRangeOneInline (1565 of 1839) PASS: lldb-unit :: Language/Highlighting/./HighlighterTests/HighlighterTest.ClangCursorPosInOtherToken (1566 of 1839) PASS: lldb-unit :: Utility/./UtilityTests/CompletionRequest.TryCompleteCurrentArgGood (1567 of 1839) PASS: lldb-unit :: Host/./HostTests/FileSystemTest.Resolve (1568 of 1839) PASS: lldb-unit :: Core/./LLDBCoreTests/RichManglingContextTest.FromCxxMethodName (1569 of 1839) PASS: lldb-shell :: SymbolFile/DWARF/find-basic-function.cpp (1570 of 1839) PASS: lldb-unit :: UnwindAssembly/x86/./UnwindAssemblyx86Tests/Testx86AssemblyInspectionEngine.Test32bitFramelessSmallStackFrame (1571 of 1839) PASS: lldb-shell :: SymbolFile/DWARF/find-variable-file.cpp (1572 of 1839) PASS: lldb-unit :: Expression/./ExpressionTests/CppModuleConfigurationTest.LinuxLocalLibCpp (1573 of 1839) PASS: lldb-unit :: Utility/./UtilityTests/StringListTest.CopyListSingle (1574 of 1839) PASS: lldb-unit :: Utility/./UtilityTests/AnsiTerminal.WhiteSpace (1575 of 1839) PASS: lldb-shell :: ObjectFile/ELF/aarch64-relocations.yaml (1576 of 1839) PASS: lldb-unit :: Symbol/./SymbolTests/TestClangASTContext.TestIsClangType (1577 of 1839) PASS: lldb-unit :: Utility/./UtilityTests/OptionsWithRawTest.EmptySuffix (1578 of 1839) PASS: lldb-api :: functionalities/thread/concurrent_events/TestConcurrentCrashWithBreak.py (1579 of 1839) PASS: lldb-unit :: Utility/./UtilityTests/StringListTest.AppendList (1580 of 1839) UNSUPPORTED: lldb-shell :: SymbolFile/PDB/function-nested-block.test (1581 of 1839) PASS: lldb-unit :: Utility/./UtilityTests/ArgsTest.TestAppendArg (1582 of 1839) PASS: lldb-unit :: ScriptInterpreter/Python/./ScriptInterpreterPythonTests/PythonDataObjectsTest.TestPythonString (1583 of 1839) PASS: lldb-shell :: Process/TestEnvironment.test (1584 of 1839) PASS: lldb-unit :: Utility/./UtilityTests/ConstStringTest.CompareConstString (1585 of 1839) UNSUPPORTED: lldb-shell :: SymbolFile/PDB/ast-restore.test (1586 of 1839) PASS: lldb-api :: commands/source/info/TestSourceInfo.py (1587 of 1839) PASS: lldb-shell :: Driver/TestRepl.test (1588 of 1839) PASS: lldb-api :: commands/expression/import-std-module/weak_ptr/TestWeakPtr.py (1589 of 1839) PASS: lldb-shell :: Settings/TestDisableColor.test (1590 of 1839) PASS: lldb-shell :: SymbolFile/DWARF/find-method-local-struct.cpp (1591 of 1839) PASS: lldb-shell :: Reproducer/Functionalities/TestImageList.test (1592 of 1839) PASS: lldb-api :: functionalities/breakpoint/inlined_breakpoints/TestInlinedBreakpoints.py (1593 of 1839) PASS: lldb-unit :: Utility/./UtilityTests/StringExtractorTest.GetU32BigEndian (1594 of 1839) PASS: lldb-unit :: Utility/./UtilityTests/StringExtractorTest.GetNameColonValueNoColon (1595 of 1839) PASS: lldb-api :: functionalities/data-formatter/data-formatter-stl/libcxx/string/TestDataFormatterLibcxxString.py (1596 of 1839) PASS: lldb-unit :: Utility/./UtilityTests/StringLexerTest.GetUnlexed (1597 of 1839) PASS: lldb-api :: functionalities/pre_run_dylibs/TestPreRunDylibs.py (1598 of 1839) PASS: lldb-shell :: Minidump/Windows/broken-unwind.test (1599 of 1839) PASS: lldb-api :: functionalities/data-formatter/dump_dynamic/TestDumpDynamic.py (1600 of 1839) PASS: lldb-unit :: Utility/./UtilityTests/FileSpecTest.AppendPathComponent (1601 of 1839) PASS: lldb-unit :: Utility/./UtilityTests/StatusTest.ErrorConversion (1602 of 1839) PASS: lldb-unit :: Utility/./UtilityTests/BinaryStreamTest.PutSLEB128TwoBytes (1603 of 1839) PASS: lldb-unit :: Utility/./UtilityTests/StreamTeeTest.Flush (1604 of 1839) PASS: lldb-api :: macosx/function-starts/TestFunctionStarts.py (1605 of 1839) UNSUPPORTED: lldb-shell :: Register/x86-64-zmm-write.test (1606 of 1839) PASS: lldb-unit :: Utility/./UtilityTests/OptionsWithRawTest.LeadingSpaceArgs (1607 of 1839) PASS: lldb-api :: tools/lldb-server/TestGdbRemote_vCont.py (1608 of 1839) UNSUPPORTED: lldb-shell :: SymbolFile/PDB/variables.test (1609 of 1839) PASS: lldb-unit :: Utility/./UtilityTests/UriParserTest.SchemeHostSeparator2 (1610 of 1839) PASS: lldb-unit :: Utility/./UtilityTests/UriParserTest.Minimal (1611 of 1839) PASS: lldb-unit :: Process/gdb-remote/./ProcessGdbRemoteTests/GDBRemoteCommunicationClientTest.WriteRegister (1612 of 1839) PASS: lldb-api :: functionalities/data-formatter/data-formatter-stl/libcxx/atomic/TestLibCxxAtomic.py (1613 of 1839) PASS: lldb-api :: functionalities/gdb_remote_client/TestPlatformClient.py (1614 of 1839) PASS: lldb-unit :: Utility/./UtilityTests/StreamTest.PutBytesAsRawHex8ToBigEndian (1615 of 1839) PASS: lldb-unit :: ScriptInterpreter/Python/./ScriptInterpreterPythonTests/PythonDataObjectsTest.TestPythonCallableCheck (1616 of 1839) PASS: lldb-shell :: SymbolFile/NativePDB/s_constant.cpp (1617 of 1839) PASS: lldb-api :: tools/lldb-vscode/breakpoint/TestVSCode_setFunctionBreakpoints.py (1618 of 1839) PASS: lldb-api :: commands/expression/inline-namespace/TestInlineNamespace.py (1619 of 1839) PASS: lldb-unit :: Utility/./UtilityTests/LogTest.LLDB_LOG_nullptr (1620 of 1839) PASS: lldb-shell :: Breakpoint/debug_addrx.test (1621 of 1839) PASS: lldb-api :: types/TestLongTypesExpr.py (1622 of 1839) PASS: lldb-api :: functionalities/data-formatter/nsdictionarysynth/TestNSDictionarySynthetic.py (1623 of 1839) UNSUPPORTED: lldb-api :: tools/lldb-server/TestGdbRemoteAuxvSupport.py (1624 of 1839) PASS: lldb-unit :: UnwindAssembly/x86/./UnwindAssemblyx86Tests/Testx86AssemblyInspectionEngine.TestPopRBP (1625 of 1839) PASS: lldb-shell :: SymbolFile/DWARF/dir-separator-no-comp-dir.s (1626 of 1839) PASS: lldb-unit :: Utility/./UtilityTests/ArgsTest.ReplaceArgumentAtIndexEqual (1627 of 1839) PASS: lldb-shell :: SymbolFile/DWARF/debug-types-missing-signature.test (1628 of 1839) UNSUPPORTED: lldb-shell :: Register/x86-ymm-read.test (1629 of 1839) PASS: lldb-api :: python_api/sbvalue_const_addrof/TestSBValueConstAddrOf.py (1630 of 1839) PASS: lldb-api :: commands/watchpoints/watchpoint_commands/condition/TestWatchpointConditionCmd.py (1631 of 1839) PASS: lldb-api :: commands/expression/argument_passing_restrictions/TestArgumentPassingRestrictions.py (1632 of 1839) PASS: lldb-unit :: Expression/./ExpressionTests/DiagnosticManagerTest.GetStringSeverityLabels (1633 of 1839) PASS: lldb-api :: functionalities/signal/raise/TestRaise.py (1634 of 1839) XFAIL: lldb-shell :: Register/x86-64-ymm-write.test (1635 of 1839) PASS: lldb-api :: functionalities/postmortem/minidump-new/TestMiniDumpNew.py (1636 of 1839) PASS: lldb-unit :: Utility/./UtilityTests/UUIDTest.RelationalOperators (1637 of 1839) PASS: lldb-shell :: SymbolFile/NativePDB/nested-types.cpp (1638 of 1839) PASS: lldb-unit :: Host/./HostTests/MainLoopTest.UnmonitoredSignal (1639 of 1839) PASS: lldb-api :: lang/cpp/namespace/TestNamespaceLookup.py (1640 of 1839) PASS: lldb-unit :: ObjectFile/ELF/./ObjectFileELFTests/ObjectFileELFTest.GetSymtab_NoSymEntryPointArmThumbAddressClass (1641 of 1839) PASS: lldb-unit :: Language/Highlighting/./HighlighterTests/HighlighterTest.ClangPPDirectives (1642 of 1839) PASS: lldb-api :: lang/c/struct_types/TestStructTypes.py (1643 of 1839) PASS: lldb-unit :: Utility/./UtilityTests/StringListTest.LongestCommonPrefix (1644 of 1839) PASS: lldb-api :: functionalities/data-formatter/data-formatter-stl/libcxx/forward_list/TestDataFormatterLibcxxForwardList.py (1645 of 1839) UNSUPPORTED: lldb-api :: functionalities/darwin_log/filter/regex/subsystem/TestDarwinLogFilterRegexSubsystem.py (1646 of 1839) PASS: lldb-unit :: Expression/./ExpressionTests/DiagnosticManagerTest.PutString (1647 of 1839) PASS: lldb-unit :: Utility/./UtilityTests/VMRange.Clear (1648 of 1839) PASS: lldb-api :: commands/add-dsym/uuid/TestAddDsymCommand.py (1649 of 1839) PASS: lldb-unit :: Utility/./UtilityTests/RecordReplayTest.InstrumentedFooSameThis (1650 of 1839) PASS: lldb-shell :: SymbolFile/NativePDB/globals-bss.cpp (1651 of 1839) PASS: lldb-unit :: Utility/./UtilityTests/StreamTeeTest.Constructor1Stream (1652 of 1839) PASS: lldb-unit :: Language/Highlighting/./HighlighterTests/HighlighterTest.ClangPreserveNewLine (1653 of 1839) PASS: lldb-unit :: Utility/./UtilityTests/StreamTeeTest.Constructor2Streams (1654 of 1839) PASS: lldb-shell :: Driver/TestSingleQuote.test (1655 of 1839) PASS: lldb-unit :: Expression/./ExpressionTests/ClangHostTest.ComputeClangResourceDirectory (1656 of 1839) PASS: lldb-unit :: Utility/./UtilityTests/VMRange.ContainsAddr (1657 of 1839) PASS: lldb-api :: functionalities/breakpoint/global_constructor/TestBreakpointInGlobalConstructor.py (1658 of 1839) PASS: lldb-unit :: Utility/./UtilityTests/StringExtractorTest.GetU64BigEndian (1659 of 1839) PASS: lldb-unit :: Utility/./UtilityTests/StreamTest.PutRawBytesToBigEndian (1660 of 1839) PASS: lldb-unit :: Process/minidump/./LLDBMinidumpTests/MinidumpParserTest.MinidumpDuplicateModuleMinAddress (1661 of 1839) PASS: lldb-api :: commands/expression/import-std-module/forward_list-basic/TestBasicForwardList.py (1662 of 1839) UNSUPPORTED: lldb-api :: functionalities/asan/TestReportData.py (1663 of 1839) PASS: lldb-unit :: Utility/./UtilityTests/DataExtractorTest.GetCStrUnterminated (1664 of 1839) PASS: lldb-unit :: Expression/./ExpressionTests/DiagnosticManagerTest.HasFixits (1665 of 1839) PASS: lldb-api :: lang/objc/objc-class-method/TestObjCClassMethod.py (1666 of 1839) PASS: lldb-shell :: SymbolFile/DWARF/dwarf5-partial-index.cpp (1667 of 1839) PASS: lldb-shell :: Driver/TestCore.test (1668 of 1839) PASS: lldb-unit :: Language/Highlighting/./HighlighterTests/HighlighterTest.ClangBraces (1669 of 1839) PASS: lldb-api :: functionalities/data-formatter/data-formatter-stl/libcxx/variant/TestDataFormatterLibcxxVariant.py (1670 of 1839) UNSUPPORTED: lldb-shell :: Register/arm-gp-read.test (1671 of 1839) PASS: lldb-unit :: UnwindAssembly/x86/./UnwindAssemblyx86Tests/Testx86AssemblyInspectionEngine.TestSpArithx86_64Augmented (1672 of 1839) PASS: lldb-api :: commands/command/script/TestCommandScript.py (1673 of 1839) PASS: lldb-unit :: SymbolFile/DWARF/./SymbolFileDWARFTests/SymbolFileDWARFTests.TestAbbrevMissingTerminator (1674 of 1839) PASS: lldb-shell :: SymbolFile/DWARF/dwarf5-debug_line.s (1675 of 1839) UNSUPPORTED: lldb-shell :: SymbolFile/PDB/class-layout.test (1676 of 1839) PASS: lldb-api :: commands/expression/ir-interpreter/TestIRInterpreter.py (1677 of 1839) PASS: lldb-unit :: Target/./TargetTests/PathMappingListTest.RemapRoot (1678 of 1839) PASS: lldb-api :: functionalities/unwind/noreturn/TestNoreturnUnwind.py (1679 of 1839) PASS: lldb-unit :: Utility/./UtilityTests/StringExtractorTest.GetHexBytesAvail_Partial (1680 of 1839) PASS: lldb-api :: commands/expression/rdar44436068/Test128BitsInteger.py (1681 of 1839) PASS: lldb-unit :: Utility/./UtilityTests/FileSpecTest.RemoveLastPathComponent (1682 of 1839) PASS: lldb-unit :: Utility/./UtilityTests/FileSpecTest.Equal (1683 of 1839) PASS: lldb-api :: functionalities/breakpoint/breakpoint_locations/TestBreakpointLocations.py (1684 of 1839) PASS: lldb-unit :: Utility/./UtilityTests/RegularExpression.Match (1685 of 1839) PASS: lldb-api :: functionalities/postmortem/elf-core/thread_crash/TestLinuxCoreThreads.py (1686 of 1839) PASS: lldb-api :: commands/expression/top-level/TestTopLevelExprs.py (1687 of 1839) PASS: lldb-api :: commands/disassemble/basic/TestDisassembleBreakpoint.py (1688 of 1839) PASS: lldb-unit :: Platform/./LLDBPlatformTests/PlatformDarwinTest.TestParseVersionBuildDir (1689 of 1839) PASS: lldb-shell :: SymbolFile/DWARF/find-basic-type.cpp (1690 of 1839) PASS: lldb-unit :: Utility/./UtilityTests/BinaryStreamTest.PutSLEB128One (1691 of 1839) PASS: lldb-unit :: Symbol/./SymbolTests/TestClangASTContext.TestUnifyAccessSpecifiers (1692 of 1839) PASS: lldb-shell :: SymbolFile/NativePDB/ast-methods.cpp (1693 of 1839) UNSUPPORTED: lldb-api :: commands/expression/completion-crash-incomplete-record/TestCompletionCrashIncompleteRecord.py (1694 of 1839) PASS: lldb-api :: lang/cpp/chained-calls/TestCppChainedCalls.py (1695 of 1839) PASS: lldb-unit :: Utility/./UtilityTests/StringListTest.ForRange (1696 of 1839) PASS: lldb-unit :: Utility/./UtilityTests/ConstStringTest.MangledCounterpart (1697 of 1839) PASS: lldb-unit :: Utility/./UtilityTests/StringListTest.LongestCommonPrefixSingleElement (1698 of 1839) PASS: lldb-shell :: Minidump/Windows/Sigsegv/sigsegv.test (1699 of 1839) PASS: lldb-shell :: Reproducer/TestRelativePath.test (1700 of 1839) UNSUPPORTED: lldb-api :: functionalities/longjmp/TestLongjmp.py (1701 of 1839) PASS: lldb-unit :: Utility/./UtilityTests/OptionsWithRawTest.EmptyArgsOnlySuffix (1702 of 1839) PASS: lldb-unit :: UnwindAssembly/x86/./UnwindAssemblyx86Tests/Testx86AssemblyInspectionEngine.TestPushR15 (1703 of 1839) PASS: lldb-unit :: Expression/./ExpressionTests/DiagnosticManagerTest.GetStringMultipleDiags (1704 of 1839) PASS: lldb-shell :: Quit/TestQuitExitCodeHex0.test (1705 of 1839) PASS: lldb-api :: functionalities/set-data/TestSetData.py (1706 of 1839) PASS: lldb-api :: lang/cpp/char1632_t/TestChar1632T.py (1707 of 1839) PASS: lldb-api :: lang/c/blocks/TestBlocks.py (1708 of 1839) PASS: lldb-unit :: Utility/./UtilityTests/RangeTest.ContainsAddr (1709 of 1839) PASS: lldb-unit :: Utility/./UtilityTests/StringListTest.InsertStringAtIndexMove (1710 of 1839) PASS: lldb-api :: functionalities/data-formatter/stringprinter/TestStringPrinter.py (1711 of 1839) PASS: lldb-api :: lang/c/const_variables/TestConstVariables.py (1712 of 1839) UNSUPPORTED: lldb-shell :: BuildScript/toolchain-msvc.test (1713 of 1839) PASS: lldb-shell :: ObjectFile/PECOFF/invalid-export-table.yaml (1714 of 1839) PASS: lldb-api :: commands/expression/no-deadlock/TestExprDoesntBlock.py (1715 of 1839) PASS: lldb-unit :: ScriptInterpreter/Python/./ScriptInterpreterPythonTests/PythonDataObjectsTest.TestPythonListValueEquality (1716 of 1839) PASS: lldb-unit :: Utility/./UtilityTests/LogTest.Unregister (1717 of 1839) PASS: lldb-unit :: Expression/./ExpressionTests/DiagnosticManagerTest.GetStringPreserveOrder (1718 of 1839) PASS: lldb-api :: commands/frame/var-scope/TestFrameVariableScope.py (1719 of 1839) PASS: lldb-api :: python_api/frame/TestFrames.py (1720 of 1839) PASS: lldb-api :: commands/watchpoints/hello_watchpoint/TestMyFirstWatchpoint.py (1721 of 1839) UNSUPPORTED: lldb-api :: benchmarks/libcxxmap/TestBenchmarkLibcxxMap.py (1722 of 1839) PASS: lldb-shell :: ObjectFile/ELF/PT_LOAD-overlap-PT_TLS.yaml (1723 of 1839) PASS: lldb-unit :: UnwindAssembly/x86/./UnwindAssemblyx86Tests/Testx86AssemblyInspectionEngine.TestSpillRegToStackViaMOVx86_64 (1724 of 1839) PASS: lldb-unit :: Utility/./UtilityTests/StringListTest.InsertStringAtIndexStdString (1725 of 1839) PASS: lldb-api :: functionalities/data-formatter/data-formatter-named-summaries/TestDataFormatterNamedSummaries.py (1726 of 1839) PASS: lldb-api :: lang/objc/single-entry-dictionary/TestObjCSingleEntryDictionary.py (1727 of 1839) PASS: lldb-unit :: ScriptInterpreter/Python/./ScriptInterpreterPythonTests/PythonDataObjectsTest.TestRun (1728 of 1839) PASS: lldb-shell :: Reproducer/Functionalities/TestExpressionEvaluation.test (1729 of 1839) UNSUPPORTED: lldb-shell :: Register/x86-gp-read.test (1730 of 1839) PASS: lldb-unit :: Language/Highlighting/./HighlighterTests/HighlighterTest.ClangCursorPosBeforeOtherToken (1731 of 1839) PASS: lldb-unit :: Utility/./UtilityTests/StreamTest.PutHex64ByteOrderBig (1732 of 1839) PASS: lldb-api :: functionalities/data-formatter/data-formatter-stl/libcxx/initializerlist/TestInitializerList.py (1733 of 1839) PASS: lldb-api :: lang/objc/modules-cache/TestClangModulesCache.py (1734 of 1839) UNSUPPORTED: lldb-api :: functionalities/asan/TestMemoryHistory.py (1735 of 1839) PASS: lldb-unit :: Utility/./UtilityTests/BinaryStreamTest.PutULEB128FiveBytes (1736 of 1839) PASS: lldb-unit :: ObjectFile/PECOFF/./ObjectFilePECOFFTests/PECallFrameInfoTest.Frame_reg_eh (1737 of 1839) PASS: lldb-shell :: SymbolFile/Breakpad/line-table-mixed-path-styles.test (1738 of 1839) PASS: lldb-unit :: Utility/./UtilityTests/StreamTest.PutChar (1739 of 1839) PASS: lldb-unit :: UnwindAssembly/x86/./UnwindAssemblyx86Tests/Testx86AssemblyInspectionEngine.TestAddRSP (1740 of 1839) PASS: lldb-unit :: Utility/./UtilityTests/RangeTest.ContainsEndInclusiveInvalid (1741 of 1839) PASS: lldb-unit :: Host/./HostTests/SocketTest.UDPGetConnectURI (1742 of 1839) PASS: lldb-unit :: Process/gdb-remote/./ProcessGdbRemoteTests/GDBRemoteCommunicationClientTest.WriteRegisterNoSuffix (1743 of 1839) PASS: lldb-unit :: Utility/./UtilityTests/BinaryStreamTest.PutULEB128EightBytes (1744 of 1839) PASS: lldb-unit :: Host/./HostTests/SocketTest.TCPListen0GetPort (1745 of 1839) PASS: lldb-unit :: Utility/./UtilityTests/OptionsWithRawTest.UnterminatedQuote (1746 of 1839) XFAIL: lldb-shell :: Register/x86-mm-xmm-write.test (1747 of 1839) PASS: lldb-unit :: Host/./HostTests/FileSystemTest.EnumerateDirectory (1748 of 1839) PASS: lldb-unit :: Expression/./ExpressionTests/CppModuleConfigurationTest.AmbiguousLibCpp (1749 of 1839) PASS: lldb-api :: functionalities/memory/read/TestMemoryRead.py (1750 of 1839) PASS: lldb-api :: types/TestRecursiveTypes.py (1751 of 1839) PASS: lldb-api :: driver/batch_mode/TestBatchMode.py (1752 of 1839) PASS: lldb-unit :: ScriptInterpreter/Python/./ScriptInterpreterPythonTests/PythonDataObjectsTest.TestPythonTupleInitializerList2 (1753 of 1839) PASS: lldb-unit :: Utility/./UtilityTests/BinaryStreamTest.PutULEB128MaxValue (1754 of 1839) PASS: lldb-unit :: Utility/./UtilityTests/StringListTest.ShiftStdString (1755 of 1839) PASS: lldb-api :: lang/cpp/unsigned_types/TestUnsignedTypes.py (1756 of 1839) PASS: lldb-api :: commands/command/history/TestCommandHistory.py (1757 of 1839) PASS: lldb-api :: functionalities/memory/cache/TestMemoryCache.py (1758 of 1839) PASS: lldb-unit :: Utility/./UtilityTests/LogChannelTest.Enable (1759 of 1839) PASS: lldb-unit :: Process/gdb-remote/./ProcessGdbRemoteTests/GDBRemoteCommunicationServerTest.SendErrorResponse_ErrorNumber (1760 of 1839) PASS: lldb-api :: python_api/default-constructor/TestDefaultConstructorForAPIObjects.py (1761 of 1839) PASS: lldb-api :: functionalities/thread/jump/TestThreadJump.py (1762 of 1839) PASS: lldb-unit :: Process/gdb-remote/./ProcessGdbRemoteTests/GDBRemoteCommunicationClientTest.ReadRegister (1763 of 1839) PASS: lldb-unit :: Expression/./ExpressionTests/DiagnosticManagerTest.FixedExpression (1764 of 1839) PASS: lldb-unit :: Utility/./UtilityTests/AnsiTerminal.Incomplete (1765 of 1839) PASS: lldb-api :: functionalities/data-formatter/data-formatter-objc/TestDataFormatterObjCNSDate.py (1766 of 1839) PASS: lldb-unit :: Utility/./UtilityTests/AnsiTerminal.AtEnd (1767 of 1839) PASS: lldb-api :: functionalities/inferior-crashing/TestInferiorCrashingStep.py (1768 of 1839) PASS: lldb-unit :: Utility/./UtilityTests/Flags.AllClear (1769 of 1839) PASS: lldb-unit :: Process/gdb-remote/./ProcessGdbRemoteTests/GDBRemoteCommunicationClientTest.SendStartTracePacket (1770 of 1839) PASS: lldb-unit :: Utility/./UtilityTests/ScalarTest.RightShiftOperator (1771 of 1839) PASS: lldb-unit :: Utility/./UtilityTests/StructuredDataTest.StringDump (1772 of 1839) PASS: lldb-unit :: ObjectFile/Breakpad/./ObjectFileBreakpadTests/LineRecord.parse (1773 of 1839) XFAIL: lldb-shell :: Register/x86-mm-xmm-read.test (1774 of 1839) UNSUPPORTED: lldb-api :: tools/lldb-server/thread-name/TestGdbRemoteThreadName.py (1775 of 1839) PASS: lldb-api :: functionalities/breakpoint/breakpoint_ids/TestBreakpointIDs.py (1776 of 1839) PASS: lldb-shell :: Breakpoint/implicit_const_form_support.test (1777 of 1839) UNSUPPORTED: lldb-api :: commands/watchpoints/multi_watchpoint_slots/TestWatchpointMultipleSlots.py (1778 of 1839) PASS: lldb-api :: lang/cpp/dynamic-value/TestCppValueCast.py (1779 of 1839) PASS: lldb-api :: functionalities/data-formatter/data-formatter-stl/libcxx/set/TestDataFormatterLibcxxSet.py (1780 of 1839) UNSUPPORTED: lldb-api :: functionalities/tsan/global_location/TestTsanGlobalLocation.py (1781 of 1839) PASS: lldb-unit :: ScriptInterpreter/Python/./ScriptInterpreterPythonTests/PythonDataObjectsTest.TestGlobalNameResolutionNoDot (1782 of 1839) UNSUPPORTED: lldb-api :: tools/lldb-server/libraries-svr4/TestGdbRemoteLibrariesSvr4Support.py (1783 of 1839) PASS: lldb-api :: tools/lldb-server/TestGdbRemoteExitCode.py (1784 of 1839) PASS: lldb-shell :: SymbolFile/Breakpad/line-table.test (1785 of 1839) PASS: lldb-unit :: Host/./HostTests/ProcessLaunchInfoTest.Constructor (1786 of 1839) PASS: lldb-unit :: Utility/./UtilityTests/ScalarTest.Comparison (1787 of 1839) PASS: lldb-api :: lang/cpp/dynamic-value-same-basename/TestDynamicValueSameBase.py (1788 of 1839) PASS: lldb-api :: types/TestShortType.py (1789 of 1839) PASS: lldb-unit :: Utility/./UtilityTests/VMRange.CollectionContains (1790 of 1839) PASS: lldb-api :: commands/expression/call-function/TestCallBuiltinFunction.py (1791 of 1839) PASS: lldb-unit :: Host/./HostTests/ConnectionFileDescriptorTest.TCPGetURIv4 (1792 of 1839) PASS: lldb-api :: types/TestCharTypeExpr.py (1793 of 1839) PASS: lldb-unit :: Symbol/./SymbolTests/PostfixExpression.ParseOneExpression (1794 of 1839) PASS: lldb-api :: python_api/value/empty_class/TestValueAPIEmptyClass.py (1795 of 1839) PASS: lldb-api :: lang/c/inlines/TestRedefinitionsInInlines.py (1796 of 1839) PASS: lldb-api :: functionalities/thread/concurrent_events/TestConcurrentWatchpointDelayWatchpointOneBreakpoint.py (1797 of 1839) PASS: lldb-api :: lang/c/strings/TestCStrings.py (1798 of 1839) PASS: lldb-unit :: Utility/./UtilityTests/Flags.AnySet (1799 of 1839) PASS: lldb-unit :: ScriptInterpreter/Python/./ScriptInterpreterPythonTests/PythonDataObjectsTest.TestPythonDictionaryManipulation (1800 of 1839) PASS: lldb-unit :: Utility/./UtilityTests/ArchSpecTest.Compatibility (1801 of 1839) PASS: lldb-api :: commands/expression/unicode-in-variable/TestUnicodeInVariable.py (1802 of 1839) UNSUPPORTED: lldb-shell :: ObjectFile/ELF/minidebuginfo-set-and-hit-breakpoint.test (1803 of 1839) PASS: lldb-unit :: ObjectFile/Breakpad/./ObjectFileBreakpadTests/InfoRecord.parse (1804 of 1839) PASS: lldb-unit :: Utility/./UtilityTests/DataExtractorTest.GetCStrAtNullOffset (1805 of 1839) PASS: lldb-unit :: Utility/./UtilityTests/StreamTest.PutHex64ByteOrderLittle (1806 of 1839) PASS: lldb-unit :: Signals/./SignalsTests/UnixSignalsTest.GetInfo (1807 of 1839) PASS: lldb-api :: functionalities/data-formatter/data-formatter-objc/TestDataFormatterObjCKVO.py (1808 of 1839) PASS: lldb-unit :: UnwindAssembly/x86/./UnwindAssemblyx86Tests/Testx86AssemblyInspectionEngine.TestSpillRegToStackViaMOVi386 (1809 of 1839) PASS: lldb-unit :: Utility/./UtilityTests/BinaryStreamTest.PutSLEB128SevenBytes (1810 of 1839) PASS: lldb-api :: functionalities/memory/find/TestMemoryFind.py (1811 of 1839) PASS: lldb-api :: commands/expression/dollar-in-variable/TestDollarInVariable.py (1812 of 1839) PASS: lldb-unit :: ObjectFile/Breakpad/./ObjectFileBreakpadTests/StackCFIRecord.parse (1813 of 1839) PASS: lldb-unit :: Host/./HostTests/MainLoopTest.TerminatesImmediately (1814 of 1839) PASS: lldb-unit :: Interpreter/./InterpreterTests/CompletionTest.FileCompletionAbsolute (1815 of 1839) PASS: lldb-shell :: Python/crashlog.test (1816 of 1839) PASS: lldb-api :: commands/expression/static-initializers/TestStaticInitializers.py (1817 of 1839) PASS: lldb-unit :: Utility/./UtilityTests/CompletionRequest.TestCompletionOwnership (1818 of 1839) PASS: lldb-unit :: Utility/./UtilityTests/FileSpecTest.IsRelative (1819 of 1839) PASS: lldb-unit :: Host/./HostTests/SocketTest.TCPGetAddress (1820 of 1839) PASS: lldb-api :: commands/expression/persist_objc_pointeetype/TestPersistObjCPointeeType.py (1821 of 1839) PASS: lldb-unit :: Expression/./ExpressionTests/DiagnosticManagerTest.AddDiagnostic (1822 of 1839) PASS: lldb-api :: commands/expression/anonymous-struct/TestCallUserAnonTypedef.py (1823 of 1839) PASS: lldb-unit :: Target/./TargetTests/MemoryRegionInfoTest.Formatv (1824 of 1839) PASS: lldb-api :: functionalities/tail_call_frames/thread_step_out_or_return/TestSteppingOutWithArtificialFrames.py (1825 of 1839) PASS: lldb-api :: commands/process/launch/TestProcessLaunch.py (1826 of 1839) UNSUPPORTED: lldb-api :: lang/cpp/printf/TestPrintf.py (1827 of 1839) PASS: lldb-api :: lang/objc/global_ptrs/TestGlobalObjects.py (1828 of 1839) PASS: lldb-api :: commands/process/attach-resume/TestAttachResume.py (1829 of 1839) PASS: lldb-api :: functionalities/inferior-crashing/recursive-inferior/TestRecursiveInferiorStep.py (1830 of 1839) PASS: lldb-api :: functionalities/stats_api/TestStatisticsAPI.py (1831 of 1839) PASS: lldb-api :: functionalities/inferior-crashing/recursive-inferior/TestRecursiveInferior.py (1832 of 1839) PASS: lldb-api :: lang/cpp/rvalue-references/TestRvalueReferences.py (1833 of 1839) PASS: lldb-api :: functionalities/breakpoint/source_regexp/TestSourceRegexBreakpoints.py (1834 of 1839) PASS: lldb-api :: python_api/module_section/TestModuleAndSection.py (1835 of 1839) PASS: lldb-api :: lang/objc/objc-foundation-dictionary-empty/TestNSDictionary0.py (1836 of 1839) PASS: lldb-api :: functionalities/data-formatter/data-formatter-stl/libcxx/unordered/TestDataFormatterUnordered.py (1837 of 1839) PASS: lldb-api :: lang/objc/real-definition/TestRealDefinition.py (1838 of 1839) PASS: lldb-api :: lang/objc/foundation/TestFoundationDisassembly.py (1839 of 1839)

Hide Details

Testing Time: 4149.07s ******************** Failing Tests (1): lldb-api :: tools/lldb-server/TestLldbGdbServer.py

Hide Details

Hide Details

Slowest Tests: -------------------------------------------------------------------------- 300.02s: lldb-api :: lang/c/anonymous/TestAnonymous.py 308.65s: lldb-api :: commands/register/register/register_command/TestRegisters.py 346.65s: lldb-api :: functionalities/inferior-crashing/TestInferiorCrashingStep.py 347.45s: lldb-api :: tools/lldb-server/TestGdbRemoteThreadsInStopReply.py 366.20s: lldb-api :: lang/cpp/namespace/TestNamespace.py 380.02s: lldb-api :: lang/objc/exceptions/TestObjCExceptions.py 382.97s: lldb-api :: functionalities/load_unload/TestLoadUnload.py 391.39s: lldb-api :: lang/objc/objc-new-syntax/TestObjCNewSyntaxLiteral.py 399.98s: lldb-api :: commands/target/basic/TestTargetCommand.py 413.75s: lldb-api :: python_api/target/TestTargetAPI.py 424.67s: lldb-api :: types/TestLongTypes.py 474.69s: lldb-api :: lang/objc/foundation/TestObjCMethods.py 491.91s: lldb-api :: functionalities/return-value/TestReturnValue.py 510.68s: lldb-api :: types/TestLongTypesExpr.py 530.61s: lldb-api :: lang/objc/foundation/TestFoundationDisassembly.py 561.03s: lldb-api :: api/multithreaded/TestMultithreaded.py 614.99s: lldb-api :: lang/objc/hidden-ivars/TestHiddenIvars.py 739.72s: lldb-api :: lang/cpp/enum_types/TestCPP11EnumTypes.py 895.34s: lldb-api :: tools/lldb-server/TestLldbGdbServer.py 1000.82s: lldb-api :: lang/cpp/namespace/TestNamespaceLookup.py

Hide Details

Tests Times: -------------------------------------------------------------------------- [ Range ] :: [ Percentage ] :: [ Count ] -------------------------------------------------------------------------- [ 0s, 100s) :: [*********************************** ] :: [1629/1839] [ 100s, 200s) :: [*** ] :: [ 157/1839] [ 200s, 300s) :: [ ] :: [ 29/1839] [ 300s, 400s) :: [ ] :: [ 8/1839] [ 400s, 500s) :: [ ] :: [ 7/1839] [ 500s, 600s) :: [ ] :: [ 4/1839] [ 600s, 700s) :: [ ] :: [ 2/1839] [ 700s, 800s) :: [ ] :: [ 0/1839] [ 800s, 900s) :: [ ] :: [ 1/1839] [ 900s,1000s) :: [ ] :: [ 1/1839] [1000s,1100s) :: [ ] :: [ 1/1839] Expected Passes : 1679 Expected Failures : 6 Unsupported Tests : 153 Unexpected Failures: 1 FAILED: tools/lldb/test/CMakeFiles/check-lldb-lit cd /Users/buildslave/jenkins/workspace/lldb-cmake-sanitized/lldb-build/tools/lldb/test && /usr/local/bin/python /Users/buildslave/jenkins/workspace/lldb-cmake-sanitized/lldb-build/./bin/llvm-lit -v --time-tests --shuffle --xunit-xml-output=/Users/buildslave/jenkins/workspace/lldb-cmake-sanitized/test/results.xml -v --timeout 1200 /Users/buildslave/jenkins/workspace/lldb-cmake-sanitized/lldb-build/tools/lldb/test ninja: build stopped: subcommand failed. Command failed: Command '['/usr/bin/env', 'TERM=vt100', '/usr/local/bin/ninja', '-v', 'check-lldb']' returned non-zero exit status 1. Command: ['/usr/bin/env', 'TERM=vt100', '/usr/local/bin/ninja', '-v', 'check-lldb'] [Pipeline] } [Pipeline] // timeout [Pipeline] } [Pipeline] // stage [Pipeline] stage [Pipeline] { (Declarative: Post Actions) [Pipeline] scanForIssues No credentials specified [Clang (LLVM based)] Sleeping for 5 seconds due to JENKINS-32191... [Clang (LLVM based)] Parsing console log (workspace: '/Users/buildslave/jenkins/workspace/lldb-cmake-sanitized') [Clang (LLVM based)] [-ERROR-] Git blame errors: [Clang (LLVM based)] [-ERROR-] - no blame results for request <llvm-project/llvm/include/llvm/CodeGen/TargetLowering.h - [954]>.

Hide Details

[Clang (LLVM based)] [-ERROR-] Git blame errors: [Clang (LLVM based)] [-ERROR-] - no blame results for request <llvm-project/llvm/include/llvm/CodeGen/SelectionDAGNodes.h - [697]>.

Hide Details

[Clang (LLVM based)] Post processing issues on 'green-dragon-23' with source code encoding 'UTF-8' [Clang (LLVM based)] Resolving absolute file names for all issues in workspace '/Users/buildslave/jenkins/workspace/lldb-cmake-sanitized' [Clang (LLVM based)] -> 0 resolved, 0 unresolved, 2 already resolved [Clang (LLVM based)] Copying affected files to Jenkins' build folder '/Users/Shared/Jenkins/Home/jobs/lldb-cmake-sanitized/builds/604/files-with-issues' [Clang (LLVM based)] -> 2 copied, 0 not in workspace, 0 not-found, 0 with I/O error [Clang (LLVM based)] Resolving module names from module definitions (build.xml, pom.xml, or Manifest.mf files) [Clang (LLVM based)] -> resolved module names for 2 issues [Clang (LLVM based)] Resolving package names (or namespaces) by parsing the affected files [Clang (LLVM based)] -> resolved package names of 2 affected files [Clang (LLVM based)] No filter has been set, publishing all 2 issues [Clang (LLVM based)] Creating fingerprints for all affected code blocks to track issues over different builds [Clang (LLVM based)] -> created fingerprints for 2 issues [Clang (LLVM based)] Invoking Git blamer to create author and commit information for all affected files [Clang (LLVM based)] GIT_COMMIT env = 'HEAD' [Clang (LLVM based)] Git working tree = '/Users/buildslave/jenkins/workspace/lldb-cmake-sanitized' [Clang (LLVM based)] Git commit ID = '4ec74127d5f944430d247a1b8f974fcb2f62ccc1' [Clang (LLVM based)] Job workspace = '/Users/buildslave/jenkins/workspace/lldb-cmake-sanitized' [Clang (LLVM based)] Created blame requests for 2 files - invoking Git blame on agent for each of the requests [Clang (LLVM based)] -> blamed authors of issues in 2 files
[Pipeline] junit Recording test results [Pipeline] } [Pipeline] // stage [Pipeline] } [Pipeline] // withEnv [Pipeline] } [Pipeline] // node [Pipeline] End of Pipeline [BFA] Scanning build for known causes... > git rev-parse HEAD^{commit} # timeout=10 [BFA] Found failure cause(s): [BFA] Ninja target failed from category Compile [BFA] Regression test failed from category Test [BFA] Done. 1s ERROR: script returned exit code 1 Finished: FAILURE