Console Output

Skipping 8,233 KB.. Full Log
PASS: lldb-api :: sample_test/TestSampleTest.py (439 of 1905)
PASS: lldb-unit :: Expression/./ExpressionTests/DiagnosticManagerTest.GetStringMultiline (440 of 1905)
PASS: lldb-shell :: ObjectFile/PECOFF/basic-info.yaml (441 of 1905)
PASS: lldb-unit :: Utility/./UtilityTests/CompletionRequest.TryCompleteCurrentArgBad (442 of 1905)
PASS: lldb-unit :: UnwindAssembly/x86/./UnwindAssemblyx86Tests/Testx86AssemblyInspectionEngine.TestSpillRegToStackViaMOVi386 (443 of 1905)
PASS: lldb-unit :: Utility/./UtilityTests/StringExtractorTest.GetHexBytes_Partial (444 of 1905)
PASS: lldb-unit :: Utility/./UtilityTests/NameMatchesTest.Equals (445 of 1905)
PASS: lldb-unit :: Utility/./UtilityTests/StreamTest.PutBytesAsRawHex8ToLittleEndian (446 of 1905)
PASS: lldb-unit :: Utility/./UtilityTests/AnsiTerminal.KnownPrefix (447 of 1905)
PASS: lldb-unit :: Host/./HostTests/SocketTest.DomainListenConnectAccept (448 of 1905)
PASS: lldb-api :: functionalities/data-formatter/stringprinter/TestStringPrinter.py (449 of 1905)
PASS: lldb-shell :: SymbolFile/DWARF/debug_ranges_and_rnglists.test (450 of 1905)
UNSUPPORTED: lldb-shell :: Register/x86-gp-read.test (451 of 1905)
PASS: lldb-api :: functionalities/breakpoint/breakpoint_locations/TestBreakpointLocations.py (452 of 1905)
UNSUPPORTED: lldb-api :: functionalities/data-formatter/data-formatter-stl/libstdcpp/smart_ptr/TestDataFormatterStdSmartPtr.py (453 of 1905)
PASS: lldb-api :: lang/cpp/gmodules/TestWithModuleDebugging.py (454 of 1905)
PASS: lldb-unit :: Utility/./UtilityTests/ConstStringTest.CompareConstString (455 of 1905)
UNSUPPORTED: lldb-api :: functionalities/breakpoint/breakpoint_in_delayslot/TestAvoidBreakpointInDelaySlot.py (456 of 1905)
PASS: lldb-unit :: ObjectFile/Breakpad/./ObjectFileBreakpadTests/StackWinRecord.parse (457 of 1905)
PASS: lldb-shell :: SymbolFile/DWARF/find-method.cpp (458 of 1905)
PASS: lldb-unit :: Utility/./UtilityTests/UriParserTest.SchemeHostSeparator2 (459 of 1905)
PASS: lldb-api :: functionalities/data-formatter/data-formatter-objc/nsindexpath/TestDataFormatterNSIndexPath.py (460 of 1905)
PASS: lldb-unit :: Utility/./UtilityTests/ConstStringTest.format_provider (461 of 1905)
PASS: lldb-unit :: Utility/./UtilityTests/CompletionRequest.FakeLastArg (462 of 1905)
PASS: lldb-api :: functionalities/dynamic_value_child_count/TestDynamicValueChildCount.py (463 of 1905)
PASS: lldb-api :: lang/cpp/dynamic-value-same-basename/TestDynamicValueSameBase.py (464 of 1905)
PASS: lldb-unit :: Expression/./ExpressionTests/CppModuleConfigurationTest.UnknownLibCppFile (465 of 1905)
PASS: lldb-unit :: Host/./HostTests/File.GetWaitableHandleFileno (466 of 1905)
PASS: lldb-api :: python_api/value/linked_list/TestValueAPILinkedList.py (467 of 1905)
UNSUPPORTED: lldb-api :: commands/watchpoints/multi_watchpoint_slots/TestWatchpointMultipleSlots.py (468 of 1905)
PASS: lldb-shell :: SymbolFile/DWARF/find-function-regex.cpp (469 of 1905)
PASS: lldb-unit :: Utility/./UtilityTests/ArgsTest.TestQuotedUnknownEscape (470 of 1905)
PASS: lldb-unit :: Utility/./UtilityTests/StreamTest.PutHex16ByteOrderBig (471 of 1905)
PASS: lldb-unit :: UnwindAssembly/x86/./UnwindAssemblyx86Tests/Testx86AssemblyInspectionEngine.Test64bitFramelessBigStackFrame (472 of 1905)
PASS: lldb-unit :: Expression/./ExpressionTests/DiagnosticManagerTest.AppendMessageSubsequentDiags (473 of 1905)
PASS: lldb-unit :: Target/./TargetTests/ModuleCacheTest.GetAndPutStrangeHostname (474 of 1905)
PASS: lldb-api :: python_api/function_symbol/TestSymbolAPI.py (475 of 1905)
PASS: lldb-unit :: Utility/./UtilityTests/ArchSpecTest.MergeFromMachOUnknown (476 of 1905)
PASS: lldb-unit :: ScriptInterpreter/Python/./ScriptInterpreterPythonTests/PythonDataObjectsTest.TestScript (477 of 1905)
PASS: lldb-unit :: Utility/./UtilityTests/RangeTest.ContainsAddrInvalid (478 of 1905)
PASS: lldb-unit :: Utility/./UtilityTests/ConstStringTest.MangledCounterpart (479 of 1905)
XFAIL: lldb-shell :: Register/x86-64-ymm-write.test (480 of 1905)
PASS: lldb-unit :: Utility/./UtilityTests/DataExtractorTest.GetMaxU64_unchecked (481 of 1905)
PASS: lldb-unit :: Utility/./UtilityTests/SubsystemRAIITest.NormalSubsystem (482 of 1905)
PASS: lldb-unit :: Language/Highlighting/./HighlighterTests/HighlighterTest.ClangCommas (483 of 1905)
PASS: lldb-api :: lang/cpp/symbols/TestSymbols.py (484 of 1905)
PASS: lldb-api :: lang/objc/objc-new-syntax/TestObjCNewSyntaxArray.py (485 of 1905)
PASS: lldb-api :: functionalities/data-formatter/data-formatter-categories/TestDataFormatterCategories.py (486 of 1905)
PASS: lldb-api :: python_api/sbstructureddata/TestStructuredDataAPI.py (487 of 1905)
PASS: lldb-api :: lang/cpp/type_lookup/TestCppTypeLookup.py (488 of 1905)
PASS: lldb-api :: lang/c/forward/TestForwardDeclaration.py (489 of 1905)
PASS: lldb-api :: lang/objcxx/objcxx-ivar-vector/TestIvarVector.py (490 of 1905)
PASS: lldb-api :: commands/expression/regression-access-function-template-in-record/TestRegressionAccessFunctionTemplateInRecord.py (491 of 1905)
UNSUPPORTED: lldb-api :: functionalities/data-formatter/data-formatter-stl/libstdcpp/string/TestDataFormatterStdString.py (492 of 1905)
PASS: lldb-unit :: Expression/./ExpressionTests/DiagnosticManagerTest.PutStringSeverities (493 of 1905)
PASS: lldb-api :: tools/lldb-vscode/launch/TestVSCode_launch.py (494 of 1905)
PASS: lldb-api :: functionalities/type_lookup/TestTypeLookup.py (495 of 1905)
PASS: lldb-api :: tools/lldb-server/commandline/TestStubReverseConnect.py (496 of 1905)
PASS: lldb-shell :: SymbolFile/DWARF/debug_loc_and_loclists.s (497 of 1905)
PASS: lldb-api :: commands/frame/var-scope/TestFrameVariableScope.py (498 of 1905)
PASS: lldb-unit :: Host/./HostTests/FileSystemTest.EnumerateDirectory (499 of 1905)
PASS: lldb-api :: lang/c/local_variables/TestLocalVariables.py (500 of 1905)
PASS: lldb-api :: functionalities/set-data/TestSetData.py (501 of 1905)
PASS: lldb-shell :: SymbolFile/DWARF/debug_ranges.s (502 of 1905)
PASS: lldb-api :: commands/statistics/basic/TestStats.py (503 of 1905)
UNSUPPORTED: lldb-api :: lang/cpp/printf/TestPrintf.py (504 of 1905)
PASS: lldb-unit :: Utility/./UtilityTests/OptionsWithRawTest.EmptyInput (505 of 1905)
PASS: lldb-api :: commands/expression/persist_objc_pointeetype/TestPersistObjCPointeeType.py (506 of 1905)
PASS: lldb-shell :: Reproducer/TestWorkingDir.test (507 of 1905)
PASS: lldb-unit :: Utility/./UtilityTests/BinaryStreamTest.PutSLEB128TwoBytes (508 of 1905)
UNSUPPORTED: lldb-api :: iohandler/completion/TestIOHandlerCompletion.py (509 of 1905)
PASS: lldb-api :: commands/watchpoints/multiple_threads/TestWatchpointMultipleThreads.py (510 of 1905)
PASS: lldb-api :: lang/c/find_struct_type/TestFindStructTypes.py (511 of 1905)
PASS: lldb-unit :: Utility/./UtilityTests/StringListTest.Join (512 of 1905)
PASS: lldb-unit :: Utility/./UtilityTests/RangeDataVector.FindEntryThatContains_Overlap (513 of 1905)
PASS: lldb-shell :: ObjectFile/ELF/netbsd-core-amd64.test (514 of 1905)
UNSUPPORTED: lldb-api :: functionalities/tsan/thread_numbers/TestTsanThreadNumbers.py (515 of 1905)
PASS: lldb-api :: lang/objc/objc-static-method/TestObjCStaticMethod.py (516 of 1905)
PASS: lldb-unit :: Language/Highlighting/./HighlighterTests/HighlighterTest.FallbackHighlighter (517 of 1905)
PASS: lldb-shell :: SymbolFile/DWARF/debug_ranges-missing-section.s (518 of 1905)
PASS: lldb-unit :: Utility/./UtilityTests/StringExtractorTest.DecodeHexU8_InvalidHex2 (519 of 1905)
UNSUPPORTED: lldb-api :: functionalities/darwin_log/filter/exact_match/message/TestDarwinLogFilterMatchMessage.py (520 of 1905)
PASS: lldb-api :: commands/expression/call-overridden-method/TestCallOverriddenMethod.py (521 of 1905)
PASS: lldb-unit :: Host/./HostTests/ConnectionFileDescriptorTest.TCPGetURIv4 (522 of 1905)
UNSUPPORTED: lldb-shell :: SymbolFile/PDB/variables-locations.test (523 of 1905)
UNSUPPORTED: lldb-shell :: SymbolFile/NativePDB/typedefs.cpp (524 of 1905)
PASS: lldb-api :: lang/c/struct_types/TestStructTypes.py (525 of 1905)
PASS: lldb-unit :: ScriptInterpreter/Python/./ScriptInterpreterPythonTests/PythonDataObjectsTest.TestCallable (526 of 1905)
PASS: lldb-unit :: Symbol/./SymbolTests/TestClangASTContext.TestDeletingImplicitCopyCstrDueToMoveCStr (527 of 1905)
PASS: lldb-api :: commands/command/script/import/rdar-12586188/TestRdar12586188.py (528 of 1905)
PASS: lldb-api :: lang/cpp/rvalue-references/TestRvalueReferences.py (529 of 1905)
PASS: lldb-shell :: ObjectFile/MachO/lc_build_version_notools.yaml (530 of 1905)
PASS: lldb-api :: functionalities/inline-stepping/TestInlineStepping.py (531 of 1905)
PASS: lldb-shell :: ExecControl/StopHook/stop-hook.test (532 of 1905)
PASS: lldb-unit :: ScriptInterpreter/Python/./ScriptInterpreterPythonTests/PythonDataObjectsTest.TestPythonIntegerToStructuredInteger (533 of 1905)
PASS: lldb-unit :: Utility/./UtilityTests/UriParserTest.BracketedHostname (534 of 1905)
PASS: lldb-shell :: Reproducer/TestReuseDirectory.test (535 of 1905)
PASS: lldb-unit :: Utility/./UtilityTests/DataExtractorTest.GetCStrUnterminated (536 of 1905)
PASS: lldb-api :: functionalities/thread/concurrent_events/TestConcurrentDelayWatchBreak.py (537 of 1905)
PASS: lldb-api :: lang/objc/objc-property/TestObjCProperty.py (538 of 1905)
PASS: lldb-unit :: Symbol/./SymbolTests/TestClangASTContext.TestConvertAccessTypeToAccessSpecifier (539 of 1905)
PASS: lldb-api :: functionalities/thread/concurrent_events/TestConcurrentManyWatchpoints.py (540 of 1905)
PASS: lldb-unit :: Utility/./UtilityTests/ArchSpecTest.MergeFrom (541 of 1905)
PASS: lldb-api :: lang/cpp/inlines/TestInlines.py (542 of 1905)
PASS: lldb-api :: commands/expression/weak_symbols/TestWeakSymbols.py (543 of 1905)
PASS: lldb-unit :: Utility/./UtilityTests/BroadcasterTest.BroadcastEvent (544 of 1905)
PASS: lldb-unit :: ObjectFile/ELF/./ObjectFileELFTests/ObjectFileELFTest.GetSymtab_NoSymEntryPointArmAddressClass (545 of 1905)
PASS: lldb-api :: lang/objc/hidden-ivars/TestHiddenIvars.py (546 of 1905)
PASS: lldb-api :: commands/expression/import-std-module/no-std-module/TestMissingStdModule.py (547 of 1905)
UNSUPPORTED: lldb-shell :: ScriptInterpreter/Lua/bindings.test (548 of 1905)
PASS: lldb-unit :: Host/./HostTests/FileSystemTest.OpenErrno (549 of 1905)
PASS: lldb-unit :: Process/gdb-remote/./ProcessGdbRemoteTests/GDBRemoteClientBaseTest.SendContinueAndInterrupt2PacketBug (550 of 1905)
PASS: lldb-unit :: Process/gdb-remote/./ProcessGdbRemoteTests/GDBRemoteCommunicationClientTest.SendGetDataPacket (551 of 1905)
PASS: lldb-shell :: SymbolFile/DWARF/debug-line-basic.s (552 of 1905)
PASS: lldb-api :: functionalities/data-formatter/data-formatter-stl/libcxx/multimap/TestDataFormatterLibccMultiMap.py (553 of 1905)
UNSUPPORTED: lldb-shell :: SymbolFile/PDB/type-quals.test (554 of 1905)
PASS: lldb-unit :: Utility/./UtilityTests/DataExtractorTest.GetMaxU64 (555 of 1905)
PASS: lldb-unit :: Utility/./UtilityTests/RangeTest.NotEqualInvalid (556 of 1905)
PASS: lldb-unit :: ScriptInterpreter/Python/./ScriptInterpreterPythonTests/PythonDataObjectsTest.TestPythonBytes (557 of 1905)
PASS: lldb-unit :: Utility/./UtilityTests/NameMatchesTest.EndsWith (558 of 1905)
PASS: lldb-unit :: Process/gdb-remote/./ProcessGdbRemoteTests/GDBRemoteCommunicationClientTest.WriteRegister (559 of 1905)
PASS: lldb-shell :: Reproducer/Functionalities/TestImageList.test (560 of 1905)
PASS: lldb-unit :: Utility/./UtilityTests/BinaryStreamTest.PutSLEB128SevenBytes (561 of 1905)
PASS: lldb-unit :: Utility/./UtilityTests/StreamTest.PutCString (562 of 1905)
PASS: lldb-shell :: SymbolFile/NativePDB/ast-functions.cpp (563 of 1905)
PASS: lldb-unit :: Utility/./UtilityTests/BinaryStreamTest.PutSLEB128ThreeBytes (564 of 1905)
PASS: lldb-shell :: SymbolFile/DWARF/forward-declarations.s (565 of 1905)
PASS: lldb-api :: lang/cpp/template/TestTemplateArgs.py (566 of 1905)
PASS: lldb-unit :: UnwindAssembly/x86/./UnwindAssemblyx86Tests/Testx86AssemblyInspectionEngine.TestPushEAX (567 of 1905)
PASS: lldb-unit :: tools/lldb-server/tests/./LLDBServerTests/TestBase.LaunchModePreservesEnvironment (568 of 1905)
PASS: lldb-unit :: Utility/./UtilityTests/ProcessInstanceInfoMatch.Name (569 of 1905)
PASS: lldb-api :: python_api/section/TestSectionAPI.py (570 of 1905)
PASS: lldb-api :: functionalities/postmortem/elf-core/gcore/TestGCore.py (571 of 1905)
PASS: lldb-unit :: Expression/./ExpressionTests/ClangHostTest.MacOSX (572 of 1905)
PASS: lldb-unit :: Interpreter/./InterpreterTests/CompletionTest.DirCompletionAbsolute (573 of 1905)
PASS: lldb-unit :: Utility/./UtilityTests/RangeTest.Slide (574 of 1905)
PASS: lldb-unit :: Expression/./ExpressionTests/DiagnosticManagerTest.PutString (575 of 1905)
PASS: lldb-api :: functionalities/gdb_remote_client/TestStopPCs.py (576 of 1905)
PASS: lldb-unit :: Host/./HostTests/HostInfoTest.GetHostname (577 of 1905)
PASS: lldb-unit :: Utility/./UtilityTests/AnsiTerminal.AtEnd (578 of 1905)
PASS: lldb-unit :: Utility/./UtilityTests/ScalarTest.ComparisonFloat (579 of 1905)
UNSUPPORTED: lldb-shell :: ScriptInterpreter/Lua/breakpoint_callback.test (580 of 1905)
PASS: lldb-api :: functionalities/breakpoint/breakpoint_ids/TestBreakpointIDs.py (581 of 1905)
PASS: lldb-unit :: Utility/./UtilityTests/StringListTest.JoinMultiCharSeparator (582 of 1905)
PASS: lldb-shell :: SymbolFile/DWARF/inline-function-address.ll (583 of 1905)
PASS: lldb-unit :: Process/gdb-remote/./ProcessGdbRemoteTests/GDBRemoteClientBaseTest.SendContinueAndAsyncPacket (584 of 1905)
PASS: lldb-unit :: Utility/./UtilityTests/ProcessInstanceInfo.DumpTable (585 of 1905)
PASS: lldb-unit :: Utility/./UtilityTests/StructuredDataTest.ParseJSONFromFile (586 of 1905)
PASS: lldb-api :: functionalities/thread/num_threads/TestNumThreads.py (587 of 1905)
PASS: lldb-api :: functionalities/breakpoint/serialize/TestBreakpointSerialization.py (588 of 1905)
PASS: lldb-unit :: Utility/./UtilityTests/StringListTest.JoinNonSpace (589 of 1905)
PASS: lldb-api :: api/command-return-object/TestSBCommandReturnObject.py (590 of 1905)
PASS: lldb-unit :: Utility/./UtilityTests/RecordReplayTest.InstrumentedFoo (591 of 1905)
PASS: lldb-api :: python_api/watchpoint/condition/TestWatchpointConditionAPI.py (592 of 1905)
PASS: lldb-unit :: Symbol/./SymbolTests/TestClangASTContext.TestFunctionTemplateConstruction (593 of 1905)
UNSUPPORTED: lldb-api :: tools/lldb-vscode/completions/TestVSCode_completions.py (594 of 1905)
UNSUPPORTED: lldb-shell :: SymbolFile/PDB/variables.test (595 of 1905)
PASS: lldb-shell :: Commands/CommandScriptImmediateOutput/CommandScriptImmediateOutputConsole.test (596 of 1905)
PASS: lldb-unit :: Utility/./UtilityTests/UUIDTest.SetFromStringRef (597 of 1905)
PASS: lldb-unit :: Language/Highlighting/./HighlighterTests/HighlighterTest.ClangTrailingBackslashBeforeNewline (598 of 1905)
PASS: lldb-unit :: Utility/./UtilityTests/BinaryStreamTest.PutULEB128EightBytes (599 of 1905)
PASS: lldb-unit :: Utility/./UtilityTests/RegularExpression.CopyAssignment (600 of 1905)
PASS: lldb-unit :: Interpreter/./InterpreterTests/OptionArgParserTest.toBoolean (601 of 1905)
PASS: lldb-unit :: Process/minidump/./LLDBMinidumpTests/MinidumpParserTest.GetThreadContext_x86_64 (602 of 1905)
PASS: lldb-unit :: Host/./HostTests/Host.GetEnvironment (603 of 1905)
UNSUPPORTED: lldb-shell :: SymbolFile/PDB/ast-restore.test (604 of 1905)
PASS: lldb-unit :: Utility/./UtilityTests/RangeTest.EqualInvalid (605 of 1905)
PASS: lldb-unit :: Utility/./UtilityTests/UriParserTest.Minimal (606 of 1905)
PASS: lldb-api :: functionalities/breakpoint/require_hw_breakpoints/TestRequireHWBreakpoints.py (607 of 1905)
PASS: lldb-api :: lang/cpp/dynamic-value/TestDynamicValue.py (608 of 1905)
PASS: lldb-api :: tools/lldb-server/inferior-crash/TestGdbRemoteSegFault.py (609 of 1905)
PASS: lldb-unit :: Core/./LLDBCoreTests/MangledTest.EmptyForInvalidName (610 of 1905)
PASS: lldb-shell :: ObjectFile/ELF/PT_LOAD-empty.yaml (611 of 1905)
PASS: lldb-api :: lang/objc/rdar-11355592/TestRdar11355592.py (612 of 1905)
PASS: lldb-unit :: Utility/./UtilityTests/StringListTest.InsertStringAtIndexStdString (613 of 1905)
PASS: lldb-api :: lang/objc/modules-hash-mismatch/TestClangModulesHashMismatch.py (614 of 1905)
PASS: lldb-shell :: Driver/TestNoUseColor.test (615 of 1905)
PASS: lldb-unit :: Utility/./UtilityTests/StatusTest.Formatv (616 of 1905)
PASS: lldb-shell :: SymbolFile/Breakpad/symtab.test (617 of 1905)
UNSUPPORTED: lldb-api :: functionalities/data-formatter/data-formatter-stl/libstdcpp/unique_ptr/TestDataFormatterStdUniquePtr.py (618 of 1905)
PASS: lldb-shell :: SymbolFile/DWARF/debug_loc-aslr.s (619 of 1905)
PASS: lldb-shell :: Watchpoint/SetErrorCases.test (620 of 1905)
PASS: lldb-api :: functionalities/breakpoint/breakpoint_conditions/TestBreakpointConditions.py (621 of 1905)
PASS: lldb-api :: macosx/lc-note/kern-ver-str/TestKernVerStrLCNOTE.py (622 of 1905)
PASS: lldb-unit :: Core/./LLDBCoreTests/RichManglingContextTest.IPDRealloc (623 of 1905)
PASS: lldb-api :: commands/expression/import-std-module/weak_ptr/TestWeakPtr.py (624 of 1905)
PASS: lldb-unit :: Language/CPlusPlus/./LanguageCPlusPlusTests/CPlusPlusLanguage.MethodNameParsing (625 of 1905)
PASS: lldb-api :: functionalities/thread/concurrent_events/TestConcurrentDelaySignalWatch.py (626 of 1905)
PASS: lldb-unit :: Utility/./UtilityTests/TimerTest.CategoryTimes (627 of 1905)
PASS: lldb-api :: lang/objc/objc-checker/TestObjCCheckers.py (628 of 1905)
UNSUPPORTED: lldb-api :: linux/add-symbols/TestTargetSymbolsAddCommand.py (629 of 1905)
PASS: lldb-unit :: Symbol/./SymbolTests/TestClangASTContext.TemplateArguments (630 of 1905)
PASS: lldb-unit :: Utility/./UtilityTests/LogChannelTest.Disable (631 of 1905)
PASS: lldb-shell :: SymbolFile/DWARF/find-method-local-struct.cpp (632 of 1905)
UNSUPPORTED: lldb-api :: functionalities/tty/TestTerminal.py (633 of 1905)
PASS: lldb-api :: functionalities/breakpoint/scripted_bkpt/TestScriptedResolver.py (634 of 1905)
PASS: lldb-unit :: UnwindAssembly/x86/./UnwindAssemblyx86Tests/Testx86AssemblyInspectionEngine.TestPopR12 (635 of 1905)
PASS: lldb-shell :: BuildScript/modes.test (636 of 1905)
PASS: lldb-unit :: Interpreter/./InterpreterTests/CompletionTest.DirCompletionUsername (637 of 1905)
PASS: lldb-api :: commands/watchpoints/watchpoint_commands/condition/TestWatchpointConditionCmd.py (638 of 1905)
PASS: lldb-unit :: UnwindAssembly/x86/./UnwindAssemblyx86Tests/Testx86AssemblyInspectionEngine.TestSimplei386ugmented (639 of 1905)
PASS: lldb-unit :: Utility/./UtilityTests/StringExtractorTest.GetHexU8_Exact_NoEof (640 of 1905)
PASS: lldb-shell :: SymbolFile/DWARF/clang-ast-from-dwarf-objc-property.m (641 of 1905)
UNSUPPORTED: lldb-api :: commands/expression/multiline-completion/TestMultilineCompletion.py (642 of 1905)
PASS: lldb-api :: lang/cpp/trivial_abi/TestTrivialABI.py (643 of 1905)
PASS: lldb-api :: lang/objc/foundation/TestObjCMethodsNSArray.py (644 of 1905)
PASS: lldb-shell :: SymbolFile/NativePDB/globals-bss.cpp (645 of 1905)
PASS: lldb-api :: functionalities/tail_call_frames/unambiguous_sequence/TestUnambiguousTailCalls.py (646 of 1905)
PASS: lldb-unit :: UnwindAssembly/x86/./UnwindAssemblyx86Tests/Testx86AssemblyInspectionEngine.TestPopRBX (647 of 1905)
PASS: lldb-api :: commands/help/TestHelp.py (648 of 1905)
UNSUPPORTED: lldb-api :: arm/breakpoint-thumb-codesection/TestBreakpointThumbCodesection.py (649 of 1905)
PASS: lldb-shell :: Reproducer/TestDump.test (650 of 1905)
PASS: lldb-api :: functionalities/thread/concurrent_events/TestConcurrentDelaySignalBreak.py (651 of 1905)
PASS: lldb-unit :: Signals/./SignalsTests/UnixSignalsTest.Iteration (652 of 1905)
PASS: lldb-unit :: Symbol/./SymbolTests/TestClangASTImporter.CopyTypeTagDecl (653 of 1905)
PASS: lldb-shell :: SymbolFile/DWARF/debug_loc.s (654 of 1905)
PASS: lldb-unit :: Utility/./UtilityTests/ArchSpecTest.TripleComponentsWereSpecified (655 of 1905)
PASS: lldb-api :: functionalities/breakpoint/breakpoint_command/TestRegexpBreakCommand.py (656 of 1905)
PASS: lldb-api :: commands/expression/vector_of_enums/TestVectorOfEnums.py (657 of 1905)
PASS: lldb-shell :: SymbolFile/DWARF/dir-separator-no-comp-dir.s (658 of 1905)
PASS: lldb-api :: lang/cpp/operator-overload/TestOperatorOverload.py (659 of 1905)
PASS: lldb-unit :: Utility/./UtilityTests/ArgsTest.ReplaceArgumentAtIndexShort (660 of 1905)
PASS: lldb-unit :: Expression/./ExpressionTests/DiagnosticManagerTest.GetStringNoDiags (661 of 1905)
PASS: lldb-unit :: Utility/./UtilityTests/AnsiTerminal.AtStart (662 of 1905)
PASS: lldb-api :: lang/objc/objc-class-method/TestObjCClassMethod.py (663 of 1905)
PASS: lldb-unit :: Language/CPlusPlus/./LanguageCPlusPlusTests/CPlusPlusLanguage.ExtractContextAndIdentifier (664 of 1905)
PASS: lldb-unit :: Utility/./UtilityTests/StringExtractorTest.InitMisc (665 of 1905)
PASS: lldb-api :: functionalities/data-formatter/data-formatter-objc/cmtime/TestDataFormatterCMTime.py (666 of 1905)
PASS: lldb-api :: functionalities/float-display/TestFloatDisplay.py (667 of 1905)
PASS: lldb-api :: commands/expression/call-function/TestCallBuiltinFunction.py (668 of 1905)
PASS: lldb-shell :: ObjectFile/ELF/section-types.yaml (669 of 1905)
PASS: lldb-api :: functionalities/data-formatter/data-formatter-stl/libcxx/list/loop/TestDataFormatterLibcxxListLoop.py (670 of 1905)
PASS: lldb-unit :: Utility/./UtilityTests/StreamTest.PutRawBytesToLittleEndian (671 of 1905)
UNSUPPORTED: lldb-api :: functionalities/thread/multi_break/TestMultipleBreakpoints.py (672 of 1905)
PASS: lldb-unit :: debugserver/./debugserverTests/RNBSocket.LoopBackListenIPv4 (673 of 1905)
PASS: lldb-api :: functionalities/data-formatter/frameformat_smallstruct/TestFrameFormatSmallStruct.py (674 of 1905)
PASS: lldb-unit :: Utility/./UtilityTests/StringExtractorTest.GetU64LittleEndian (675 of 1905)
PASS: lldb-unit :: Process/minidump/./LLDBMinidumpTests/RegisterContextMinidump.ConvertMinidumpContext_x86_32 (676 of 1905)
PASS: lldb-unit :: ObjectFile/Breakpad/./ObjectFileBreakpadTests/FuncRecord.parse (677 of 1905)
PASS: lldb-api :: functionalities/memory/find/TestMemoryFind.py (678 of 1905)
PASS: lldb-unit :: Utility/./UtilityTests/StreamTeeTest.GetStreamAtIndexOutOfBounds (679 of 1905)
PASS: lldb-unit :: Symbol/./SymbolTests/TestClangASTContext.TestRemoveFastQualifiers (680 of 1905)
PASS: lldb-unit :: Utility/./UtilityTests/StreamTest.PutHex8 (681 of 1905)
PASS: lldb-unit :: ObjectFile/Breakpad/./ObjectFileBreakpadTests/InfoRecord.parse (682 of 1905)
PASS: lldb-api :: commands/settings/quoting/TestQuoting.py (683 of 1905)
PASS: lldb-api :: functionalities/step-avoids-no-debug/TestStepNoDebug.py (684 of 1905)
PASS: lldb-api :: commands/command/script/import/TestImport.py (685 of 1905)
PASS: lldb-shell :: Quit/TestQuitExitCode30.test (686 of 1905)
UNSUPPORTED: lldb-api :: terminal/TestEditline.py (687 of 1905)
PASS: lldb-shell :: Breakpoint/debug_rnglistx_rlex.test (688 of 1905)
PASS: lldb-unit :: Host/./HostTests/SocketTest.TCPGetAddress (689 of 1905)
PASS: lldb-api :: lang/objc/orderedset/TestOrderedSet.py (690 of 1905)
PASS: lldb-api :: arm/emulation/TestEmulations.py (691 of 1905)
PASS: lldb-api :: types/TestIntegerType.py (692 of 1905)
PASS: lldb-unit :: Utility/./UtilityTests/StringLexerTest.PutBack (693 of 1905)
PASS: lldb-unit :: Utility/./UtilityTests/StringExtractorTest.GetHexBytes (694 of 1905)
PASS: lldb-api :: functionalities/thread/concurrent_events/TestConcurrentSignalWatchBreak.py (695 of 1905)
PASS: lldb-unit :: UnwindAssembly/x86/./UnwindAssemblyx86Tests/Testx86AssemblyInspectionEngine.TestSimple64bitFrameFunction (696 of 1905)
PASS: lldb-api :: functionalities/return-value/TestReturnValue.py (697 of 1905)
PASS: lldb-api :: lang/cpp/thread_local/TestThreadLocal.py (698 of 1905)
UNSUPPORTED: lldb-api :: functionalities/darwin_log/filter/exact_match/subsystem/TestDarwinLogFilterMatchSubsystem.py (699 of 1905)
PASS: lldb-unit :: Process/minidump/./LLDBMinidumpTests/MinidumpParserTest.GetMemoryRegionInfoLinuxMaps (700 of 1905)
PASS: lldb-unit :: Utility/./UtilityTests/ListenerTest.GetEventWait (701 of 1905)
PASS: lldb-unit :: Utility/./UtilityTests/EnvironmentTest.EnvpConstruction (702 of 1905)
PASS: lldb-api :: commands/expression/context-object-objc/TestContextObjectObjc.py (703 of 1905)
PASS: lldb-unit :: SymbolFile/NativePDB/./SymbolFileNativePDBTests/PDBFPOProgramToDWARFExpressionTests.MultipleIndependentAssignments (704 of 1905)
PASS: lldb-api :: tools/lldb-vscode/stackTrace/TestVSCode_stackTrace.py (705 of 1905)
PASS: lldb-api :: functionalities/data-formatter/language_category_updates/TestDataFormatterLanguageCategoryUpdates.py (706 of 1905)
PASS: lldb-unit :: Target/./TargetTests/PathMappingListTest.RemapRoot (707 of 1905)
PASS: lldb-unit :: Utility/./UtilityTests/StringListTest.LongestCommonPrefixDuplicateElement (708 of 1905)
PASS: lldb-unit :: Utility/./UtilityTests/ArgsTest.TestMultipleArgs (709 of 1905)
PASS: lldb-api :: lang/objc/objc-stepping/TestObjCStepping.py (710 of 1905)
PASS: lldb-api :: lang/objc/rdar-10967107/TestRdar10967107.py (711 of 1905)
PASS: lldb-shell :: SymbolFile/DWARF/debug_rnglists-dwo.s (712 of 1905)
PASS: lldb-api :: commands/expression/ignore-artificial-constructors/TestIgnoreArtificialConstructors.py (713 of 1905)
PASS: lldb-unit :: Utility/./UtilityTests/StreamTest.AddressNoSuffix (714 of 1905)
PASS: lldb-shell :: Breakpoint/debug_addrx.test (715 of 1905)
PASS: lldb-unit :: Host/./HostTests/NativeProcessProtocolTest.SetBreakpointFailWrite (716 of 1905)
PASS: lldb-api :: commands/expression/import-std-module/deque-basic/TestBasicDeque.py (717 of 1905)
PASS: lldb-unit :: Host/./HostTests/FileSystemTest.GetByteSize (718 of 1905)
PASS: lldb-api :: lang/c/inlines/TestRedefinitionsInInlines.py (719 of 1905)
PASS: lldb-unit :: Utility/./UtilityTests/StringExtractorTest.GetHexBytesAvail_Underflow (720 of 1905)
PASS: lldb-api :: commands/expression/class_template_specialization_empty_pack/TestClassTemplateSpecializationParametersHandling.py (721 of 1905)
PASS: lldb-unit :: Symbol/./SymbolTests/TestClangASTContext.TestRecordHasFields (722 of 1905)
PASS: lldb-unit :: Utility/./UtilityTests/GeneratorTest.Get (723 of 1905)
UNSUPPORTED: lldb-shell :: Register/aarch64-fp-read.test (724 of 1905)
PASS: lldb-api :: lang/objc/real-definition/TestRealDefinition.py (725 of 1905)
PASS: lldb-shell :: ObjectFile/wasm/embedded-debug-sections.yaml (726 of 1905)
PASS: lldb-unit :: UnwindAssembly/x86/./UnwindAssemblyx86Tests/Testx86AssemblyInspectionEngine.TestSpillRegToStackViaMOVx86_64 (727 of 1905)
UNSUPPORTED: lldb-shell :: Register/aarch64-gp-read.test (728 of 1905)
PASS: lldb-unit :: Expression/./ExpressionTests/DWARFExpression.DW_OP_pick (729 of 1905)
PASS: lldb-api :: tools/lldb-server/TestLldbGdbServer.py (730 of 1905)
PASS: lldb-api :: lang/objcxx/hide-runtime-values/TestObjCXXHideRuntimeValues.py (731 of 1905)
PASS: lldb-unit :: Utility/./UtilityTests/LogChannelEnabledTest.LLDB_LOG_ERROR (732 of 1905)
PASS: lldb-shell :: ObjectFile/PECOFF/symbol.yaml (733 of 1905)
PASS: lldb-unit :: ScriptInterpreter/Python/./ScriptInterpreterPythonTests/PythonDataObjectsTest.TestPythonStringToStr (734 of 1905)
PASS: lldb-unit :: Utility/./UtilityTests/StringListTest.GetMaxStringLengthDecreasingSize (735 of 1905)
PASS: lldb-api :: types/TestCharTypeExpr.py (736 of 1905)
PASS: lldb-shell :: SymbolFile/NativePDB/s_constant.cpp (737 of 1905)
PASS: lldb-unit :: Utility/./UtilityTests/LogChannelEnabledTest.LogThread (738 of 1905)
PASS: lldb-unit :: Process/gdb-remote/./ProcessGdbRemoteTests/GDBRemoteCommunicationClientTest.TestPacketSpeedJSON (739 of 1905)
PASS: lldb-unit :: UnwindAssembly/x86/./UnwindAssemblyx86Tests/Testx86AssemblyInspectionEngine.TestPushR14 (740 of 1905)
PASS: lldb-unit :: Core/./LLDBCoreTests/UniqueCStringMap.NoDefaultConstructor (741 of 1905)
UNSUPPORTED: lldb-api :: functionalities/darwin_log/filter/exact_match/category/TestDarwinLogFilterMatchCategory.py (742 of 1905)
PASS: lldb-api :: functionalities/unwind/noreturn/module-end/TestNoReturnModuleEnd.py (743 of 1905)
PASS: lldb-api :: lang/c/const_variables/TestConstVariables.py (744 of 1905)
PASS: lldb-shell :: SymbolFile/DWARF/debug_line-relative_path.s (745 of 1905)
PASS: lldb-api :: functionalities/jitloader_gdb/TestJITLoaderGDB.py (746 of 1905)
PASS: lldb-shell :: Driver/TestRepl.test (747 of 1905)
PASS: lldb-api :: lang/c/step-target/TestStepTarget.py (748 of 1905)
UNSUPPORTED: lldb-shell :: SymbolFile/NativePDB/local-variables.cpp (749 of 1905)
PASS: lldb-shell :: BuildScript/toolchain-clang.test (750 of 1905)
UNSUPPORTED: lldb-api :: functionalities/thread/create_during_step/TestCreateDuringStep.py (751 of 1905)
UNSUPPORTED: lldb-shell :: Unwind/eh-frame-small-fde.test (752 of 1905)
PASS: lldb-unit :: Utility/./UtilityTests/RangeDataVector.CustomSort (753 of 1905)
PASS: lldb-api :: functionalities/var_path/TestVarPath.py (754 of 1905)
PASS: lldb-shell :: SymbolFile/NativePDB/nested-types.cpp (755 of 1905)
PASS: lldb-api :: functionalities/breakpoint/address_breakpoints/TestBadAddressBreakpoints.py (756 of 1905)
PASS: lldb-shell :: Process/TestEnvironment.test (757 of 1905)
PASS: lldb-shell :: BuildScript/compiler-full-path.test (758 of 1905)
PASS: lldb-unit :: Utility/./UtilityTests/FileSpecTest.AppendPathComponent (759 of 1905)
PASS: lldb-unit :: Process/gdb-remote/./ProcessGdbRemoteTests/GDBRemoteClientBaseTest.SendContinueDelegateInterface (760 of 1905)
PASS: lldb-shell :: SymbolFile/DWARF/dir-separator-posix.s (761 of 1905)
PASS: lldb-api :: commands/expression/calculator_mode/TestCalculatorMode.py (762 of 1905)
PASS: lldb-unit :: Utility/./UtilityTests/Flags.AnyClear (763 of 1905)
PASS: lldb-unit :: ScriptInterpreter/Python/./ScriptInterpreterPythonTests/PythonDataObjectsTest.TestPythonListValueEquality (764 of 1905)
PASS: lldb-unit :: Language/Highlighting/./HighlighterTests/HighlighterTest.Colons (765 of 1905)
PASS: lldb-unit :: Utility/./UtilityTests/StringListTest.JoinSingle (766 of 1905)
PASS: lldb-shell :: SymbolFile/NativePDB/function-types-classes.cpp (767 of 1905)
PASS: lldb-api :: lang/cpp/limit-debug-info/TestWithLimitDebugInfo.py (768 of 1905)
PASS: lldb-api :: commands/expression/persistent_ptr_update/TestPersistentPtrUpdate.py (769 of 1905)
PASS: lldb-unit :: Utility/./UtilityTests/UriParserTest.BracketedHostnameWithColon (770 of 1905)
PASS: lldb-unit :: Symbol/./SymbolTests/TestClangASTContext.TestFunctionTemplateInRecordConstruction (771 of 1905)
PASS: lldb-shell :: Breakpoint/debug_rnglist_offset_pair.test (772 of 1905)
PASS: lldb-api :: python_api/symbol-context/TestSymbolContext.py (773 of 1905)
PASS: lldb-api :: commands/apropos/basic/TestApropos.py (774 of 1905)
PASS: lldb-api :: lang/objc/foundation/TestSymbolTable.py (775 of 1905)
PASS: lldb-api :: lang/objc/objc-optimized/TestObjcOptimized.py (776 of 1905)
PASS: lldb-api :: commands/command/source/TestCommandSource.py (777 of 1905)
UNSUPPORTED: lldb-shell :: ObjectFile/PECOFF/disassemble-thumb.yaml (778 of 1905)
PASS: lldb-api :: lang/c/register_variables/TestRegisterVariables.py (779 of 1905)
PASS: lldb-unit :: Process/gdb-remote/./ProcessGdbRemoteTests/GDBRemoteCommunicationClientTest.GetModulesInfo_UUID20 (780 of 1905)
UNSUPPORTED: lldb-shell :: ScriptInterpreter/Lua/lua.test (781 of 1905)
PASS: lldb-shell :: ScriptInterpreter/Python/crashlog.test (782 of 1905)
PASS: lldb-api :: lang/cpp/breakpoint-commands/TestCPPBreakpointCommands.py (783 of 1905)
PASS: lldb-unit :: Expression/./ExpressionTests/CppModuleConfigurationTest.LibCppV2 (784 of 1905)
PASS: lldb-unit :: Expression/./ExpressionTests/CppModuleConfigurationTest.UnrelatedLibrary (785 of 1905)
PASS: lldb-api :: python_api/debugger/TestDebuggerAPI.py (786 of 1905)
PASS: lldb-unit :: Host/./HostTests/HostInfoTest.GetAugmentedArchSpec (787 of 1905)
PASS: lldb-api :: lang/cpp/accelerator-table/TestCPPAccelerator.py (788 of 1905)
PASS: lldb-unit :: UnwindAssembly/x86/./UnwindAssemblyx86Tests/Testx86AssemblyInspectionEngine.TestStackRealignMSVC_i386 (789 of 1905)
PASS: lldb-api :: functionalities/data-formatter/synthcapping/TestSyntheticCapping.py (790 of 1905)
UNSUPPORTED: lldb-api :: functionalities/asan/TestReportData.py (791 of 1905)
PASS: lldb-api :: functionalities/data-formatter/data-formatter-enum-format/TestDataFormatterEnumFormat.py (792 of 1905)
PASS: lldb-api :: python_api/sbvalue_persist/TestSBValuePersist.py (793 of 1905)
PASS: lldb-unit :: Utility/./UtilityTests/StreamTest.PutCharNull (794 of 1905)
PASS: lldb-api :: source-manager/TestSourceManager.py (795 of 1905)
PASS: lldb-api :: commands/expression/formatters/TestFormatters.py (796 of 1905)
PASS: lldb-api :: functionalities/show_location/TestShowLocationDwarf5.py (797 of 1905)
PASS: lldb-unit :: Utility/./UtilityTests/VMRange.SetEndAddress (798 of 1905)
PASS: lldb-api :: tools/lldb-vscode/variables/TestVSCode_variables.py (799 of 1905)
PASS: lldb-api :: lang/cpp/stl/TestStdCXXDisassembly.py (800 of 1905)
PASS: lldb-unit :: Utility/./UtilityTests/ArgsTest.EscapeLLDBCommandArgument (801 of 1905)
PASS: lldb-shell :: Reproducer/Modules/TestModuleCXX.test (802 of 1905)
PASS: lldb-unit :: Utility/./UtilityTests/SubsystemRAIITest.SubsystemWithErrorFailure (803 of 1905)
PASS: lldb-unit :: Utility/./UtilityTests/BinaryStreamTest.PutULEB128SixBytes (804 of 1905)
PASS: lldb-shell :: SymbolFile/DWARF/dwarf5_locations.s (805 of 1905)
PASS: lldb-api :: python_api/watchpoint/watchlocation/TestSetWatchlocation.py (806 of 1905)
UNSUPPORTED: lldb-api :: tools/lldb-server/platform-process-connect/TestPlatformProcessConnect.py (807 of 1905)
PASS: lldb-unit :: Utility/./UtilityTests/ArgsTest.TestOverwriteArgs (808 of 1905)
PASS: lldb-api :: commands/expression/import-std-module/deque-dbg-info-content/TestDbgInfoContentDeque.py (809 of 1905)
PASS: lldb-unit :: Utility/./UtilityTests/ArchSpecTest.TestParseMachCPUDashSubtypeTripleExtra (810 of 1905)
PASS: lldb-api :: lang/c/modules/TestCModules.py (811 of 1905)
PASS: lldb-unit :: Utility/./UtilityTests/OptionsWithRawTest.EmptySuffix (812 of 1905)
PASS: lldb-api :: commands/expression/import-std-module/empty-module/TestEmptyStdModule.py (813 of 1905)
PASS: lldb-shell :: Settings/TestDisableColor.test (814 of 1905)
PASS: lldb-api :: functionalities/data-formatter/data-formatter-skip-summary/TestDataFormatterSkipSummary.py (815 of 1905)
PASS: lldb-unit :: Utility/./UtilityTests/ScalarTest.GetBytes (816 of 1905)
PASS: lldb-api :: commands/expression/completion/TestExprCompletion.py (817 of 1905)
PASS: lldb-unit :: UnwindAssembly/x86/./UnwindAssemblyx86Tests/Testx86AssemblyInspectionEngine.TestPushExtended (818 of 1905)
PASS: lldb-api :: lang/c/step_over_no_deadlock/TestStepOverDoesntBlock.py (819 of 1905)
PASS: lldb-shell :: Reproducer/Functionalities/TestExpressionEvaluation.test (820 of 1905)
PASS: lldb-unit :: Utility/./UtilityTests/FileSpecTest.CopyByAppendingPathComponent (821 of 1905)
PASS: lldb-api :: functionalities/non-overlapping-index-variable-i/TestIndexVariable.py (822 of 1905)
PASS: lldb-shell :: SymbolFile/DWARF/anon_class_w_and_wo_export_symbols.ll (823 of 1905)
XFAIL: lldb-shell :: Register/x86-mm-xmm-write.test (824 of 1905)
PASS: lldb-api :: commands/expression/persistent_variables/TestPersistentVariables.py (825 of 1905)
PASS: lldb-api :: lang/c/shared_lib/TestSharedLib.py (826 of 1905)
PASS: lldb-unit :: ScriptInterpreter/Python/./ScriptInterpreterPythonTests/PythonDataObjectsTest.TestPythonTupleValues (827 of 1905)
PASS: lldb-api :: python_api/process/read-mem-cstring/TestReadMemCString.py (828 of 1905)
PASS: lldb-unit :: Utility/./UtilityTests/RangeTest.SlideZero (829 of 1905)
PASS: lldb-api :: functionalities/thread/thread_specific_break/TestThreadSpecificBreakpoint.py (830 of 1905)
PASS: lldb-unit :: ScriptInterpreter/Python/./ScriptInterpreterPythonTests/PythonDataObjectsTest.TestPythonTupleInitializerList2 (831 of 1905)
PASS: lldb-api :: functionalities/type_completion/TestTypeCompletion.py (832 of 1905)
PASS: lldb-api :: commands/expression/invalid-args/TestInvalidArgsExpression.py (833 of 1905)
PASS: lldb-api :: commands/frame/diagnose/array/TestArray.py (834 of 1905)
PASS: lldb-shell :: SymbolFile/Breakpad/line-table.test (835 of 1905)
PASS: lldb-unit :: Symbol/./SymbolTests/TestClangASTContext.TestGetTypeClassDeclType (836 of 1905)
PASS: lldb-api :: lang/cpp/bool/TestCPPBool.py (837 of 1905)
UNSUPPORTED: lldb-shell :: ScriptInterpreter/Lua/nested_sessions.test (838 of 1905)
PASS: lldb-unit :: UnwindAssembly/x86/./UnwindAssemblyx86Tests/Testx86AssemblyInspectionEngine.TestSimple32bitFrameFunction (839 of 1905)
PASS: lldb-api :: python_api/lldbutil/frame/TestFrameUtils.py (840 of 1905)
PASS: lldb-shell :: ObjectFile/wasm/unified-debug-sections.yaml (841 of 1905)
PASS: lldb-api :: commands/expression/entry-bp/TestExprEntryBP.py (842 of 1905)
PASS: lldb-api :: functionalities/data-formatter/data-formatter-stl/libcxx/vector/TestDataFormatterLibcxxVector.py (843 of 1905)
UNSUPPORTED: lldb-api :: macosx/macabi/TestMacABImacOSFramework.py (844 of 1905)
PASS: lldb-unit :: Utility/./UtilityTests/OptionsWithRawTest.MultiWordSuffix (845 of 1905)
PASS: lldb-unit :: Utility/./UtilityTests/RangeTest.ContainsEndInclusive (846 of 1905)
PASS: lldb-unit :: Symbol/./SymbolTests/SymbolsTest.LocateExecutableSymbolFileForUnknownExecutableAndMissingSymbolFile (847 of 1905)
PASS: lldb-unit :: Process/gdb-remote/./ProcessGdbRemoteTests/GDBRemoteCommunicationClientTest.GetModulesInfoInvalidResponse (848 of 1905)
PASS: lldb-unit :: Host/./HostTests/FileSystemTest.Resolve (849 of 1905)
PASS: lldb-api :: functionalities/data-formatter/data-formatter-stl/libcxx/initializerlist/TestInitializerList.py (850 of 1905)
PASS: lldb-unit :: Utility/./UtilityTests/StreamTest.AddressPrefixAndSuffix (851 of 1905)
PASS: lldb-shell :: Breakpoint/single-file-split-dwarf.test (852 of 1905)
PASS: lldb-unit :: Host/./HostTests/Host.WaitStatusFormat (853 of 1905)
PASS: lldb-api :: functionalities/thread/concurrent_events/TestConcurrentTwoWatchpointsOneSignal.py (854 of 1905)
PASS: lldb-unit :: SymbolFile/DWARF/./SymbolFileDWARFTests/SymbolFileDWARFTests.TestAbbrevNullAttrValidForm (855 of 1905)
PASS: lldb-api :: functionalities/data-formatter/ptr_ref_typedef/TestPtrRef2Typedef.py (856 of 1905)
PASS: lldb-unit :: Utility/./UtilityTests/StringExtractorTest.GetHexBytesAvail (857 of 1905)
PASS: lldb-api :: functionalities/abbreviation/TestAbbreviations.py (858 of 1905)
PASS: lldb-api :: functionalities/data-formatter/data-formatter-stl/libcxx/bitset/TestDataFormatterLibcxxBitset.py (859 of 1905)
PASS: lldb-unit :: Host/./HostTests/MainLoopTest.UnmonitoredSignal (860 of 1905)
PASS: lldb-shell :: SymbolFile/DWARF/apple-index-is-used.cpp (861 of 1905)
PASS: lldb-api :: python_api/frame/TestFrames.py (862 of 1905)
PASS: lldb-unit :: Interpreter/./InterpreterTests/CompletionTest.FileCompletionAbsolute (863 of 1905)
PASS: lldb-shell :: ObjectFile/PECOFF/dep-modules.yaml (864 of 1905)
PASS: lldb-api :: functionalities/gdb_remote_client/TestPlatformClient.py (865 of 1905)
PASS: lldb-api :: functionalities/value_md5_crash/TestValueMD5Crash.py (866 of 1905)
PASS: lldb-api :: functionalities/inferior-crashing/recursive-inferior/TestRecursiveInferiorStep.py (867 of 1905)
PASS: lldb-api :: lang/cpp/unique-types/TestUniqueTypes.py (868 of 1905)
PASS: lldb-api :: commands/watchpoints/watchpoint_disable/TestWatchpointDisable.py (869 of 1905)
PASS: lldb-unit :: Utility/./UtilityTests/BinaryStreamTest.PutULEB128SevenBytes (870 of 1905)
PASS: lldb-api :: functionalities/data-formatter/refpointer-recursion/TestDataFormatterRefPtrRecursion.py (871 of 1905)
PASS: lldb-shell :: Commands/CommandScriptImmediateOutput/CommandScriptImmediateOutputFile.test (872 of 1905)
PASS: lldb-api :: functionalities/data-formatter/setvaluefromcstring/TestSetValueFromCString.py (873 of 1905)
PASS: lldb-api :: commands/frame/var/TestFrameVar.py (874 of 1905)
PASS: lldb-api :: types/TestDoubleTypes.py (875 of 1905)
PASS: lldb-api :: lang/cpp/virtual/TestVirtual.py (876 of 1905)
PASS: lldb-api :: functionalities/breakpoint/breakpoint_set_restart/TestBreakpointSetRestart.py (877 of 1905)
XFAIL: lldb-shell :: Register/x86-64-write.test (878 of 1905)
PASS: lldb-shell :: SymbolFile/DWARF/debug-names-compressed.cpp (879 of 1905)
PASS: lldb-unit :: Utility/./UtilityTests/FileSpecTest.Match (880 of 1905)
PASS: lldb-shell :: Quit/TestQuitExitCodeNonInt.test (881 of 1905)
PASS: lldb-unit :: ScriptInterpreter/Python/./ScriptInterpreterPythonTests/PythonDataObjectsTest.TestPythonBoolean (882 of 1905)
PASS: lldb-unit :: UnwindAssembly/x86/./UnwindAssemblyx86Tests/Testx86AssemblyInspectionEngine.TestPushRBX (883 of 1905)
PASS: lldb-shell :: SymbolFile/DWARF/split-dwarf-multiple-cu.ll (884 of 1905)
PASS: lldb-unit :: Process/gdb-remote/./ProcessGdbRemoteTests/GDBRemoteClientBaseTest.InterruptNoResponse (885 of 1905)
PASS: lldb-api :: functionalities/tail_call_frames/thread_step_out_message/TestArtificialFrameStepOutMessage.py (886 of 1905)
PASS: lldb-unit :: Utility/./UtilityTests/IndexToObjectTest.ObjectForIndex (887 of 1905)
PASS: lldb-api :: lang/cpp/modules-import/TestCXXModulesImport.py (888 of 1905)
PASS: lldb-api :: lang/cpp/class_types/TestClassTypes.py (889 of 1905)
PASS: lldb-api :: lang/objc/objc-foundation-dictionary-empty/TestNSDictionary0.py (890 of 1905)
PASS: lldb-unit :: Utility/./UtilityTests/StreamTest.PutNHex8 (891 of 1905)
PASS: lldb-unit :: ObjectFile/PECOFF/./ObjectFilePECOFFTests/PECallFrameInfoTest.Basic_eh (892 of 1905)
PASS: lldb-api :: tools/lldb-server/TestGdbRemoteRegisterState.py (893 of 1905)
PASS: lldb-unit :: Utility/./UtilityTests/LogChannelTest.Enable (894 of 1905)
PASS: lldb-api :: functionalities/data-formatter/data-formatter-stl/libcxx/unordered/TestDataFormatterUnordered.py (895 of 1905)
PASS: lldb-unit :: Utility/./UtilityTests/BinaryStreamTest.PutSLEB128SixBytes (896 of 1905)
PASS: lldb-unit :: debugserver/./debugserverTests/RNBSocket.LoopBackConnectIPv6 (897 of 1905)
PASS: lldb-unit :: Utility/./UtilityTests/RangeDataVector.FindEntryThatContains (898 of 1905)
PASS: lldb-api :: commands/expression/ir-interpreter/TestIRInterpreter.py (899 of 1905)
PASS: lldb-api :: macosx/find-app-in-bundle/TestFindAppInBundle.py (900 of 1905)
UNSUPPORTED: lldb-shell :: Register/x86-gp-write.test (901 of 1905)
PASS: lldb-api :: commands/expression/namespace_local_var_same_name_cpp_and_c/TestNamespaceLocalVarSameNameCppAndC.py (902 of 1905)
PASS: lldb-api :: functionalities/data-formatter/data-formatter-objc/TestDataFormatterObjCNSDate.py (903 of 1905)
PASS: lldb-api :: commands/expression/call-function/TestCallStdStringFunction.py (904 of 1905)
PASS: lldb-unit :: Symbol/./SymbolTests/TestClangASTContext.TestGetTypeClassTypeOfExpr (905 of 1905)
PASS: lldb-unit :: Utility/./UtilityTests/DataExtractorTest.GetCStrAtEnd (906 of 1905)
PASS: lldb-api :: lang/cpp/char8_t/TestCxxChar8_t.py (907 of 1905)
PASS: lldb-api :: types/TestDoubleTypesExpr.py (908 of 1905)
PASS: lldb-unit :: UnwindAssembly/x86/./UnwindAssemblyx86Tests/Testx86AssemblyInspectionEngine.TestStackRealign32BitDisp_x86_64 (909 of 1905)
PASS: lldb-unit :: Utility/./UtilityTests/UUIDTest.RelationalOperators (910 of 1905)
PASS: lldb-shell :: ScriptInterpreter/Python/scripted_breakpoint.test (911 of 1905)
PASS: lldb-unit :: Utility/./UtilityTests/StringExtractorTest.GetHexBytes_FullString (912 of 1905)
PASS: lldb-api :: python_api/target/TestTargetAPI.py (913 of 1905)
PASS: lldb-unit :: Utility/./UtilityTests/VMRange.Comparison (914 of 1905)
PASS: lldb-api :: commands/register/register/register_command/TestRegisters.py (915 of 1905)
PASS: lldb-api :: lang/objc/single-entry-dictionary/TestObjCSingleEntryDictionary.py (916 of 1905)
UNSUPPORTED: lldb-api :: functionalities/exec/TestExec.py (917 of 1905)
PASS: lldb-api :: functionalities/postmortem/mach-core/TestMachCore.py (918 of 1905)
PASS: lldb-api :: lang/objc/objc_direct-methods/TestObjCDirectMethods.py (919 of 1905)
PASS: lldb-unit :: Host/./HostTests/FileSystemTest.MakeAbsolute (920 of 1905)
PASS: lldb-api :: tools/lldb-server/TestAppleSimulatorOSType.py (921 of 1905)
PASS: lldb-unit :: Utility/./UtilityTests/BinaryStreamTest.PutULEB128One (922 of 1905)
PASS: lldb-unit :: Language/Highlighting/./HighlighterTests/HighlighterTest.DefaultHighlighterWithCursor (923 of 1905)
PASS: lldb-api :: commands/command/delete/TestCommandDelete.py (924 of 1905)
PASS: lldb-unit :: Utility/./UtilityTests/TildeExpressionResolver.ResolveFullPath (925 of 1905)
PASS: lldb-api :: commands/platform/basic/TestPlatformPython.py (926 of 1905)
PASS: lldb-api :: lang/objc/unicode-string/TestUnicodeString.py (927 of 1905)
PASS: lldb-api :: functionalities/breakpoint/dummy_target_breakpoints/TestBreakpointsWithNoTargets.py (928 of 1905)
PASS: lldb-api :: lang/cpp/operators/TestCppOperators.py (929 of 1905)
PASS: lldb-unit :: Utility/./UtilityTests/StringLexerTest.AdvanceIf (930 of 1905)
PASS: lldb-api :: lang/cpp/namespace/TestNamespaceLookup.py (931 of 1905)
PASS: lldb-shell :: Quit/TestQuitExitCode0.test (932 of 1905)
UNSUPPORTED: lldb-shell :: Register/x86-zmm-write.test (933 of 1905)
PASS: lldb-api :: lang/cpp/global_variables/TestCPPGlobalVariables.py (934 of 1905)
PASS: lldb-unit :: Utility/./UtilityTests/RegularExpression.Invalid (935 of 1905)
PASS: lldb-unit :: Process/minidump/./LLDBMinidumpTests/MinidumpParserTest.GetArchitectureWindows (936 of 1905)
PASS: lldb-shell :: SymbolFile/DWARF/deterministic-build.cpp (937 of 1905)
PASS: lldb-unit :: Utility/./UtilityTests/ArgsTest.TestSingleArgWithQuotedSpace (938 of 1905)
PASS: lldb-api :: functionalities/thread/concurrent_events/TestConcurrentCrashWithWatchpointBreakpointSignal.py (939 of 1905)
PASS: lldb-unit :: UnwindAssembly/x86/./UnwindAssemblyx86Tests/Testx86AssemblyInspectionEngine.TestPopEDI (940 of 1905)
PASS: lldb-unit :: Utility/./UtilityTests/StringExtractorTest.DecodeHexU8_Exact (941 of 1905)
PASS: lldb-shell :: SymbolFile/DWARF/find-inline-method.s (942 of 1905)
PASS: lldb-unit :: UnwindAssembly/x86/./UnwindAssemblyx86Tests/Testx86AssemblyInspectionEngine.TestCALLNextInsn (943 of 1905)
PASS: lldb-unit :: Core/./LLDBCoreTests/MangledTest.NameIndexes_FindFunctionSymbols (944 of 1905)
PASS: lldb-api :: python_api/frame/get-variables/TestGetVariables.py (945 of 1905)
PASS: lldb-unit :: Language/Highlighting/./HighlighterTests/HighlighterTest.ClangBraces (946 of 1905)
PASS: lldb-api :: functionalities/tail_call_frames/ambiguous_tail_call_seq1/TestAmbiguousTailCallSeq1.py (947 of 1905)
PASS: lldb-unit :: Host/./HostTests/TaskPoolTest.RunTasks (948 of 1905)
PASS: lldb-unit :: ScriptInterpreter/Python/./ScriptInterpreterPythonTests/PythonDataObjectsTest.TestPythonDictionaryValueEquality (949 of 1905)
PASS: lldb-unit :: debugserver/./debugserverTests/RNBSocket.AnyListen (950 of 1905)
UNSUPPORTED: lldb-shell :: SymbolFile/PDB/enums-layout.test (951 of 1905)
PASS: lldb-shell :: SymbolFile/Breakpad/line-table-mixed-path-styles.test (952 of 1905)
UNSUPPORTED: lldb-shell :: SymbolFile/dissassemble-entry-point.s (953 of 1905)
PASS: lldb-unit :: Utility/./UtilityTests/StringLexerTest.Peek (954 of 1905)
UNSUPPORTED: lldb-api :: benchmarks/turnaround/TestCompileRunToBreakpointTurnaround.py (955 of 1905)
PASS: lldb-api :: functionalities/data-formatter/data-formatter-stl/libcxx/iterator/TestDataFormatterLibccIterator.py (956 of 1905)
PASS: lldb-api :: lang/cpp/class_types/TestClassTypesDisassembly.py (957 of 1905)
PASS: lldb-unit :: Host/./HostTests/SocketTest.UDPConnect (958 of 1905)
PASS: lldb-shell :: Heap/heap-cstr.test (959 of 1905)
PASS: lldb-api :: commands/watchpoints/watchpoint_events/TestWatchpointEvents.py (960 of 1905)
PASS: lldb-unit :: Process/minidump/./LLDBMinidumpTests/MinidumpParserTest.GetFilteredModuleList (961 of 1905)
PASS: lldb-api :: functionalities/data-formatter/varscript_formatting/TestDataFormatterVarScriptFormatting.py (962 of 1905)
PASS: lldb-unit :: Utility/./UtilityTests/StringListTest.GetMaxStringLengthEmpty (963 of 1905)
PASS: lldb-unit :: Utility/./UtilityTests/ProcessInfoTest.Constructor (964 of 1905)
UNSUPPORTED: lldb-shell :: SymbolFile/PDB/typedefs.test (965 of 1905)
PASS: lldb-unit :: Utility/./UtilityTests/StreamTeeTest.CopyConstructor (966 of 1905)
PASS: lldb-api :: lang/cpp/static_methods/TestCPPStaticMethods.py (967 of 1905)
PASS: lldb-unit :: Signals/./SignalsTests/UnixSignalsTest.GetFilteredSignals (968 of 1905)
PASS: lldb-api :: api/multiple-targets/TestMultipleTargets.py (969 of 1905)
PASS: lldb-unit :: Utility/./UtilityTests/DataExtractorTest.GetCStrAtNullOffset (970 of 1905)
PASS: lldb-api :: functionalities/backticks/TestBackticksWithoutATarget.py (971 of 1905)
UNSUPPORTED: lldb-api :: commands/expression/macros/TestMacros.py (972 of 1905)
PASS: lldb-unit :: Utility/./UtilityTests/UriParserTest.MinimalPortPath (973 of 1905)
PASS: lldb-unit :: Process/minidump/./LLDBMinidumpTests/MinidumpParserTest.MinidumpModuleOrder (974 of 1905)
PASS: lldb-unit :: Utility/./UtilityTests/ScalarTest.SetValueFromCString (975 of 1905)
PASS: lldb-api :: commands/frame/diagnose/dereference-function-return/TestDiagnoseDereferenceFunctionReturn.py (976 of 1905)
PASS: lldb-unit :: Target/./TargetTests/ModuleCacheTest.GetAndPutUuidExists (977 of 1905)
PASS: lldb-unit :: Utility/./UtilityTests/OptionsWithRawTest.WhitespaceInput (978 of 1905)
PASS: lldb-api :: lang/cpp/nsimport/TestCppNsImport.py (979 of 1905)
PASS: lldb-api :: functionalities/data-formatter/data-formatter-cpp/TestDataFormatterCpp.py (980 of 1905)
PASS: lldb-unit :: Utility/./UtilityTests/StringListTest.ShiftCString (981 of 1905)
PASS: lldb-api :: lang/c/function_types/TestFunctionTypes.py (982 of 1905)
PASS: lldb-unit :: Utility/./UtilityTests/StringExtractorTest.GetHexBytes_Underflow (983 of 1905)
PASS: lldb-api :: lang/cpp/namespace/TestNamespace.py (984 of 1905)
PASS: lldb-unit :: SymbolFile/NativePDB/./SymbolFileNativePDBTests/PDBFPOProgramToDWARFExpressionTests.InvalidAssignmentMultiple (985 of 1905)
PASS: lldb-unit :: Utility/./UtilityTests/StringExtractorTest.InitEmpty (986 of 1905)
PASS: lldb-api :: commands/expression/persistent_types/TestNestedPersistentTypes.py (987 of 1905)
PASS: lldb-unit :: Host/./HostTests/SocketTest.TCPListen0GetPort (988 of 1905)
PASS: lldb-shell :: ObjectFile/ELF/PT_LOAD-overlap-PT_INTERP.yaml (989 of 1905)
PASS: lldb-api :: api/listeners/TestListener.py (990 of 1905)
PASS: lldb-api :: functionalities/data-formatter/data-formatter-script/TestDataFormatterScript.py (991 of 1905)
PASS: lldb-unit :: Symbol/./SymbolTests/TestClangASTImporter.DeportDeclTagDecl (992 of 1905)
PASS: lldb-shell :: ObjectFile/PECOFF/basic-info-arm64.yaml (993 of 1905)
PASS: lldb-api :: python_api/lldbutil/iter/TestRegistersIterator.py (994 of 1905)
PASS: lldb-api :: functionalities/thread/step_until/TestStepUntil.py (995 of 1905)
PASS: lldb-unit :: SymbolFile/NativePDB/./SymbolFileNativePDBTests/PDBFPOProgramToDWARFExpressionTests.DependencyChain (996 of 1905)
PASS: lldb-unit :: Process/gdb-remote/./ProcessGdbRemoteTests/GDBRemoteClientBaseTest.SendPacketAndReceiveResponseWithOutputSupport (997 of 1905)
PASS: lldb-unit :: Utility/./UtilityTests/StringExtractorTest.GetNameColonValueNoColon (998 of 1905)
PASS: lldb-api :: functionalities/dead-strip/TestDeadStrip.py (999 of 1905)
PASS: lldb-unit :: Symbol/./SymbolTests/SymbolsTest.TerminateLocateExecutableSymbolFileForUnknownExecutableAndUnknownSymbolFile (1000 of 1905)
PASS: lldb-unit :: ScriptInterpreter/Python/./ScriptInterpreterPythonTests/PythonDataObjectsTest.TestPythonString (1001 of 1905)
PASS: lldb-unit :: Symbol/./SymbolTests/LineEntryTest.GetSameLineContiguousAddressRangeNoInlines (1002 of 1905)
PASS: lldb-api :: commands/expression/xvalue/TestXValuePrinting.py (1003 of 1905)
PASS: lldb-api :: functionalities/data-formatter/data-formatter-proper-plurals/TestFormattersOneIsSingular.py (1004 of 1905)
PASS: lldb-api :: python_api/class_members/TestSBTypeClassMembers.py (1005 of 1905)
PASS: lldb-shell :: SymbolFile/Breakpad/unwind-via-stack-win.test (1006 of 1905)
PASS: lldb-unit :: Utility/./UtilityTests/BinaryStreamTest.PutULEB128FourBytes (1007 of 1905)
PASS: lldb-api :: functionalities/gdb_remote_client/TestGDBRemoteClient.py (1008 of 1905)
PASS: lldb-shell :: Settings/TestSettingsWrite.test (1009 of 1905)
PASS: lldb-api :: commands/expression/import_builtin_fileid/TestImportBuiltinFileID.py (1010 of 1905)
PASS: lldb-api :: python_api/interpreter/TestRunCommandInterpreterAPI.py (1011 of 1905)
PASS: lldb-unit :: Process/minidump/./LLDBMinidumpTests/MinidumpParserTest.GetArchitecture (1012 of 1905)
PASS: lldb-unit :: Language/Highlighting/./HighlighterTests/HighlighterTest.ClangComments (1013 of 1905)
PASS: lldb-api :: functionalities/gdb_remote_client/TestRecognizeBreakpoint.py (1014 of 1905)
PASS: lldb-shell :: Commands/command-source.test (1015 of 1905)
PASS: lldb-unit :: Utility/./UtilityTests/UriParserTest.LongPath (1016 of 1905)
UNSUPPORTED: lldb-shell :: SymbolFile/PDB/function-level-linking.test (1017 of 1905)
PASS: lldb-unit :: Host/./HostTests/ProcessLaunchInfoTest.Constructor (1018 of 1905)
PASS: lldb-unit :: Utility/./UtilityTests/VASprintfTest.BufferResize (1019 of 1905)
PASS: lldb-api :: functionalities/postmortem/elf-core/TestLinuxCore.py (1020 of 1905)
PASS: lldb-unit :: Core/./LLDBCoreTests/RichManglingContextTest.FromCxxMethodName (1021 of 1905)
PASS: lldb-unit :: Utility/./UtilityTests/Predicate.WaitForValueNotEqualTo (1022 of 1905)
PASS: lldb-unit :: Symbol/./SymbolTests/TestClangASTContext.TestGetTypeClassNested (1023 of 1905)
PASS: lldb-unit :: Utility/./UtilityTests/StreamTest.ShiftOperatorChars (1024 of 1905)
PASS: lldb-unit :: Utility/./UtilityTests/ArgsTest.TestTrailingBackslash (1025 of 1905)
PASS: lldb-unit :: Utility/./UtilityTests/Flags.GetBitSize (1026 of 1905)
PASS: lldb-unit :: ScriptInterpreter/Python/./ScriptInterpreterPythonTests/PythonDataObjectsTest.TestBorrowedReferences (1027 of 1905)
PASS: lldb-api :: commands/expression/radar_9673664/TestExprHelpExamples.py (1028 of 1905)
PASS: lldb-unit :: Symbol/./SymbolTests/TestClangASTImporter.CopyDeclTagDecl (1029 of 1905)
PASS: lldb-unit :: Utility/./UtilityTests/StringListTest.GetMaxStringLengthIncreasingSize (1030 of 1905)
PASS: lldb-unit :: Utility/./UtilityTests/ArgsTest.TestArgv (1031 of 1905)
PASS: lldb-unit :: Utility/./UtilityTests/UriParserTest.SchemeHostSeparator4 (1032 of 1905)
PASS: lldb-unit :: Utility/./UtilityTests/StringExtractorTest.GetHexU8_Extra_NoEof (1033 of 1905)
PASS: lldb-unit :: Utility/./UtilityTests/BinaryStreamTest.PutSLEB128FourBytes (1034 of 1905)
PASS: lldb-unit :: Process/minidump/./LLDBMinidumpTests/MinidumpParserTest.GetThreadsAndGetThreadContext (1035 of 1905)
PASS: lldb-shell :: ObjectFile/MachO/subsections.yaml (1036 of 1905)
PASS: lldb-shell :: ObjectFile/PECOFF/invalid-export-table.yaml (1037 of 1905)
PASS: lldb-shell :: SymbolFile/DWARF/clang-ast-from-dwarf-unamed-and-anon-structs.cpp (1038 of 1905)
PASS: lldb-api :: commands/expression/inline-namespace/TestInlineNamespace.py (1039 of 1905)
PASS: lldb-unit :: Utility/./UtilityTests/StreamTeeTest.Write (1040 of 1905)
PASS: lldb-shell :: SymbolFile/DWARF/debug_rnglists.s (1041 of 1905)
PASS: lldb-shell :: SymbolFile/DWARF/dwarf5-index-is-used.cpp (1042 of 1905)
PASS: lldb-unit :: Host/./HostTests/NativeProcessProtocolTest.ReadCStringFromMemory_CrossPageBoundary (1043 of 1905)
PASS: lldb-unit :: SymbolFile/NativePDB/./SymbolFileNativePDBTests/PDBFPOProgramToDWARFExpressionTests.UnresolvedRegisterAssignmentReference (1044 of 1905)
PASS: lldb-unit :: Utility/./UtilityTests/RangeTest.ContainsEndInclusiveInvalid (1045 of 1905)
PASS: lldb-api :: functionalities/thread/concurrent_events/TestConcurrentTwoBreakpointsOneSignal.py (1046 of 1905)
PASS: lldb-shell :: Driver/TestSingleQuote.test (1047 of 1905)
PASS: lldb-shell :: SymbolFile/DWARF/debug-types-signature-loop.s (1048 of 1905)
PASS: lldb-api :: python_api/value/change_values/TestChangeValueAPI.py (1049 of 1905)
PASS: lldb-unit :: Utility/./UtilityTests/ArgsTest.TestUnknownEscape (1050 of 1905)
PASS: lldb-api :: commands/log/basic/TestLogging.py (1051 of 1905)
UNSUPPORTED: lldb-shell :: Register/x86-64-zmm-read.test (1052 of 1905)
UNSUPPORTED: lldb-shell :: ObjectFile/ELF/minidebuginfo-no-lzma.yaml (1053 of 1905)
PASS: lldb-api :: lang/objc/conflicting-definition/TestConflictingDefinition.py (1054 of 1905)
UNSUPPORTED: lldb-api :: lang/objc/objc-dynamic-value/TestObjCDynamicValue.py (1055 of 1905)
PASS: lldb-unit :: Utility/./UtilityTests/StringListTest.ForRangeEmpty (1056 of 1905)
PASS: lldb-unit :: Utility/./UtilityTests/ArgsTest.ReplaceArgumentAtIndexOutOfRange (1057 of 1905)
PASS: lldb-unit :: Utility/./UtilityTests/RangeTest.Constructor (1058 of 1905)
PASS: lldb-unit :: Utility/./UtilityTests/StreamTeeTest.Constructor1Stream (1059 of 1905)
PASS: lldb-unit :: Utility/./UtilityTests/ConstStringTest.CompareStringRef (1060 of 1905)
PASS: lldb-unit :: Utility/./UtilityTests/StreamTest.PutRawBytesToBigEndian (1061 of 1905)
PASS: lldb-api :: functionalities/unwind/sigtramp/TestSigtrampUnwind.py (1062 of 1905)
PASS: lldb-api :: commands/expression/char/TestExprsChar.py (1063 of 1905)
PASS: lldb-unit :: Host/./HostTests/ConnectionFileDescriptorTest.TCPGetURIv6 (1064 of 1905)
PASS: lldb-unit :: Utility/./UtilityTests/StringListTest.SplitIntoLinesEmpty (1065 of 1905)
PASS: lldb-unit :: Symbol/./SymbolTests/TestClangASTContext.TestGetTypeClassTypeOf (1066 of 1905)
PASS: lldb-unit :: Utility/./UtilityTests/ArgsTest.ReplaceArgumentAtIndexEqual (1067 of 1905)
PASS: lldb-shell :: Settings/TestStopCommandSourceOnError.test (1068 of 1905)
PASS: lldb-shell :: SymbolFile/DWARF/dwarf5-atomic.s (1069 of 1905)
PASS: lldb-api :: api/log/TestAPILog.py (1070 of 1905)
PASS: lldb-unit :: Utility/./UtilityTests/StringListTest.SplitIntoLines (1071 of 1905)
PASS: lldb-shell :: Reproducer/TestCaptureEnvOverride.test (1072 of 1905)
PASS: lldb-shell :: Minidump/breakpad-symbols.test (1073 of 1905)
PASS: lldb-unit :: Utility/./UtilityTests/OptionsWithRawTest.LeadingSpaceArgs (1074 of 1905)
PASS: lldb-api :: commands/watchpoints/multiple_hits/TestMultipleHits.py (1075 of 1905)
PASS: lldb-shell :: Minidump/no-process-id.yaml (1076 of 1905)
PASS: lldb-unit :: Utility/./UtilityTests/StreamTeeTest.AppendStream (1077 of 1905)
PASS: lldb-unit :: SymbolFile/NativePDB/./SymbolFileNativePDBTests/PDBFPOProgramToDWARFExpressionTests.MultipleDependentAssignments (1078 of 1905)
PASS: lldb-unit :: Expression/./ExpressionTests/DiagnosticManagerTest.AppendMessageNoDiag (1079 of 1905)
PASS: lldb-unit :: Process/minidump/./LLDBMinidumpTests/MinidumpParserTest.GetMemoryRegionInfoFromMemory64List (1080 of 1905)
PASS: lldb-unit :: Utility/./UtilityTests/StringExtractorTest.GetNameColonValueNoSemicolon (1081 of 1905)
PASS: lldb-shell :: Unwind/eh-frame-dwarf-unwind.test (1082 of 1905)
PASS: lldb-unit :: Process/minidump/./LLDBMinidumpTests/MinidumpParserTest.GetPid (1083 of 1905)
PASS: lldb-unit :: Utility/./UtilityTests/RangeTest.SetRangeBase (1084 of 1905)
PASS: lldb-unit :: SymbolFile/DWARF/./SymbolFileDWARFTests/SymbolFileDWARFTests.TestAbbrevMissingTerminator (1085 of 1905)
PASS: lldb-api :: functionalities/data-formatter/pyobjsynthprovider/TestPyObjSynthProvider.py (1086 of 1905)
PASS: lldb-api :: types/TestLongTypesExpr.py (1087 of 1905)
PASS: lldb-unit :: Process/gdb-remote/./ProcessGdbRemoteTests/GDBRemoteCommunicationClientTest.SaveRestoreRegistersNoSuffix (1088 of 1905)
PASS: lldb-api :: lang/objc/blocks/TestObjCIvarsInBlocks.py (1089 of 1905)
PASS: lldb-unit :: Utility/./UtilityTests/NameMatchesTest.Ignore (1090 of 1905)
PASS: lldb-api :: commands/expression/import-std-module/forward_list-dbg-info-content/TestDbgInfoContentForwardList.py (1091 of 1905)
PASS: lldb-api :: lang/c/strings/TestCStrings.py (1092 of 1905)
PASS: lldb-api :: functionalities/thread/concurrent_events/TestConcurrentSignalNWatchNBreak.py (1093 of 1905)
PASS: lldb-api :: tools/lldb-server/TestGdbRemoteAttach.py (1094 of 1905)
PASS: lldb-unit :: SymbolFile/NativePDB/./SymbolFileNativePDBTests/PDBFPOProgramToDWARFExpressionTests.MissingTargetRegister (1095 of 1905)
UNSUPPORTED: lldb-api :: benchmarks/expression/TestRepeatedExprs.py (1096 of 1905)
PASS: lldb-unit :: Utility/./UtilityTests/LogTest.LLDB_LOG_nullptr (1097 of 1905)
UNSUPPORTED: lldb-api :: python_api/disassemble-raw-data/TestDisassemble_VST1_64.py (1098 of 1905)
PASS: lldb-unit :: Utility/./UtilityTests/ScalarTest.APIntConstructor (1099 of 1905)
PASS: lldb-api :: functionalities/breakpoint/breakpoint_ignore_count/TestBreakpointIgnoreCount.py (1100 of 1905)
PASS: lldb-unit :: Utility/./UtilityTests/RegularExpression.Empty (1101 of 1905)
PASS: lldb-unit :: ObjectFile/ELF/./ObjectFileELFTests/ObjectFileELFTest.GetModuleSpecifications_EarlySectionHeaders (1102 of 1905)
UNSUPPORTED: lldb-api :: functionalities/signal/handle-segv/TestHandleSegv.py (1103 of 1905)
PASS: lldb-unit :: Utility/./UtilityTests/StringListTest.AppendStringMove (1104 of 1905)
PASS: lldb-unit :: Utility/./UtilityTests/RangeTest.SizeTypes (1105 of 1905)
UNSUPPORTED: lldb-api :: functionalities/darwin_log/filter/regex/category/TestDarwinLogFilterRegexCategory.py (1106 of 1905)
PASS: lldb-unit :: Utility/./UtilityTests/LogChannelEnabledTest.LogGetLogThread (1107 of 1905)
UNSUPPORTED: lldb-api :: functionalities/darwin_log/filter/exact_match/activity-chain/TestDarwinLogFilterMatchActivityChain.py (1108 of 1905)
PASS: lldb-api :: commands/expression/import-std-module/weak_ptr-dbg-info-content/TestDbgInfoContentWeakPtr.py (1109 of 1905)
PASS: lldb-api :: functionalities/data-formatter/data-formatter-stl/libcxx/vbool/TestDataFormatterLibcxxVBool.py (1110 of 1905)
PASS: lldb-api :: functionalities/thread/concurrent_events/TestConcurrentTwoWatchpointsOneDelayBreakpoint.py (1111 of 1905)
PASS: lldb-unit :: Utility/./UtilityTests/FileSpecTest.EqualSeparator (1112 of 1905)
PASS: lldb-api :: functionalities/stats_api/TestStatisticsAPI.py (1113 of 1905)
PASS: lldb-shell :: Reproducer/TestFileRepro.test (1114 of 1905)
PASS: lldb-unit :: Utility/./UtilityTests/UUIDTest.Validity (1115 of 1905)
PASS: lldb-unit :: Expression/./ExpressionTests/DiagnosticManagerTest.GetStringPreserveOrder (1116 of 1905)
PASS: lldb-api :: commands/expression/import-std-module/basic/TestImportStdModule.py (1117 of 1905)
PASS: lldb-unit :: Utility/./UtilityTests/StreamTest.PutChar (1118 of 1905)
PASS: lldb-api :: functionalities/data-formatter/data-formatter-stl/libcxx/forward_list/TestDataFormatterLibcxxForwardList.py (1119 of 1905)
PASS: lldb-unit :: UnwindAssembly/x86/./UnwindAssemblyx86Tests/Testx86AssemblyInspectionEngine.TestPushR12 (1120 of 1905)
PASS: lldb-api :: functionalities/breakpoint/breakpoint_names/TestBreakpointNames.py (1121 of 1905)
PASS: lldb-api :: python_api/value_var_update/TestValueVarUpdate.py (1122 of 1905)
PASS: lldb-unit :: Interpreter/./InterpreterTests/OptionArgParserTest.toScriptLanguage (1123 of 1905)
PASS: lldb-api :: commands/expression/top-level/TestTopLevelExprs.py (1124 of 1905)
PASS: lldb-unit :: Expression/./ExpressionTests/CppModuleConfigurationTest.AmbiguousLibCpp (1125 of 1905)
PASS: lldb-api :: commands/expression/call-function/TestCallUserDefinedFunction.py (1126 of 1905)
PASS: lldb-api :: commands/expression/import-std-module/unique_ptr/TestUniquePtr.py (1127 of 1905)
PASS: lldb-unit :: Utility/./UtilityTests/StreamTest.PutBytesAsRawHex8ToBigEndian (1128 of 1905)
PASS: lldb-api :: macosx/version_zero/TestGetVersionZeroVersion.py (1129 of 1905)
PASS: lldb-shell :: Breakpoint/debug_rnglist_rlestartend.test (1130 of 1905)
PASS: lldb-unit :: Utility/./UtilityTests/StringListTest.AppendStringCString (1131 of 1905)
PASS: lldb-api :: python_api/watchpoint/TestWatchpointIgnoreCount.py (1132 of 1905)
PASS: lldb-api :: commands/expression/import-std-module/shared_ptr-dbg-info-content/TestSharedPtrDbgInfoContent.py (1133 of 1905)
PASS: lldb-unit :: Utility/./UtilityTests/TimerTest.CategoryTimes2 (1134 of 1905)
PASS: lldb-unit :: Utility/./UtilityTests/ProcessInstanceInfo.Dump (1135 of 1905)
PASS: lldb-api :: functionalities/data-formatter/data-formatter-stl/libcxx/tuple/TestDataFormatterLibcxxTuple.py (1136 of 1905)
PASS: lldb-shell :: ObjectFile/ELF/section-overlap.yaml (1137 of 1905)
PASS: lldb-api :: lang/objc/modules-update/TestClangModulesUpdate.py (1138 of 1905)
PASS: lldb-api :: functionalities/data-formatter/data-formatter-objc/TestDataFormatterObjCNSContainer.py (1139 of 1905)
PASS: lldb-api :: commands/watchpoints/watchpoint_commands/command/TestWatchpointCommandPython.py (1140 of 1905)
PASS: lldb-unit :: Language/Highlighting/./HighlighterTests/HighlighterTest.ClangCursorOutOfBounds (1141 of 1905)
PASS: lldb-api :: lang/cpp/template-function/TestTemplateFunctions.py (1142 of 1905)
PASS: lldb-unit :: Utility/./UtilityTests/StringExtractorTest.GetHexU8_InvalidHex_NoEof (1143 of 1905)
PASS: lldb-api :: commands/expression/rdar44436068/Test128BitsInteger.py (1144 of 1905)
PASS: lldb-unit :: ScriptInterpreter/Python/./ScriptInterpreterPythonTests/PythonDataObjectsTest.TestPythonIntegerToStr (1145 of 1905)
PASS: lldb-unit :: Utility/./UtilityTests/OptionsWithRawTest.ArgsButNoDelimiter (1146 of 1905)
PASS: lldb-unit :: Utility/./UtilityTests/CompletionRequest.ShiftArguments (1147 of 1905)
PASS: lldb-unit :: Utility/./UtilityTests/NameMatchesTest.StartsWith (1148 of 1905)
PASS: lldb-api :: functionalities/data-formatter/data-formatter-ptr-to-array/TestPtrToArrayFormatting.py (1149 of 1905)
PASS: lldb-shell :: Unwind/thread-step-out-ret-addr-check.test (1150 of 1905)
PASS: lldb-api :: python_api/sbvalue_const_addrof/TestSBValueConstAddrOf.py (1151 of 1905)
PASS: lldb-api :: commands/frame/diagnose/virtual-method-call/TestDiagnoseDereferenceVirtualMethodCall.py (1152 of 1905)
PASS: lldb-unit :: Expression/./ExpressionTests/DiagnosticManagerTest.PutStringMultiple (1153 of 1905)
PASS: lldb-api :: commands/breakpoint/command/list/TestBreakpointCommandList.py (1154 of 1905)
UNSUPPORTED: lldb-shell :: Register/x86-64-zmm-write.test (1155 of 1905)
PASS: lldb-api :: functionalities/data-formatter/poarray/TestPrintObjectArray.py (1156 of 1905)
UNSUPPORTED: lldb-api :: tools/lldb-server/thread-name/TestGdbRemoteThreadName.py (1157 of 1905)
PASS: lldb-unit :: Utility/./UtilityTests/StreamTest.PutHex16ByteOrderLittle (1158 of 1905)
PASS: lldb-unit :: debugserver/./debugserverTests/JSON.Parse (1159 of 1905)
PASS: lldb-api :: lang/cpp/nested-class-other-compilation-unit/TestNestedClassWithParentInAnotherCU.py (1160 of 1905)
UNSUPPORTED: lldb-api :: functionalities/data-formatter/data-formatter-stl/libstdcpp/map/TestDataFormatterStdMap.py (1161 of 1905)
PASS: lldb-unit :: Utility/./UtilityTests/StreamTest.PutHex32ByteOrderBig (1162 of 1905)
PASS: lldb-api :: functionalities/data-formatter/data-formatter-stl/libcxx/optional/TestDataFormatterLibcxxOptional.py (1163 of 1905)
PASS: lldb-unit :: Process/minidump/./LLDBMinidumpTests/MinidumpParserTest.GetMemory (1164 of 1905)
PASS: lldb-unit :: Utility/./UtilityTests/CompletionRequest.Constructor (1165 of 1905)
UNSUPPORTED: lldb-shell :: Watchpoint/netbsd-nouserdbregs.test (1166 of 1905)
UNSUPPORTED: lldb-shell :: BuildScript/toolchain-msvc.test (1167 of 1905)
PASS: lldb-unit :: Utility/./UtilityTests/UserIDResolver.GetGroupName (1168 of 1905)
PASS: lldb-api :: python_api/function_symbol/TestDisasmAPI.py (1169 of 1905)
PASS: lldb-unit :: Utility/./UtilityTests/AnsiTerminal.Incomplete (1170 of 1905)
PASS: lldb-api :: lang/c/offsetof/TestOffsetof.py (1171 of 1905)
PASS: lldb-api :: functionalities/postmortem/minidump-new/TestMiniDumpUUID.py (1172 of 1905)
PASS: lldb-shell :: SymbolFile/NativePDB/globals-fundamental.cpp (1173 of 1905)
PASS: lldb-unit :: Utility/./UtilityTests/ArgsTest.TestQuotedTrailingBackslash (1174 of 1905)
PASS: lldb-unit :: Utility/./UtilityTests/ConstStringTest.NullAndEmptyStates (1175 of 1905)
PASS: lldb-unit :: Utility/./UtilityTests/BinaryStreamTest.PutSLEB128Zero (1176 of 1905)
PASS: lldb-api :: functionalities/data-formatter/nsarraysynth/TestNSArraySynthetic.py (1177 of 1905)
PASS: lldb-unit :: Utility/./UtilityTests/StringListTest.InsertStringAtIndexOutOfBounds (1178 of 1905)
UNSUPPORTED: lldb-api :: lang/objc/foundation/TestFoundationDisassembly.py (1179 of 1905)
PASS: lldb-api :: functionalities/thread/step_out/TestThreadStepOut.py (1180 of 1905)
PASS: lldb-unit :: Utility/./UtilityTests/ScalarTest.Promotion (1181 of 1905)
PASS: lldb-unit :: UnwindAssembly/x86/./UnwindAssemblyx86Tests/Testx86AssemblyInspectionEngine.TestPushESI (1182 of 1905)
UNSUPPORTED: lldb-shell :: ScriptInterpreter/Lua/convenience_variables.test (1183 of 1905)
PASS: lldb-unit :: Utility/./UtilityTests/BinaryStreamTest.PutSLEB128FiveBytes (1184 of 1905)
PASS: lldb-unit :: ScriptInterpreter/Python/./ScriptInterpreterPythonTests/PythonDataObjectsTest.TestObjectAttributes (1185 of 1905)
PASS: lldb-unit :: Utility/./UtilityTests/StreamTest.PutMaxHex64ByteOrderBig (1186 of 1905)
PASS: lldb-shell :: Breakpoint/split-dwarf5-debug-stroffsets.test (1187 of 1905)
PASS: lldb-api :: functionalities/data-formatter/var-in-aggregate-misuse/TestVarInAggregateMisuse.py (1188 of 1905)
PASS: lldb-unit :: UnwindAssembly/x86/./UnwindAssemblyx86Tests/Testx86AssemblyInspectionEngine.TestPopR15 (1189 of 1905)
PASS: lldb-shell :: ObjectFile/ELF/short-build-id.yaml (1190 of 1905)
PASS: lldb-api :: lang/cpp/stl/TestSTL.py (1191 of 1905)
PASS: lldb-unit :: Symbol/./SymbolTests/TestClangASTImporter.ImportInvalidType (1192 of 1905)
PASS: lldb-unit :: ScriptInterpreter/Python/./ScriptInterpreterPythonTests/PythonDataObjectsTest.TestResetting (1193 of 1905)
PASS: lldb-unit :: Utility/./UtilityTests/StringListTest.GetMaxStringLengthMixed (1194 of 1905)
PASS: lldb-shell :: Minidump/disassemble-no-module.yaml (1195 of 1905)
UNSUPPORTED: lldb-shell :: Register/x86-ymm-write.test (1196 of 1905)
PASS: lldb-shell :: ScriptInterpreter/None/import_module.test (1197 of 1905)
PASS: lldb-unit :: Utility/./UtilityTests/ScalarTest.Division (1198 of 1905)
PASS: lldb-unit :: Process/gdb-remote/./ProcessGdbRemoteTests/GDBRemoteCommunicationClientTest.SendSignalsToIgnore (1199 of 1905)
PASS: lldb-api :: commands/expression/import-std-module/list-basic/TestBasicList.py (1200 of 1905)
PASS: lldb-unit :: Host/./HostTests/NativeProcessProtocolTest.ReadCStringFromMemory (1201 of 1905)
PASS: lldb-unit :: SymbolFile/DWARF/./SymbolFileDWARFTests/SymbolFileDWARFTests.TestAbbrevInvalidNULLTag (1202 of 1905)
PASS: lldb-api :: lang/c/enum_types/TestEnumTypes.py (1203 of 1905)
PASS: lldb-api :: macosx/function-starts/TestFunctionStarts.py (1204 of 1905)
PASS: lldb-unit :: Language/Highlighting/./HighlighterTests/HighlighterTest.ClangCursorPosBeforeOtherToken (1205 of 1905)
PASS: lldb-api :: functionalities/thread/concurrent_events/TestConcurrentWatchpointWithDelayWatchpointThreads.py (1206 of 1905)
PASS: lldb-api :: functionalities/breakpoint/global_constructor/TestBreakpointInGlobalConstructor.py (1207 of 1905)
PASS: lldb-unit :: UnwindAssembly/x86/./UnwindAssemblyx86Tests/Testx86AssemblyInspectionEngine.TestPopRBPWithREX (1208 of 1905)
PASS: lldb-unit :: Utility/./UtilityTests/RangeTest.ContainsAddr (1209 of 1905)
PASS: lldb-unit :: Utility/./UtilityTests/UUIDTest.StringConverion (1210 of 1905)
PASS: lldb-unit :: Process/gdb-remote/./ProcessGdbRemoteTests/GDBRemoteClientBaseTest.SendContinueDelegateStructuredDataReceipt (1211 of 1905)
PASS: lldb-unit :: Process/gdb-remote/./ProcessGdbRemoteTests/GDBRemoteCommunicationClientTest.ReadRegister (1212 of 1905)
PASS: lldb-unit :: Language/Highlighting/./HighlighterTests/HighlighterTest.ClangUnterminatedString (1213 of 1905)
UNSUPPORTED: lldb-shell :: Register/arm-gp-read.test (1214 of 1905)
PASS: lldb-api :: lang/cpp/scope/TestCppScope.py (1215 of 1905)
PASS: lldb-unit :: ScriptInterpreter/Python/./ScriptInterpreterPythonTests/PythonDataObjectsTest.TestExtractingUInt64ThroughStructuredData (1216 of 1905)
PASS: lldb-unit :: Utility/./UtilityTests/VASprintfTest.EncodingError (1217 of 1905)
PASS: lldb-unit :: Utility/./UtilityTests/ArgsTest.GetArgumentArrayRef (1218 of 1905)
PASS: lldb-unit :: Language/Highlighting/./HighlighterTests/HighlighterTest.ClangOperators (1219 of 1905)
PASS: lldb-unit :: Utility/./UtilityTests/ArgsTest.TestAppendArg (1220 of 1905)
PASS: lldb-unit :: Utility/./UtilityTests/StateTest.Formatv (1221 of 1905)
UNSUPPORTED: lldb-api :: lang/objc/bitfield_ivars/TestBitfieldIvars.py (1222 of 1905)
PASS: lldb-unit :: Expression/./ExpressionTests/DiagnosticManagerTest.GetStringBasic (1223 of 1905)
PASS: lldb-api :: functionalities/gdb_remote_client/TestWriteMemory.py (1224 of 1905)
PASS: lldb-unit :: SymbolFile/NativePDB/./SymbolFileNativePDBTests/PDBFPOProgramToDWARFExpressionTests.UnknownOp (1225 of 1905)
PASS: lldb-shell :: Driver/LocalLLDBInit.test (1226 of 1905)
PASS: lldb-unit :: Utility/./UtilityTests/FileSpecTest.Equal (1227 of 1905)
PASS: lldb-api :: lang/c/blocks/TestBlocks.py (1228 of 1905)
PASS: lldb-unit :: Process/minidump/./LLDBMinidumpTests/MinidumpParserTest.GetMiscInfo_no_stream (1229 of 1905)
PASS: lldb-unit :: Utility/./UtilityTests/StreamTest.ChangingByteOrder (1230 of 1905)
PASS: lldb-api :: lang/cpp/wchar_t/TestCxxWCharT.py (1231 of 1905)
PASS: lldb-shell :: SymbolFile/DWARF/DW_AT_low_pc-addrx.s (1232 of 1905)
PASS: lldb-unit :: Utility/./UtilityTests/StringListTest.RemoveBlankLines (1233 of 1905)
PASS: lldb-api :: lang/objc/global_ptrs/TestGlobalObjects.py (1234 of 1905)
PASS: lldb-api :: python_api/signals/TestSignalsAPI.py (1235 of 1905)
PASS: lldb-api :: functionalities/data-formatter/data-formatter-objc/TestDataFormatterObjCExpr.py (1236 of 1905)
PASS: lldb-unit :: Utility/./UtilityTests/LogChannelEnabledTest.LogVerboseThread (1237 of 1905)
PASS: lldb-api :: commands/command/invalid-args/TestInvalidArgsCommand.py (1238 of 1905)
UNSUPPORTED: lldb-api :: benchmarks/libcxxlist/TestBenchmarkLibcxxList.py (1239 of 1905)
PASS: lldb-unit :: Utility/./UtilityTests/StringExtractorTest.DecodeHexU8_Underflow2 (1240 of 1905)
PASS: lldb-api :: functionalities/memory/read/TestMemoryRead.py (1241 of 1905)
PASS: lldb-unit :: Utility/./UtilityTests/ArchSpecTest.OperatorBool (1242 of 1905)
PASS: lldb-unit :: Utility/./UtilityTests/GeneratorTest.GetOrCreate (1243 of 1905)
PASS: lldb-api :: tools/lldb-server/TestGdbRemoteKill.py (1244 of 1905)
PASS: lldb-unit :: Utility/./UtilityTests/StringListTest.LongestCommonPrefixSingleElement (1245 of 1905)
PASS: lldb-unit :: Host/./HostTests/MainLoopTest.ReadObject (1246 of 1905)
PASS: lldb-api :: python_api/value/TestValueAPI.py (1247 of 1905)
PASS: lldb-unit :: Utility/./UtilityTests/AnsiTerminal.Twice (1248 of 1905)
PASS: lldb-unit :: Symbol/./SymbolTests/Type.GetTypeScopeAndBasename (1249 of 1905)
PASS: lldb-unit :: Utility/./UtilityTests/ArgsTest.ReplaceArgumentAtIndexLonger (1250 of 1905)
PASS: lldb-api :: functionalities/data-formatter/format-propagation/TestFormatPropagation.py (1251 of 1905)
UNSUPPORTED: lldb-api :: python_api/event/TestEvents.py (1252 of 1905)
PASS: lldb-unit :: tools/lldb-server/tests/./LLDBServerTests/TestBase.DebugserverEnv (1253 of 1905)
PASS: lldb-api :: commands/expression/completion-in-lambda-and-unnamed-class/TestCompletionInLambdaAndUnnamedClass.py (1254 of 1905)
PASS: lldb-unit :: Language/Highlighting/./HighlighterTests/HighlighterTest.HighlighterSelectionType (1255 of 1905)
PASS: lldb-unit :: ScriptInterpreter/Python/./ScriptInterpreterPythonTests/PythonDataObjectsTest.TestGlobalNameResolutionNoDot (1256 of 1905)
PASS: lldb-unit :: Utility/./UtilityTests/StringListTest.InsertStringAtIndexMove (1257 of 1905)
PASS: lldb-unit :: Symbol/./SymbolTests/TestClangASTContext.TestIsClangType (1258 of 1905)
PASS: lldb-api :: lang/c/array_types/TestArrayTypes.py (1259 of 1905)
PASS: lldb-api :: commands/expression/namespace_local_var_same_name_obj_c/TestNamespaceLocalVarSameNameObjC.py (1260 of 1905)
PASS: lldb-api :: commands/expression/test/TestExprs2.py (1261 of 1905)
PASS: lldb-unit :: Utility/./UtilityTests/NameMatchesTest.Contains (1262 of 1905)
PASS: lldb-shell :: SymbolFile/DWARF/DW_AT_loclists_base.s (1263 of 1905)
PASS: lldb-unit :: Utility/./UtilityTests/RangeTest.ContainsRange (1264 of 1905)
PASS: lldb-api :: tools/lldb-server/TestGdbRemoteThreadsInStopReply.py (1265 of 1905)
PASS: lldb-unit :: Language/Highlighting/./HighlighterTests/HighlighterTest.ClangCursorPosInOtherToken (1266 of 1905)
PASS: lldb-shell :: Settings/TestDisassemblyFormat.test (1267 of 1905)
PASS: lldb-api :: commands/expression/anonymous-struct/TestCallUserAnonTypedef.py (1268 of 1905)
UNSUPPORTED: lldb-api :: functionalities/darwin_log/filter/exact_match/activity/TestDarwinLogFilterMatchActivity.py (1269 of 1905)
PASS: lldb-unit :: Utility/./UtilityTests/FileSpecTest.FormatFileSpec (1270 of 1905)
UNSUPPORTED: lldb-shell :: Register/x86-64-xmm16-read.test (1271 of 1905)
PASS: lldb-unit :: Expression/./ExpressionTests/CppModuleConfigurationTest.LinuxLocalLibCpp (1272 of 1905)
PASS: lldb-api :: sample_test/TestSampleInlineTest.py (1273 of 1905)
PASS: lldb-api :: lang/objc/ivar-IMP/TestObjCiVarIMP.py (1274 of 1905)
UNSUPPORTED: lldb-api :: arm/breakpoint-it/TestBreakpointIt.py (1275 of 1905)
PASS: lldb-unit :: Process/gdb-remote/./ProcessGdbRemoteTests/GDBRemoteCommunicationClientTest.GetMemoryRegionInfoInvalidResponse (1276 of 1905)
PASS: lldb-api :: functionalities/tail_call_frames/disambiguate_call_site/TestDisambiguateCallSite.py (1277 of 1905)
PASS: lldb-unit :: Process/minidump/./LLDBMinidumpTests/MinidumpParserTest.GetLinuxProcStatus_no_stream (1278 of 1905)
PASS: lldb-api :: lang/objc/objc-dyn-sbtype/TestObjCDynamicSBType.py (1279 of 1905)
PASS: lldb-unit :: Utility/./UtilityTests/FileSpecTest.EqualDotsWindows (1280 of 1905)
PASS: lldb-api :: functionalities/thread/create_after_attach/TestCreateAfterAttach.py (1281 of 1905)
PASS: lldb-shell :: Breakpoint/case-sensitive.test (1282 of 1905)
PASS: lldb-unit :: Utility/./UtilityTests/DataExtractorTest.PeekData (1283 of 1905)
PASS: lldb-shell :: ObjectFile/ELF/duplicate-section.yaml (1284 of 1905)
PASS: lldb-unit :: Utility/./UtilityTests/ReproducerTest.SetReplay (1285 of 1905)
PASS: lldb-api :: macosx/duplicate-archive-members/TestDuplicateMembers.py (1286 of 1905)
PASS: lldb-api :: functionalities/ptr_refs/TestPtrRefs.py (1287 of 1905)
XFAIL: lldb-shell :: Unwind/prefer-debug-over-eh-frame.test (1288 of 1905)
PASS: lldb-unit :: Host/./HostTests/SocketTest.DecodeHostAndPort (1289 of 1905)
PASS: lldb-api :: functionalities/postmortem/elf-core/thread_crash/TestLinuxCoreThreads.py (1290 of 1905)
PASS: lldb-api :: commands/target/create-deps/TestTargetCreateDeps.py (1291 of 1905)
UNSUPPORTED: lldb-api :: functionalities/breakpoint/hardware_breakpoints/hardware_breakpoint_on_multiple_threads/TestHWBreakMultiThread.py (1292 of 1905)
PASS: lldb-shell :: Quit/TestQuitExitCodeHexA.test (1293 of 1905)
PASS: lldb-shell :: ObjectFile/ELF/PT_TLS-overlap-PT_LOAD.yaml (1294 of 1905)
PASS: lldb-api :: commands/target/basic/TestTargetCommand.py (1295 of 1905)
PASS: lldb-unit :: SymbolFile/DWARF/./SymbolFileDWARFTests/SymbolFileDWARFTests.TestAbbrevValidAttrNullForm (1296 of 1905)
PASS: lldb-shell :: ObjectFile/Breakpad/breakpad-identification.test (1297 of 1905)
PASS: lldb-api :: functionalities/breakpoint/breakpoint_options/TestBreakpointOptions.py (1298 of 1905)
UNSUPPORTED: lldb-shell :: Minidump/Windows/arm-fp-unwind.test (1299 of 1905)
PASS: lldb-api :: lang/cpp/extern_c/TestExternCSymbols.py (1300 of 1905)
PASS: lldb-unit :: Utility/./UtilityTests/GeneratorTest.Create (1301 of 1905)
PASS: lldb-api :: functionalities/memory-region/TestMemoryRegion.py (1302 of 1905)
PASS: lldb-api :: functionalities/data-formatter/data-formatter-objc/TestDataFormatterObjCNSData.py (1303 of 1905)
PASS: lldb-api :: lang/cpp/llvm-style/TestLLVMStyle.py (1304 of 1905)
PASS: lldb-api :: commands/expression/issue_11588/Test11588.py (1305 of 1905)
PASS: lldb-shell :: SymbolFile/Breakpad/line-table-edgecases.test (1306 of 1905)
PASS: lldb-unit :: Symbol/./SymbolTests/TestClangASTContext.TestGetBasicTypeFromEnum (1307 of 1905)
PASS: lldb-api :: lang/cpp/incomplete-types/TestCppIncompleteTypes.py (1308 of 1905)
PASS: lldb-api :: lang/objc/foundation/TestObjectDescriptionAPI.py (1309 of 1905)
PASS: lldb-unit :: ScriptInterpreter/Python/./ScriptInterpreterPythonTests/PythonDataObjectsTest.TestPythonFile (1310 of 1905)
PASS: lldb-api :: functionalities/memory/cache/TestMemoryCache.py (1311 of 1905)
PASS: lldb-api :: functionalities/gdb_remote_client/TestNoGPacketSupported.py (1312 of 1905)
PASS: lldb-api :: functionalities/wrong_commands/TestWrongCommands.py (1313 of 1905)
PASS: lldb-unit :: Utility/./UtilityTests/LogTest.Unregister (1314 of 1905)
PASS: lldb-unit :: Process/gdb-remote/./ProcessGdbRemoteTests/GDBRemoteCommunicationClientTest.GetModulesInfo (1315 of 1905)
PASS: lldb-api :: macosx/nslog/TestDarwinNSLogOutput.py (1316 of 1905)
PASS: lldb-unit :: UnwindAssembly/x86/./UnwindAssemblyx86Tests/Testx86AssemblyInspectionEngine.Test32bitFramelessBigStackFrame (1317 of 1905)
PASS: lldb-shell :: ObjectFile/ELF/minidebuginfo-corrupt-xz.yaml (1318 of 1905)
PASS: lldb-api :: commands/target/dump-symtab-demangle/TestDumpSymtabDemangle.py (1319 of 1905)
PASS: lldb-shell :: Register/x86-64-read.test (1320 of 1905)
PASS: lldb-unit :: Host/./HostTests/FileSystemTest.Readable (1321 of 1905)
PASS: lldb-shell :: Reproducer/Functionalities/TestStepping.test (1322 of 1905)
PASS: lldb-api :: lang/cpp/const_this/TestConstThis.py (1323 of 1905)
PASS: lldb-shell :: SymbolFile/DWARF/find-qualified-variable.cpp (1324 of 1905)
PASS: lldb-unit :: Utility/./UtilityTests/CompletionRequest.TryCompleteCurrentArgGood (1325 of 1905)
PASS: lldb-unit :: Utility/./UtilityTests/VMRange.IsValid (1326 of 1905)
PASS: lldb-api :: functionalities/signal/handle-abrt/TestHandleAbort.py (1327 of 1905)
PASS: lldb-api :: lang/cpp/global_operators/TestCppGlobalOperators.py (1328 of 1905)
PASS: lldb-unit :: UnwindAssembly/x86/./UnwindAssemblyx86Tests/Testx86AssemblyInspectionEngine.TestPushEBP (1329 of 1905)
PASS: lldb-unit :: debugserver/./debugserverTests/RNBSocket.LoopBackListenIPv6 (1330 of 1905)
PASS: lldb-api :: macosx/universal/TestUniversal.py (1331 of 1905)
PASS: lldb-unit :: Utility/./UtilityTests/StringListTest.LongestCommonPrefixEmpty (1332 of 1905)
PASS: lldb-unit :: UnwindAssembly/x86/./UnwindAssemblyx86Tests/Testx86AssemblyInspectionEngine.TestPushEDX (1333 of 1905)
PASS: lldb-unit :: Process/minidump/./LLDBMinidumpTests/MinidumpParserTest.MinidumpDuplicateModuleMinAddress (1334 of 1905)
UNSUPPORTED: lldb-shell :: SymbolFile/target-symbols-add-unwind.test (1335 of 1905)
PASS: lldb-shell :: Quit/TestQuitExitCodeImplicit0.test (1336 of 1905)
PASS: lldb-shell :: ObjectFile/ELF/gnu-debuglink.yaml (1337 of 1905)
PASS: lldb-shell :: Expr/TestIRMemoryMap.test (1338 of 1905)
PASS: lldb-unit :: Utility/./UtilityTests/ArgsTest.TestSingleQuotedArgWithSpace (1339 of 1905)
PASS: lldb-api :: lang/objc/objc++/TestObjCXX.py (1340 of 1905)
PASS: lldb-api :: api/multithreaded/TestMultithreaded.py (1341 of 1905)
PASS: lldb-api :: lang/objc/foundation/TestObjCMethods.py (1342 of 1905)
PASS: lldb-unit :: Utility/./UtilityTests/FileSpecTest.IsRelative (1343 of 1905)
PASS: lldb-api :: functionalities/breakpoint/breakpoint_hit_count/TestBreakpointHitCount.py (1344 of 1905)
PASS: lldb-shell :: ObjectFile/Breakpad/sections-trailing-func.test (1345 of 1905)
PASS: lldb-api :: commands/expression/timeout/TestCallWithTimeout.py (1346 of 1905)
PASS: lldb-unit :: Process/minidump/./LLDBMinidumpTests/MinidumpParserTest.GetLinuxProcStatus (1347 of 1905)
PASS: lldb-unit :: Utility/./UtilityTests/StringExtractorTest.DecodeHexU8_InvalidHex (1348 of 1905)
PASS: lldb-api :: lang/objc/modules-app-update/TestClangModulesAppUpdate.py (1349 of 1905)
PASS: lldb-api :: functionalities/rerun/TestRerun.py (1350 of 1905)
PASS: lldb-api :: functionalities/thread/concurrent_events/TestConcurrentTwoWatchpointsOneBreakpoint.py (1351 of 1905)
PASS: lldb-unit :: Utility/./UtilityTests/OptionsWithRawTest.EmptySuffixSingleWhitespace (1352 of 1905)
PASS: lldb-api :: functionalities/load_unload/TestLoadUnload.py (1353 of 1905)
PASS: lldb-api :: functionalities/breakpoint/move_nearest/TestMoveNearest.py (1354 of 1905)
PASS: lldb-api :: lang/objc/foundation/TestRuntimeTypes.py (1355 of 1905)
PASS: lldb-unit :: UnwindAssembly/x86/./UnwindAssemblyx86Tests/Testx86AssemblyInspectionEngine.TestPushR15 (1356 of 1905)
PASS: lldb-unit :: Utility/./UtilityTests/AnsiTerminal.Empty (1357 of 1905)
PASS: lldb-api :: functionalities/data-formatter/data-formatter-globals/TestDataFormatterGlobals.py (1358 of 1905)
PASS: lldb-unit :: UnwindAssembly/x86/./UnwindAssemblyx86Tests/Testx86AssemblyInspectionEngine.TestSubESP (1359 of 1905)
PASS: lldb-unit :: Expression/./ExpressionTests/DWARFExpression.DW_OP_piece (1360 of 1905)
PASS: lldb-api :: commands/expression/persistent_types/TestPersistentTypes.py (1361 of 1905)
PASS: lldb-unit :: Utility/./UtilityTests/StringListTest.AppendStringStdString (1362 of 1905)
UNSUPPORTED: lldb-api :: functionalities/thread/concurrent_events/TestConcurrentManySignals.py (1363 of 1905)
PASS: lldb-shell :: Settings/TestFrameFormatMangling.test (1364 of 1905)
PASS: lldb-api :: functionalities/step_scripted/TestStepScripted.py (1365 of 1905)
PASS: lldb-unit :: Utility/./UtilityTests/StreamTeeTest.Assignment (1366 of 1905)
PASS: lldb-api :: functionalities/data-formatter/ostypeformatting/TestFormattersOsType.py (1367 of 1905)
PASS: lldb-unit :: ScriptInterpreter/Python/./ScriptInterpreterPythonTests/PythonDataObjectsTest.TestPythonDictionaryToStructuredDictionary (1368 of 1905)
UNSUPPORTED: lldb-api :: lang/cpp/function-template-parameter-pack/TestFunctionTemplateParameterPack.py (1369 of 1905)
PASS: lldb-api :: commands/platform/basic/TestPlatformCommand.py (1370 of 1905)
PASS: lldb-api :: macosx/load-kext/TestLoadKext.py (1371 of 1905)
PASS: lldb-api :: functionalities/data-formatter/data-formatter-synthtype/TestDataFormatterSynthType.py (1372 of 1905)
PASS: lldb-api :: lang/cpp/member-and-local-vars-with-same-name/TestMembersAndLocalsWithSameName.py (1373 of 1905)
PASS: lldb-api :: commands/expression/po_verbosity/TestPoVerbosity.py (1374 of 1905)
PASS: lldb-unit :: Utility/./UtilityTests/StreamTest.PutULEB128 (1375 of 1905)
PASS: lldb-api :: commands/expression/no-deadlock/TestExprDoesntBlock.py (1376 of 1905)
PASS: lldb-api :: functionalities/thread/concurrent_events/TestConcurrentTwoWatchpointThreads.py (1377 of 1905)
PASS: lldb-api :: functionalities/postmortem/minidump/TestMiniDump.py (1378 of 1905)
PASS: lldb-unit :: UnwindAssembly/x86/./UnwindAssemblyx86Tests/Testx86AssemblyInspectionEngine.TestSimplex86_64Augmented (1379 of 1905)
PASS: lldb-api :: macosx/indirect_symbol/TestIndirectSymbols.py (1380 of 1905)
PASS: lldb-unit :: Utility/./UtilityTests/RangeTest.Equal (1381 of 1905)
PASS: lldb-unit :: Utility/./UtilityTests/FileSpecTest.EqualDotsPosixRoot (1382 of 1905)
PASS: lldb-unit :: Process/minidump/./LLDBMinidumpTests/MinidumpParserTest.FindMemoryRangeWithFullMemoryMinidump (1383 of 1905)
PASS: lldb-unit :: Utility/./UtilityTests/UriParserTest.PortOverflow (1384 of 1905)
PASS: lldb-api :: commands/expression/dont_allow_jit/TestAllowJIT.py (1385 of 1905)
PASS: lldb-api :: commands/disassemble/basic/TestDisassembleBreakpoint.py (1386 of 1905)
PASS: lldb-api :: commands/version/TestVersion.py (1387 of 1905)
UNSUPPORTED: lldb-api :: functionalities/darwin_log/filter/regex/message/TestDarwinLogFilterRegexMessage.py (1388 of 1905)
PASS: lldb-unit :: Utility/./UtilityTests/StringLexerTest.Next (1389 of 1905)
PASS: lldb-unit :: Utility/./UtilityTests/BinaryStreamTest.PutSLEB128MaxValue (1390 of 1905)
PASS: lldb-shell :: SymbolFile/NativePDB/global-classes.cpp (1391 of 1905)
PASS: lldb-unit :: Language/Highlighting/./HighlighterTests/HighlighterTest.ClangCursorPosEndOfLine (1392 of 1905)
PASS: lldb-shell :: Settings/TestFrameFormatColor.test (1393 of 1905)
PASS: lldb-api :: commands/expression/fixits/TestFixIts.py (1394 of 1905)
PASS: lldb-api :: functionalities/data-formatter/summary-string-onfail/Test-rdar-9974002.py (1395 of 1905)
PASS: lldb-unit :: Utility/./UtilityTests/BinaryStreamTest.PutSLEB128One (1396 of 1905)
PASS: lldb-shell :: Quit/TestQuitExitCodeTooManyArgs.test (1397 of 1905)
PASS: lldb-shell :: SymbolFile/Breakpad/stack-cfi-parsing.test (1398 of 1905)
PASS: lldb-unit :: ObjectFile/Breakpad/./ObjectFileBreakpadTests/StackCFIRecord.parse (1399 of 1905)
PASS: lldb-api :: lang/cpp/enum_types/TestCPP11EnumTypes.py (1400 of 1905)
PASS: lldb-shell :: SymbolFile/DWARF/dwarf5-debug_line.s (1401 of 1905)
PASS: lldb-unit :: Process/gdb-remote/./ProcessGdbRemoteTests/GDBRemoteCommunicationClientTest.GetMemoryRegionInfo (1402 of 1905)
PASS: lldb-unit :: Utility/./UtilityTests/Flags.Reset (1403 of 1905)
PASS: lldb-unit :: Core/./LLDBCoreTests/MangledTest.ResultForBlockInvocation (1404 of 1905)
UNSUPPORTED: lldb-shell :: SymbolFile/PDB/function-nested-block.test (1405 of 1905)
PASS: lldb-unit :: Utility/./UtilityTests/StreamTest.PutCStringWithStringRef (1406 of 1905)
UNSUPPORTED: lldb-shell :: SymbolFile/PDB/calling-conventions.test (1407 of 1905)
PASS: lldb-api :: lang/cpp/unsigned_types/TestUnsignedTypes.py (1408 of 1905)
PASS: lldb-api :: commands/expression/import-std-module/list-dbg-info-content/TestDbgInfoContentList.py (1409 of 1905)
PASS: lldb-unit :: ScriptInterpreter/Python/./ScriptInterpreterPythonTests/PythonDataObjectsTest.TestDictionaryResolutionWithDot (1410 of 1905)
PASS: lldb-unit :: Utility/./UtilityTests/StatusTest.ErrorConstructor (1411 of 1905)
PASS: lldb-api :: commands/expression/static-initializers/TestStaticInitializers.py (1412 of 1905)
PASS: lldb-unit :: Utility/./UtilityTests/OptionsWithRawTest.SingleWhitespaceInput (1413 of 1905)
PASS: lldb-api :: lang/c/vla/TestVLA.py (1414 of 1905)
PASS: lldb-api :: functionalities/conditional_break/TestConditionalBreak.py (1415 of 1905)
PASS: lldb-unit :: Language/Highlighting/./HighlighterTests/HighlighterTest.DefaultHighlighterWithCursorOutOfBounds (1416 of 1905)
PASS: lldb-unit :: UnwindAssembly/x86/./UnwindAssemblyx86Tests/Testx86AssemblyInspectionEngine.TestAddESP (1417 of 1905)
PASS: lldb-api :: functionalities/data-formatter/data-formatter-stl/libcxx/string/TestDataFormatterLibcxxString.py (1418 of 1905)
PASS: lldb-api :: functionalities/postmortem/netbsd-core/TestNetBSDCore.py (1419 of 1905)
PASS: lldb-unit :: Utility/./UtilityTests/RegularExpression.Match (1420 of 1905)
PASS: lldb-api :: linux/builtin_trap/TestBuiltinTrap.py (1421 of 1905)
PASS: lldb-unit :: Utility/./UtilityTests/NameMatchesTest.RegularExpression (1422 of 1905)
PASS: lldb-api :: commands/expression/two-files/TestObjCTypeQueryFromOtherCompileUnit.py (1423 of 1905)
PASS: lldb-unit :: Utility/./UtilityTests/StreamTest.PutHex64ByteOrderBig (1424 of 1905)
PASS: lldb-unit :: Utility/./UtilityTests/StringExtractorTest.GetHexBytesAvail_Partial (1425 of 1905)
PASS: lldb-unit :: Language/Highlighting/./HighlighterTests/HighlighterTest.HighlighterSelectionPath (1426 of 1905)
PASS: lldb-unit :: Utility/./UtilityTests/StreamTest.PutHex64ByteOrderLittle (1427 of 1905)
PASS: lldb-unit :: Utility/./UtilityTests/ArgsTest.ReplaceArgumentAtIndexFarOutOfRange (1428 of 1905)
PASS: lldb-unit :: UnwindAssembly/x86/./UnwindAssemblyx86Tests/Testx86AssemblyInspectionEngine.Test32bitFramelessSmallStackFrame (1429 of 1905)
PASS: lldb-api :: commands/frame/diagnose/local-variable/TestLocalVariable.py (1430 of 1905)
PASS: lldb-unit :: Utility/./UtilityTests/ScalarTest.CastOperations (1431 of 1905)
PASS: lldb-api :: lang/objc/foundation/TestObjCMethods2.py (1432 of 1905)
UNSUPPORTED: lldb-api :: functionalities/ubsan/basic/TestUbsanBasic.py (1433 of 1905)
PASS: lldb-unit :: Utility/./UtilityTests/UriParserTest.MinimalPath (1434 of 1905)
PASS: lldb-unit :: UnwindAssembly/x86/./UnwindAssemblyx86Tests/Testx86AssemblyInspectionEngine.Test32BitOnlyInstruction (1435 of 1905)
PASS: lldb-unit :: ScriptInterpreter/Python/./ScriptInterpreterPythonTests/PythonDataObjectsTest.TestRun (1436 of 1905)
PASS: lldb-unit :: Utility/./UtilityTests/BinaryStreamTest.PutULEB128NineBytes (1437 of 1905)
PASS: lldb-shell :: SymbolFile/DWARF/compilercontext.ll (1438 of 1905)
PASS: lldb-api :: lang/cpp/class-template-parameter-pack/TestClassTemplateParameterPack.py (1439 of 1905)
PASS: lldb-api :: lang/objc/objc-static-method-stripped/TestObjCStaticMethodStripped.py (1440 of 1905)
PASS: lldb-unit :: SymbolFile/DWARF/./SymbolFileDWARFTests/SymbolFileDWARFTests.TestAbbrevOutOfOrder (1441 of 1905)
PASS: lldb-unit :: Host/./HostTests/NativeProcessProtocolTest.ReadCStringFromMemory_MaxSize (1442 of 1905)
PASS: lldb-api :: commands/watchpoints/watchpoint_on_vectors/TestValueOfVectorVariable.py (1443 of 1905)
PASS: lldb-unit :: Utility/./UtilityTests/StringListTest.ForRange (1444 of 1905)
PASS: lldb-unit :: Editline/./EditlineTests/EditlineTestFixture.EditlineReceivesMultiLineText (1445 of 1905)
PASS: lldb-shell :: ObjectFile/ELF/compressed-sections.yaml (1446 of 1905)
PASS: lldb-unit :: UnwindAssembly/x86/./UnwindAssemblyx86Tests/Testx86AssemblyInspectionEngine.TestPushEDI (1447 of 1905)
PASS: lldb-api :: functionalities/thread/concurrent_events/TestConcurrentSignalDelayBreak.py (1448 of 1905)
PASS: lldb-unit :: Utility/./UtilityTests/StringExtractorTest.GetHexBytesAvail_FullString (1449 of 1905)
PASS: lldb-unit :: Utility/./UtilityTests/StringExtractorTest.GetU64BigEndian (1450 of 1905)
PASS: lldb-api :: functionalities/thread/concurrent_events/TestConcurrentManyBreakpoints.py (1451 of 1905)
PASS: lldb-api :: macosx/thread-names/TestInterruptThreadNames.py (1452 of 1905)
PASS: lldb-shell :: ObjectFile/PECOFF/export-dllfunc.yaml (1453 of 1905)
PASS: lldb-unit :: Utility/./UtilityTests/StringListTest.AppendListCStringArray (1454 of 1905)
PASS: lldb-shell :: Expr/TestMultilineExpr.test (1455 of 1905)
UNSUPPORTED: lldb-api :: functionalities/data-formatter/data-formatter-stl/libstdcpp/vector/TestDataFormatterStdVector.py (1456 of 1905)
PASS: lldb-unit :: Utility/./UtilityTests/OptionsWithRawTest.ArgsButNoLeadingDash (1457 of 1905)
PASS: lldb-api :: macosx/find-dsym/bundle-with-dot-in-filename/TestBundleWithDotInFilename.py (1458 of 1905)
PASS: lldb-unit :: Utility/./UtilityTests/StringExtractorTest.GetHexU8_Underflow_NoEof (1459 of 1905)
PASS: lldb-shell :: SymbolFile/DWARF/win-i386-line-table.s (1460 of 1905)
PASS: lldb-api :: functionalities/data-formatter/data-formatter-advanced/TestDataFormatterAdv.py (1461 of 1905)
PASS: lldb-api :: python_api/objc_type/TestObjCType.py (1462 of 1905)
PASS: lldb-api :: functionalities/object-file/TestImageListMultiArchitecture.py (1463 of 1905)
PASS: lldb-unit :: ScriptInterpreter/Python/./ScriptInterpreterPythonTests/PythonDataObjectsTest.TestExceptions (1464 of 1905)
PASS: lldb-api :: commands/expression/cast_int_to_anonymous_enum/TestCastIntToAnonymousEnum.py (1465 of 1905)
PASS: lldb-unit :: Utility/./UtilityTests/VMRange.Reset (1466 of 1905)
PASS: lldb-api :: commands/expression/import-std-module/vector-of-vectors/TestVectorOfVectors.py (1467 of 1905)
UNSUPPORTED: lldb-shell :: Register/arm-fp-read.test (1468 of 1905)
UNSUPPORTED: lldb-shell :: ObjectFile/ELF/minidebuginfo-set-and-hit-breakpoint.test (1469 of 1905)
PASS: lldb-shell :: Quit/TestQuitExitCodeHex0.test (1470 of 1905)
UNSUPPORTED: lldb-api :: lang/c/typedef/Testtypedef.py (1471 of 1905)
PASS: lldb-unit :: Utility/./UtilityTests/ArchSpecTest.Compatibility (1472 of 1905)
PASS: lldb-unit :: Utility/./UtilityTests/OptionsWithRawTest.WhitespaceSuffix (1473 of 1905)
PASS: lldb-api :: lang/cpp/char1632_t/TestChar1632T.py (1474 of 1905)
PASS: lldb-shell :: Breakpoint/implicit_const_form_support.test (1475 of 1905)
PASS: lldb-unit :: Expression/./ExpressionTests/CppModuleConfigurationTest.MissingLibCpp (1476 of 1905)
PASS: lldb-api :: python_api/hello_world/TestHelloWorld.py (1477 of 1905)
PASS: lldb-unit :: Utility/./UtilityTests/BroadcasterTest.EventTypeHasListeners (1478 of 1905)
PASS: lldb-unit :: tools/lldb-server/tests/./LLDBServerTests/StandardStartupTest.TestStopReplyContainsThreadPcs (1479 of 1905)
PASS: lldb-api :: functionalities/breakpoint/objc/TestObjCBreakpoints.py (1480 of 1905)
PASS: lldb-api :: python_api/exprpath_synthetic/TestExprPathSynthetic.py (1481 of 1905)
PASS: lldb-shell :: SymbolFile/NativePDB/tag-types.cpp (1482 of 1905)
PASS: lldb-unit :: Expression/./ExpressionTests/DWARFExpression.DW_OP_convert (1483 of 1905)
PASS: lldb-shell :: SymbolFile/DWARF/debug-types-missing-signature.test (1484 of 1905)
PASS: lldb-unit :: Symbol/./SymbolTests/TestClangASTContext.TestBuiltinTypeForEncodingAndBitSize (1485 of 1905)
PASS: lldb-unit :: Utility/./UtilityTests/StreamTeeTest.Flush (1486 of 1905)
PASS: lldb-api :: python_api/process/TestProcessAPI.py (1487 of 1905)
PASS: lldb-api :: commands/process/launch-with-shellexpand/TestLaunchWithShellExpand.py (1488 of 1905)
PASS: lldb-unit :: Utility/./UtilityTests/StructuredDataTest.StringDump (1489 of 1905)
PASS: lldb-api :: python_api/lldbutil/iter/TestLLDBIterator.py (1490 of 1905)
UNSUPPORTED: lldb-shell :: ScriptInterpreter/Lua/command_script_import.test (1491 of 1905)
PASS: lldb-api :: lang/cpp/this/TestCPPThis.py (1492 of 1905)
PASS: lldb-unit :: Utility/./UtilityTests/Flags.AllSet (1493 of 1905)
PASS: lldb-unit :: Process/gdb-remote/./ProcessGdbRemoteTests/GDBRemoteClientBaseTest.SendContinueAndInterrupt (1494 of 1905)
PASS: lldb-unit :: Utility/./UtilityTests/StringLexerTest.HasAtLeast (1495 of 1905)
PASS: lldb-api :: lang/objc/forward-decl/TestForwardDecl.py (1496 of 1905)
PASS: lldb-unit :: Utility/./UtilityTests/UserIDResolver.GetUserName (1497 of 1905)
PASS: lldb-api :: commands/expression/rdar42038760/TestScalarURem.py (1498 of 1905)
UNSUPPORTED: lldb-api :: linux/sepdebugsymlink/TestTargetSymbolsSepDebugSymlink.py (1499 of 1905)
PASS: lldb-unit :: Utility/./UtilityTests/SerializationRountripTest.SerializeDeserializeObjectPointer (1500 of 1905)
PASS: lldb-api :: python_api/watchpoint/TestWatchpointIter.py (1501 of 1905)
UNSUPPORTED: lldb-api :: functionalities/asan/TestMemoryHistory.py (1502 of 1905)
PASS: lldb-shell :: SymbolFile/DWARF/debug-types-dwo-cross-reference.cpp (1503 of 1905)
PASS: lldb-api :: python_api/breakpoint/TestBreakpointAPI.py (1504 of 1905)
PASS: lldb-api :: functionalities/thread/concurrent_events/TestConcurrentTwoBreakpointThreads.py (1505 of 1905)
PASS: lldb-unit :: ScriptInterpreter/Python/./ScriptInterpreterPythonTests/PythonDataObjectsTest.TestGlobalNameResolutionWithDot (1506 of 1905)
PASS: lldb-shell :: SymbolFile/DWARF/childless-compile-unit.s (1507 of 1905)
PASS: lldb-shell :: ObjectFile/ELF/PT_LOAD-overlap.yaml (1508 of 1905)
PASS: lldb-api :: commands/command/script_alias/TestCommandScriptAlias.py (1509 of 1905)
PASS: lldb-unit :: Utility/./UtilityTests/RangeTest.DoesAdjoinOrIntersect (1510 of 1905)
PASS: lldb-shell :: Reproducer/TestCrash.test (1511 of 1905)
PASS: lldb-unit :: Process/minidump/./LLDBMinidumpTests/MinidumpParserTest.GetThreadContext_x86_32 (1512 of 1905)
PASS: lldb-api :: functionalities/data-formatter/data-formatter-objc/TestDataFormatterObjCCF.py (1513 of 1905)
PASS: lldb-shell :: ObjectFile/ELF/section-types-edgecases.yaml (1514 of 1905)
PASS: lldb-api :: functionalities/breakpoint/source_regexp/TestSourceRegexBreakpoints.py (1515 of 1905)
PASS: lldb-api :: functionalities/breakpoint/auto_continue/TestBreakpointAutoContinue.py (1516 of 1905)
PASS: lldb-api :: commands/expression/unicode-in-variable/TestUnicodeInVariable.py (1517 of 1905)
PASS: lldb-api :: functionalities/data-formatter/data-formatter-stl/libstdcpp/unique_ptr/invalid/TestDataFormatterInvalidStdUniquePtr.py (1518 of 1905)
PASS: lldb-unit :: UnwindAssembly/x86/./UnwindAssemblyx86Tests/Testx86AssemblyInspectionEngine.TestPopR14 (1519 of 1905)
PASS: lldb-unit :: Process/minidump/./LLDBMinidumpTests/MinidumpParserTest.GetExceptionStream (1520 of 1905)
UNSUPPORTED: lldb-shell :: SymbolFile/PDB/expressions.test (1521 of 1905)
PASS: lldb-unit :: Utility/./UtilityTests/StreamTest.PutCharWhitespace (1522 of 1905)
PASS: lldb-unit :: UnwindAssembly/x86/./UnwindAssemblyx86Tests/Testx86AssemblyInspectionEngine.Test64bitFramelessSmallStackFrame (1523 of 1905)
PASS: lldb-api :: functionalities/data-formatter/data-formatter-named-summaries/TestDataFormatterNamedSummaries.py (1524 of 1905)
UNSUPPORTED: lldb-shell :: SymbolFile/PDB/vbases.test (1525 of 1905)
PASS: lldb-api :: functionalities/plugins/python_os_plugin/TestPythonOSPlugin.py (1526 of 1905)
PASS: lldb-unit :: Language/Highlighting/./HighlighterTests/HighlighterTest.ClangStringLiterals (1527 of 1905)
PASS: lldb-shell :: ObjectFile/wasm/basic.yaml (1528 of 1905)
PASS: lldb-unit :: Process/gdb-remote/./ProcessGdbRemoteTests/GDBRemoteClientBaseTest.SendContinueAndAsyncSignal (1529 of 1905)
PASS: lldb-shell :: SymbolFile/NativePDB/source-list.cpp (1530 of 1905)
PASS: lldb-shell :: Commands/command-regex-unalias.test (1531 of 1905)
PASS: lldb-api :: tools/lldb-vscode/breakpoint/TestVSCode_setExceptionBreakpoints.py (1532 of 1905)
PASS: lldb-api :: lang/cpp/namespace_conflicts/TestNamespaceConflicts.py (1533 of 1905)
PASS: lldb-unit :: Utility/./UtilityTests/SerializationRountripTest.SerializeDeserializePodReferences (1534 of 1905)
PASS: lldb-unit :: ScriptInterpreter/Python/./ScriptInterpreterPythonTests/PythonDataObjectsTest.TestPythonListManipulation (1535 of 1905)
PASS: lldb-unit :: Utility/./UtilityTests/RegularExpression.Valid (1536 of 1905)
PASS: lldb-shell :: SymbolFile/NativePDB/ast-methods.cpp (1537 of 1905)
PASS: lldb-unit :: Utility/./UtilityTests/StringLexerTest.NextIfList (1538 of 1905)
PASS: lldb-api :: sanity/TestModuleCacheSanity.py (1539 of 1905)
PASS: lldb-unit :: Host/./HostTests/File.GetStreamFromDescriptor (1540 of 1905)
PASS: lldb-api :: lang/objc/modules-cache/TestClangModulesCache.py (1541 of 1905)
PASS: lldb-api :: commands/settings/TestSettings.py (1542 of 1905)
PASS: lldb-unit :: Utility/./UtilityTests/LogChannelTest.EnableOptions (1543 of 1905)
PASS: lldb-api :: commands/platform/process/TestProcessList.py (1544 of 1905)
PASS: lldb-unit :: Utility/./UtilityTests/LogChannelEnabledTest.log_options (1545 of 1905)
PASS: lldb-api :: python_api/type/TestTypeList.py (1546 of 1905)
PASS: lldb-api :: functionalities/data-formatter/data-formatter-stl/libcxx/function/TestLibCxxFunction.py (1547 of 1905)
PASS: lldb-api :: functionalities/thread/jump/TestThreadJump.py (1548 of 1905)
PASS: lldb-unit :: Utility/./UtilityTests/StringListTest.ShiftStdString (1549 of 1905)
UNSUPPORTED: lldb-api :: functionalities/tsan/global_location/TestTsanGlobalLocation.py (1550 of 1905)
PASS: lldb-api :: functionalities/thread/backtrace_limit/TestBacktraceLimit.py (1551 of 1905)
PASS: lldb-unit :: Utility/./UtilityTests/RangeTest.ContainsRangeStartingFromZero (1552 of 1905)
PASS: lldb-unit :: Utility/./UtilityTests/FileSpecTest.PrependPathComponent (1553 of 1905)
PASS: lldb-unit :: Utility/./UtilityTests/StreamTeeTest.SetStreamAtIndexOutOfBounds (1554 of 1905)
UNSUPPORTED: lldb-api :: linux/mix-dwo-and-regular-objects/TestMixedDwarfBinary.py (1555 of 1905)
PASS: lldb-api :: commands/command/script/TestCommandScript.py (1556 of 1905)
PASS: lldb-unit :: ObjectFile/ELF/./ObjectFileELFTests/ObjectFileELFTest.GetSymtab_NoSymEntryPointArmThumbAddressClass (1557 of 1905)
PASS: lldb-shell :: SymbolFile/NativePDB/disassembly.cpp (1558 of 1905)
PASS: lldb-api :: lang/cpp/function_refs/TestFunctionRefs.py (1559 of 1905)
PASS: lldb-unit :: Utility/./UtilityTests/OptionsWithRawTest.TerminatedQuote (1560 of 1905)
PASS: lldb-unit :: Utility/./UtilityTests/ListenerTest.GetEventImmediate (1561 of 1905)
PASS: lldb-unit :: Utility/./UtilityTests/CompletionRequest.TryCompleteCurrentArgMode (1562 of 1905)
PASS: lldb-api :: lang/objc/modules-inline-functions/TestModulesInlineFunctions.py (1563 of 1905)
PASS: lldb-shell :: ObjectFile/PECOFF/section-types.yaml (1564 of 1905)
UNSUPPORTED: lldb-api :: commands/watchpoints/variable_out_of_scope/TestWatchedVarHitWhenInScope.py (1565 of 1905)
PASS: lldb-unit :: SymbolFile/DWARF/./SymbolFileDWARFTests/SymbolFileDWARFTests.TestAbbrevOrder1Start1 (1566 of 1905)
PASS: lldb-shell :: Settings/TestModuleCacheSanity.test (1567 of 1905)
PASS: lldb-unit :: Expression/./ExpressionTests/ClangExpressionDeclMapTest.TestPersistentDeclLookup (1568 of 1905)
PASS: lldb-unit :: Process/gdb-remote/./ProcessGdbRemoteTests/GDBRemoteCommunicationClientTest.SendStartTracePacket (1569 of 1905)
PASS: lldb-api :: functionalities/target-new-solib-notifications/TestModuleLoadedNotifys.py (1570 of 1905)
PASS: lldb-unit :: Utility/./UtilityTests/RangeTest.ClearWithStarAddress (1571 of 1905)
PASS: lldb-api :: commands/expression/options/TestExprOptions.py (1572 of 1905)
PASS: lldb-unit :: Utility/./UtilityTests/FileSpecTest.FileAndDirectoryComponents (1573 of 1905)
PASS: lldb-unit :: Host/./HostTests/FileSystemTest.Exists (1574 of 1905)
PASS: lldb-unit :: Language/CPlusPlus/./LanguageCPlusPlusTests/CPlusPlusLanguage.FindAlternateFunctionManglings (1575 of 1905)
PASS: lldb-unit :: Utility/./UtilityTests/VMRange.ContainsRange (1576 of 1905)
PASS: lldb-unit :: Process/minidump/./LLDBMinidumpTests/MinidumpParserTest.FindMemoryRange (1577 of 1905)
PASS: lldb-unit :: Utility/./UtilityTests/SerializationRountripTest.SerializeDeserializePod (1578 of 1905)
PASS: lldb-unit :: Utility/./UtilityTests/StreamTest.AddressRangeEmptyRange (1579 of 1905)
PASS: lldb-unit :: Utility/./UtilityTests/StringListTest.CopyListEmpty (1580 of 1905)
PASS: lldb-api :: python_api/thread/TestThreadAPI.py (1581 of 1905)
PASS: lldb-unit :: Host/./HostTests/MainLoopTest.TerminatesImmediately (1582 of 1905)
UNSUPPORTED: lldb-api :: benchmarks/startup/TestStartupDelays.py (1583 of 1905)
PASS: lldb-unit :: Symbol/./SymbolTests/Type.CompilerContextPattern (1584 of 1905)
PASS: lldb-unit :: Host/./HostTests/NativeProcessProtocolTest.SetBreakpoint (1585 of 1905)
PASS: lldb-api :: functionalities/gdb_remote_client/TestJLink6Armv7RegisterDefinition.py (1586 of 1905)
PASS: lldb-unit :: Core/./LLDBCoreTests/StreamCallbackTest.Callback (1587 of 1905)
UNSUPPORTED: lldb-api :: functionalities/darwin_log/filter/regex/subsystem/TestDarwinLogFilterRegexSubsystem.py (1588 of 1905)
PASS: lldb-unit :: Process/gdb-remote/./ProcessGdbRemoteTests/GDBRemoteCommunicationServerTest.SendErrorResponse_UnimplementedError (1589 of 1905)
PASS: lldb-unit :: Symbol/./SymbolTests/TestClangASTContext.TestUnifyAccessSpecifiers (1590 of 1905)
UNSUPPORTED: lldb-shell :: Breakpoint/ppc64-localentry.test (1591 of 1905)
PASS: lldb-shell :: Minidump/Windows/broken-unwind.test (1592 of 1905)
PASS: lldb-api :: functionalities/thread/concurrent_events/TestConcurrentCrashWithSignal.py (1593 of 1905)
PASS: lldb-api :: functionalities/thread/concurrent_events/TestConcurrentSignalBreak.py (1594 of 1905)
PASS: lldb-unit :: Utility/./UtilityTests/StringListTest.AppendList (1595 of 1905)
PASS: lldb-api :: commands/process/launch/TestProcessLaunch.py (1596 of 1905)
UNSUPPORTED: lldb-api :: linux/thread/create_during_instruction_step/TestCreateDuringInstructionStep.py (1597 of 1905)
PASS: lldb-shell :: SymbolFile/DWARF/dwarf5-partial-index.cpp (1598 of 1905)
PASS: lldb-api :: lang/c/unicode/TestUnicodeSymbols.py (1599 of 1905)
PASS: lldb-api :: python_api/name_lookup/TestNameLookup.py (1600 of 1905)
PASS: lldb-unit :: Symbol/./SymbolTests/TestClangASTImporter.MetadataPropagationIndirectImport (1601 of 1905)
PASS: lldb-api :: lang/cpp/auto/TestCPPAuto.py (1602 of 1905)
UNSUPPORTED: lldb-api :: tools/lldb-server/TestGdbRemoteAuxvSupport.py (1603 of 1905)
PASS: lldb-api :: functionalities/data-formatter/data-formatter-smart-array/TestDataFormatterSmartArray.py (1604 of 1905)
PASS: lldb-api :: functionalities/param_entry_vals/basic_entry_values_x86_64/TestBasicEntryValuesX86_64.py (1605 of 1905)
PASS: lldb-unit :: Utility/./UtilityTests/FileSpecTest.GuessPathStyle (1606 of 1905)
PASS: lldb-api :: lang/cpp/overloaded-functions/TestOverloadedFunctions.py (1607 of 1905)
PASS: lldb-api :: functionalities/multidebugger_commands/TestMultipleDebuggersCommands.py (1608 of 1905)
PASS: lldb-api :: functionalities/inferior-changed/TestInferiorChanged.py (1609 of 1905)
PASS: lldb-api :: functionalities/thread/concurrent_events/TestConcurrentWatchBreakDelay.py (1610 of 1905)
PASS: lldb-unit :: Utility/./UtilityTests/Flags.AnySet (1611 of 1905)
PASS: lldb-unit :: UnwindAssembly/x86/./UnwindAssemblyx86Tests/Testx86AssemblyInspectionEngine.TestPushRBP (1612 of 1905)
PASS: lldb-unit :: Utility/./UtilityTests/SerializationRountripTest.SerializeDeserializeObjectReference (1613 of 1905)
PASS: lldb-unit :: Utility/./UtilityTests/ArgsTest.DoubleQuotedItem (1614 of 1905)
PASS: lldb-shell :: ObjectFile/ELF/section-permissions.yaml (1615 of 1905)
PASS: lldb-unit :: Process/minidump/./LLDBMinidumpTests/RegisterContextMinidump.ConvertMinidumpContext_x86_64 (1616 of 1905)
PASS: lldb-api :: python_api/get-value-32bit-int/TestGetValue32BitInt.py (1617 of 1905)
PASS: lldb-unit :: ObjectFile/Breakpad/./ObjectFileBreakpadTests/ModuleRecord.parse (1618 of 1905)
PASS: lldb-api :: commands/expression/unwind_expression/TestUnwindExpression.py (1619 of 1905)
PASS: lldb-unit :: Utility/./UtilityTests/OptionsWithRawTest.QuotedSuffix (1620 of 1905)
PASS: lldb-unit :: Utility/./UtilityTests/StreamTest.AddressRangeInvalidRange (1621 of 1905)
PASS: lldb-api :: commands/process/attach/TestProcessAttach.py (1622 of 1905)
PASS: lldb-api :: functionalities/thread/concurrent_events/TestConcurrentBreakpointOneDelayBreakpointThreads.py (1623 of 1905)
UNSUPPORTED: lldb-api :: functionalities/tsan/thread_leak/TestTsanThreadLeak.py (1624 of 1905)
PASS: lldb-unit :: Utility/./UtilityTests/StringExtractorTest.GetNameColonValueSuccess (1625 of 1905)
PASS: lldb-unit :: Process/minidump/./LLDBMinidumpTests/RegisterContextMinidump.CheckRegisterContextMinidump_ARM (1626 of 1905)
PASS: lldb-unit :: Utility/./UtilityTests/RangeTest.DefaultConstructor (1627 of 1905)
PASS: lldb-api :: functionalities/data-formatter/data-formatter-stl/libcxx/queue/TestDataFormatterLibcxxQueue.py (1628 of 1905)
PASS: lldb-api :: functionalities/data-formatter/data-formatter-objc/TestDataFormatterObjCNSError.py (1629 of 1905)
PASS: lldb-unit :: Utility/./UtilityTests/StreamTest.PutBytesAsRawHex8ToMixedEndian (1630 of 1905)
PASS: lldb-api :: functionalities/data-formatter/boolreference/TestFormattersBoolRefPtr.py (1631 of 1905)
PASS: lldb-unit :: SymbolFile/NativePDB/./SymbolFileNativePDBTests/PDBFPOProgramToDWARFExpressionTests.InvalidAssignmentSingle (1632 of 1905)
PASS: lldb-unit :: Utility/./UtilityTests/RangeTest.Clear (1633 of 1905)
PASS: lldb-shell :: SymbolFile/DWARF/debug_aranges-empty-section.s (1634 of 1905)
PASS: lldb-api :: functionalities/data-formatter/data-formatter-caching/TestDataFormatterCaching.py (1635 of 1905)
PASS: lldb-unit :: Utility/./UtilityTests/StreamTest.PutRawBytesToMixedEndian (1636 of 1905)
PASS: lldb-shell :: SymbolFile/DWARF/debug-types-address-ranges.s (1637 of 1905)
PASS: lldb-unit :: SymbolFile/DWARF/./SymbolFileDWARFTests/SymbolFileDWARFTests.TestAbilitiesForDWARF (1638 of 1905)
PASS: lldb-api :: functionalities/tail_call_frames/inlining_and_tail_calls/TestInliningAndTailCalls.py (1639 of 1905)
UNSUPPORTED: lldb-api :: tools/lldb-server/libraries-svr4/TestGdbRemoteLibrariesSvr4Support.py (1640 of 1905)
PASS: lldb-api :: lang/c/conflicting-symbol/TestConflictingSymbol.py (1641 of 1905)
PASS: lldb-unit :: Utility/./UtilityTests/StringListTest.Clear (1642 of 1905)
PASS: lldb-unit :: Language/Highlighting/./HighlighterTests/HighlighterTest.DefaultHighlighter (1643 of 1905)
UNSUPPORTED: lldb-shell :: Process/Windows/exception_access_violation.cpp (1644 of 1905)
PASS: lldb-shell :: Breakpoint/dummy-target.test (1645 of 1905)
PASS: lldb-api :: lang/cpp/dynamic-value/TestCppValueCast.py (1646 of 1905)
PASS: lldb-unit :: Utility/./UtilityTests/EnvironmentTest.EnvpConversion (1647 of 1905)
PASS: lldb-shell :: SymbolFile/NativePDB/function-types-builtins.cpp (1648 of 1905)
PASS: lldb-shell :: SymbolFile/DWARF/inline-function-address-shared.test (1649 of 1905)
PASS: lldb-api :: functionalities/thread/thread_exit/TestThreadExit.py (1650 of 1905)
PASS: lldb-api :: functionalities/target_var/TestTargetVar.py (1651 of 1905)
PASS: lldb-api :: functionalities/data-formatter/data-formatter-objc/TestDataFormatterObjCKVO.py (1652 of 1905)
PASS: lldb-api :: functionalities/paths/TestPaths.py (1653 of 1905)
PASS: lldb-shell :: Reproducer/TestGDBRemoteRepro.test (1654 of 1905)
PASS: lldb-unit :: Process/gdb-remote/./ProcessGdbRemoteTests/GDBRemoteCommunicationServerTest.SendErrorResponse_StringError (1655 of 1905)
UNSUPPORTED: lldb-api :: iohandler/unicode/TestUnicode.py (1656 of 1905)
PASS: lldb-api :: lang/cpp/unicode-literals/TestUnicodeLiterals.py (1657 of 1905)
PASS: lldb-unit :: Utility/./UtilityTests/UriParserTest.SchemeHostSeparator3 (1658 of 1905)
PASS: lldb-shell :: SymbolFile/NativePDB/function-types-calling-conv.cpp (1659 of 1905)
PASS: lldb-api :: commands/expression/context-object/TestContextObject.py (1660 of 1905)
PASS: lldb-unit :: Utility/./UtilityTests/StringExtractorTest.DecodeHexU8_Underflow (1661 of 1905)
PASS: lldb-shell :: ObjectFile/ELF/PT_LOAD-overlap-PT_TLS.yaml (1662 of 1905)
UNSUPPORTED: lldb-api :: benchmarks/expression/TestExpressionCmd.py (1663 of 1905)
PASS: lldb-api :: lang/cpp/offsetof/TestOffsetofCpp.py (1664 of 1905)
PASS: lldb-unit :: Host/./HostTests/MainLoopTest.DetectsEOF (1665 of 1905)
PASS: lldb-api :: lang/objc/objc-new-syntax/TestObjCNewSyntaxDictionary.py (1666 of 1905)
PASS: lldb-unit :: Symbol/./SymbolTests/DWARFCallFrameInfoTest.Basic_dwarf3 (1667 of 1905)
PASS: lldb-shell :: SymbolFile/DWARF/split-dwarf-inlining.cpp (1668 of 1905)
PASS: lldb-unit :: SymbolFile/DWARF/./SymbolFileDWARFTests/SymbolFileDWARFTests.TestAbbrevOrder1Start5 (1669 of 1905)
PASS: lldb-unit :: DataFormatter/./LLDBFormatterTests/FormatManagerTests.CompatibleLangs (1670 of 1905)
PASS: lldb-unit :: Signals/./SignalsTests/UnixSignalsTest.VersionChange (1671 of 1905)
PASS: lldb-api :: functionalities/thread/concurrent_events/TestConcurrentBreakpointDelayBreakpointOneSignal.py (1672 of 1905)
PASS: lldb-unit :: Utility/./UtilityTests/StringListTest.DefaultConstructor (1673 of 1905)
PASS: lldb-unit :: Utility/./UtilityTests/RangeTest.Copy (1674 of 1905)
PASS: lldb-api :: functionalities/breakpoint/debugbreak/TestDebugBreak.py (1675 of 1905)
PASS: lldb-unit :: ObjectFile/Breakpad/./ObjectFileBreakpadTests/Record.classify (1676 of 1905)
PASS: lldb-unit :: Utility/./UtilityTests/SerializationRountripTest.SerializeDeserializeCString (1677 of 1905)
PASS: lldb-api :: functionalities/data-formatter/data-formatter-stl/libcxx/atomic/TestLibCxxAtomic.py (1678 of 1905)
PASS: lldb-api :: functionalities/gdb_remote_client/TestNoWatchpointSupportInfo.py (1679 of 1905)
PASS: lldb-unit :: Utility/./UtilityTests/CompletionRequest.DuplicateFilteringWithComments (1680 of 1905)
PASS: lldb-unit :: Utility/./UtilityTests/StringListTest.GetSize (1681 of 1905)
PASS: lldb-unit :: Utility/./UtilityTests/ScalarTest.Comparison (1682 of 1905)
PASS: lldb-api :: commands/watchpoints/hello_watchpoint/TestMyFirstWatchpoint.py (1683 of 1905)
PASS: lldb-shell :: ObjectFile/Breakpad/discontiguous-sections.test (1684 of 1905)
PASS: lldb-api :: commands/expression/call-function/TestCallStopAndContinue.py (1685 of 1905)
UNSUPPORTED: lldb-api :: commands/register/register/intel_xtended_registers/TestMPXRegisters.py (1686 of 1905)
PASS: lldb-unit :: SymbolFile/NativePDB/./SymbolFileNativePDBTests/PDBFPOProgramToDWARFExpressionTests.SingleAssignmentRegisterRef (1687 of 1905)
PASS: lldb-shell :: SymbolFile/DWARF/debug-types-dwarf5.s (1688 of 1905)
PASS: lldb-unit :: ScriptInterpreter/Python/./ScriptInterpreterPythonTests/PythonDataObjectsTest.TestPythonInteger (1689 of 1905)
PASS: lldb-unit :: Language/CPlusPlus/./LanguageCPlusPlusTests/CPlusPlusLanguage.CPlusPlusNameParser (1690 of 1905)
PASS: lldb-api :: functionalities/inferior-crashing/TestInferiorCrashing.py (1691 of 1905)
PASS: lldb-unit :: Utility/./UtilityTests/StringListTest.PopBack (1692 of 1905)
PASS: lldb-unit :: Process/minidump/./LLDBMinidumpTests/MinidumpParserTest.InvalidMinidump (1693 of 1905)
PASS: lldb-unit :: Symbol/./SymbolTests/TestClangASTContext.TestGetBasicTypeFromName (1694 of 1905)
PASS: lldb-api :: functionalities/thread/concurrent_events/TestConcurrentBreakpointsDelayedBreakpointOneWatchpoint.py (1695 of 1905)
UNSUPPORTED: lldb-shell :: Breakpoint/case-insensitive.test (1696 of 1905)
PASS: lldb-api :: lang/objc/objc-struct-argument/TestObjCStructArgument.py (1697 of 1905)
PASS: lldb-shell :: ObjectFile/ELF/basic-info.yaml (1698 of 1905)
PASS: lldb-api :: functionalities/data-formatter/data-formatter-stl/libcxx/list/TestDataFormatterLibcxxList.py (1699 of 1905)
PASS: lldb-unit :: UnwindAssembly/x86/./UnwindAssemblyx86Tests/Testx86AssemblyInspectionEngine.TestReturnDetect (1700 of 1905)
PASS: lldb-unit :: Utility/./UtilityTests/Flags.Clear (1701 of 1905)
PASS: lldb-api :: macosx/order/TestOrderFile.py (1702 of 1905)
PASS: lldb-api :: lang/cpp/signed_types/TestSignedTypes.py (1703 of 1905)
UNSUPPORTED: lldb-api :: commands/expression/completion-crash-invalid-iterator/TestInvalidIteratorCompletionCrash.py (1704 of 1905)
PASS: lldb-api :: functionalities/breakpoint/step_over_breakpoint/TestStepOverBreakpoint.py (1705 of 1905)
PASS: lldb-unit :: Utility/./UtilityTests/ConstStringTest.UpdateMangledCounterpart (1706 of 1905)
PASS: lldb-shell :: ObjectFile/ELF/base-address.yaml (1707 of 1905)
PASS: lldb-unit :: UnwindAssembly/x86/./UnwindAssemblyx86Tests/Testx86AssemblyInspectionEngine.TestPushImm (1708 of 1905)
PASS: lldb-shell :: SymbolFile/DWARF/dir-separator-windows.s (1709 of 1905)
PASS: lldb-api :: functionalities/inferior-crashing/recursive-inferior/TestRecursiveInferior.py (1710 of 1905)
PASS: lldb-api :: lang/cpp/std-function-step-into-callable/TestStdFunctionStepIntoCallable.py (1711 of 1905)
PASS: lldb-api :: functionalities/thread/concurrent_events/TestConcurrentNWatchNBreak.py (1712 of 1905)
PASS: lldb-unit :: Utility/./UtilityTests/StreamTest.AddressRangeSize (1713 of 1905)
PASS: lldb-unit :: Host/./HostTests/FileSystemTest.FileAndDirectoryComponents (1714 of 1905)
PASS: lldb-api :: lang/objc/objc-super/TestObjCSuper.py (1715 of 1905)
PASS: lldb-unit :: Process/gdb-remote/./ProcessGdbRemoteTests/GDBRemoteCommunicationClientTest.SyncThreadState (1716 of 1905)
PASS: lldb-shell :: ObjectFile/ELF/netbsd-exec-8.99.30-amd64.yaml (1717 of 1905)
PASS: lldb-api :: lang/objc/modules-auto-import/TestModulesAutoImport.py (1718 of 1905)
PASS: lldb-unit :: Core/./LLDBCoreTests/RichManglingContextTest.Basic (1719 of 1905)
PASS: lldb-api :: functionalities/thread/concurrent_events/TestConcurrentSignalDelayWatch.py (1720 of 1905)
PASS: lldb-shell :: SymbolFile/DWARF/find-basic-namespace.cpp (1721 of 1905)
PASS: lldb-unit :: Process/minidump/./LLDBMinidumpTests/MinidumpParserTest.GetMemoryRegionInfoFromMemoryList (1722 of 1905)
PASS: lldb-api :: functionalities/postmortem/wow64_minidump/TestWow64MiniDump.py (1723 of 1905)
PASS: lldb-unit :: Host/./HostTests/NativeProcessProtocolTest.SetBreakpointFailRead (1724 of 1905)
PASS: lldb-api :: functionalities/pre_run_dylibs/TestPreRunDylibs.py (1725 of 1905)
PASS: lldb-unit :: Core/./LLDBCoreTests/MangledTest.ResultForValidName (1726 of 1905)
PASS: lldb-api :: functionalities/gdb_remote_client/TestNestedRegDefinitions.py (1727 of 1905)
UNSUPPORTED: lldb-api :: functionalities/data-formatter/data-formatter-stl/libstdcpp/list/TestDataFormatterStdList.py (1728 of 1905)
PASS: lldb-api :: tools/lldb-server/commandline/TestStubSetSID.py (1729 of 1905)
PASS: lldb-unit :: Utility/./UtilityTests/StringListTest.SetSize (1730 of 1905)
PASS: lldb-shell :: ObjectFile/PECOFF/basic-info-arm.yaml (1731 of 1905)
UNSUPPORTED: lldb-api :: functionalities/darwin_log/format/TestDarwinLogMessageFormat.py (1732 of 1905)
PASS: lldb-unit :: Target/./TargetTests/PathMappingListTest.AbsoluteTests (1733 of 1905)
PASS: lldb-shell :: SymbolFile/DWARF/array-sizes.s (1734 of 1905)
PASS: lldb-unit :: UnwindAssembly/x86/./UnwindAssemblyx86Tests/Testx86AssemblyInspectionEngine.TestPushECX (1735 of 1905)
PASS: lldb-unit :: Target/./TargetTests/PathMappingListTest.RelativeTests (1736 of 1905)
PASS: lldb-shell :: ObjectFile/wasm/stripped-debug-sections.yaml (1737 of 1905)
PASS: lldb-api :: functionalities/gdb_remote_client/TestRestartBug.py (1738 of 1905)
PASS: lldb-shell :: Register/x86-64-gp-read.test (1739 of 1905)
PASS: lldb-unit :: Process/gdb-remote/./ProcessGdbRemoteTests/GDBRemoteCommunicationServerTest.SendErrorResponse_ErrorNumber (1740 of 1905)
UNSUPPORTED: lldb-api :: functionalities/longjmp/TestLongjmp.py (1741 of 1905)
PASS: lldb-unit :: Utility/./UtilityTests/StringListTest.Assignment (1742 of 1905)
PASS: lldb-unit :: Utility/./UtilityTests/DataExtractorTest.GetMaxS64 (1743 of 1905)
PASS: lldb-shell :: SymbolFile/Breakpad/line-table-discontinuous-file-ids.test (1744 of 1905)
PASS: lldb-shell :: Minidump/fb-dump.test (1745 of 1905)
PASS: lldb-shell :: SymbolFile/Breakpad/unwind-via-raSearch.test (1746 of 1905)
PASS: lldb-unit :: Utility/./UtilityTests/RecordReplayTest.InstrumentedFooSameThis (1747 of 1905)
UNSUPPORTED: lldb-api :: functionalities/unwind/standard/TestStandardUnwind.py (1748 of 1905)
PASS: lldb-unit :: ObjectFile/Breakpad/./ObjectFileBreakpadTests/PublicRecord.parse (1749 of 1905)
PASS: lldb-shell :: SymbolFile/DWARF/find-basic-function.cpp (1750 of 1905)
PASS: lldb-unit :: Language/Highlighting/./HighlighterTests/HighlighterTest.ClangTrailingBackslashMissingNewLine (1751 of 1905)
PASS: lldb-unit :: Utility/./UtilityTests/ScalarTest.GetValue (1752 of 1905)
PASS: lldb-api :: lang/mixed/TestMixedLanguages.py (1753 of 1905)
PASS: lldb-api :: lang/objc/ptr_refs/TestPtrRefsObjC.py (1754 of 1905)
PASS: lldb-api :: types/TestIntegerTypeExpr.py (1755 of 1905)
PASS: lldb-unit :: Utility/./UtilityTests/Predicate.WaitForValueEqualTo (1756 of 1905)
PASS: lldb-api :: lang/c/global_variables/TestGlobalVariables.py (1757 of 1905)
UNSUPPORTED: lldb-api :: commands/register/register/intel_xtended_registers/mpx_bound_violation/TestBoundViolation.py (1758 of 1905)
PASS: lldb-unit :: Expression/./ExpressionTests/CppModuleConfigurationTest.AmbiguousCLib (1759 of 1905)
PASS: lldb-api :: functionalities/archives/TestBSDArchives.py (1760 of 1905)
PASS: lldb-shell :: SymbolFile/DWARF/debug_loclists-dwo.s (1761 of 1905)
PASS: lldb-api :: lang/cpp/chained-calls/TestCppChainedCalls.py (1762 of 1905)
PASS: lldb-shell :: Settings/TestFrameFormatNoColor.test (1763 of 1905)
PASS: lldb-unit :: Utility/./UtilityTests/StreamTest.QuotedCString (1764 of 1905)
PASS: lldb-api :: lang/objc/modules/TestObjCModules.py (1765 of 1905)
PASS: lldb-api :: commands/expression/argument_passing_restrictions/TestArgumentPassingRestrictions.py (1766 of 1905)
PASS: lldb-unit :: Host/./HostTests/SocketTest.TCPGetConnectURI (1767 of 1905)
PASS: lldb-api :: lang/cpp/breakpoint_in_member_func_w_non_primitive_params/TestBreakpointInMemberFuncWNonPrimitiveParams.py (1768 of 1905)
PASS: lldb-unit :: Symbol/./SymbolTests/TestClangASTContext.TestNotDeletingUserCopyCstrDueToMoveCStr (1769 of 1905)
PASS: lldb-api :: lang/objc/objc-struct-return/TestObjCStructReturn.py (1770 of 1905)
PASS: lldb-api :: commands/disassemble/basic/TestFrameDisassemble.py (1771 of 1905)
PASS: lldb-unit :: Utility/./UtilityTests/BinaryStreamTest.PutULEB128ThreeBytes (1772 of 1905)
PASS: lldb-api :: commands/frame/diagnose/complicated-expression/TestComplicatedExpression.py (1773 of 1905)
PASS: lldb-unit :: Language/Highlighting/./HighlighterTests/HighlighterTest.ClangPreserveNewLine (1774 of 1905)
PASS: lldb-api :: functionalities/mtc/simple/TestMTCSimple.py (1775 of 1905)
PASS: lldb-unit :: Language/Highlighting/./HighlighterTests/HighlighterTest.ClangSquareBrackets (1776 of 1905)
PASS: lldb-unit :: UnwindAssembly/x86/./UnwindAssemblyx86Tests/Testx86AssemblyInspectionEngine.TestDisassemblyMidFunctionEpilogues (1777 of 1905)
PASS: lldb-unit :: ScriptInterpreter/Python/./ScriptInterpreterPythonTests/PythonDataObjectsTest.TestInstanceNameResolutionNoDot (1778 of 1905)
PASS: lldb-shell :: SymbolFile/DWARF/gnu-style-compression.cpp (1779 of 1905)
PASS: lldb-unit :: Utility/./UtilityTests/StreamTest.ShiftOperatorPtr (1780 of 1905)
PASS: lldb-api :: types/TestFloatTypesExpr.py (1781 of 1905)
PASS: lldb-shell :: SymbolFile/NativePDB/break-by-function.cpp (1782 of 1905)
PASS: lldb-api :: functionalities/thread/concurrent_events/TestConcurrentWatchpointDelayWatchpointOneBreakpoint.py (1783 of 1905)
PASS: lldb-api :: functionalities/data-formatter/data-formatter-stl/libcxx/multiset/TestDataFormatterLibcxxMultiSet.py (1784 of 1905)
PASS: lldb-api :: python_api/process/io/TestProcessIO.py (1785 of 1905)
PASS: lldb-api :: lang/c/local_types/TestUseClosestType.py (1786 of 1905)
PASS: lldb-api :: functionalities/inferior-crashing/TestInferiorCrashingStep.py (1787 of 1905)
PASS: lldb-api :: lang/objc/objc-builtin-types/TestObjCBuiltinTypes.py (1788 of 1905)
PASS: lldb-unit :: Process/minidump/./LLDBMinidumpTests/MinidumpParserTest.GetMiscInfoWindows (1789 of 1905)
PASS: lldb-api :: functionalities/thread/backtrace_all/TestBacktraceAll.py (1790 of 1905)
PASS: lldb-api :: python_api/interpreter/TestCommandInterpreterAPI.py (1791 of 1905)
PASS: lldb-shell :: ObjectFile/PECOFF/uuid.yaml (1792 of 1905)
PASS: lldb-api :: python_api/sblaunchinfo/TestSBLaunchInfo.py (1793 of 1905)
PASS: lldb-api :: python_api/findvalue_duplist/TestSBFrameFindValue.py (1794 of 1905)
PASS: lldb-unit :: ScriptInterpreter/Python/./ScriptInterpreterPythonTests/PythonDataObjectsTest.TestPythonByteArray (1795 of 1905)
PASS: lldb-api :: commands/process/attach-resume/TestAttachResume.py (1796 of 1905)
PASS: lldb-unit :: Utility/./UtilityTests/BinaryStreamTest.PutSLEB128OneByte (1797 of 1905)
PASS: lldb-unit :: Host/./HostTests/MainLoopTest.Signal (1798 of 1905)
PASS: lldb-unit :: Target/./TargetTests/ModuleCacheTest.GetAndPut (1799 of 1905)
PASS: lldb-api :: python_api/module_section/TestModuleAndSection.py (1800 of 1905)
PASS: lldb-api :: functionalities/avoids-fd-leak/TestFdLeak.py (1801 of 1905)
PASS: lldb-unit :: Utility/./UtilityTests/Flags.IsClear (1802 of 1905)
PASS: lldb-unit :: Utility/./UtilityTests/ArchSpecTest.TestParseMachCPUDashSubtypeTripleSimple (1803 of 1905)
PASS: lldb-unit :: Utility/./UtilityTests/CompletionRequest.TestCompletionOwnership (1804 of 1905)
PASS: lldb-api :: functionalities/breakpoint/breakpoint_language/TestBreakpointLanguage.py (1805 of 1905)
UNSUPPORTED: lldb-api :: benchmarks/stepping/TestSteppingSpeed.py (1806 of 1905)
PASS: lldb-unit :: Host/./HostTests/TaskPoolTest.TaskMap (1807 of 1905)
UNSUPPORTED: lldb-api :: functionalities/tsan/cpp_global_location/TestTsanCPPGlobalLocation.py (1808 of 1905)
PASS: lldb-api :: lang/objc/variadic_methods/TestVariadicMethods.py (1809 of 1905)
PASS: lldb-shell :: Quit/TestQuitExitCode-30.test (1810 of 1905)
PASS: lldb-unit :: Process/minidump/./LLDBMinidumpTests/MinidumpParserTest.GetThreadContext_x86_32_wow64 (1811 of 1905)
PASS: lldb-api :: python_api/watchpoint/watchlocation/TestTargetWatchAddress.py (1812 of 1905)
PASS: lldb-api :: commands/frame/select/TestFrameSelect.py (1813 of 1905)
PASS: lldb-api :: functionalities/data-formatter/type_summary_list_arg/TestTypeSummaryListArg.py (1814 of 1905)
PASS: lldb-api :: functionalities/breakpoint/cpp_exception/TestCPPExceptionBreakpoint.py (1815 of 1905)
PASS: lldb-api :: functionalities/signal/TestSendSignal.py (1816 of 1905)
PASS: lldb-shell :: Driver/TestTarget.test (1817 of 1905)
PASS: lldb-unit :: Utility/./UtilityTests/LogTest.Register (1818 of 1905)
UNSUPPORTED: lldb-api :: api/multiple-debuggers/TestMultipleDebuggers.py (1819 of 1905)
PASS: lldb-unit :: Host/./HostTests/NativeProcessProtocolTest.SetBreakpointFailVerify (1820 of 1905)
PASS: lldb-shell :: Reproducer/TestSynchronous.test (1821 of 1905)
PASS: lldb-api :: commands/expression/import-std-module/conflicts/TestStdModuleWithConflicts.py (1822 of 1905)
PASS: lldb-unit :: Expression/./ExpressionTests/DiagnosticManagerTest.AppendMessageAttachToLastDiag (1823 of 1905)
PASS: lldb-unit :: Utility/./UtilityTests/StringListTest.InsertStringAtIndexEnd (1824 of 1905)
PASS: lldb-unit :: Process/minidump/./LLDBMinidumpTests/MinidumpParserTest.GetPidWindows (1825 of 1905)
PASS: lldb-api :: types/TestFloatTypes.py (1826 of 1905)
PASS: lldb-unit :: Utility/./UtilityTests/ArgsTest.TestInsertArg (1827 of 1905)
PASS: lldb-api :: functionalities/thread/concurrent_events/TestConcurrentCrashWithWatchpoint.py (1828 of 1905)
PASS: lldb-unit :: ScriptInterpreter/Python/./ScriptInterpreterPythonTests/PythonDataObjectsTest.TestPythonTupleInitializerList (1829 of 1905)
PASS: lldb-unit :: Utility/./UtilityTests/ArgsTest.AppendArguments (1830 of 1905)
PASS: lldb-unit :: Expression/./ExpressionTests/DiagnosticManagerTest.HasFixits (1831 of 1905)
PASS: lldb-unit :: Utility/./UtilityTests/StringListTest.LongestCommonPrefixNoPrefix (1832 of 1905)
PASS: lldb-api :: lang/objc/exceptions/TestObjCExceptions.py (1833 of 1905)
PASS: lldb-unit :: Utility/./UtilityTests/RangeTest.NotEqual (1834 of 1905)
UNSUPPORTED: lldb-shell :: BuildScript/toolchain-clang-cl.test (1835 of 1905)
PASS: lldb-unit :: Utility/./UtilityTests/StringExtractorTest.GetHexBytesAvail_OddPair (1836 of 1905)
PASS: lldb-shell :: Settings/TestSettingsSet.test (1837 of 1905)
PASS: lldb-api :: driver/batch_mode/TestBatchMode.py (1838 of 1905)
PASS: lldb-unit :: Utility/./UtilityTests/StatusTest.ErrorConversion (1839 of 1905)
PASS: lldb-unit :: UnwindAssembly/x86/./UnwindAssemblyx86Tests/Testx86AssemblyInspectionEngine.Testi386IgnoredRegisters (1840 of 1905)
PASS: lldb-api :: python_api/symbol-context/two-files/TestSymbolContextTwoFiles.py (1841 of 1905)
PASS: lldb-api :: tools/lldb-server/inferior-crash/TestGdbRemoteAbort.py (1842 of 1905)
UNSUPPORTED: lldb-api :: android/platform/TestDefaultCacheLineSize.py (1843 of 1905)
PASS: lldb-unit :: Utility/./UtilityTests/StreamTest.AddressPrefix (1844 of 1905)
PASS: lldb-unit :: Utility/./UtilityTests/StreamTest.PutMaxHex64ByteOrderLittle (1845 of 1905)
PASS: lldb-unit :: Host/./HostTests/SocketAddressTest.Set (1846 of 1905)
UNSUPPORTED: lldb-api :: functionalities/darwin_log/source/debug/TestDarwinLogSourceDebug.py (1847 of 1905)
PASS: lldb-api :: lang/objcxx/cxx-bridged-po/TestObjCXXBridgedPO.py (1848 of 1905)
PASS: lldb-unit :: Utility/./UtilityTests/StreamTest.PutStringAsRawHex8 (1849 of 1905)
PASS: lldb-unit :: Expression/./ExpressionTests/DiagnosticManagerTest.GetStringMultipleDiags (1850 of 1905)
PASS: lldb-unit :: Utility/./UtilityTests/BinaryStreamTest.PutULEB128Zero (1851 of 1905)
PASS: lldb-unit :: Utility/./UtilityTests/StringExtractorTest.GetHexU8_Underflow2_NoEof (1852 of 1905)
PASS: lldb-unit :: Host/./HostTests/SocketTest.DomainGetConnectURI (1853 of 1905)
PASS: lldb-api :: commands/expression/import-std-module/shared_ptr/TestSharedPtr.py (1854 of 1905)
UNSUPPORTED: lldb-shell :: Register/x86-64-xmm16-write.test (1855 of 1905)
UNRESOLVED: lldb-api :: functionalities/breakpoint/comp_dir_symlink/TestCompDirSymLink.py (1856 of 1905)
******************** TEST 'lldb-api :: functionalities/breakpoint/comp_dir_symlink/TestCompDirSymLink.py' FAILED ********************
Unable to find 'RESULT: PASSED' in dotest output (exit code -6):

Hide Details

lldb version 11.0.99 clang revision 7b8dc8c57697e95fd0b1248e4494ecc0f929aba1 llvm revision 7b8dc8c57697e95fd0b1248e4494ecc0f929aba1 AddressSanitizer:DEADLYSIGNAL ================================================================= ==83604==ERROR: AddressSanitizer: SEGV on unknown address 0x000000000000 (pc 0x7fff77668712 bp 0x7ffee0e29f10 sp 0x7ffee0e29f10 T0) ==83604==The signal is caused by a READ memory access. ==83604==Hint: address points to the zero page. #0 0x7fff77668712 in _platform_strlen+0x12 (libsystem_platform.dylib:x86_64+0x1712) #1 0x10ee1191b in wrap_readlink+0x5b (libclang_rt.asan_osx_dynamic.dylib:x86_64+0x3991b) #2 0x119a61e57 in lldb_private::FileSystem::Readlink(lldb_private::FileSpec const&, lldb_private::FileSpec&) FileSystemPosix.cpp:46 #3 0x1197f4b0d in lldb_private::ModuleListProperties::UpdateSymlinkMappings() ModuleList.cpp:122 #4 0x119af5664 in lldb_private::OptionValueFileSpecList::SetValueFromString(llvm::StringRef, lldb_private::VarSetOperationType) OptionValueFileSpecList.cpp #5 0x119b01851 in lldb_private::OptionValueProperties::SetSubValue(lldb_private::ExecutionContext const*, lldb_private::VarSetOperationType, llvm::StringRef, llvm::StringRef) OptionValueProperties.cpp:209 #6 0x119886a80 in lldb_private::Properties::SetPropertyValue(lldb_private::ExecutionContext const*, lldb_private::VarSetOperationType, llvm::StringRef, llvm::StringRef) UserSettingsController.cpp:49 #7 0x1197234cb in lldb_private::Debugger::SetPropertyValue(lldb_private::ExecutionContext const*, lldb_private::VarSetOperationType, llvm::StringRef, llvm::StringRef) Debugger.cpp:275 #8 0x11c2e19ef in CommandObjectSettingsSet::DoExecute(llvm::StringRef, lldb_private::CommandReturnObject&) CommandObjectSettings.cpp:222 #9 0x119aba342 in lldb_private::CommandObjectRaw::Execute(char const*, lldb_private::CommandReturnObject&) CommandObject.cpp:1003 #10 0x119a94b4a in lldb_private::CommandInterpreter::HandleCommand(char const*, lldb_private::LazyBool, lldb_private::CommandReturnObject&, lldb_private::ExecutionContext*, bool, bool) CommandInterpreter.cpp:1762 #11 0x118c1b547 in lldb::SBCommandInterpreter::HandleCommand(char const*, lldb::SBExecutionContext&, lldb::SBCommandReturnObject&, bool) SBCommandInterpreter.cpp:281 #12 0x118c1a83a in lldb::SBCommandInterpreter::HandleCommand(char const*, lldb::SBCommandReturnObject&, bool) SBCommandInterpreter.cpp:259 #13 0x1193cfa28 in _wrap_SBCommandInterpreter_HandleCommand(_object*, _object*) LLDBWrapPython.cpp:14074 #14 0x10fb64bda in PyCFunction_Call+0x140 (Python:x86_64+0x19bda) #15 0x10fbf39e2 in _PyEval_EvalFrameDefault+0x1f45 (Python:x86_64+0xa89e2) #16 0x10fbfb2da in _PyEval_EvalCodeWithName+0x72a (Python:x86_64+0xb02da) #17 0x10fb6488b in _PyFunction_FastCallKeywords+0xe0 (Python:x86_64+0x1988b) #18 0x10fbfa97d in call_function+0x256 (Python:x86_64+0xaf97d) #19 0x10fbf35d5 in _PyEval_EvalFrameDefault+0x1b38 (Python:x86_64+0xa85d5) #20 0x10fbfb2da in _PyEval_EvalCodeWithName+0x72a (Python:x86_64+0xb02da) #21 0x10fb6488b in _PyFunction_FastCallKeywords+0xe0 (Python:x86_64+0x1988b) #22 0x10fbfa97d in call_function+0x256 (Python:x86_64+0xaf97d) #23 0x10fbf35d5 in _PyEval_EvalFrameDefault+0x1b38 (Python:x86_64+0xa85d5) #24 0x10fb64ca1 in function_code_fastcall+0x6f (Python:x86_64+0x19ca1) #25 0x10fbfa97d in call_function+0x256 (Python:x86_64+0xaf97d) #26 0x10fbf35d5 in _PyEval_EvalFrameDefault+0x1b38 (Python:x86_64+0xa85d5) #27 0x10fb64ca1 in function_code_fastcall+0x6f (Python:x86_64+0x19ca1) #28 0x10fbf3905 in _PyEval_EvalFrameDefault+0x1e68 (Python:x86_64+0xa8905) #29 0x10fbfb2da in _PyEval_EvalCodeWithName+0x72a (Python:x86_64+0xb02da) #30 0x10fb6488b in _PyFunction_FastCallKeywords+0xe0 (Python:x86_64+0x1988b) #31 0x10fbfa97d in call_function+0x256 (Python:x86_64+0xaf97d) #32 0x10fbf368c in _PyEval_EvalFrameDefault+0x1bef (Python:x86_64+0xa868c) #33 0x10fbfb2da in _PyEval_EvalCodeWithName+0x72a (Python:x86_64+0xb02da) #34 0x10fb6488b in _PyFunction_FastCallKeywords+0xe0 (Python:x86_64+0x1988b) #35 0x10fbfa97d in call_function+0x256 (Python:x86_64+0xaf97d) #36 0x10fbf368c in _PyEval_EvalFrameDefault+0x1bef (Python:x86_64+0xa868c) #37 0x10fb64ca1 in function_code_fastcall+0x6f (Python:x86_64+0x19ca1) #38 0x10fbfa97d in call_function+0x256 (Python:x86_64+0xaf97d) #39 0x10fbf35d5 in _PyEval_EvalFrameDefault+0x1b38 (Python:x86_64+0xa85d5) #40 0x10fbfb2da in _PyEval_EvalCodeWithName+0x72a (Python:x86_64+0xb02da) #41 0x10fb644f4 in _PyFunction_FastCallDict+0x1b8 (Python:x86_64+0x194f4) #42 0x10fb65624 in _PyObject_Call_Prepend+0x95 (Python:x86_64+0x1a624) #43 0x10fb649d4 in PyObject_Call+0x87 (Python:x86_64+0x199d4) #44 0x10fbf3905 in _PyEval_EvalFrameDefault+0x1e68 (Python:x86_64+0xa8905) #45 0x10fbfb2da in _PyEval_EvalCodeWithName+0x72a (Python:x86_64+0xb02da) #46 0x10fb644f4 in _PyFunction_FastCallDict+0x1b8 (Python:x86_64+0x194f4) #47 0x10fb65624 in _PyObject_Call_Prepend+0x95 (Python:x86_64+0x1a624) #48 0x10fba24af in slot_tp_call+0x46 (Python:x86_64+0x574af) #49 0x10fb6472c in _PyObject_FastCallKeywords+0x166 (Python:x86_64+0x1972c) #50 0x10fbfa976 in call_function+0x24f (Python:x86_64+0xaf976) #51 0x10fbf368c in _PyEval_EvalFrameDefault+0x1bef (Python:x86_64+0xa868c) #52 0x10fbfb2da in _PyEval_EvalCodeWithName+0x72a (Python:x86_64+0xb02da) #53 0x10fb6488b in _PyFunction_FastCallKeywords+0xe0 (Python:x86_64+0x1988b) #54 0x10fbfa97d in call_function+0x256 (Python:x86_64+0xaf97d) #55 0x10fbf35d5 in _PyEval_EvalFrameDefault+0x1b38 (Python:x86_64+0xa85d5) #56 0x10fbfb2da in _PyEval_EvalCodeWithName+0x72a (Python:x86_64+0xb02da) #57 0x10fb6488b in _PyFunction_FastCallKeywords+0xe0 (Python:x86_64+0x1988b) #58 0x10fbfa97d in call_function+0x256 (Python:x86_64+0xaf97d) #59 0x10fbf35d5 in _PyEval_EvalFrameDefault+0x1b38 (Python:x86_64+0xa85d5) #60 0x10fb64ca1 in function_code_fastcall+0x6f (Python:x86_64+0x19ca1) #61 0x10fb65624 in _PyObject_Call_Prepend+0x95 (Python:x86_64+0x1a624) #62 0x10fb649d4 in PyObject_Call+0x87 (Python:x86_64+0x199d4) #63 0x10fbf3905 in _PyEval_EvalFrameDefault+0x1e68 (Python:x86_64+0xa8905) #64 0x10fbfb2da in _PyEval_EvalCodeWithName+0x72a (Python:x86_64+0xb02da) #65 0x10fb644f4 in _PyFunction_FastCallDict+0x1b8 (Python:x86_64+0x194f4) #66 0x10fb65624 in _PyObject_Call_Prepend+0x95 (Python:x86_64+0x1a624) #67 0x10fba24af in slot_tp_call+0x46 (Python:x86_64+0x574af) #68 0x10fb6472c in _PyObject_FastCallKeywords+0x166 (Python:x86_64+0x1972c) #69 0x10fbfa976 in call_function+0x24f (Python:x86_64+0xaf976) #70 0x10fbf368c in _PyEval_EvalFrameDefault+0x1bef (Python:x86_64+0xa868c) #71 0x10fb64ca1 in function_code_fastcall+0x6f (Python:x86_64+0x19ca1) #72 0x10fbfa97d in call_function+0x256 (Python:x86_64+0xaf97d) #73 0x10fbf35d5 in _PyEval_EvalFrameDefault+0x1b38 (Python:x86_64+0xa85d5) #74 0x10fb64ca1 in function_code_fastcall+0x6f (Python:x86_64+0x19ca1) #75 0x10fbfa97d in call_function+0x256 (Python:x86_64+0xaf97d) #76 0x10fbf35ee in _PyEval_EvalFrameDefault+0x1b51 (Python:x86_64+0xa85ee) #77 0x10fbfb2da in _PyEval_EvalCodeWithName+0x72a (Python:x86_64+0xb02da) #78 0x10fbf1a14 in PyEval_EvalCode+0x29 (Python:x86_64+0xa6a14) #79 0x10fc202aa in run_mod+0x35 (Python:x86_64+0xd52aa) #80 0x10fc1f2c5 in PyRun_FileExFlags+0xa3 (Python:x86_64+0xd42c5) #81 0x10fc1e9a4 in PyRun_SimpleFileExFlags+0x114 (Python:x86_64+0xd39a4) #82 0x10fc36010 in pymain_main+0x13de (Python:x86_64+0xeb010) #83 0x10fc367b7 in _Py_UnixMain+0x67 (Python:x86_64+0xeb7b7) #84 0x7fff77482084 in start+0x0 (libdyld.dylib:x86_64+0x17084)

Hide Details

==83604==Register values: rax = 0x000000010fada8f0 rbx = 0x0000000000000000 rcx = 0x0000000000000000 rdx = 0x0000000000000000 rdi = 0x0000000000000000 rsi = 0x0000000112ea3820 rbp = 0x00007ffee0e29f10 rsp = 0x00007ffee0e29f10 r8 = 0x0000000002fd9c0a r9 = 0xffffffff00000000 r10 = 0x0000631000079b18 r11 = 0x0000000000000001 r12 = 0x0000000112da38c0 r13 = 0x00001000225d4700 r14 = 0x00000000000003ff r15 = 0x0000000112ea3820 AddressSanitizer can not provide additional info. SUMMARY: AddressSanitizer: SEGV (libsystem_platform.dylib:x86_64+0x1712) in _platform_strlen+0x12 ==83604==ABORTING

Hide Details

******************** PASS: lldb-api :: functionalities/deleted-executable/TestDeletedExecutable.py (1857 of 1905) PASS: lldb-api :: tools/lldb-server/TestGdbRemoteHostInfo.py (1858 of 1905) PASS: lldb-unit :: Expression/./ExpressionTests/CppModuleConfigurationTest.Linux (1859 of 1905) PASS: lldb-unit :: Symbol/./SymbolTests/TestClangASTImporter.CanImportInvalidType (1860 of 1905) PASS: lldb-api :: lang/cpp/call-function/TestCallCPPFunction.py (1861 of 1905) PASS: lldb-unit :: Utility/./UtilityTests/StreamTest.PutPtr (1862 of 1905) PASS: lldb-api :: functionalities/thread/concurrent_events/TestConcurrentCrashWithBreak.py (1863 of 1905) PASS: lldb-shell :: Driver/TestConvenienceVariables.test (1864 of 1905) PASS: lldb-api :: python_api/frame/inlines/TestInlinedFrame.py (1865 of 1905) PASS: lldb-api :: functionalities/data-formatter/data-formatter-objc/TestDataFormatterObjCNSBundle.py (1866 of 1905) UNSUPPORTED: lldb-api :: tools/lldb-server/signal-filtering/TestGdbRemote_QPassSignals.py (1867 of 1905) PASS: lldb-api :: tools/lldb-vscode/breakpoint/TestVSCode_setFunctionBreakpoints.py (1868 of 1905) PASS: lldb-api :: functionalities/thread/concurrent_events/TestConcurrentDelayedCrashWithBreakpointWatchpoint.py (1869 of 1905) PASS: lldb-shell :: ObjectFile/ELF/minidebuginfo-find-symbols.yaml (1870 of 1905) PASS: lldb-shell :: Breakpoint/jitbp_elf.test (1871 of 1905) PASS: lldb-unit :: Utility/./UtilityTests/StringExtractorTest.GetHexU8_InvalidHex (1872 of 1905) PASS: lldb-shell :: Host/TestCustomShell.test (1873 of 1905) PASS: lldb-unit :: UnwindAssembly/x86/./UnwindAssemblyx86Tests/Testx86AssemblyInspectionEngine.TestPopRBP (1874 of 1905) PASS: lldb-unit :: Utility/./UtilityTests/UriParserTest.TypicalPortPath (1875 of 1905) PASS: lldb-unit :: UnwindAssembly/x86/./UnwindAssemblyx86Tests/Testx86AssemblyInspectionEngine.TestPush0 (1876 of 1905) PASS: lldb-unit :: Utility/./UtilityTests/ArchSpecTest.TestSetTriple (1877 of 1905) PASS: lldb-api :: lang/objc/objc-new-syntax/TestObjCNewSyntaxLiteral.py (1878 of 1905) PASS: lldb-unit :: Language/Highlighting/./HighlighterTests/HighlighterTest.ClangCursorPosAfterOtherToken (1879 of 1905) PASS: lldb-api :: macosx/DBGSourcePathRemapping/TestDSYMSourcePathRemapping.py (1880 of 1905) PASS: lldb-unit :: Utility/./UtilityTests/BinaryStreamTest.PutULEB128MaxValue (1881 of 1905) PASS: lldb-unit :: Utility/./UtilityTests/StringListTest.CopyListSingle (1882 of 1905) PASS: lldb-unit :: Symbol/./SymbolTests/DWARFCallFrameInfoTest.Basic_eh (1883 of 1905) PASS: lldb-api :: lang/c/set_values/TestSetValues.py (1884 of 1905) PASS: lldb-unit :: Process/gdb-remote/./ProcessGdbRemoteTests/GDBRemoteClientBaseTest.SendContinueAndWait (1885 of 1905) PASS: lldb-api :: functionalities/data-formatter/data-formatter-objc/nsstring/TestDataFormatterNSString.py (1886 of 1905) PASS: lldb-unit :: Host/./HostTests/SocketTest.UDPGetConnectURI (1887 of 1905) UNSUPPORTED: lldb-api :: functionalities/tsan/multiple/TestTsanMultiple.py (1888 of 1905) PASS: lldb-shell :: Reproducer/TestDiscard.test (1889 of 1905) PASS: lldb-api :: functionalities/thread/exit_during_step/TestExitDuringStep.py (1890 of 1905) PASS: lldb-unit :: Utility/./UtilityTests/StringExtractorTest.GetHexBytes_OddPair2 (1891 of 1905) PASS: lldb-api :: types/TestShortTypeExpr.py (1892 of 1905) PASS: lldb-unit :: Host/./HostTests/FileSystemTest.GetPermissions (1893 of 1905) PASS: lldb-unit :: SymbolFile/NativePDB/./SymbolFileNativePDBTests/PDBFPOProgramToDWARFExpressionTests.UnsupportedRASearch (1894 of 1905) PASS: lldb-api :: lang/c/shared_lib_stripped_symbols/TestSharedLibStrippedSymbols.py (1895 of 1905) PASS: lldb-api :: functionalities/tail_call_frames/ambiguous_tail_call_seq2/TestAmbiguousTailCallSeq2.py (1896 of 1905) PASS: lldb-unit :: Expression/./ExpressionTests/CppModuleConfigurationTest.MissingUsrInclude (1897 of 1905) PASS: lldb-unit :: Utility/./UtilityTests/TimerTest.CategoryTimesStats (1898 of 1905) PASS: lldb-unit :: SymbolFile/NativePDB/./SymbolFileNativePDBTests/PDBFPOProgramToDWARFExpressionTests.UnresolvedCyclicRegisterAssignmentReference (1899 of 1905) XFAIL: lldb-shell :: SymbolFile/DWARF/find-type-in-function.cpp (1900 of 1905) PASS: lldb-api :: commands/expression/completion-crash-incomplete-record/TestCompletionCrashIncompleteRecord.py (1901 of 1905) PASS: lldb-api :: commands/watchpoints/step_over_watchpoint/TestStepOverWatchpoint.py (1902 of 1905) PASS: lldb-api :: commands/expression/import-std-module/vector-dbg-info-content/TestDbgInfoContentVector.py (1903 of 1905) PASS: lldb-api :: functionalities/data-formatter/parray/TestPrintArray.py (1904 of 1905) PASS: lldb-api :: commands/expression/diagnostics/TestExprDiagnostics.py (1905 of 1905)

Hide Details

Testing Time: 4194.30s ******************** Unresolved Tests (1): lldb-api :: functionalities/breakpoint/comp_dir_symlink/TestCompDirSymLink.py

Hide Details

Hide Details

Slowest Tests: -------------------------------------------------------------------------- 86.98s: lldb-api :: functionalities/data-formatter/compactvectors/TestCompactVectors.py 91.49s: lldb-api :: commands/expression/import-std-module/vector-basic/TestBasicVector.py 92.88s: lldb-api :: types/TestLongTypes.py 106.69s: lldb-api :: lang/objcxx/class-name-clash/TestNameClash.py 112.02s: lldb-api :: lang/objc/foundation/TestObjCMethodsNSError.py 113.52s: lldb-api :: lang/objc/foundation/TestObjCMethodsString.py 113.75s: lldb-api :: lang/objc/objc-new-syntax/TestObjCNewSyntaxDictionary.py 114.93s: lldb-api :: lang/objc/objc-new-syntax/TestObjCNewSyntaxArray.py 119.67s: lldb-api :: tools/lldb-server/TestGdbRemote_qThreadStopInfo.py 129.84s: lldb-api :: types/TestLongTypesExpr.py 136.71s: lldb-api :: lang/objc/exceptions/TestObjCExceptions.py 138.79s: lldb-api :: lang/objc/real-definition/TestRealDefinition.py 150.69s: lldb-api :: lang/objc/objc-new-syntax/TestObjCNewSyntaxLiteral.py 162.25s: lldb-api :: lang/cpp/namespace/TestNamespaceLookup.py 214.55s: lldb-api :: lang/objc/foundation/TestObjCMethods.py 239.84s: lldb-api :: lang/objc/hidden-ivars/TestHiddenIvars.py 247.09s: lldb-api :: tools/lldb-server/TestGdbRemoteThreadsInStopReply.py 253.85s: lldb-api :: api/multithreaded/TestMultithreaded.py 270.26s: lldb-api :: lang/cpp/enum_types/TestCPP11EnumTypes.py 362.78s: lldb-api :: tools/lldb-server/TestLldbGdbServer.py

Hide Details

Tests Times: -------------------------------------------------------------------------- [ Range ] :: [ Percentage ] :: [ Count ] -------------------------------------------------------------------------- [ 0s, 20s) :: [********************************** ] :: [1654/1905] [ 20s, 40s) :: [** ] :: [ 125/1905] [ 40s, 60s) :: [* ] :: [ 76/1905] [ 60s, 80s) :: [ ] :: [ 23/1905] [ 80s,100s) :: [ ] :: [ 10/1905] [100s,120s) :: [ ] :: [ 4/1905] [120s,140s) :: [ ] :: [ 3/1905] [140s,160s) :: [ ] :: [ 3/1905] [160s,180s) :: [ ] :: [ 1/1905] [180s,200s) :: [ ] :: [ 0/1905] [200s,220s) :: [ ] :: [ 0/1905] [220s,240s) :: [ ] :: [ 1/1905] [240s,260s) :: [ ] :: [ 2/1905] [260s,280s) :: [ ] :: [ 1/1905] [280s,300s) :: [ ] :: [ 1/1905] [300s,320s) :: [ ] :: [ 0/1905] [320s,340s) :: [ ] :: [ 0/1905] [340s,360s) :: [ ] :: [ 0/1905] [360s,380s) :: [ ] :: [ 1/1905] Expected Passes : 1735 Expected Failures : 6 Unsupported Tests : 163 Unresolved Tests : 1 FAILED: tools/lldb/test/CMakeFiles/check-lldb-lit cd /Users/buildslave/jenkins/workspace/lldb-cmake-sanitized/lldb-build/tools/lldb/test && /usr/local/bin/python /Users/buildslave/jenkins/workspace/lldb-cmake-sanitized/lldb-build/./bin/llvm-lit -v --time-tests --shuffle --xunit-xml-output=/Users/buildslave/jenkins/workspace/lldb-cmake-sanitized/test/results.xml -v -j 4 --timeout 1200 /Users/buildslave/jenkins/workspace/lldb-cmake-sanitized/lldb-build/tools/lldb/test ninja: build stopped: subcommand failed. Command failed: Command '['/usr/bin/env', 'TERM=vt100', '/usr/local/bin/ninja', '-v', 'check-lldb']' returned non-zero exit status 1. Command: ['/usr/bin/env', 'TERM=vt100', '/usr/local/bin/ninja', '-v', 'check-lldb'] [Pipeline] } [Pipeline] // timeout [Pipeline] } [Pipeline] // stage [Pipeline] stage [Pipeline] { (Declarative: Post Actions) [Pipeline] scanForIssues No credentials specified [Clang (LLVM based)] Sleeping for 5 seconds due to JENKINS-32191... [Clang (LLVM based)] Parsing console log (workspace: '/Users/buildslave/jenkins/workspace/lldb-cmake-sanitized') [Pipeline] junit Recording test results [Pipeline] } [Pipeline] // stage [Pipeline] } [Pipeline] // withEnv [Pipeline] } [Pipeline] // node [Pipeline] End of Pipeline ERROR: script returned exit code 1 Finished: FAILURE