Console Output

Skipping 6,906 KB.. Full Log
PASS: lldb-unit :: Utility/./UtilityTests/CompletionRequest.Constructor (445 of 1906)
PASS: lldb-api :: python_api/section/TestSectionAPI.py (446 of 1906)
PASS: lldb-api :: lang/objc/variadic_methods/TestVariadicMethods.py (447 of 1906)
PASS: lldb-api :: tools/lldb-server/TestGdbRemoteHostInfo.py (448 of 1906)
PASS: lldb-unit :: Utility/./UtilityTests/StringExtractorTest.GetHexBytesAvail (449 of 1906)
PASS: lldb-api :: functionalities/thread/concurrent_events/TestConcurrentBreakpointDelayBreakpointOneSignal.py (450 of 1906)
PASS: lldb-shell :: Process/TestEnvironment.test (451 of 1906)
PASS: lldb-api :: lang/cpp/call-function/TestCallCPPFunction.py (452 of 1906)
PASS: lldb-api :: functionalities/data-formatter/hexcaps/TestDataFormatterHexCaps.py (453 of 1906)
PASS: lldb-unit :: Platform/./LLDBPlatformTests/PlatformDarwinTest.TestParseVersionBuildDir (454 of 1906)
PASS: lldb-shell :: SymbolFile/Breakpad/unwind-via-raSearch.test (455 of 1906)
PASS: lldb-api :: lang/cpp/class_types/TestClassTypesDisassembly.py (456 of 1906)
PASS: lldb-shell :: Driver/LocalLLDBInit.test (457 of 1906)
PASS: lldb-shell :: Quit/TestQuitExitCode30.test (458 of 1906)
PASS: lldb-api :: lang/cpp/modules-import/TestCXXModulesImport.py (459 of 1906)
PASS: lldb-unit :: Utility/./UtilityTests/ConstStringTest.MangledCounterpart (460 of 1906)
PASS: lldb-unit :: Host/./HostTests/FileSystemTest.OpenErrno (461 of 1906)
PASS: lldb-shell :: Breakpoint/dummy-target.test (462 of 1906)
PASS: lldb-unit :: Symbol/./SymbolTests/SymbolsTest.LocateExecutableSymbolFileForUnknownExecutableAndMissingSymbolFile (463 of 1906)
PASS: lldb-api :: types/TestIntegerType.py (464 of 1906)
PASS: lldb-unit :: ScriptInterpreter/Python/./ScriptInterpreterPythonTests/PythonDataObjectsTest.TestGlobalNameResolutionWithDot (465 of 1906)
PASS: lldb-api :: api/multiple-targets/TestMultipleTargets.py (466 of 1906)
PASS: lldb-api :: commands/expression/ir-interpreter/TestIRInterpreter.py (467 of 1906)
PASS: lldb-api :: python_api/module_section/TestModuleAndSection.py (468 of 1906)
PASS: lldb-api :: functionalities/tail_call_frames/ambiguous_tail_call_seq1/TestAmbiguousTailCallSeq1.py (469 of 1906)
PASS: lldb-api :: commands/expression/import-std-module/vector-of-vectors/TestVectorOfVectors.py (470 of 1906)
PASS: lldb-shell :: SymbolFile/DWARF/inline-function-address.ll (471 of 1906)
PASS: lldb-unit :: Utility/./UtilityTests/StringExtractorTest.GetHexBytes_OddPair2 (472 of 1906)
PASS: lldb-api :: lang/objc/objc-class-method/TestObjCClassMethod.py (473 of 1906)
PASS: lldb-api :: lang/cpp/function_refs/TestFunctionRefs.py (474 of 1906)
PASS: lldb-unit :: Host/./HostTests/SocketTest.TCPGetAddress (475 of 1906)
PASS: lldb-api :: tools/lldb-server/inferior-crash/TestGdbRemoteSegFault.py (476 of 1906)
PASS: lldb-api :: functionalities/data-formatter/format-propagation/TestFormatPropagation.py (477 of 1906)
PASS: lldb-unit :: Process/gdb-remote/./ProcessGdbRemoteTests/GDBRemoteClientBaseTest.SendContinueAndAsyncSignal (478 of 1906)
PASS: lldb-unit :: Expression/./ExpressionTests/CppModuleConfigurationTest.AmbiguousLibCpp (479 of 1906)
PASS: lldb-api :: tools/lldb-vscode/breakpoint/TestVSCode_setExceptionBreakpoints.py (480 of 1906)
PASS: lldb-api :: python_api/file_handle/TestFileHandle.py (481 of 1906)
PASS: lldb-unit :: Process/gdb-remote/./ProcessGdbRemoteTests/GDBRemoteCommunicationClientTest.SyncThreadState (482 of 1906)
PASS: lldb-api :: functionalities/data-formatter/setvaluefromcstring/TestSetValueFromCString.py (483 of 1906)
UNSUPPORTED: lldb-shell :: SymbolFile/PDB/compilands.test (484 of 1906)
PASS: lldb-api :: python_api/target/TestTargetAPI.py (485 of 1906)
PASS: lldb-unit :: UnwindAssembly/x86/./UnwindAssemblyx86Tests/Testx86AssemblyInspectionEngine.TestSimplei386ugmented (486 of 1906)
PASS: lldb-api :: functionalities/tail_call_frames/thread_step_out_message/TestArtificialFrameStepOutMessage.py (487 of 1906)
UNSUPPORTED: lldb-api :: functionalities/thread/thread_specific_break_plus_condition/TestThreadSpecificBpPlusCondition.py (488 of 1906)
PASS: lldb-unit :: Utility/./UtilityTests/VMRange.IsValid (489 of 1906)
UNSUPPORTED: lldb-api :: commands/expression/call-restarts/TestCallThatRestarts.py (490 of 1906)
UNSUPPORTED: lldb-shell :: Register/aarch64-fp-read.test (491 of 1906)
PASS: lldb-api :: lang/objc/objc-ivar-stripped/TestObjCIvarStripped.py (492 of 1906)
PASS: lldb-unit :: Utility/./UtilityTests/StreamTest.PutSLEB128 (493 of 1906)
PASS: lldb-unit :: UnwindAssembly/x86/./UnwindAssemblyx86Tests/Testx86AssemblyInspectionEngine.TestPushRBP (494 of 1906)
PASS: lldb-unit :: ScriptInterpreter/Python/./ScriptInterpreterPythonTests/PythonDataObjectsTest.TestPythonTupleSize (495 of 1906)
PASS: lldb-unit :: Utility/./UtilityTests/StringExtractorTest.GetU64LittleEndian (496 of 1906)
PASS: lldb-api :: commands/expression/import-std-module/empty-module/TestEmptyStdModule.py (497 of 1906)
PASS: lldb-api :: lang/cpp/enum_types/TestCPP11EnumTypes.py (498 of 1906)
PASS: lldb-api :: python_api/name_lookup/TestNameLookup.py (499 of 1906)
PASS: lldb-unit :: Utility/./UtilityTests/ArgsTest.TestUnknownEscape (500 of 1906)
PASS: lldb-api :: tools/lldb-server/TestLldbGdbServer.py (501 of 1906)
PASS: lldb-api :: functionalities/data-formatter/data-formatter-stl/libcxx/queue/TestDataFormatterLibcxxQueue.py (502 of 1906)
PASS: lldb-unit :: Utility/./UtilityTests/UserIDResolver.GetUserName (503 of 1906)
PASS: lldb-api :: commands/target/create-no-such-arch/TestNoSuchArch.py (504 of 1906)
PASS: lldb-api :: functionalities/data-formatter/data-formatter-disabling/TestDataFormatterDisabling.py (505 of 1906)
PASS: lldb-unit :: UnwindAssembly/x86/./UnwindAssemblyx86Tests/Testx86AssemblyInspectionEngine.TestPushR12 (506 of 1906)
PASS: lldb-api :: lang/objc/foundation/TestObjCMethods2.py (507 of 1906)
PASS: lldb-api :: python_api/sblaunchinfo/TestSBLaunchInfo.py (508 of 1906)
PASS: lldb-shell :: Unwind/trap_frame_sym_ctx.test (509 of 1906)
PASS: lldb-unit :: Symbol/./SymbolTests/LineEntryTest.GetSameLineContiguousAddressRangeNoInlines (510 of 1906)
PASS: lldb-unit :: Process/gdb-remote/./ProcessGdbRemoteTests/GDBRemoteCommunicationClientTest.GetModulesInfoInvalidResponse (511 of 1906)
PASS: lldb-shell :: SymbolFile/DWARF/find-basic-type.cpp (512 of 1906)
PASS: lldb-shell :: SymbolFile/NativePDB/ast-types.cpp (513 of 1906)
PASS: lldb-api :: lang/objc/exceptions/TestObjCExceptions.py (514 of 1906)
PASS: lldb-api :: functionalities/data-formatter/compactvectors/TestCompactVectors.py (515 of 1906)
PASS: lldb-unit :: Signals/./SignalsTests/UnixSignalsTest.GetInfo (516 of 1906)
UNSUPPORTED: lldb-api :: functionalities/darwin_log/filter/exact_match/activity/TestDarwinLogFilterMatchActivity.py (517 of 1906)
PASS: lldb-unit :: Utility/./UtilityTests/ArchSpecTest.TestParseMachCPUDashSubtypeTripleExtra (518 of 1906)
UNSUPPORTED: lldb-api :: commands/expression/completion-crash-invalid-iterator/TestInvalidIteratorCompletionCrash.py (519 of 1906)
PASS: lldb-shell :: Reproducer/Functionalities/TestDataFormatter.test (520 of 1906)
PASS: lldb-unit :: Language/Highlighting/./HighlighterTests/HighlighterTest.Keywords (521 of 1906)
UNSUPPORTED: lldb-shell :: Expr/TestIRMemoryMapWindows.test (522 of 1906)
PASS: lldb-api :: python_api/frame/inlines/TestInlinedFrame.py (523 of 1906)
PASS: lldb-shell :: SymbolFile/DWARF/debug-names-compressed.cpp (524 of 1906)
PASS: lldb-shell :: Reproducer/TestSynchronous.test (525 of 1906)
PASS: lldb-api :: lang/c/strings/TestCStrings.py (526 of 1906)
PASS: lldb-unit :: Utility/./UtilityTests/StreamTest.PutHex64ByteOrderLittle (527 of 1906)
PASS: lldb-api :: commands/expression/static-initializers/TestStaticInitializers.py (528 of 1906)
PASS: lldb-api :: functionalities/data-formatter/data-formatter-objc/TestDataFormatterObjCPlain.py (529 of 1906)
PASS: lldb-unit :: debugserver/./debugserverTests/RNBSocket.LoopBackListenIPv6 (530 of 1906)
UNSUPPORTED: lldb-api :: functionalities/darwin_log/filter/exact_match/message/TestDarwinLogFilterMatchMessage.py (531 of 1906)
PASS: lldb-unit :: Utility/./UtilityTests/ScalarTest.Comparison (532 of 1906)
PASS: lldb-api :: lang/cpp/namespace_definitions/TestNamespaceDefinitions.py (533 of 1906)
PASS: lldb-api :: commands/expression/top-level/TestTopLevelExprs.py (534 of 1906)
PASS: lldb-unit :: Utility/./UtilityTests/StringExtractorTest.GetNameColonValueNoColon (535 of 1906)
PASS: lldb-unit :: Host/./HostTests/Host.WaitStatusFormat (536 of 1906)
PASS: lldb-unit :: Utility/./UtilityTests/UriParserTest.SchemeHostSeparator2 (537 of 1906)
PASS: lldb-api :: lang/cpp/overloaded-functions/TestOverloadedFunctions.py (538 of 1906)
PASS: lldb-api :: lang/cpp/limit-debug-info/TestWithLimitDebugInfo.py (539 of 1906)
PASS: lldb-api :: commands/command/nested_alias/TestNestedAlias.py (540 of 1906)
PASS: lldb-shell :: Commands/CommandScriptImmediateOutput/CommandScriptImmediateOutputFile.test (541 of 1906)
PASS: lldb-unit :: Core/./LLDBCoreTests/RichManglingContextTest.SwitchProvider (542 of 1906)
PASS: lldb-unit :: ScriptInterpreter/Python/./ScriptInterpreterPythonTests/PythonDataObjectsTest.TestPythonInteger (543 of 1906)
PASS: lldb-unit :: Symbol/./SymbolTests/TestClangASTContext.TestBuiltinTypeForEncodingAndBitSize (544 of 1906)
PASS: lldb-api :: tools/lldb-server/TestGdbRemoteSingleStep.py (545 of 1906)
PASS: lldb-unit :: UnwindAssembly/x86/./UnwindAssemblyx86Tests/Testx86AssemblyInspectionEngine.TestPopEDI (546 of 1906)
PASS: lldb-unit :: Utility/./UtilityTests/AnsiTerminal.Basic (547 of 1906)
PASS: lldb-unit :: Utility/./UtilityTests/RangeTest.Slide (548 of 1906)
PASS: lldb-unit :: Language/Highlighting/./HighlighterTests/HighlighterTest.ClangCommas (549 of 1906)
PASS: lldb-shell :: Minidump/dump-all.test (550 of 1906)
PASS: lldb-unit :: Utility/./UtilityTests/StringExtractorTest.GetHexBytes_Underflow (551 of 1906)
PASS: lldb-api :: functionalities/data-formatter/data-formatter-stl/libcxx/multimap/TestDataFormatterLibccMultiMap.py (552 of 1906)
PASS: lldb-unit :: Target/./TargetTests/MemoryRegionInfoTest.Formatv (553 of 1906)
PASS: lldb-shell :: SymbolFile/DWARF/debug_ranges_and_rnglists.test (554 of 1906)
PASS: lldb-unit :: Utility/./UtilityTests/LogChannelEnabledTest.LogGetLogThread (555 of 1906)
PASS: lldb-shell :: SymbolFile/DWARF/debug-types-missing-signature.test (556 of 1906)
PASS: lldb-api :: commands/target/dump-symtab-demangle/TestDumpSymtabDemangle.py (557 of 1906)
PASS: lldb-unit :: Language/Highlighting/./HighlighterTests/HighlighterTest.HighlighterSelectionPath (558 of 1906)
PASS: lldb-unit :: Utility/./UtilityTests/StringListTest.ForRangeEmpty (559 of 1906)
PASS: lldb-api :: python_api/hello_world/TestHelloWorld.py (560 of 1906)
PASS: lldb-unit :: Utility/./UtilityTests/ArgsTest.BareSingleQuote (561 of 1906)
PASS: lldb-unit :: ObjectFile/Breakpad/./ObjectFileBreakpadTests/Record.classify (562 of 1906)
PASS: lldb-api :: functionalities/data-formatter/data-formatter-stl/libcxx/initializerlist/TestInitializerList.py (563 of 1906)
PASS: lldb-unit :: ScriptInterpreter/Python/./ScriptInterpreterPythonTests/PythonDataObjectsTest.TestPythonTupleInitializerList2 (564 of 1906)
PASS: lldb-unit :: UnwindAssembly/x86/./UnwindAssemblyx86Tests/Testx86AssemblyInspectionEngine.TestStackRealign32BitDisp_x86_64 (565 of 1906)
PASS: lldb-api :: lang/c/step-target/TestStepTarget.py (566 of 1906)
PASS: lldb-shell :: ObjectFile/Breakpad/sections-trailing-func.test (567 of 1906)
PASS: lldb-unit :: Utility/./UtilityTests/RegularExpression.CopyAssignment (568 of 1906)
UNSUPPORTED: lldb-shell :: Register/x86-gp-write.test (569 of 1906)
PASS: lldb-api :: functionalities/gdb_remote_client/TestGDBRemoteLoad.py (570 of 1906)
PASS: lldb-api :: functionalities/thread/concurrent_events/TestConcurrentTwoWatchpointThreads.py (571 of 1906)
PASS: lldb-unit :: Utility/./UtilityTests/ArgsTest.GetArgumentArrayRef (572 of 1906)
PASS: lldb-unit :: Utility/./UtilityTests/Flags.AllClear (573 of 1906)
PASS: lldb-unit :: Process/minidump/./LLDBMinidumpTests/MinidumpParserTest.GetThreadsAndGetThreadContext (574 of 1906)
PASS: lldb-shell :: ObjectFile/ELF/section-types.yaml (575 of 1906)
PASS: lldb-unit :: Process/minidump/./LLDBMinidumpTests/MinidumpParserTest.GetMiscInfoWindows (576 of 1906)
PASS: lldb-unit :: ObjectFile/Breakpad/./ObjectFileBreakpadTests/StackWinRecord.parse (577 of 1906)
PASS: lldb-api :: commands/expression/radar_9673664/TestExprHelpExamples.py (578 of 1906)
PASS: lldb-shell :: ObjectFile/wasm/stripped-debug-sections.yaml (579 of 1906)
PASS: lldb-unit :: Utility/./UtilityTests/OptionsWithRawTest.EmptyInput (580 of 1906)
PASS: lldb-api :: functionalities/inferior-crashing/TestInferiorCrashing.py (581 of 1906)
PASS: lldb-api :: lang/c/function_types/TestFunctionTypes.py (582 of 1906)
PASS: lldb-api :: commands/frame/diagnose/bad-reference/TestBadReference.py (583 of 1906)
UNSUPPORTED: lldb-api :: functionalities/unwind/ehframe/TestEhFrameUnwind.py (584 of 1906)
UNSUPPORTED: lldb-shell :: Register/x86-64-gp-write.test (585 of 1906)
PASS: lldb-api :: functionalities/inferior-assert/TestInferiorAssert.py (586 of 1906)
PASS: lldb-unit :: Language/CPlusPlus/./LanguageCPlusPlusTests/CPlusPlusLanguage.MethodNameParsing (587 of 1906)
PASS: lldb-api :: lang/cpp/thread_local/TestThreadLocal.py (588 of 1906)
PASS: lldb-api :: lang/c/global_variables/TestGlobalVariables.py (589 of 1906)
PASS: lldb-unit :: Host/./HostTests/NativeProcessProtocolTest.SetBreakpointFailWrite (590 of 1906)
PASS: lldb-unit :: Utility/./UtilityTests/FileSpecTest.GetPath (591 of 1906)
PASS: lldb-api :: functionalities/abbreviation/TestAbbreviations.py (592 of 1906)
PASS: lldb-api :: functionalities/type_lookup/TestTypeLookup.py (593 of 1906)
PASS: lldb-unit :: Expression/./ExpressionTests/CppModuleConfigurationTest.MissingLibCpp (594 of 1906)
PASS: lldb-api :: lang/objc/print-obj/TestPrintObj.py (595 of 1906)
PASS: lldb-api :: commands/expression/persist_objc_pointeetype/TestPersistObjCPointeeType.py (596 of 1906)
PASS: lldb-api :: python_api/lldbutil/iter/TestRegistersIterator.py (597 of 1906)
PASS: lldb-api :: lang/objc/orderedset/TestOrderedSet.py (598 of 1906)
PASS: lldb-shell :: ObjectFile/ELF/aarch64-relocations.yaml (599 of 1906)
PASS: lldb-unit :: Utility/./UtilityTests/StringListTest.AppendStringMove (600 of 1906)
UNSUPPORTED: lldb-api :: lang/c/typedef/Testtypedef.py (601 of 1906)
PASS: lldb-unit :: Utility/./UtilityTests/RangeTest.SlideZero (602 of 1906)
PASS: lldb-unit :: Utility/./UtilityTests/StreamTest.PutCharWhitespace (603 of 1906)
PASS: lldb-shell :: Reproducer/TestMultipleTargets.test (604 of 1906)
PASS: lldb-unit :: ScriptInterpreter/Python/./ScriptInterpreterPythonTests/PythonDataObjectsTest.TestPythonBoolean (605 of 1906)
PASS: lldb-api :: sanity/TestModuleCacheSanity.py (606 of 1906)
PASS: lldb-shell :: Breakpoint/debug_rnglist_basic.test (607 of 1906)
PASS: lldb-shell :: SymbolFile/symbol-binding.test (608 of 1906)
PASS: lldb-api :: commands/expression/ir-interpreter-phi-nodes/TestIRInterpreterPHINodes.py (609 of 1906)
PASS: lldb-unit :: Utility/./UtilityTests/StringListTest.SetSize (610 of 1906)
PASS: lldb-unit :: Utility/./UtilityTests/CompletionRequest.ShiftArguments (611 of 1906)
PASS: lldb-api :: commands/platform/basic/TestPlatformPython.py (612 of 1906)
PASS: lldb-api :: commands/add-dsym/uuid/TestAddDsymCommand.py (613 of 1906)
PASS: lldb-api :: functionalities/breakpoint/cpp_exception/TestCPPExceptionBreakpoint.py (614 of 1906)
PASS: lldb-api :: python_api/function_symbol/TestSymbolAPI.py (615 of 1906)
PASS: lldb-unit :: Utility/./UtilityTests/StringExtractorTest.GetHexU8_Underflow2 (616 of 1906)
UNSUPPORTED: lldb-api :: functionalities/tty/TestTerminal.py (617 of 1906)
UNSUPPORTED: lldb-shell :: Register/x86-64-xmm16-write.test (618 of 1906)
PASS: lldb-unit :: Utility/./UtilityTests/StringExtractorTest.GetHexBytesAvail_Underflow (619 of 1906)
PASS: lldb-api :: functionalities/tail_call_frames/disambiguate_paths_to_common_sink/TestDisambiguatePathsToCommonSink.py (620 of 1906)
PASS: lldb-api :: functionalities/data-formatter/data-formatter-stl/libcxx/unordered/TestDataFormatterUnordered.py (621 of 1906)
PASS: lldb-shell :: ObjectFile/ELF/netbsd-core-amd64.test (622 of 1906)
PASS: lldb-api :: lang/cpp/global_operators/TestCppGlobalOperators.py (623 of 1906)
PASS: lldb-api :: functionalities/thread/concurrent_events/TestConcurrentSignalNWatchNBreak.py (624 of 1906)
PASS: lldb-unit :: Utility/./UtilityTests/StreamTest.AddressRangeEmptyRange (625 of 1906)
PASS: lldb-unit :: Utility/./UtilityTests/StringListTest.GetMaxStringLengthIncreasingSize (626 of 1906)
PASS: lldb-unit :: ScriptInterpreter/Python/./ScriptInterpreterPythonTests/PythonDataObjectsTest.TestPythonIntegerToStructuredInteger (627 of 1906)
PASS: lldb-api :: lang/cpp/global_variables/TestCPPGlobalVariables.py (628 of 1906)
PASS: lldb-unit :: Expression/./ExpressionTests/DiagnosticManagerTest.GetStringNoDiags (629 of 1906)
PASS: lldb-unit :: Utility/./UtilityTests/VMRange.CollectionContains (630 of 1906)
PASS: lldb-unit :: Utility/./UtilityTests/AnsiTerminal.KnownPrefix (631 of 1906)
PASS: lldb-api :: lang/cpp/stl/TestStdCXXDisassembly.py (632 of 1906)
PASS: lldb-unit :: ScriptInterpreter/Python/./ScriptInterpreterPythonTests/PythonDataObjectsTest.TestModuleNameResolutionNoDot (633 of 1906)
PASS: lldb-api :: macosx/nslog/TestDarwinNSLogOutput.py (634 of 1906)
PASS: lldb-api :: commands/expression/import-std-module/basic/TestImportStdModule.py (635 of 1906)
PASS: lldb-unit :: Utility/./UtilityTests/OptionsWithRawTest.EmptyArgsOnlySuffix (636 of 1906)
PASS: lldb-api :: lang/objc/objc-struct-argument/TestObjCStructArgument.py (637 of 1906)
PASS: lldb-api :: functionalities/data-formatter/vector-types/TestVectorTypesFormatting.py (638 of 1906)
PASS: lldb-api :: functionalities/breakpoint/objc/TestObjCBreakpoints.py (639 of 1906)
PASS: lldb-unit :: Process/minidump/./LLDBMinidumpTests/MinidumpParserTest.GetThreadContext_x86_32 (640 of 1906)
PASS: lldb-api :: python_api/frame/TestFrames.py (641 of 1906)
PASS: lldb-api :: functionalities/tail_call_frames/disambiguate_call_site/TestDisambiguateCallSite.py (642 of 1906)
PASS: lldb-api :: tools/lldb-vscode/variables/TestVSCode_variables.py (643 of 1906)
PASS: lldb-unit :: Utility/./UtilityTests/BinaryStreamTest.PutULEB128MaxValue (644 of 1906)
PASS: lldb-api :: lang/objc/rdar-11355592/TestRdar11355592.py (645 of 1906)
PASS: lldb-unit :: UnwindAssembly/x86/./UnwindAssemblyx86Tests/Testx86AssemblyInspectionEngine.TestSubRSP (646 of 1906)
PASS: lldb-api :: functionalities/gdb_remote_client/TestGDBRemoteClient.py (647 of 1906)
PASS: lldb-unit :: Process/gdb-remote/./ProcessGdbRemoteTests/GDBRemoteCommunicationClientTest.SaveRestoreRegistersNoSuffix (648 of 1906)
PASS: lldb-api :: python_api/sbstructureddata/TestStructuredDataAPI.py (649 of 1906)
PASS: lldb-api :: python_api/value_var_update/TestValueVarUpdate.py (650 of 1906)
PASS: lldb-api :: lang/c/offsetof/TestOffsetof.py (651 of 1906)
PASS: lldb-api :: lang/cpp/member-and-local-vars-with-same-name/TestMembersAndLocalsWithSameName.py (652 of 1906)
PASS: lldb-unit :: Utility/./UtilityTests/UriParserTest.MinimalPath (653 of 1906)
PASS: lldb-unit :: Utility/./UtilityTests/StreamTeeTest.DefaultConstructor (654 of 1906)
PASS: lldb-api :: lang/objc/foundation/TestRuntimeTypes.py (655 of 1906)
PASS: lldb-api :: commands/expression/argument_passing_restrictions/TestArgumentPassingRestrictions.py (656 of 1906)
PASS: lldb-shell :: SymbolFile/DWARF/dir-separator-windows.s (657 of 1906)
PASS: lldb-api :: lang/c/local_variables/TestLocalVariables.py (658 of 1906)
PASS: lldb-shell :: ScriptInterpreter/None/import_module.test (659 of 1906)
PASS: lldb-unit :: Process/gdb-remote/./ProcessGdbRemoteTests/GDBRemoteCommunicationClientTest.WriteRegister (660 of 1906)
PASS: lldb-unit :: Utility/./UtilityTests/UUIDTest.StringConverion (661 of 1906)
PASS: lldb-unit :: Host/./HostTests/FileActionTest.Open (662 of 1906)
PASS: lldb-unit :: SymbolFile/NativePDB/./SymbolFileNativePDBTests/PDBFPOProgramToDWARFExpressionTests.UnresolvedRegisterAssignmentReference (663 of 1906)
PASS: lldb-shell :: Watchpoint/SetErrorCases.test (664 of 1906)
PASS: lldb-api :: functionalities/thread/concurrent_events/TestConcurrentDelayedCrashWithBreakpointWatchpoint.py (665 of 1906)
UNSUPPORTED: lldb-shell :: SymbolFile/PDB/class-layout.test (666 of 1906)
PASS: lldb-api :: lang/objc/objc_direct-methods/TestObjCDirectMethods.py (667 of 1906)
PASS: lldb-unit :: Process/gdb-remote/./ProcessGdbRemoteTests/GDBRemoteClientBaseTest.SendContinueAndWait (668 of 1906)
PASS: lldb-shell :: Commands/CommandScriptImmediateOutput/CommandScriptImmediateOutputConsole.test (669 of 1906)
PASS: lldb-unit :: UnwindAssembly/x86/./UnwindAssemblyx86Tests/Testx86AssemblyInspectionEngine.TestLEAVE (670 of 1906)
PASS: lldb-unit :: Utility/./UtilityTests/StreamTest.PutBytesAsRawHex8ToLittleEndian (671 of 1906)
UNSUPPORTED: lldb-shell :: Register/x86-64-zmm-write.test (672 of 1906)
PASS: lldb-unit :: Utility/./UtilityTests/RecordReplayTest.InstrumentedBar (673 of 1906)
PASS: lldb-api :: commands/expression/import-std-module/forward_list-dbg-info-content/TestDbgInfoContentForwardList.py (674 of 1906)
PASS: lldb-api :: functionalities/thread/concurrent_events/TestConcurrentTwoWatchpointsOneSignal.py (675 of 1906)
PASS: lldb-shell :: SymbolFile/NativePDB/bitfields.cpp (676 of 1906)
PASS: lldb-api :: functionalities/step-avoids-no-debug/TestStepNoDebug.py (677 of 1906)
PASS: lldb-unit :: Utility/./UtilityTests/ScalarTest.Equality (678 of 1906)
PASS: lldb-api :: functionalities/breakpoint/breakpoint_ignore_count/TestBreakpointIgnoreCount.py (679 of 1906)
PASS: lldb-api :: tools/lldb-vscode/breakpoint/TestVSCode_setFunctionBreakpoints.py (680 of 1906)
PASS: lldb-shell :: Reproducer/TestVersionCheck.test (681 of 1906)
PASS: lldb-api :: api/multithreaded/TestMultithreaded.py (682 of 1906)
PASS: lldb-unit :: UnwindAssembly/x86/./UnwindAssemblyx86Tests/Testx86AssemblyInspectionEngine.TestSubESP (683 of 1906)
PASS: lldb-api :: functionalities/gdb_remote_client/TestRecognizeBreakpoint.py (684 of 1906)
PASS: lldb-api :: functionalities/set-data/TestSetData.py (685 of 1906)
PASS: lldb-api :: python_api/process/read-mem-cstring/TestReadMemCString.py (686 of 1906)
PASS: lldb-api :: commands/expression/function_template_specialization_temp_args/TestFunctionTemplateSpecializationTempArgs.py (687 of 1906)
PASS: lldb-api :: functionalities/data-formatter/data-formatter-caching/TestDataFormatterCaching.py (688 of 1906)
PASS: lldb-unit :: Utility/./UtilityTests/StreamTest.PutMaxHex64ByteOrderLittle (689 of 1906)
PASS: lldb-api :: lang/c/forward/TestForwardDeclaration.py (690 of 1906)
PASS: lldb-api :: functionalities/thread/concurrent_events/TestConcurrentDelayWatchBreak.py (691 of 1906)
PASS: lldb-unit :: Host/./HostTests/SocketTest.DomainListenConnectAccept (692 of 1906)
PASS: lldb-api :: lang/objc/objc-baseclass-sbtype/TestObjCBaseClassSBType.py (693 of 1906)
PASS: lldb-unit :: UnwindAssembly/x86/./UnwindAssemblyx86Tests/Testx86AssemblyInspectionEngine.TestPopRBP (694 of 1906)
PASS: lldb-api :: lang/c/const_variables/TestConstVariables.py (695 of 1906)
PASS: lldb-api :: commands/target/stop-hooks/TestStopHooks.py (696 of 1906)
PASS: lldb-api :: lang/objc/foundation/TestSymbolTable.py (697 of 1906)
PASS: lldb-unit :: Utility/./UtilityTests/StringExtractorTest.GetHexBytes (698 of 1906)
PASS: lldb-api :: commands/expression/call-overridden-method/TestCallOverriddenMethod.py (699 of 1906)
PASS: lldb-api :: lang/cpp/wchar_t/TestCxxWCharT.py (700 of 1906)
PASS: lldb-api :: commands/expression/completion-in-lambda-and-unnamed-class/TestCompletionInLambdaAndUnnamedClass.py (701 of 1906)
PASS: lldb-unit :: tools/lldb-server/tests/./LLDBServerTests/StandardStartupTest.TestStopReplyContainsThreadPcs (702 of 1906)
PASS: lldb-unit :: Utility/./UtilityTests/CompletionRequest.DuplicateFiltering (703 of 1906)
PASS: lldb-unit :: Symbol/./SymbolTests/PostfixExpression.ToDWARF (704 of 1906)
PASS: lldb-unit :: Utility/./UtilityTests/StreamTest.PutRawBytesToLittleEndian (705 of 1906)
PASS: lldb-shell :: Unwind/thread-step-out-ret-addr-check.test (706 of 1906)
PASS: lldb-unit :: SymbolFile/NativePDB/./SymbolFileNativePDBTests/PDBFPOProgramToDWARFExpressionTests.InvalidAssignmentSingle (707 of 1906)
PASS: lldb-api :: lang/cpp/operator-overload/TestOperatorOverload.py (708 of 1906)
PASS: lldb-unit :: UnwindAssembly/x86/./UnwindAssemblyx86Tests/Testx86AssemblyInspectionEngine.TestSimplex86_64Augmented (709 of 1906)
PASS: lldb-unit :: Host/./HostTests/SocketAddressTest.Set (710 of 1906)
PASS: lldb-shell :: Minidump/Windows/find-module.test (711 of 1906)
PASS: lldb-unit :: UnwindAssembly/x86/./UnwindAssemblyx86Tests/Testx86AssemblyInspectionEngine.TestPushECX (712 of 1906)
PASS: lldb-api :: functionalities/data-formatter/language_category_updates/TestDataFormatterLanguageCategoryUpdates.py (713 of 1906)
PASS: lldb-unit :: Host/./HostTests/NativeProcessProtocolTest.SetBreakpoint (714 of 1906)
PASS: lldb-api :: functionalities/var_path/TestVarPath.py (715 of 1906)
PASS: lldb-unit :: ObjectFile/ELF/./ObjectFileELFTests/ObjectFileELFTest.GetSymtab_NoSymEntryPointArmAddressClass (716 of 1906)
PASS: lldb-unit :: ScriptInterpreter/Python/./ScriptInterpreterPythonTests/PythonDataObjectsTest.TestDictionaryResolutionWithDot (717 of 1906)
PASS: lldb-unit :: Target/./TargetTests/PathMappingListTest.RelativeTests (718 of 1906)
PASS: lldb-unit :: Utility/./UtilityTests/StringExtractorTest.GetU64BigEndian (719 of 1906)
PASS: lldb-api :: commands/version/TestVersion.py (720 of 1906)
PASS: lldb-shell :: SymbolFile/DWARF/split-dwarf-inlining.cpp (721 of 1906)
PASS: lldb-api :: lang/cpp/signed_types/TestSignedTypes.py (722 of 1906)
PASS: lldb-api :: functionalities/value_md5_crash/TestValueMD5Crash.py (723 of 1906)
PASS: lldb-api :: functionalities/breakpoint/debugbreak/TestDebugBreak.py (724 of 1906)
PASS: lldb-unit :: SymbolFile/NativePDB/./SymbolFileNativePDBTests/PDBFPOProgramToDWARFExpressionTests.UnsupportedRASearch (725 of 1906)
PASS: lldb-api :: commands/expression/diagnostics/TestExprDiagnostics.py (726 of 1906)
PASS: lldb-api :: lang/objc/objc-new-syntax/TestObjCNewSyntaxLiteral.py (727 of 1906)
PASS: lldb-unit :: Utility/./UtilityTests/StringListTest.AppendList (728 of 1906)
PASS: lldb-unit :: Signals/./SignalsTests/UnixSignalsTest.Iteration (729 of 1906)
PASS: lldb-shell :: Reproducer/TestFileRepro.test (730 of 1906)
PASS: lldb-api :: functionalities/tail_call_frames/cross_dso/TestCrossDSOTailCalls.py (731 of 1906)
PASS: lldb-api :: lang/c/unions/TestUnionMembers.py (732 of 1906)
PASS: lldb-unit :: Utility/./UtilityTests/BinaryStreamTest.PutSLEB128FiveBytes (733 of 1906)
PASS: lldb-unit :: UnwindAssembly/x86/./UnwindAssemblyx86Tests/Testx86AssemblyInspectionEngine.TestPopRBPWithREX (734 of 1906)
PASS: lldb-api :: functionalities/breakpoint/serialize/TestBreakpointSerialization.py (735 of 1906)
PASS: lldb-api :: commands/expression/import-std-module/unique_ptr/TestUniquePtr.py (736 of 1906)
PASS: lldb-unit :: Utility/./UtilityTests/OptionsWithRawTest.MultiWordSuffix (737 of 1906)
PASS: lldb-unit :: Utility/./UtilityTests/NameMatchesTest.RegularExpression (738 of 1906)
PASS: lldb-api :: types/TestDoubleTypesExpr.py (739 of 1906)
PASS: lldb-api :: linux/builtin_trap/TestBuiltinTrap.py (740 of 1906)
PASS: lldb-shell :: SymbolFile/DWARF/debug-types-dwarf5.s (741 of 1906)
PASS: lldb-unit :: Symbol/./SymbolTests/TestClangASTContext.TestGetTypeClassNested (742 of 1906)
UNSUPPORTED: lldb-shell :: SymbolFile/target-symbols-add-unwind.test (743 of 1906)
PASS: lldb-api :: functionalities/mtc/simple/TestMTCSimple.py (744 of 1906)
UNSUPPORTED: lldb-api :: lang/cpp/printf/TestPrintf.py (745 of 1906)
PASS: lldb-unit :: Utility/./UtilityTests/StringExtractorTest.GetHexBytesAvail_OddPair2 (746 of 1906)
PASS: lldb-api :: macosx/indirect_symbol/TestIndirectSymbols.py (747 of 1906)
PASS: lldb-unit :: Utility/./UtilityTests/ArgsTest.TestAppendArg (748 of 1906)
PASS: lldb-api :: functionalities/data-formatter/data-formatter-stl/libcxx/string/TestDataFormatterLibcxxString.py (749 of 1906)
PASS: lldb-unit :: Utility/./UtilityTests/StringExtractorTest.DecodeHexU8_InvalidHex2 (750 of 1906)
PASS: lldb-api :: commands/frame/var/TestFrameVar.py (751 of 1906)
PASS: lldb-unit :: Utility/./UtilityTests/BinaryStreamTest.PutULEB128Zero (752 of 1906)
PASS: lldb-shell :: ObjectFile/Breakpad/breakpad-identification.test (753 of 1906)
PASS: lldb-unit :: Utility/./UtilityTests/ArgsTest.StringListConstructor (754 of 1906)
PASS: lldb-api :: functionalities/thread/create_after_attach/TestCreateAfterAttach.py (755 of 1906)
PASS: lldb-shell :: SymbolFile/NativePDB/disassembly.cpp (756 of 1906)
PASS: lldb-unit :: Utility/./UtilityTests/StreamTeeTest.Constructor2Streams (757 of 1906)
PASS: lldb-unit :: Utility/./UtilityTests/RangeTest.ContainsEndInclusiveInvalid (758 of 1906)
PASS: lldb-shell :: Reproducer/Functionalities/TestImageList.test (759 of 1906)
PASS: lldb-api :: functionalities/data-formatter/data-formatter-stl/libcxx/variant/TestDataFormatterLibcxxVariant.py (760 of 1906)
PASS: lldb-api :: functionalities/memory/cache/TestMemoryCache.py (761 of 1906)
PASS: lldb-shell :: ObjectFile/PECOFF/export-dllfunc.yaml (762 of 1906)
PASS: lldb-api :: functionalities/thread/step_until/TestStepUntil.py (763 of 1906)
PASS: lldb-shell :: SymbolFile/DWARF/dir-separator-no-comp-dir.s (764 of 1906)
PASS: lldb-api :: tools/lldb-server/TestGdbRemoteAttach.py (765 of 1906)
PASS: lldb-unit :: Utility/./UtilityTests/ProcessInfoTest.Constructor (766 of 1906)
PASS: lldb-api :: functionalities/signal/raise/TestRaise.py (767 of 1906)
PASS: lldb-unit :: Utility/./UtilityTests/StreamTest.PutHex8 (768 of 1906)
PASS: lldb-unit :: Utility/./UtilityTests/StringListTest.RemoveBlankLines (769 of 1906)
PASS: lldb-unit :: Utility/./UtilityTests/NameMatchesTest.Equals (770 of 1906)
PASS: lldb-unit :: Process/gdb-remote/./ProcessGdbRemoteTests/GDBRemoteCommunicationClientTest.TestPacketSpeedJSON (771 of 1906)
PASS: lldb-unit :: Utility/./UtilityTests/ArgsTest.AppendArguments (772 of 1906)
PASS: lldb-unit :: UnwindAssembly/x86/./UnwindAssemblyx86Tests/Testx86AssemblyInspectionEngine.TestPushR15 (773 of 1906)
UNSUPPORTED: lldb-api :: functionalities/thread/concurrent_events/TestConcurrentManySignals.py (774 of 1906)
PASS: lldb-api :: functionalities/thread/concurrent_events/TestConcurrentTwoBreakpointsOneSignal.py (775 of 1906)
PASS: lldb-unit :: Interpreter/./InterpreterTests/OptionArgParserTest.toChar (776 of 1906)
PASS: lldb-unit :: Host/./HostTests/SocketAddressTest.GetAddressInfo (777 of 1906)
UNSUPPORTED: lldb-api :: functionalities/darwin_log/source/info/TestDarwinLogSourceInfo.py (778 of 1906)
PASS: lldb-api :: functionalities/plugins/python_os_plugin/TestPythonOSPlugin.py (779 of 1906)
PASS: lldb-api :: functionalities/unwind/noreturn/module-end/TestNoReturnModuleEnd.py (780 of 1906)
PASS: lldb-api :: commands/expression/regression-access-function-template-in-record/TestRegressionAccessFunctionTemplateInRecord.py (781 of 1906)
PASS: lldb-api :: lang/cpp/gmodules/TestWithModuleDebugging.py (782 of 1906)
PASS: lldb-api :: functionalities/data-formatter/data-formatter-python-synth/TestDataFormatterPythonSynth.py (783 of 1906)
UNSUPPORTED: lldb-api :: functionalities/thread/break_after_join/TestBreakAfterJoin.py (784 of 1906)
UNSUPPORTED: lldb-api :: functionalities/darwin_log/filter/regex/activity/TestDarwinLogFilterRegexActivity.py (785 of 1906)
PASS: lldb-api :: functionalities/inferior-crashing/recursive-inferior/TestRecursiveInferiorStep.py (786 of 1906)
PASS: lldb-unit :: Utility/./UtilityTests/StreamTest.PutULEB128 (787 of 1906)
PASS: lldb-api :: types/TestRecursiveTypes.py (788 of 1906)
PASS: lldb-unit :: Host/./HostTests/NativeProcessProtocolTest.ReadCStringFromMemory_CrossPageBoundary (789 of 1906)
PASS: lldb-shell :: Reproducer/TestRelativePath.test (790 of 1906)
PASS: lldb-api :: tools/lldb-vscode/breakpoint/TestVSCode_setBreakpoints.py (791 of 1906)
PASS: lldb-unit :: Utility/./UtilityTests/ListenerTest.GetEventImmediate (792 of 1906)
PASS: lldb-api :: lang/objc/ivar-IMP/TestObjCiVarIMP.py (793 of 1906)
PASS: lldb-api :: functionalities/breakpoint/inlined_breakpoints/TestInlinedBreakpoints.py (794 of 1906)
PASS: lldb-api :: commands/expression/test/TestExprs2.py (795 of 1906)
PASS: lldb-api :: functionalities/lazy-loading/TestLazyLoading.py (796 of 1906)
PASS: lldb-unit :: Target/./TargetTests/ExecutionContextTest.GetByteOrderTarget (797 of 1906)
PASS: lldb-shell :: SymbolFile/DWARF/DW_OP_piece-struct.s (798 of 1906)
PASS: lldb-unit :: Expression/./ExpressionTests/DiagnosticManagerTest.PutStringMultiple (799 of 1906)
PASS: lldb-unit :: Utility/./UtilityTests/StreamTest.AddressPrefix (800 of 1906)
PASS: lldb-api :: lang/objc/modules-update/TestClangModulesUpdate.py (801 of 1906)
PASS: lldb-shell :: ObjectFile/PECOFF/sections.yaml (802 of 1906)
PASS: lldb-shell :: SymbolFile/DWARF/apple-index-is-used.cpp (803 of 1906)
PASS: lldb-shell :: SymbolFile/DWARF/debug-types-address-ranges.s (804 of 1906)
PASS: lldb-unit :: Utility/./UtilityTests/StringExtractorTest.InitEmpty (805 of 1906)
PASS: lldb-unit :: UnwindAssembly/x86/./UnwindAssemblyx86Tests/Testx86AssemblyInspectionEngine.TestPushImm (806 of 1906)
PASS: lldb-api :: commands/expression/completion-crash-incomplete-record/TestCompletionCrashIncompleteRecord.py (807 of 1906)
PASS: lldb-api :: commands/process/launch/TestProcessLaunch.py (808 of 1906)
PASS: lldb-unit :: ScriptInterpreter/Python/./ScriptInterpreterPythonTests/PythonDataObjectsTest.TestExtractingUInt64ThroughStructuredData (809 of 1906)
PASS: lldb-api :: lang/objc/foundation/TestObjectDescriptionAPI.py (810 of 1906)
PASS: lldb-api :: functionalities/thread/thread_specific_break/TestThreadSpecificBreakpoint.py (811 of 1906)
PASS: lldb-api :: lang/cpp/unicode-literals/TestUnicodeLiterals.py (812 of 1906)
PASS: lldb-api :: python_api/signals/TestSignalsAPI.py (813 of 1906)
PASS: lldb-unit :: Utility/./UtilityTests/StringListTest.LongestCommonPrefixSingleElement (814 of 1906)
PASS: lldb-unit :: Utility/./UtilityTests/VMRange.Comparison (815 of 1906)
XFAIL: lldb-shell :: SymbolFile/DWARF/find-type-in-function.cpp (816 of 1906)
PASS: lldb-api :: functionalities/data-formatter/data-formatter-stl/libcxx/optional/TestDataFormatterLibcxxOptional.py (817 of 1906)
PASS: lldb-unit :: Utility/./UtilityTests/ProcessInstanceInfo.DumpTable (818 of 1906)
PASS: lldb-unit :: Expression/./ExpressionTests/CppModuleConfigurationTest.UnknownLibCppFile (819 of 1906)
PASS: lldb-shell :: SymbolFile/DWARF/find-qualified-variable.cpp (820 of 1906)
PASS: lldb-unit :: Expression/./ExpressionTests/CppModuleConfigurationTest.AmbiguousCLib (821 of 1906)
UNSUPPORTED: lldb-api :: tools/lldb-server/TestGdbRemoteAuxvSupport.py (822 of 1906)
PASS: lldb-shell :: Breakpoint/debug_rnglist_offset_pair.test (823 of 1906)
PASS: lldb-api :: functionalities/data-formatter/data-formatter-stl/libcxx/set/TestDataFormatterLibcxxSet.py (824 of 1906)
UNSUPPORTED: lldb-api :: benchmarks/stepping/TestSteppingSpeed.py (825 of 1906)
PASS: lldb-unit :: Language/Highlighting/./HighlighterTests/HighlighterTest.ClangCursorOutOfBounds (826 of 1906)
PASS: lldb-api :: commands/expression/import_builtin_fileid/TestImportBuiltinFileID.py (827 of 1906)
PASS: lldb-unit :: Process/gdb-remote/./ProcessGdbRemoteTests/GDBRemoteCommunicationClientTest.SendGetMetaDataPacket (828 of 1906)
PASS: lldb-unit :: UnwindAssembly/x86/./UnwindAssemblyx86Tests/Testx86AssemblyInspectionEngine.Test32bitFramelessBigStackFrame (829 of 1906)
PASS: lldb-unit :: Utility/./UtilityTests/RangeTest.LessThan (830 of 1906)
PASS: lldb-unit :: Utility/./UtilityTests/StringExtractorTest.GetNameColonValueSuccess (831 of 1906)
PASS: lldb-shell :: SymbolFile/DWARF/debug_loclists-dwo.s (832 of 1906)
PASS: lldb-unit :: UnwindAssembly/x86/./UnwindAssemblyx86Tests/Testx86AssemblyInspectionEngine.TestSimple32bitFrameFunction (833 of 1906)
PASS: lldb-shell :: SymbolFile/Breakpad/symtab-macho.test (834 of 1906)
PASS: lldb-api :: lang/cpp/nested-class-other-compilation-unit/TestNestedClassWithParentInAnotherCU.py (835 of 1906)
PASS: lldb-unit :: Utility/./UtilityTests/BinaryStreamTest.PutULEB128SixBytes (836 of 1906)
PASS: lldb-api :: functionalities/data-formatter/data-formatter-stl/libcxx/atomic/TestLibCxxAtomic.py (837 of 1906)
PASS: lldb-unit :: Utility/./UtilityTests/ArgsTest.ReplaceArgumentAtIndexLonger (838 of 1906)
PASS: lldb-unit :: ObjectFile/ELF/./ObjectFileELFTests/ObjectFileELFTest.GetSymtab_NoSymEntryPointArmThumbAddressClass (839 of 1906)
PASS: lldb-api :: functionalities/breakpoint/move_nearest/TestMoveNearest.py (840 of 1906)
PASS: lldb-shell :: Reproducer/TestGDBRemoteRepro.test (841 of 1906)
PASS: lldb-unit :: SymbolFile/DWARF/./SymbolFileDWARFTests/SymbolFileDWARFTests.TestAbilitiesForDWARF (842 of 1906)
PASS: lldb-shell :: SymbolFile/DWARF/find-method.cpp (843 of 1906)
PASS: lldb-api :: commands/settings/TestSettings.py (844 of 1906)
PASS: lldb-unit :: Expression/./ExpressionTests/DWARFExpression.DW_OP_convert (845 of 1906)
PASS: lldb-unit :: Utility/./UtilityTests/BinaryStreamTest.PutSLEB128SixBytes (846 of 1906)
PASS: lldb-unit :: Utility/./UtilityTests/TildeExpressionResolver.ResolveFullPath (847 of 1906)
PASS: lldb-api :: lang/objcxx/objcxx-ivar-vector/TestIvarVector.py (848 of 1906)
UNSUPPORTED: lldb-api :: functionalities/asan/TestMemoryHistory.py (849 of 1906)
PASS: lldb-api :: commands/apropos/basic/TestApropos.py (850 of 1906)
PASS: lldb-unit :: UnwindAssembly/x86/./UnwindAssemblyx86Tests/Testx86AssemblyInspectionEngine.TestPushEDX (851 of 1906)
PASS: lldb-unit :: debugserver/./debugserverTests/RNBSocket.AnyListen (852 of 1906)
UNSUPPORTED: lldb-shell :: SymbolFile/PDB/variables-locations.test (853 of 1906)
UNSUPPORTED: lldb-shell :: Register/x86-zmm-write.test (854 of 1906)
PASS: lldb-unit :: Utility/./UtilityTests/StreamTest.QuotedCString (855 of 1906)
PASS: lldb-unit :: SymbolFile/DWARF/./SymbolFileDWARFTests/SymbolFileDWARFTests.TestAbbrevMissingTerminator (856 of 1906)
PASS: lldb-unit :: Process/minidump/./LLDBMinidumpTests/MinidumpParserTest.GetMemoryRegionInfoFromMemory64List (857 of 1906)
PASS: lldb-unit :: Core/./LLDBCoreTests/StreamCallbackTest.Callback (858 of 1906)
PASS: lldb-unit :: Utility/./UtilityTests/OptionsWithRawTest.EmptySuffixSingleWhitespace (859 of 1906)
PASS: lldb-shell :: ObjectFile/PECOFF/basic-info.yaml (860 of 1906)
PASS: lldb-api :: commands/expression/dollar-in-variable/TestDollarInVariable.py (861 of 1906)
PASS: lldb-api :: functionalities/data-formatter/data-formatter-objc/nsindexpath/TestDataFormatterNSIndexPath.py (862 of 1906)
PASS: lldb-unit :: Utility/./UtilityTests/BinaryStreamTest.PutULEB128NineBytes (863 of 1906)
PASS: lldb-shell :: ObjectFile/MachO/lc_version_min.yaml (864 of 1906)
PASS: lldb-unit :: SymbolFile/DWARF/./SymbolFileDWARFTests/SymbolFileDWARFTests.TestAbbrevOutOfOrder (865 of 1906)
PASS: lldb-unit :: SymbolFile/DWARF/./SymbolFileDWARFTests/SymbolFileDWARFTests.TestAbbrevValidAttrNullForm (866 of 1906)
PASS: lldb-unit :: Symbol/./SymbolTests/TestClangASTImporter.DeportTypeTagDecl (867 of 1906)
PASS: lldb-shell :: ObjectFile/wasm/basic.yaml (868 of 1906)
PASS: lldb-unit :: Process/gdb-remote/./ProcessGdbRemoteTests/GDBRemoteClientBaseTest.SendContinueDelegateStructuredDataReceipt (869 of 1906)
PASS: lldb-api :: functionalities/tail_call_frames/inlining_and_tail_calls/TestInliningAndTailCalls.py (870 of 1906)
PASS: lldb-shell :: SymbolFile/DWARF/debug_loc-aslr.s (871 of 1906)
PASS: lldb-api :: functionalities/data-formatter/data-formatter-synth/TestDataFormatterSynth.py (872 of 1906)
UNSUPPORTED: lldb-api :: lang/objc/bitfield_ivars/TestBitfieldIvars.py (873 of 1906)
PASS: lldb-unit :: Host/./HostTests/FileSystemTest.Exists (874 of 1906)
PASS: lldb-api :: lang/cpp/lambdas/TestLambdas.py (875 of 1906)
PASS: lldb-unit :: Utility/./UtilityTests/FileSpecTest.EqualSeparator (876 of 1906)
PASS: lldb-unit :: Utility/./UtilityTests/ScalarTest.Promotion (877 of 1906)
PASS: lldb-unit :: Utility/./UtilityTests/ArgsTest.TestArgv (878 of 1906)
PASS: lldb-api :: python_api/sbvalue_persist/TestSBValuePersist.py (879 of 1906)
PASS: lldb-unit :: SymbolFile/NativePDB/./SymbolFileNativePDBTests/PDBFPOProgramToDWARFExpressionTests.MultipleIndependentAssignments (880 of 1906)
PASS: lldb-unit :: Utility/./UtilityTests/UriParserTest.MinimalPort (881 of 1906)
PASS: lldb-api :: functionalities/data-formatter/array_typedef/TestArrayTypedef.py (882 of 1906)
PASS: lldb-unit :: Process/gdb-remote/./ProcessGdbRemoteTests/GDBRemoteClientBaseTest.SendContinueAndLateInterrupt (883 of 1906)
PASS: lldb-api :: commands/expression/import-std-module/list-dbg-info-content/TestDbgInfoContentList.py (884 of 1906)
PASS: lldb-api :: functionalities/data-formatter/ptr_ref_typedef/TestPtrRef2Typedef.py (885 of 1906)
PASS: lldb-api :: commands/watchpoints/watchpoint_commands/TestWatchpointCommands.py (886 of 1906)
PASS: lldb-unit :: Utility/./UtilityTests/StringExtractorTest.InitMisc (887 of 1906)
PASS: lldb-unit :: UnwindAssembly/x86/./UnwindAssemblyx86Tests/Testx86AssemblyInspectionEngine.TestPushRBPWithREX (888 of 1906)
PASS: lldb-api :: lang/cpp/namespace/TestNamespaceLookup.py (889 of 1906)
PASS: lldb-api :: commands/expression/deleting-implicit-copy-constructor/TestDeletingImplicitCopyConstructor.py (890 of 1906)
PASS: lldb-api :: commands/expression/persistent_types/TestNestedPersistentTypes.py (891 of 1906)
PASS: lldb-unit :: Symbol/./SymbolTests/TestClangASTContext.TestGetTypeClassDeclType (892 of 1906)
PASS: lldb-unit :: Utility/./UtilityTests/RangeTest.Equal (893 of 1906)
PASS: lldb-unit :: Utility/./UtilityTests/VASprintfTest.EncodingError (894 of 1906)
PASS: lldb-api :: lang/objc/foundation/TestObjCMethodsNSError.py (895 of 1906)
PASS: lldb-unit :: Utility/./UtilityTests/TimerTest.CategoryTimes (896 of 1906)
UNSUPPORTED: lldb-api :: functionalities/data-formatter/data-formatter-stl/libstdcpp/unique_ptr/TestDataFormatterStdUniquePtr.py (897 of 1906)
UNSUPPORTED: lldb-shell :: Process/Windows/exception_access_violation.cpp (898 of 1906)
PASS: lldb-shell :: Expr/TestIRMemoryMap.test (899 of 1906)
PASS: lldb-api :: lang/objc/objc-ivar-offsets/TestObjCIvarOffsets.py (900 of 1906)
PASS: lldb-api :: lang/cpp/class-template-parameter-pack/TestClassTemplateParameterPack.py (901 of 1906)
PASS: lldb-unit :: Utility/./UtilityTests/ArgsTest.ReplaceArgumentAtIndexShort (902 of 1906)
PASS: lldb-shell :: SymbolFile/DWARF/find-method-local-struct.cpp (903 of 1906)
PASS: lldb-unit :: Utility/./UtilityTests/StreamTest.PutStringAsRawHex8 (904 of 1906)
PASS: lldb-unit :: Expression/./ExpressionTests/CppModuleConfigurationTest.IgnoreLibStdCpp (905 of 1906)
PASS: lldb-shell :: Breakpoint/implicit_const_form_support.test (906 of 1906)
PASS: lldb-unit :: UnwindAssembly/x86/./UnwindAssemblyx86Tests/Testx86AssemblyInspectionEngine.TestPushEDI (907 of 1906)
UNSUPPORTED: lldb-shell :: SymbolFile/PDB/func-symbols.test (908 of 1906)
PASS: lldb-api :: python_api/value/change_values/TestChangeValueAPI.py (909 of 1906)
PASS: lldb-unit :: Utility/./UtilityTests/BinaryStreamTest.PutSLEB128Zero (910 of 1906)
PASS: lldb-api :: lang/cpp/namespace_conflicts/TestNamespaceConflicts.py (911 of 1906)
PASS: lldb-api :: functionalities/tail_call_frames/unambiguous_sequence/TestUnambiguousTailCalls.py (912 of 1906)
PASS: lldb-unit :: Expression/./ExpressionTests/ClangHostTest.MacOSX (913 of 1906)
XFAIL: lldb-shell :: Register/x86-64-write.test (914 of 1906)
PASS: lldb-unit :: ScriptInterpreter/Python/./ScriptInterpreterPythonTests/PythonDataObjectsTest.TestResetting (915 of 1906)
PASS: lldb-shell :: SymbolFile/DWARF/debug-line-basic.s (916 of 1906)
PASS: lldb-api :: functionalities/thread/backtrace_all/TestBacktraceAll.py (917 of 1906)
XFAIL: lldb-shell :: Unwind/prefer-debug-over-eh-frame.test (918 of 1906)
PASS: lldb-shell :: Breakpoint/debug_addrx.test (919 of 1906)
PASS: lldb-unit :: Process/minidump/./LLDBMinidumpTests/MinidumpParserTest.GetPidWow64 (920 of 1906)
PASS: lldb-api :: lang/objc/objc-new-syntax/TestObjCNewSyntaxDictionary.py (921 of 1906)
PASS: lldb-api :: commands/command/invalid-args/TestInvalidArgsCommand.py (922 of 1906)
PASS: lldb-api :: lang/cpp/class_static/TestStaticVariables.py (923 of 1906)
UNSUPPORTED: lldb-api :: arm/breakpoint-it/TestBreakpointIt.py (924 of 1906)
PASS: lldb-unit :: UnwindAssembly/x86/./UnwindAssemblyx86Tests/Testx86AssemblyInspectionEngine.TestSpillRegToStackViaMOVi386 (925 of 1906)
PASS: lldb-api :: types/TestLongTypesExpr.py (926 of 1906)
PASS: lldb-unit :: ObjectFile/Breakpad/./ObjectFileBreakpadTests/FuncRecord.parse (927 of 1906)
PASS: lldb-unit :: Utility/./UtilityTests/StringListTest.InsertStringAtIndexOutOfBounds (928 of 1906)
PASS: lldb-shell :: Driver/TestNoUseColor.test (929 of 1906)
UNSUPPORTED: lldb-shell :: ObjectFile/PECOFF/disassemble-thumb.yaml (930 of 1906)
PASS: lldb-shell :: SymbolFile/DWARF/clang-ast-from-dwarf-objc-property.m (931 of 1906)
PASS: lldb-api :: functionalities/gdb_remote_client/TestStopPCs.py (932 of 1906)
UNSUPPORTED: lldb-shell :: SymbolFile/PDB/variables.test (933 of 1906)
UNSUPPORTED: lldb-api :: functionalities/darwin_log/basic/TestDarwinLogBasic.py (934 of 1906)
PASS: lldb-unit :: Utility/./UtilityTests/StringExtractorTest.GetNameColonValueContainsColon (935 of 1906)
PASS: lldb-unit :: Language/Highlighting/./HighlighterTests/HighlighterTest.ClangBraces (936 of 1906)
PASS: lldb-unit :: UnwindAssembly/x86/./UnwindAssemblyx86Tests/Testx86AssemblyInspectionEngine.TestPopEBP (937 of 1906)
PASS: lldb-unit :: Utility/./UtilityTests/StreamTest.PutBytesAsRawHex8ToMixedEndian (938 of 1906)
PASS: lldb-shell :: BuildScript/toolchain-clang.test (939 of 1906)
PASS: lldb-api :: lang/c/enum_types/TestEnumTypes.py (940 of 1906)
PASS: lldb-unit :: Process/minidump/./LLDBMinidumpTests/MinidumpParserTest.InvalidMinidump (941 of 1906)
PASS: lldb-unit :: Core/./LLDBCoreTests/UniqueCStringMap.NoDefaultConstructor (942 of 1906)
PASS: lldb-unit :: SymbolFile/DWARF/./SymbolFileDWARFTests/SymbolFileDWARFTests.TestAbbrevInvalidNULLTag (943 of 1906)
PASS: lldb-api :: types/TestLongTypes.py (944 of 1906)
PASS: lldb-unit :: UnwindAssembly/x86/./UnwindAssemblyx86Tests/Testx86AssemblyInspectionEngine.TestPopR14 (945 of 1906)
UNSUPPORTED: lldb-api :: functionalities/breakpoint/breakpoint_callback_command_source/TestBreakpointCallbackCommandSource.py (946 of 1906)
PASS: lldb-shell :: SymbolFile/DWARF/debug-types-basic.test (947 of 1906)
PASS: lldb-unit :: Symbol/./SymbolTests/SymbolsTest.TerminateLocateExecutableSymbolFileForUnknownExecutableAndUnknownSymbolFile (948 of 1906)
PASS: lldb-api :: macosx/universal/TestUniversal.py (949 of 1906)
PASS: lldb-unit :: Process/minidump/./LLDBMinidumpTests/MinidumpParserTest.GetThreadContext_x86_32_wow64 (950 of 1906)
PASS: lldb-unit :: ObjectFile/PECOFF/./ObjectFilePECOFFTests/PECallFrameInfoTest.Basic_eh (951 of 1906)
PASS: lldb-unit :: Symbol/./SymbolTests/TestClangASTContext.TestUnifyAccessSpecifiers (952 of 1906)
PASS: lldb-api :: python_api/formatters/TestFormattersSBAPI.py (953 of 1906)
PASS: lldb-unit :: Signals/./SignalsTests/UnixSignalsTest.VersionChange (954 of 1906)
PASS: lldb-unit :: Utility/./UtilityTests/StringExtractorTest.GetHexBytesAvail_OddPair (955 of 1906)
PASS: lldb-api :: commands/expression/import-std-module/list-basic/TestBasicList.py (956 of 1906)
PASS: lldb-unit :: Expression/./ExpressionTests/ClangExpressionDeclMapTest.TestPersistentDeclLookup (957 of 1906)
PASS: lldb-unit :: Core/./LLDBCoreTests/MangledTest.ResultForBlockInvocation (958 of 1906)
PASS: lldb-unit :: Utility/./UtilityTests/UriParserTest.BracketedHostname (959 of 1906)
PASS: lldb-unit :: Process/gdb-remote/./ProcessGdbRemoteTests/GDBRemoteCommunicationClientTest.SendGetTraceConfigPacket (960 of 1906)
PASS: lldb-shell :: ObjectFile/Breakpad/discontiguous-sections.test (961 of 1906)
PASS: lldb-api :: tools/lldb-vscode/stackTrace/TestVSCode_stackTrace.py (962 of 1906)
PASS: lldb-shell :: BuildScript/script-args.test (963 of 1906)
PASS: lldb-unit :: UnwindAssembly/x86/./UnwindAssemblyx86Tests/Testx86AssemblyInspectionEngine.Test32bitFramelessSmallStackFrame (964 of 1906)
PASS: lldb-api :: python_api/lldbutil/TestSwigVersion.py (965 of 1906)
PASS: lldb-unit :: ScriptInterpreter/Python/./ScriptInterpreterPythonTests/PythonDataObjectsTest.TestPythonDictionaryToStructuredDictionary (966 of 1906)
PASS: lldb-unit :: Utility/./UtilityTests/StringListTest.GetMaxStringLengthEqualSize (967 of 1906)
PASS: lldb-unit :: Utility/./UtilityTests/StreamTeeTest.Flush (968 of 1906)
PASS: lldb-unit :: Host/./HostTests/FileSystemTest.GetPermissions (969 of 1906)
PASS: lldb-unit :: Expression/./ExpressionTests/DiagnosticManagerTest.GetStringSeverityLabels (970 of 1906)
PASS: lldb-unit :: ScriptInterpreter/Python/./ScriptInterpreterPythonTests/PythonDataObjectsTest.TestBorrowedReferences (971 of 1906)
PASS: lldb-unit :: Utility/./UtilityTests/DataExtractorTest.GetCStrAtNullOffset (972 of 1906)
PASS: lldb-api :: functionalities/postmortem/minidump-new/TestMiniDumpNew.py (973 of 1906)
PASS: lldb-unit :: Symbol/./SymbolTests/LineEntryTest.GetSameLineContiguousAddressRangeOneInline (974 of 1906)
PASS: lldb-api :: commands/source/info/TestSourceInfo.py (975 of 1906)
PASS: lldb-api :: python_api/watchpoint/watchlocation/TestSetWatchlocation.py (976 of 1906)
PASS: lldb-api :: functionalities/thread/concurrent_events/TestConcurrentTwoBreakpointsOneDelaySignal.py (977 of 1906)
PASS: lldb-api :: python_api/symbol-context/TestSymbolContext.py (978 of 1906)
PASS: lldb-shell :: Quit/TestQuitExitCodeImplicit0.test (979 of 1906)
PASS: lldb-shell :: Settings/TestDisableColor.test (980 of 1906)
PASS: lldb-unit :: Language/CPlusPlus/./LanguageCPlusPlusTests/CPlusPlusLanguage.CPlusPlusNameParser (981 of 1906)
PASS: lldb-unit :: UnwindAssembly/x86/./UnwindAssemblyx86Tests/Testx86AssemblyInspectionEngine.Test32BitOnlyInstruction (982 of 1906)
PASS: lldb-api :: commands/expression/import-std-module/weak_ptr-dbg-info-content/TestDbgInfoContentWeakPtr.py (983 of 1906)
UNSUPPORTED: lldb-api :: functionalities/breakpoint/hardware_breakpoints/hardware_breakpoint_on_multiple_threads/TestHWBreakMultiThread.py (984 of 1906)
PASS: lldb-unit :: Utility/./UtilityTests/RangeTest.ContainsEndInclusive (985 of 1906)
PASS: lldb-api :: commands/statistics/basic/TestStats.py (986 of 1906)
PASS: lldb-unit :: Host/./HostTests/MainLoopTest.UnmonitoredSignal (987 of 1906)
PASS: lldb-api :: lang/cpp/dynamic-value/TestDynamicValue.py (988 of 1906)
PASS: lldb-api :: functionalities/data-formatter/synthcapping/TestSyntheticCapping.py (989 of 1906)
PASS: lldb-api :: functionalities/data-formatter/dump_dynamic/TestDumpDynamic.py (990 of 1906)
PASS: lldb-unit :: Utility/./UtilityTests/StringListTest.JoinThree (991 of 1906)
PASS: lldb-api :: functionalities/gdb_remote_client/TestThreadSelectionBug.py (992 of 1906)
PASS: lldb-unit :: Utility/./UtilityTests/StringLexerTest.NextIfList (993 of 1906)
PASS: lldb-api :: functionalities/data-formatter/data-formatter-stl/libcxx/tuple/TestDataFormatterLibcxxTuple.py (994 of 1906)
PASS: lldb-unit :: Utility/./UtilityTests/LogChannelTest.Enable (995 of 1906)
PASS: lldb-shell :: Settings/TestSettingsSet.test (996 of 1906)
PASS: lldb-api :: functionalities/data-formatter/data-formatter-advanced/TestDataFormatterAdv.py (997 of 1906)
PASS: lldb-unit :: UnwindAssembly/x86/./UnwindAssemblyx86Tests/Testx86AssemblyInspectionEngine.TestPushEBP (998 of 1906)
PASS: lldb-api :: commands/expression/import-std-module/vector-dbg-info-content/TestDbgInfoContentVector.py (999 of 1906)
PASS: lldb-unit :: Host/./HostTests/SocketTest.TCPListen0GetPort (1000 of 1906)
PASS: lldb-api :: commands/expression/vector_of_enums/TestVectorOfEnums.py (1001 of 1906)
PASS: lldb-api :: functionalities/inferior-changed/TestInferiorChanged.py (1002 of 1906)
PASS: lldb-unit :: SymbolFile/NativePDB/./SymbolFileNativePDBTests/PDBFPOProgramToDWARFExpressionTests.UnresolvedRegisterReference (1003 of 1906)
PASS: lldb-api :: functionalities/thread/concurrent_events/TestConcurrentSignalWatchBreak.py (1004 of 1906)
PASS: lldb-unit :: Utility/./UtilityTests/StatusTest.ErrorConversion (1005 of 1906)
UNSUPPORTED: lldb-api :: commands/register/register/intel_xtended_registers/TestMPXRegisters.py (1006 of 1906)
PASS: lldb-unit :: Language/Highlighting/./HighlighterTests/HighlighterTest.ClangTrailingBackslashBeforeNewline (1007 of 1906)
PASS: lldb-shell :: SymbolFile/NativePDB/break-by-line.cpp (1008 of 1906)
PASS: lldb-shell :: Settings/TestSettingsWrite.test (1009 of 1906)
PASS: lldb-unit :: UnwindAssembly/x86/./UnwindAssemblyx86Tests/Testx86AssemblyInspectionEngine.Test64bitFramelessBigStackFrame (1010 of 1906)
PASS: lldb-shell :: SymbolFile/DWARF/debug_rnglists.s (1011 of 1906)
PASS: lldb-unit :: Utility/./UtilityTests/AnsiTerminal.Empty (1012 of 1906)
PASS: lldb-api :: commands/help/TestHelp.py (1013 of 1906)
PASS: lldb-shell :: ObjectFile/ELF/PT_LOAD-overlap-section.yaml (1014 of 1906)
PASS: lldb-unit :: Utility/./UtilityTests/StringListTest.InsertStringAtIndexMove (1015 of 1906)
UNSUPPORTED: lldb-api :: commands/target/auto-install-main-executable/TestAutoInstallMainExecutable.py (1016 of 1906)
XFAIL: lldb-shell :: Register/x86-64-ymm-write.test (1017 of 1906)
PASS: lldb-unit :: Utility/./UtilityTests/StringListTest.CopyList (1018 of 1906)
PASS: lldb-unit :: debugserver/./debugserverTests/JSON.Parse (1019 of 1906)
PASS: lldb-api :: functionalities/data-formatter/stringprinter/TestStringPrinter.py (1020 of 1906)
PASS: lldb-shell :: ObjectFile/PECOFF/symbol.yaml (1021 of 1906)
PASS: lldb-unit :: Host/./HostTests/ProcessLaunchInfoTest.Constructor (1022 of 1906)
UNSUPPORTED: lldb-api :: terminal/TestEditline.py (1023 of 1906)
PASS: lldb-api :: functionalities/dead-strip/TestDeadStrip.py (1024 of 1906)
PASS: lldb-api :: commands/expression/persistent_types/TestPersistentTypes.py (1025 of 1906)
PASS: lldb-api :: functionalities/thread/concurrent_events/TestConcurrentTwoWatchpointsOneBreakpoint.py (1026 of 1906)
PASS: lldb-unit :: Utility/./UtilityTests/StreamTest.AddressSize (1027 of 1906)
PASS: lldb-api :: functionalities/archives/TestBSDArchives.py (1028 of 1906)
PASS: lldb-api :: lang/objc/objc++/TestObjCXX.py (1029 of 1906)
PASS: lldb-api :: lang/objc/objc-new-syntax/TestObjCNewSyntaxArray.py (1030 of 1906)
PASS: lldb-unit :: Expression/./ExpressionTests/DiagnosticManagerTest.AppendMessageSubsequentDiags (1031 of 1906)
PASS: lldb-unit :: Language/Highlighting/./HighlighterTests/HighlighterTest.ClangOperators (1032 of 1906)
PASS: lldb-api :: terminal/TestSTTYBeforeAndAfter.py (1033 of 1906)
UNSUPPORTED: lldb-api :: lang/objc/objc-dynamic-value/TestObjCDynamicValue.py (1034 of 1906)
PASS: lldb-api :: functionalities/breakpoint/consecutive_breakpoints/TestConsecutiveBreakpoints.py (1035 of 1906)
PASS: lldb-api :: functionalities/breakpoint/breakpoint_command/TestRegexpBreakCommand.py (1036 of 1906)
PASS: lldb-unit :: Utility/./UtilityTests/ReproducerTest.SetCapture (1037 of 1906)
PASS: lldb-shell :: Reproducer/Modules/TestModuleCXX.test (1038 of 1906)
UNSUPPORTED: lldb-api :: functionalities/tsan/basic/TestTsanBasic.py (1039 of 1906)
PASS: lldb-shell :: Settings/TestFrameFormatColor.test (1040 of 1906)
PASS: lldb-shell :: ScriptInterpreter/None/none.test (1041 of 1906)
PASS: lldb-unit :: Utility/./UtilityTests/BinaryStreamTest.PutULEB128TwoBytes (1042 of 1906)
PASS: lldb-unit :: Utility/./UtilityTests/StreamTest.AddressRangeInvalidRange (1043 of 1906)
PASS: lldb-api :: types/TestShortTypeExpr.py (1044 of 1906)
PASS: lldb-unit :: Process/gdb-remote/./ProcessGdbRemoteTests/GDBRemoteClientBaseTest.SendPacketAndReceiveResponseWithOutputSupport (1045 of 1906)
PASS: lldb-unit :: Host/./HostTests/SocketTest.UDPConnect (1046 of 1906)
PASS: lldb-unit :: Utility/./UtilityTests/StringListTest.SplitIntoLines (1047 of 1906)
PASS: lldb-api :: types/TestCharTypeExpr.py (1048 of 1906)
PASS: lldb-api :: lang/cpp/breakpoint-commands/TestCPPBreakpointCommands.py (1049 of 1906)
PASS: lldb-unit :: Utility/./UtilityTests/ScalarTest.GetValue (1050 of 1906)
PASS: lldb-api :: functionalities/breakpoint/breakpoint_locations/TestBreakpointLocations.py (1051 of 1906)
PASS: lldb-shell :: Reproducer/Functionalities/TestStepping.test (1052 of 1906)
PASS: lldb-api :: lang/cpp/class_types/TestClassTypes.py (1053 of 1906)
PASS: lldb-api :: tools/lldb-server/TestGdbRemoteProcessInfo.py (1054 of 1906)
PASS: lldb-api :: lang/cpp/char8_t/TestCxxChar8_t.py (1055 of 1906)
PASS: lldb-unit :: Expression/./ExpressionTests/DiagnosticManagerTest.FixedExpression (1056 of 1906)
PASS: lldb-api :: commands/expression/import-std-module/stack/TestStack.py (1057 of 1906)
PASS: lldb-unit :: Utility/./UtilityTests/StringListTest.AppendStringStdString (1058 of 1906)
PASS: lldb-api :: sample_test/TestSampleInlineTest.py (1059 of 1906)
PASS: lldb-unit :: ObjectFile/Breakpad/./ObjectFileBreakpadTests/FileRecord.parse (1060 of 1906)
PASS: lldb-unit :: Interpreter/./InterpreterTests/OptionArgParserTest.toScriptLanguage (1061 of 1906)
PASS: lldb-unit :: Utility/./UtilityTests/RecordReplayTest.InstrumentedFoo (1062 of 1906)
PASS: lldb-unit :: UnwindAssembly/x86/./UnwindAssemblyx86Tests/Testx86AssemblyInspectionEngine.TestPopR15 (1063 of 1906)
UNSUPPORTED: lldb-api :: functionalities/darwin_log/format/TestDarwinLogMessageFormat.py (1064 of 1906)
PASS: lldb-unit :: UnwindAssembly/x86/./UnwindAssemblyx86Tests/Testx86AssemblyInspectionEngine.TestSimple64bitFrameFunction (1065 of 1906)
PASS: lldb-unit :: Utility/./UtilityTests/Flags.Reset (1066 of 1906)
PASS: lldb-api :: functionalities/gdb_remote_client/TestNoWatchpointSupportInfo.py (1067 of 1906)
PASS: lldb-unit :: Symbol/./SymbolTests/TestClangASTContext.TestRecordHasFields (1068 of 1906)
PASS: lldb-api :: functionalities/gdb_remote_client/TestPlatformClient.py (1069 of 1906)
PASS: lldb-unit :: Process/minidump/./LLDBMinidumpTests/RegisterContextMinidump.ConvertMinidumpContext_x86_32 (1070 of 1906)
PASS: lldb-api :: python_api/watchpoint/TestSetWatchpoint.py (1071 of 1906)
PASS: lldb-shell :: ObjectFile/PECOFF/basic-info-arm64.yaml (1072 of 1906)
PASS: lldb-unit :: Utility/./UtilityTests/UriParserTest.MinimalPortPath (1073 of 1906)
PASS: lldb-unit :: Utility/./UtilityTests/FileSpecTest.Equal (1074 of 1906)
PASS: lldb-api :: functionalities/inferior-crashing/TestInferiorCrashingStep.py (1075 of 1906)
UNSUPPORTED: lldb-api :: functionalities/data-formatter/data-formatter-stl/libstdcpp/tuple/TestDataFormatterStdTuple.py (1076 of 1906)
PASS: lldb-api :: functionalities/signal/TestSendSignal.py (1077 of 1906)
PASS: lldb-api :: types/TestDoubleTypes.py (1078 of 1906)
PASS: lldb-api :: lang/objc/foundation/TestObjCMethodsString.py (1079 of 1906)
PASS: lldb-unit :: Process/gdb-remote/./ProcessGdbRemoteTests/GDBRemoteCommunicationServerTest.SendErrorResponse_ErrorList (1080 of 1906)
PASS: lldb-api :: commands/expression/persistent_ptr_update/TestPersistentPtrUpdate.py (1081 of 1906)
PASS: lldb-unit :: Utility/./UtilityTests/IndexToObjectTest.ObjectForIndex (1082 of 1906)
PASS: lldb-api :: commands/reproducer/invalid-args/TestInvalidArgsReproducer.py (1083 of 1906)
PASS: lldb-api :: functionalities/data-formatter/data-formatter-synthtype/TestDataFormatterSynthType.py (1084 of 1906)
PASS: lldb-unit :: Utility/./UtilityTests/UriParserTest.SchemeHostSeparator4 (1085 of 1906)
PASS: lldb-unit :: Host/./HostTests/NativeProcessProtocolTest.ReadMemoryWithoutTrap (1086 of 1906)
PASS: lldb-unit :: Utility/./UtilityTests/StringListTest.LongestCommonPrefixNoPrefix (1087 of 1906)
PASS: lldb-api :: functionalities/recursion/TestValueObjectRecursion.py (1088 of 1906)
PASS: lldb-unit :: Process/minidump/./LLDBMinidumpTests/MinidumpParserTest.GetExceptionStream (1089 of 1906)
PASS: lldb-api :: functionalities/breakpoint/address_breakpoints/TestAddressBreakpoints.py (1090 of 1906)
PASS: lldb-shell :: ObjectFile/ELF/PT_LOAD-overlap-PT_TLS.yaml (1091 of 1906)
PASS: lldb-api :: functionalities/tail_call_frames/cross_object/TestCrossObjectTailCalls.py (1092 of 1906)
PASS: lldb-shell :: SymbolFile/NativePDB/function-types-builtins.cpp (1093 of 1906)
PASS: lldb-unit :: Utility/./UtilityTests/UUIDTest.SetFromStringRef (1094 of 1906)
PASS: lldb-shell :: Commands/command-backtrace.test (1095 of 1906)
PASS: lldb-api :: lang/cpp/symbols/TestSymbols.py (1096 of 1906)
PASS: lldb-shell :: SymbolFile/DWARF/anon_class_w_and_wo_export_symbols.ll (1097 of 1906)
UNSUPPORTED: lldb-api :: functionalities/darwin_log/filter/exact_match/activity-chain/TestDarwinLogFilterMatchActivityChain.py (1098 of 1906)
PASS: lldb-unit :: ScriptInterpreter/Python/./ScriptInterpreterPythonTests/PythonDataObjectsTest.TestOwnedReferences (1099 of 1906)
PASS: lldb-api :: types/TestFloatTypesExpr.py (1100 of 1906)
PASS: lldb-unit :: Language/CPlusPlus/./LanguageCPlusPlusTests/CPlusPlusLanguage.ExtractContextAndIdentifier (1101 of 1906)
PASS: lldb-api :: lang/objc/objc-ivar-protocols/TestIvarProtocols.py (1102 of 1906)
PASS: lldb-api :: lang/objcxx/class-name-clash/TestNameClash.py (1103 of 1906)
PASS: lldb-unit :: Utility/./UtilityTests/AnsiTerminal.WhiteSpace (1104 of 1906)
UNSUPPORTED: lldb-shell :: ScriptInterpreter/Lua/persistent_state.test (1105 of 1906)
PASS: lldb-api :: functionalities/conditional_break/TestConditionalBreak.py (1106 of 1906)
PASS: lldb-shell :: Expr/TestTypeOfDeclTypeExpr.test (1107 of 1906)
PASS: lldb-unit :: Utility/./UtilityTests/StringExtractorTest.GetHexU8_Exact_NoEof (1108 of 1906)
PASS: lldb-unit :: Process/gdb-remote/./ProcessGdbRemoteTests/GDBRemoteCommunicationClientTest.GetMemoryRegionInfoInvalidResponse (1109 of 1906)
PASS: lldb-api :: python_api/function_symbol/TestDisasmAPI.py (1110 of 1906)
PASS: lldb-unit :: Host/./HostTests/SocketTest.UDPGetConnectURI (1111 of 1906)
UNSUPPORTED: lldb-api :: commands/watchpoints/multi_watchpoint_slots/TestWatchpointMultipleSlots.py (1112 of 1906)
PASS: lldb-api :: functionalities/thread/concurrent_events/TestConcurrentWatchpointDelayWatchpointOneBreakpoint.py (1113 of 1906)
UNSUPPORTED: lldb-api :: lang/objc/foundation/TestFoundationDisassembly.py (1114 of 1906)
PASS: lldb-api :: commands/apropos/with-process/TestAproposWithProcess.py (1115 of 1906)
PASS: lldb-api :: lang/c/set_values/TestSetValues.py (1116 of 1906)
PASS: lldb-shell :: ScriptInterpreter/Python/scripted_breakpoint.test (1117 of 1906)
PASS: lldb-unit :: UnwindAssembly/x86/./UnwindAssemblyx86Tests/Testx86AssemblyInspectionEngine.TestPopR13 (1118 of 1906)
PASS: lldb-shell :: Quit/TestQuitExitCode-30.test (1119 of 1906)
PASS: lldb-unit :: Utility/./UtilityTests/StringListTest.GetMaxStringLengthDecreasingSize (1120 of 1906)
PASS: lldb-unit :: Language/Highlighting/./HighlighterTests/HighlighterTest.ClangTrailingBackslashMissingNewLine (1121 of 1906)
PASS: lldb-shell :: BuildScript/modes.test (1122 of 1906)
PASS: lldb-api :: commands/expression/anonymous-struct/TestCallUserAnonTypedef.py (1123 of 1906)
PASS: lldb-api :: functionalities/data-formatter/data-formatter-proper-plurals/TestFormattersOneIsSingular.py (1124 of 1906)
PASS: lldb-api :: functionalities/testid/TestTestId.py (1125 of 1906)
PASS: lldb-api :: lang/mixed/TestMixedLanguages.py (1126 of 1906)
PASS: lldb-api :: functionalities/breakpoint/breakpoint_command/TestBreakpointCommandsFromPython.py (1127 of 1906)
PASS: lldb-api :: commands/expression/import-std-module/deque-basic/TestBasicDeque.py (1128 of 1906)
PASS: lldb-api :: commands/platform/process/TestProcessList.py (1129 of 1906)
PASS: lldb-unit :: Utility/./UtilityTests/StreamTeeTest.GetStreamAtIndexOutOfBounds (1130 of 1906)
PASS: lldb-api :: lang/cpp/unsigned_types/TestUnsignedTypes.py (1131 of 1906)
PASS: lldb-api :: functionalities/data-formatter/data-formatter-globals/TestDataFormatterGlobals.py (1132 of 1906)
PASS: lldb-api :: python_api/watchpoint/condition/TestWatchpointConditionAPI.py (1133 of 1906)
UNSUPPORTED: lldb-shell :: ObjectFile/ELF/minidebuginfo-no-lzma.yaml (1134 of 1906)
UNSUPPORTED: lldb-api :: functionalities/data-formatter/data-formatter-stl/libstdcpp/string/TestDataFormatterStdString.py (1135 of 1906)
UNSUPPORTED: lldb-api :: functionalities/darwin_log/filter/regex/message/TestDarwinLogFilterRegexMessage.py (1136 of 1906)
PASS: lldb-api :: commands/expression/import-std-module/no-std-module/TestMissingStdModule.py (1137 of 1906)
PASS: lldb-api :: functionalities/thread/concurrent_events/TestConcurrentWatchBreak.py (1138 of 1906)
PASS: lldb-api :: lang/cpp/accelerator-table/TestCPPAccelerator.py (1139 of 1906)
UNSUPPORTED: lldb-shell :: Register/arm-gp-read.test (1140 of 1906)
UNSUPPORTED: lldb-shell :: SymbolFile/PDB/ast-restore.test (1141 of 1906)
PASS: lldb-unit :: Process/gdb-remote/./ProcessGdbRemoteTests/GDBRemoteCommunicationClientTest.SendSignalsToIgnore (1142 of 1906)
PASS: lldb-api :: tools/lldb-server/TestAppleSimulatorOSType.py (1143 of 1906)
PASS: lldb-unit :: Utility/./UtilityTests/StatusTest.Formatv (1144 of 1906)
PASS: lldb-shell :: SymbolFile/NativePDB/ast-methods.cpp (1145 of 1906)
PASS: lldb-api :: functionalities/history/TestHistoryRecall.py (1146 of 1906)
UNSUPPORTED: lldb-shell :: SymbolFile/PDB/function-nested-block.test (1147 of 1906)
PASS: lldb-unit :: Utility/./UtilityTests/StringLexerTest.Next (1148 of 1906)
PASS: lldb-unit :: Utility/./UtilityTests/UUIDTest.Validity (1149 of 1906)
PASS: lldb-unit :: Utility/./UtilityTests/StringListTest.LongestCommonPrefix (1150 of 1906)
PASS: lldb-shell :: Reproducer/TestCaptureEnvOverride.test (1151 of 1906)
PASS: lldb-shell :: Expr/TestMultilineExpr.test (1152 of 1906)
PASS: lldb-unit :: ObjectFile/ELF/./ObjectFileELFTests/ObjectFileELFTest.GetModuleSpecifications_EarlySectionHeaders (1153 of 1906)
PASS: lldb-shell :: Minidump/memory-region-from-module.yaml (1154 of 1906)
PASS: lldb-shell :: SymbolFile/DWARF/split-dwarf-multiple-cu.ll (1155 of 1906)
PASS: lldb-api :: types/TestIntegerTypeExpr.py (1156 of 1906)
PASS: lldb-shell :: ObjectFile/Breakpad/uuid-matching-mac.test (1157 of 1906)
PASS: lldb-unit :: Utility/./UtilityTests/BroadcasterTest.BroadcastEvent (1158 of 1906)
PASS: lldb-shell :: ObjectFile/ELF/PT_LOAD-empty.yaml (1159 of 1906)
PASS: lldb-api :: lang/objc/conflicting-definition/TestConflictingDefinition.py (1160 of 1906)
PASS: lldb-shell :: Reproducer/TestCrash.test (1161 of 1906)
PASS: lldb-api :: functionalities/breakpoint/breakpoint_options/TestBreakpointOptions.py (1162 of 1906)
PASS: lldb-api :: python_api/interpreter/TestCommandInterpreterAPI.py (1163 of 1906)
PASS: lldb-unit :: Process/minidump/./LLDBMinidumpTests/MinidumpParserTest.GetLinuxProcStatus_no_stream (1164 of 1906)
UNSUPPORTED: lldb-api :: functionalities/darwin_log/filter/exact_match/category/TestDarwinLogFilterMatchCategory.py (1165 of 1906)
PASS: lldb-unit :: Host/./HostTests/SocketTest.TCPListen0ConnectAccept (1166 of 1906)
UNSUPPORTED: lldb-api :: functionalities/tsan/multiple/TestTsanMultiple.py (1167 of 1906)
PASS: lldb-unit :: UnwindAssembly/x86/./UnwindAssemblyx86Tests/Testx86AssemblyInspectionEngine.TestReturnDetect (1168 of 1906)
PASS: lldb-api :: lang/objc/real-definition/TestRealDefinition.py (1169 of 1906)
PASS: lldb-unit :: Host/./HostTests/ConnectionFileDescriptorTest.TCPGetURIv4 (1170 of 1906)
PASS: lldb-shell :: Reproducer/TestWorkingDir.test (1171 of 1906)
PASS: lldb-api :: python_api/objc_type/TestObjCType.py (1172 of 1906)
PASS: lldb-unit :: Utility/./UtilityTests/ReproducerTest.SetReplay (1173 of 1906)
PASS: lldb-unit :: Target/./TargetTests/ExecutionContextTest.GetByteOrder (1174 of 1906)
PASS: lldb-api :: lang/objc/objc-foundation-dictionary-empty/TestNSDictionary0.py (1175 of 1906)
PASS: lldb-unit :: Utility/./UtilityTests/UriParserTest.LongPath (1176 of 1906)
PASS: lldb-api :: functionalities/thread/backtrace_limit/TestBacktraceLimit.py (1177 of 1906)
PASS: lldb-shell :: Driver/TestCore.test (1178 of 1906)
PASS: lldb-api :: lang/c/vla/TestVLA.py (1179 of 1906)
PASS: lldb-unit :: Utility/./UtilityTests/StreamTeeTest.AppendStream (1180 of 1906)
PASS: lldb-unit :: Host/./HostTests/NativeProcessProtocolTest.SetBreakpointFailRead (1181 of 1906)
PASS: lldb-unit :: Utility/./UtilityTests/FileSpecTest.Match (1182 of 1906)
UNSUPPORTED: lldb-api :: commands/register/register/intel_xtended_registers/mpx_offset_intersection/TestMPXOffsetIntersection.py (1183 of 1906)
PASS: lldb-unit :: UnwindAssembly/x86/./UnwindAssemblyx86Tests/Testx86AssemblyInspectionEngine.TestPushR13 (1184 of 1906)
PASS: lldb-shell :: ObjectFile/PECOFF/basic-info-arm.yaml (1185 of 1906)
PASS: lldb-unit :: Host/./HostTests/SocketTest.DecodeHostAndPort (1186 of 1906)
PASS: lldb-api :: lang/objc/modules-hash-mismatch/TestClangModulesHashMismatch.py (1187 of 1906)
PASS: lldb-shell :: SymbolFile/NativePDB/break-by-function.cpp (1188 of 1906)
PASS: lldb-unit :: Language/Highlighting/./HighlighterTests/HighlighterTest.ClangSquareBrackets (1189 of 1906)
PASS: lldb-api :: lang/objc/self/TestObjCSelf.py (1190 of 1906)
PASS: lldb-unit :: ScriptInterpreter/Python/./ScriptInterpreterPythonTests/PythonDataObjectsTest.TestPythonListManipulation (1191 of 1906)
PASS: lldb-shell :: ObjectFile/ELF/section-overlap.yaml (1192 of 1906)
PASS: lldb-api :: lang/c/find_struct_type/TestFindStructTypes.py (1193 of 1906)
PASS: lldb-unit :: Utility/./UtilityTests/UriParserTest.Minimal (1194 of 1906)
PASS: lldb-shell :: ObjectFile/MachO/lc_build_version.yaml (1195 of 1906)
PASS: lldb-unit :: Editline/./EditlineTests/EditlineTestFixture.EditlineReceivesMultiLineText (1196 of 1906)
PASS: lldb-unit :: Process/minidump/./LLDBMinidumpTests/MinidumpParserTest.GetPid (1197 of 1906)
UNSUPPORTED: lldb-api :: functionalities/signal/handle-segv/TestHandleSegv.py (1198 of 1906)
PASS: lldb-unit :: Utility/./UtilityTests/FileSpecTest.FileAndDirectoryComponents (1199 of 1906)
PASS: lldb-shell :: ObjectFile/ELF/minidebuginfo-find-symbols.yaml (1200 of 1906)
UNSUPPORTED: lldb-shell :: Register/x86-ymm-write.test (1201 of 1906)
PASS: lldb-unit :: Utility/./UtilityTests/NameMatchesTest.Ignore (1202 of 1906)
PASS: lldb-shell :: ScriptInterpreter/Python/crashlog.test (1203 of 1906)
UNSUPPORTED: lldb-api :: functionalities/data-formatter/data-formatter-stl/libstdcpp/map/TestDataFormatterStdMap.py (1204 of 1906)
PASS: lldb-api :: functionalities/breakpoint/auto_continue/TestBreakpointAutoContinue.py (1205 of 1906)
PASS: lldb-unit :: Host/./HostTests/SocketTest.DomainGetConnectURI (1206 of 1906)
PASS: lldb-api :: commands/expression/inline-namespace/TestInlineNamespace.py (1207 of 1906)
PASS: lldb-api :: commands/expression/import-std-module/unique_ptr-dbg-info-content/TestUniquePtrDbgInfoContent.py (1208 of 1906)
UNSUPPORTED: lldb-shell :: SymbolFile/PDB/vbases.test (1209 of 1906)
PASS: lldb-unit :: Symbol/./SymbolTests/TestClangASTContext.TestFunctionTemplateConstruction (1210 of 1906)
PASS: lldb-api :: lang/cpp/template/TestTemplateArgs.py (1211 of 1906)
UNSUPPORTED: lldb-shell :: Watchpoint/netbsd-nouserdbregs.test (1212 of 1906)
PASS: lldb-unit :: Expression/./ExpressionTests/DiagnosticManagerTest.GetStringMultiline (1213 of 1906)
PASS: lldb-shell :: SymbolFile/NativePDB/ast-functions.cpp (1214 of 1906)
PASS: lldb-unit :: Process/minidump/./LLDBMinidumpTests/MinidumpParserTest.GetMemoryRegionInfoLinuxMaps (1215 of 1906)
PASS: lldb-shell :: SymbolFile/DWARF/parallel-indexing-stress.s (1216 of 1906)
PASS: lldb-api :: commands/expression/import-std-module/forward_list-basic/TestBasicForwardList.py (1217 of 1906)
PASS: lldb-api :: functionalities/data-formatter/data-formatter-objc/TestDataFormatterObjCNSBundle.py (1218 of 1906)
PASS: lldb-api :: lang/c/conflicting-symbol/TestConflictingSymbol.py (1219 of 1906)
PASS: lldb-unit :: Process/minidump/./LLDBMinidumpTests/MinidumpParserTest.GetArchitecture (1220 of 1906)
PASS: lldb-shell :: Host/TestCustomShell.test (1221 of 1906)
PASS: lldb-unit :: Utility/./UtilityTests/ArgsTest.ReplaceArgumentAtIndexOutOfRange (1222 of 1906)
PASS: lldb-unit :: Process/gdb-remote/./ProcessGdbRemoteTests/GDBRemoteCommunicationTest.ReadPacket_checksum (1223 of 1906)
PASS: lldb-shell :: SymbolFile/Breakpad/line-table-missing-file.test (1224 of 1906)
PASS: lldb-unit :: Process/gdb-remote/./ProcessGdbRemoteTests/GDBRemoteClientBaseTest.SendContinueAndInterrupt2PacketBug (1225 of 1906)
PASS: lldb-unit :: Expression/./ExpressionTests/CppModuleConfigurationTest.LinuxLocalLibCpp (1226 of 1906)
PASS: lldb-shell :: Unwind/eh-frame-dwarf-unwind.test (1227 of 1906)
PASS: lldb-unit :: Host/./HostTests/NativeProcessProtocolTest.ReadCStringFromMemory_MaxSize (1228 of 1906)
PASS: lldb-api :: lang/cpp/virtual/TestVirtual.py (1229 of 1906)
PASS: lldb-shell :: SymbolFile/DWARF/debug-types-signature-loop.s (1230 of 1906)
PASS: lldb-api :: python_api/debugger/TestDebuggerAPI.py (1231 of 1906)
PASS: lldb-api :: lang/c/shared_lib_stripped_symbols/TestSharedLibStrippedSymbols.py (1232 of 1906)
PASS: lldb-unit :: ObjectFile/Breakpad/./ObjectFileBreakpadTests/InfoRecord.parse (1233 of 1906)
PASS: lldb-api :: tools/lldb-server/commandline/TestStubSetSID.py (1234 of 1906)
PASS: lldb-api :: commands/expression/unwind_expression/TestUnwindExpression.py (1235 of 1906)
PASS: lldb-api :: functionalities/breakpoint/breakpoint_hit_count/TestBreakpointHitCount.py (1236 of 1906)
PASS: lldb-unit :: Utility/./UtilityTests/StringListTest.ShiftMove (1237 of 1906)
PASS: lldb-unit :: Symbol/./SymbolTests/TestClangASTContext.TestGetBasicTypeFromName (1238 of 1906)
PASS: lldb-unit :: ScriptInterpreter/Python/./ScriptInterpreterPythonTests/PythonDataObjectsTest.TestCallable (1239 of 1906)
PASS: lldb-unit :: Process/minidump/./LLDBMinidumpTests/MinidumpParserTest.MinidumpModuleOrder (1240 of 1906)
PASS: lldb-unit :: Utility/./UtilityTests/TimerTest.CategoryTimes2 (1241 of 1906)
PASS: lldb-unit :: Host/./HostTests/FileSystemTest.EnumerateDirectory (1242 of 1906)
PASS: lldb-unit :: Symbol/./SymbolTests/DWARFCallFrameInfoTest.Basic_dwarf3 (1243 of 1906)
PASS: lldb-api :: lang/cpp/incomplete-types/TestCppIncompleteTypes.py (1244 of 1906)
PASS: lldb-unit :: Utility/./UtilityTests/CompletionRequest.TryCompleteCurrentArgMode (1245 of 1906)
PASS: lldb-api :: functionalities/thread/concurrent_events/TestConcurrentSignalWatch.py (1246 of 1906)
PASS: lldb-api :: functionalities/data-formatter/parray/TestPrintArray.py (1247 of 1906)
PASS: lldb-api :: lang/cpp/type_lookup/TestCppTypeLookup.py (1248 of 1906)
UNSUPPORTED: lldb-shell :: SymbolFile/PDB/calling-conventions.test (1249 of 1906)
PASS: lldb-unit :: Process/minidump/./LLDBMinidumpTests/MinidumpParserTest.GetMemoryRegionInfoFromMemoryList (1250 of 1906)
PASS: lldb-api :: functionalities/data-formatter/nssetsynth/TestNSSetSynthetic.py (1251 of 1906)
PASS: lldb-unit :: UnwindAssembly/x86/./UnwindAssemblyx86Tests/Testx86AssemblyInspectionEngine.TestMovRSPtoRBP (1252 of 1906)
PASS: lldb-api :: functionalities/postmortem/wow64_minidump/TestWow64MiniDump.py (1253 of 1906)
PASS: lldb-api :: commands/expression/context-object/TestContextObject.py (1254 of 1906)
PASS: lldb-api :: lang/cpp/scope/TestCppScope.py (1255 of 1906)
PASS: lldb-unit :: Utility/./UtilityTests/RangeDataVector.FindEntryThatContains (1256 of 1906)
PASS: lldb-shell :: SymbolFile/DWARF/find-function-regex.cpp (1257 of 1906)
PASS: lldb-unit :: Expression/./ExpressionTests/ClangExpressionDeclMapTest.TestUnknownIdentifierLookup (1258 of 1906)
PASS: lldb-unit :: Expression/./ExpressionTests/CppModuleConfigurationTest.UnrelatedLibrary (1259 of 1906)
PASS: lldb-unit :: Core/./LLDBCoreTests/RichManglingContextTest.FromCxxMethodName (1260 of 1906)
PASS: lldb-unit :: Process/minidump/./LLDBMinidumpTests/MinidumpParserTest.GetPidWindows (1261 of 1906)
PASS: lldb-unit :: Utility/./UtilityTests/StreamTest.PutPtr (1262 of 1906)
PASS: lldb-unit :: Utility/./UtilityTests/ScalarTest.SetValueFromCString (1263 of 1906)
PASS: lldb-unit :: Utility/./UtilityTests/EnvironmentTest.EnvpConversion (1264 of 1906)
UNSUPPORTED: lldb-api :: functionalities/thread/multi_break/TestMultipleBreakpoints.py (1265 of 1906)
PASS: lldb-shell :: Breakpoint/case-sensitive.test (1266 of 1906)
PASS: lldb-unit :: UnwindAssembly/x86/./UnwindAssemblyx86Tests/Testx86AssemblyInspectionEngine.TestPopEBX (1267 of 1906)
PASS: lldb-unit :: Utility/./UtilityTests/StringListTest.InsertStringAtIndexStdString (1268 of 1906)
UNSUPPORTED: lldb-shell :: Breakpoint/case-insensitive.test (1269 of 1906)
PASS: lldb-unit :: Process/gdb-remote/./ProcessGdbRemoteTests/GDBRemoteCommunicationClientTest.GetMemoryRegionInfo (1270 of 1906)
UNSUPPORTED: lldb-api :: benchmarks/expression/TestExpressionCmd.py (1271 of 1906)
PASS: lldb-api :: commands/platform/basic/TestPlatformCommand.py (1272 of 1906)
PASS: lldb-unit :: Utility/./UtilityTests/StreamTest.PutCharNull (1273 of 1906)
PASS: lldb-unit :: Process/gdb-remote/./ProcessGdbRemoteTests/GDBRemoteClientBaseTest.SendContinueDelegateInterface (1274 of 1906)
PASS: lldb-unit :: Utility/./UtilityTests/RegularExpression.Invalid (1275 of 1906)
PASS: lldb-unit :: Symbol/./SymbolTests/TestClangASTContext.TemplateArguments (1276 of 1906)
PASS: lldb-api :: types/TestFloatTypes.py (1277 of 1906)
PASS: lldb-unit :: Utility/./UtilityTests/OptionsWithRawTest.EmptySuffix (1278 of 1906)
UNSUPPORTED: lldb-shell :: SymbolFile/PDB/function-level-linking.test (1279 of 1906)
PASS: lldb-unit :: Utility/./UtilityTests/UserIDResolver.GetGroupName (1280 of 1906)
PASS: lldb-unit :: Utility/./UtilityTests/BinaryStreamTest.PutULEB128OneByte (1281 of 1906)
UNSUPPORTED: lldb-api :: functionalities/process_save_core/TestProcessSaveCore.py (1282 of 1906)
PASS: lldb-api :: functionalities/breakpoint/breakpoint_language/TestBreakpointLanguage.py (1283 of 1906)
PASS: lldb-unit :: Utility/./UtilityTests/SubsystemRAIITest.SubsystemWithErrorSuccess (1284 of 1906)
PASS: lldb-api :: lang/objc/objc-optimized/TestObjcOptimized.py (1285 of 1906)
PASS: lldb-shell :: Quit/TestQuitExitCodeHexA.test (1286 of 1906)
PASS: lldb-api :: lang/c/anonymous/TestAnonymous.py (1287 of 1906)
PASS: lldb-api :: lang/objc/forward-decl/TestForwardDecl.py (1288 of 1906)
PASS: lldb-unit :: Utility/./UtilityTests/FileSpecTest.CopyByAppendingPathComponent (1289 of 1906)
PASS: lldb-unit :: Utility/./UtilityTests/StringExtractorTest.GetHexBytes_Partial (1290 of 1906)
UNSUPPORTED: lldb-api :: lang/cpp/function-template-parameter-pack/TestFunctionTemplateParameterPack.py (1291 of 1906)
UNSUPPORTED: lldb-api :: commands/watchpoints/hello_watchlocation/TestWatchLocation.py (1292 of 1906)
PASS: lldb-api :: commands/disassemble/basic/TestFrameDisassemble.py (1293 of 1906)
PASS: lldb-api :: functionalities/thread/concurrent_events/TestConcurrentDelaySignalWatch.py (1294 of 1906)
PASS: lldb-unit :: Symbol/./SymbolTests/DWARFCallFrameInfoTest.Basic_dwarf4 (1295 of 1906)
PASS: lldb-unit :: Host/./HostTests/FileSystemTest.MakeAbsolute (1296 of 1906)
PASS: lldb-shell :: Driver/TestConvenienceVariables.test (1297 of 1906)
PASS: lldb-api :: commands/target/create-deps/TestTargetCreateDeps.py (1298 of 1906)
PASS: lldb-api :: functionalities/process_group/TestChangeProcessGroup.py (1299 of 1906)
PASS: lldb-unit :: Host/./HostTests/SocketTest.TCPGetConnectURI (1300 of 1906)
PASS: lldb-api :: api/check_public_api_headers/TestPublicAPIHeaders.py (1301 of 1906)
PASS: lldb-unit :: Expression/./ExpressionTests/DiagnosticManagerTest.GetStringPreserveOrder (1302 of 1906)
PASS: lldb-unit :: Language/Highlighting/./HighlighterTests/HighlighterTest.ClangCursorPosAfterOtherToken (1303 of 1906)
UNSUPPORTED: lldb-shell :: Register/x86-zmm-read.test (1304 of 1906)
PASS: lldb-api :: functionalities/data-formatter/data-formatter-objc/TestDataFormatterObjCNSError.py (1305 of 1906)
PASS: lldb-unit :: Language/Highlighting/./HighlighterTests/HighlighterTest.DefaultHighlighterWithCursor (1306 of 1906)
UNSUPPORTED: lldb-shell :: SymbolFile/DWARF/debug-types-expressions.test (1307 of 1906)
PASS: lldb-api :: functionalities/data-formatter/data-formatter-smart-array/TestDataFormatterSmartArray.py (1308 of 1906)
PASS: lldb-api :: commands/register/register/register_command/TestRegisters.py (1309 of 1906)
PASS: lldb-unit :: Utility/./UtilityTests/AnsiTerminal.AtEnd (1310 of 1906)
PASS: lldb-unit :: Language/Highlighting/./HighlighterTests/HighlighterTest.FallbackHighlighter (1311 of 1906)
PASS: lldb-api :: commands/watchpoints/watchpoint_events/TestWatchpointEvents.py (1312 of 1906)
PASS: lldb-api :: commands/expression/two-files/TestObjCTypeQueryFromOtherCompileUnit.py (1313 of 1906)
PASS: lldb-unit :: Symbol/./SymbolTests/TestClangASTContext.TestConvertAccessTypeToAccessSpecifier (1314 of 1906)
PASS: lldb-unit :: Utility/./UtilityTests/RecordReplayTest.InstrumentedBarRef (1315 of 1906)
PASS: lldb-api :: lang/objc/objc-stepping/TestObjCStepping.py (1316 of 1906)
PASS: lldb-api :: lang/objc/objc-runtime-ivars/TestRuntimeIvars.py (1317 of 1906)
PASS: lldb-unit :: UnwindAssembly/x86/./UnwindAssemblyx86Tests/Testx86AssemblyInspectionEngine.TestPushESI (1318 of 1906)
PASS: lldb-unit :: Symbol/./SymbolTests/TestClangASTImporter.CanImportInvalidType (1319 of 1906)
PASS: lldb-unit :: Utility/./UtilityTests/ScalarTest.GetBytes (1320 of 1906)
PASS: lldb-api :: lang/c/unicode/TestUnicodeSymbols.py (1321 of 1906)
PASS: lldb-unit :: Utility/./UtilityTests/ArchSpecTest.MergeFromMachOUnknown (1322 of 1906)
PASS: lldb-api :: commands/settings/quoting/TestQuoting.py (1323 of 1906)
PASS: lldb-unit :: Utility/./UtilityTests/RangeDataVector.FindEntryThatContains_Overlap (1324 of 1906)
PASS: lldb-api :: functionalities/thread/step_out/TestThreadStepOut.py (1325 of 1906)
PASS: lldb-unit :: ScriptInterpreter/Python/./ScriptInterpreterPythonTests/PythonDataObjectsTest.TestPythonBytes (1326 of 1906)
PASS: lldb-shell :: SymbolFile/DWARF/dwarf5_locations.s (1327 of 1906)
PASS: lldb-api :: commands/target/basic/TestTargetCommand.py (1328 of 1906)
PASS: lldb-unit :: Symbol/./SymbolTests/TestClangASTContext.TestGetBasicTypeFromEnum (1329 of 1906)
PASS: lldb-shell :: Breakpoint/split-dwarf5-debug-stroffsets.test (1330 of 1906)
PASS: lldb-api :: commands/expression/import-std-module/shared_ptr/TestSharedPtr.py (1331 of 1906)
PASS: lldb-api :: functionalities/multiword-commands/TestMultiWordCommands.py (1332 of 1906)
PASS: lldb-unit :: Utility/./UtilityTests/GeneratorTest.Create (1333 of 1906)
PASS: lldb-api :: python_api/watchpoint/watchlocation/TestTargetWatchAddress.py (1334 of 1906)
PASS: lldb-api :: commands/watchpoints/step_over_watchpoint/TestStepOverWatchpoint.py (1335 of 1906)
PASS: lldb-unit :: Host/./HostTests/FileSystemTest.Readable (1336 of 1906)
PASS: lldb-api :: functionalities/gdb_remote_client/TestNestedRegDefinitions.py (1337 of 1906)
PASS: lldb-api :: api/listeners/TestListener.py (1338 of 1906)
UNSUPPORTED: lldb-shell :: Register/x86-ymm-read.test (1339 of 1906)
PASS: lldb-unit :: Host/./HostTests/HostInfoTest.GetHostname (1340 of 1906)
PASS: lldb-unit :: Target/./TargetTests/PathMappingListTest.AbsoluteTests (1341 of 1906)
PASS: lldb-unit :: Host/./HostTests/File.GetWaitableHandleFileno (1342 of 1906)
PASS: lldb-unit :: Utility/./UtilityTests/VMRange.Clear (1343 of 1906)
PASS: lldb-unit :: Target/./TargetTests/PathMappingListTest.RemapRoot (1344 of 1906)
PASS: lldb-unit :: Utility/./UtilityTests/BinaryStreamTest.PutULEB128FiveBytes (1345 of 1906)
PASS: lldb-api :: functionalities/data-formatter/data-formatter-stl/libcxx/bitset/TestDataFormatterLibcxxBitset.py (1346 of 1906)
PASS: lldb-unit :: Utility/./UtilityTests/Predicate.WaitForValueNotEqualTo (1347 of 1906)
PASS: lldb-unit :: ScriptInterpreter/Python/./ScriptInterpreterPythonTests/PythonDataObjectsTest.TestPythonListValueEquality (1348 of 1906)
PASS: lldb-api :: lang/objc/objc-dyn-sbtype/TestObjCDynamicSBType.py (1349 of 1906)
PASS: lldb-shell :: Heap/heap-cstr.test (1350 of 1906)
PASS: lldb-api :: lang/objc/objc-static-method-stripped/TestObjCStaticMethodStripped.py (1351 of 1906)
PASS: lldb-unit :: SymbolFile/NativePDB/./SymbolFileNativePDBTests/PDBFPOProgramToDWARFExpressionTests.MultipleDependentAssignments (1352 of 1906)
UNSUPPORTED: lldb-api :: tools/lldb-server/thread-name/TestGdbRemoteThreadName.py (1353 of 1906)
PASS: lldb-unit :: Utility/./UtilityTests/StreamTest.PutHex32ByteOrderLittle (1354 of 1906)
PASS: lldb-api :: commands/frame/diagnose/virtual-method-call/TestDiagnoseDereferenceVirtualMethodCall.py (1355 of 1906)
PASS: lldb-shell :: Commands/command-regex-unalias.test (1356 of 1906)
PASS: lldb-unit :: Utility/./UtilityTests/SerializationRountripTest.SerializeDeserializeObjectPointer (1357 of 1906)
PASS: lldb-unit :: Utility/./UtilityTests/StreamTest.PutBytesAsRawHex8ToBigEndian (1358 of 1906)
UNSUPPORTED: lldb-shell :: SymbolFile/PDB/type-quals.test (1359 of 1906)
PASS: lldb-unit :: ScriptInterpreter/Python/./ScriptInterpreterPythonTests/PythonDataObjectsTest.TestPythonFile (1360 of 1906)
PASS: lldb-api :: commands/expression/xvalue/TestXValuePrinting.py (1361 of 1906)
PASS: lldb-unit :: Utility/./UtilityTests/StreamTeeTest.Write (1362 of 1906)
PASS: lldb-unit :: Utility/./UtilityTests/StructuredDataTest.ParseJSONFromFile (1363 of 1906)
PASS: lldb-unit :: Utility/./UtilityTests/Predicate.WaitForValueEqualTo (1364 of 1906)
PASS: lldb-shell :: Register/x86-64-read.test (1365 of 1906)
PASS: lldb-api :: functionalities/gdb_remote_client/TestNoGPacketSupported.py (1366 of 1906)
PASS: lldb-api :: functionalities/data-formatter/data-formatter-stl/libcxx/list/TestDataFormatterLibcxxList.py (1367 of 1906)
PASS: lldb-shell :: ObjectFile/ELF/netbsd-exec-8.99.30-amd64.yaml (1368 of 1906)
PASS: lldb-unit :: ScriptInterpreter/Python/./ScriptInterpreterPythonTests/PythonDataObjectsTest.TestPythonIntegerToStr (1369 of 1906)
PASS: lldb-shell :: SymbolFile/Breakpad/symtab.test (1370 of 1906)
PASS: lldb-unit :: ScriptInterpreter/Python/./ScriptInterpreterPythonTests/PythonDataObjectsTest.TestPythonDictionaryValueEquality (1371 of 1906)
PASS: lldb-unit :: Process/gdb-remote/./ProcessGdbRemoteTests/GDBRemoteCommunicationServerTest.SendErrorResponse_UnimplementedError (1372 of 1906)
PASS: lldb-api :: python_api/thread/TestThreadAPI.py (1373 of 1906)
PASS: lldb-api :: functionalities/data-formatter/typedef_array/TestTypedefArray.py (1374 of 1906)
PASS: lldb-api :: commands/frame/language/TestGuessLanguage.py (1375 of 1906)
PASS: lldb-shell :: SymbolFile/DWARF/debug-types-line-tables.s (1376 of 1906)
PASS: lldb-unit :: Utility/./UtilityTests/FileSpecTest.IsRelative (1377 of 1906)
PASS: lldb-unit :: Utility/./UtilityTests/StringExtractorTest.GetHexBytesAvail_Partial (1378 of 1906)
PASS: lldb-unit :: Expression/./ExpressionTests/DiagnosticManagerTest.AddDiagnostic (1379 of 1906)
PASS: lldb-api :: commands/expression/import-std-module/conflicts/TestStdModuleWithConflicts.py (1380 of 1906)
PASS: lldb-shell :: ExecControl/StopHook/stop-hook.test (1381 of 1906)
PASS: lldb-api :: functionalities/tail_call_frames/disambiguate_tail_call_seq/TestDisambiguateTailCallSeq.py (1382 of 1906)
PASS: lldb-unit :: Utility/./UtilityTests/StreamTest.AddressRange (1383 of 1906)
PASS: lldb-api :: functionalities/thread/concurrent_events/TestConcurrentWatchBreakDelay.py (1384 of 1906)
UNSUPPORTED: lldb-shell :: ScriptInterpreter/Lua/convenience_variables.test (1385 of 1906)
PASS: lldb-shell :: SymbolFile/Breakpad/line-table.test (1386 of 1906)
PASS: lldb-unit :: Process/minidump/./LLDBMinidumpTests/MinidumpParserTest.FindMemoryRangeWithFullMemoryMinidump (1387 of 1906)
UNSUPPORTED: lldb-api :: linux/sepdebugsymlink/TestTargetSymbolsSepDebugSymlink.py (1388 of 1906)
PASS: lldb-api :: functionalities/multidebugger_commands/TestMultipleDebuggersCommands.py (1389 of 1906)
PASS: lldb-unit :: Utility/./UtilityTests/StreamTest.PutRawBytesToBigEndian (1390 of 1906)
PASS: lldb-unit :: Utility/./UtilityTests/FileSpecTest.PrependPathComponent (1391 of 1906)
PASS: lldb-api :: functionalities/object-file/TestImageListMultiArchitecture.py (1392 of 1906)
PASS: lldb-unit :: Utility/./UtilityTests/RangeTest.ClearWithStarAddress (1393 of 1906)
UNSUPPORTED: lldb-api :: functionalities/darwin_log/filter/regex/subsystem/TestDarwinLogFilterRegexSubsystem.py (1394 of 1906)
PASS: lldb-unit :: Utility/./UtilityTests/StringListTest.JoinSingle (1395 of 1906)
PASS: lldb-api :: functionalities/thread/concurrent_events/TestConcurrentTwoBreakpointsOneWatchpoint.py (1396 of 1906)
PASS: lldb-unit :: Symbol/./SymbolTests/TestClangASTContext.TestDeletingImplicitCopyCstrDueToMoveCStr (1397 of 1906)
PASS: lldb-api :: functionalities/memory/find/TestMemoryFind.py (1398 of 1906)
PASS: lldb-api :: api/log/TestAPILog.py (1399 of 1906)
PASS: lldb-api :: python_api/type/TestTypeList.py (1400 of 1906)
PASS: lldb-api :: commands/expression/fixits/TestFixIts.py (1401 of 1906)
PASS: lldb-shell :: Driver/TestProcessAttach.test (1402 of 1906)
PASS: lldb-api :: python_api/symbol-context/two-files/TestSymbolContextTwoFiles.py (1403 of 1906)
PASS: lldb-api :: lang/cpp/offsetof/TestOffsetofCpp.py (1404 of 1906)
PASS: lldb-api :: functionalities/data-formatter/data-formatter-synthval/TestDataFormatterSynthVal.py (1405 of 1906)
PASS: lldb-unit :: Utility/./UtilityTests/StructuredDataTest.StringDump (1406 of 1906)
PASS: lldb-api :: functionalities/thread/crash_during_step/TestCrashDuringStep.py (1407 of 1906)
PASS: lldb-api :: macosx/DBGSourcePathRemapping/TestDSYMSourcePathRemapping.py (1408 of 1906)
UNSUPPORTED: lldb-api :: iohandler/unicode/TestUnicode.py (1409 of 1906)
PASS: lldb-shell :: SymbolFile/DWARF/debug_ranges.s (1410 of 1906)
UNSUPPORTED: lldb-shell :: SymbolFile/NativePDB/local-variables.cpp (1411 of 1906)
PASS: lldb-unit :: Target/./TargetTests/ModuleCacheTest.GetAndPut (1412 of 1906)
PASS: lldb-api :: commands/expression/unicode-in-variable/TestUnicodeInVariable.py (1413 of 1906)
PASS: lldb-unit :: Utility/./UtilityTests/UriParserTest.BracketedHostnamePort (1414 of 1906)
PASS: lldb-shell :: SymbolFile/DWARF/debug-types-dwo-cross-reference.cpp (1415 of 1906)
PASS: lldb-unit :: Utility/./UtilityTests/RangeTest.Clear (1416 of 1906)
PASS: lldb-api :: functionalities/thread/concurrent_events/TestConcurrentNWatchNBreak.py (1417 of 1906)
PASS: lldb-api :: commands/expression/import-std-module/shared_ptr-dbg-info-content/TestSharedPtrDbgInfoContent.py (1418 of 1906)
PASS: lldb-unit :: Core/./LLDBCoreTests/MangledTest.EmptyForInvalidName (1419 of 1906)
UNSUPPORTED: lldb-api :: benchmarks/turnaround/TestCompileRunToBreakpointTurnaround.py (1420 of 1906)
PASS: lldb-api :: python_api/watchpoint/TestWatchpointIter.py (1421 of 1906)
PASS: lldb-shell :: SymbolFile/NativePDB/source-list.cpp (1422 of 1906)
PASS: lldb-api :: commands/expression/cast_int_to_anonymous_enum/TestCastIntToAnonymousEnum.py (1423 of 1906)
PASS: lldb-unit :: Process/gdb-remote/./ProcessGdbRemoteTests/GDBRemoteCommunicationClientTest.SendStartTracePacket (1424 of 1906)
PASS: lldb-shell :: ObjectFile/ELF/section-permissions.yaml (1425 of 1906)
UNSUPPORTED: lldb-api :: benchmarks/frame_variable/TestFrameVariableResponse.py (1426 of 1906)
PASS: lldb-api :: commands/frame/diagnose/local-variable/TestLocalVariable.py (1427 of 1906)
UNSUPPORTED: lldb-api :: functionalities/darwin_log/filter/exact_match/subsystem/TestDarwinLogFilterMatchSubsystem.py (1428 of 1906)
PASS: lldb-shell :: SymbolFile/DWARF/find-inline-method.s (1429 of 1906)
PASS: lldb-unit :: Utility/./UtilityTests/ConstStringTest.UpdateMangledCounterpart (1430 of 1906)
PASS: lldb-api :: functionalities/postmortem/minidump/TestMiniDump.py (1431 of 1906)
PASS: lldb-api :: functionalities/breakpoint/cpp/TestCPPBreakpointLocations.py (1432 of 1906)
PASS: lldb-api :: functionalities/data-formatter/data-formatter-stl/libcxx/iterator/TestDataFormatterLibccIterator.py (1433 of 1906)
PASS: lldb-unit :: Process/minidump/./LLDBMinidumpTests/MinidumpParserTest.GetLinuxProcStatus (1434 of 1906)
PASS: lldb-unit :: Utility/./UtilityTests/BinaryStreamTest.PutSLEB128MaxValue (1435 of 1906)
PASS: lldb-unit :: Utility/./UtilityTests/StringExtractorTest.GetHexBytes_OddPair (1436 of 1906)
PASS: lldb-unit :: Utility/./UtilityTests/DataExtractorTest.GetCStr (1437 of 1906)
PASS: lldb-api :: commands/frame/var-scope/TestFrameVariableScope.py (1438 of 1906)
PASS: lldb-unit :: Utility/./UtilityTests/SerializationRountripTest.SerializeDeserializeCString (1439 of 1906)
PASS: lldb-unit :: Host/./HostTests/NativeProcessProtocolTest.ReadCStringFromMemory (1440 of 1906)
PASS: lldb-api :: functionalities/data-formatter/data-formatter-objc/TestDataFormatterObjCNSContainer.py (1441 of 1906)
PASS: lldb-unit :: ObjectFile/Breakpad/./ObjectFileBreakpadTests/StackCFIRecord.parse (1442 of 1906)
PASS: lldb-api :: commands/expression/entry-bp/TestExprEntryBP.py (1443 of 1906)
PASS: lldb-unit :: Core/./LLDBCoreTests/MangledTest.NameIndexes_FindFunctionSymbols (1444 of 1906)
PASS: lldb-unit :: Utility/./UtilityTests/VMRange.Reset (1445 of 1906)
PASS: lldb-api :: functionalities/return-value/TestReturnValue.py (1446 of 1906)
PASS: lldb-unit :: Utility/./UtilityTests/OptionsWithRawTest.QuotedSuffix (1447 of 1906)
PASS: lldb-unit :: Utility/./UtilityTests/LogChannelEnabledTest.LogVerboseThread (1448 of 1906)
PASS: lldb-api :: commands/quit/TestQuit.py (1449 of 1906)
PASS: lldb-api :: functionalities/data-formatter/ostypeformatting/TestFormattersOsType.py (1450 of 1906)
PASS: lldb-unit :: UnwindAssembly/x86/./UnwindAssemblyx86Tests/Testx86AssemblyInspectionEngine.Testi386IgnoredRegisters (1451 of 1906)
PASS: lldb-unit :: tools/lldb-server/tests/./LLDBServerTests/TestBase.DebugserverEnv (1452 of 1906)
PASS: lldb-unit :: Utility/./UtilityTests/StreamTest.AddressEmptyPrefix (1453 of 1906)
PASS: lldb-unit :: Utility/./UtilityTests/StringExtractorTest.GetHexU8_Extra (1454 of 1906)
PASS: lldb-unit :: Utility/./UtilityTests/SubsystemRAIITest.SubsystemWithErrorFailure (1455 of 1906)
PASS: lldb-unit :: Utility/./UtilityTests/CompletionRequest.DuplicateFilteringWithComments (1456 of 1906)
PASS: lldb-unit :: Utility/./UtilityTests/RangeTest.EqualInvalid (1457 of 1906)
PASS: lldb-api :: lang/cpp/extern_c/TestExternCSymbols.py (1458 of 1906)
PASS: lldb-api :: functionalities/jitloader_gdb/TestJITLoaderGDB.py (1459 of 1906)
UNSUPPORTED: lldb-api :: arm/breakpoint-thumb-codesection/TestBreakpointThumbCodesection.py (1460 of 1906)
PASS: lldb-api :: commands/expression/call-function/TestCallBuiltinFunction.py (1461 of 1906)
PASS: lldb-unit :: Host/./HostTests/NativeProcessProtocolTest.SetBreakpointFailVerify (1462 of 1906)
PASS: lldb-api :: lang/cpp/rvalue-references/TestRvalueReferences.py (1463 of 1906)
PASS: lldb-unit :: Target/./TargetTests/ExecutionContextTest.GetByteOrderProcess (1464 of 1906)
PASS: lldb-api :: commands/log/invalid-args/TestInvalidArgsLog.py (1465 of 1906)
PASS: lldb-shell :: Driver/TestCommands.test (1466 of 1906)
PASS: lldb-unit :: Utility/./UtilityTests/ScalarTest.Division (1467 of 1906)
PASS: lldb-unit :: Utility/./UtilityTests/StreamTest.PutHex32ByteOrderBig (1468 of 1906)
PASS: lldb-api :: functionalities/data-formatter/data-formatter-stl/libcxx/list/loop/TestDataFormatterLibcxxListLoop.py (1469 of 1906)
PASS: lldb-unit :: Utility/./UtilityTests/StringListTest.GetMaxStringLengthEmpty (1470 of 1906)
PASS: lldb-api :: commands/expression/radar_9531204/TestPrintfAfterUp.py (1471 of 1906)
PASS: lldb-unit :: Expression/./ExpressionTests/DWARFExpression.DW_OP_pick (1472 of 1906)
PASS: lldb-api :: functionalities/data-formatter/refpointer-recursion/TestDataFormatterRefPtrRecursion.py (1473 of 1906)
PASS: lldb-unit :: Utility/./UtilityTests/EventTest.DumpEventDataBytes (1474 of 1906)
PASS: lldb-api :: python_api/value/empty_class/TestValueAPIEmptyClass.py (1475 of 1906)
PASS: lldb-shell :: Driver/TestFile.test (1476 of 1906)
PASS: lldb-unit :: Utility/./UtilityTests/StringLexerTest.AdvanceIf (1477 of 1906)
PASS: lldb-shell :: Quit/TestQuitExitCodeTooManyArgs.test (1478 of 1906)
UNSUPPORTED: lldb-api :: functionalities/ubsan/user-expression/TestUbsanUserExpression.py (1479 of 1906)
PASS: lldb-shell :: Breakpoint/split-dwarf-5-addrbase.test (1480 of 1906)
UNSUPPORTED: lldb-shell :: Unwind/unwind-plan-dwarf-dump.test (1481 of 1906)
PASS: lldb-unit :: Process/gdb-remote/./ProcessGdbRemoteTests/GDBRemoteCommunicationServerTest.SendErrorResponse_Status (1482 of 1906)
PASS: lldb-unit :: Utility/./UtilityTests/StringListTest.Join (1483 of 1906)
PASS: lldb-shell :: Breakpoint/jitbp_elf.test (1484 of 1906)
PASS: lldb-api :: commands/watchpoints/watchpoint_commands/command/TestWatchpointCommandLLDB.py (1485 of 1906)
PASS: lldb-api :: functionalities/step_scripted/TestStepScripted.py (1486 of 1906)
PASS: lldb-unit :: Utility/./UtilityTests/ScalarTest.ExtractBitfield (1487 of 1906)
UNSUPPORTED: lldb-shell :: ScriptInterpreter/Lua/lua.test (1488 of 1906)
PASS: lldb-unit :: Interpreter/./InterpreterTests/OptionArgParserTest.toBoolean (1489 of 1906)
PASS: lldb-api :: functionalities/data-formatter/data-formatter-objc/TestDataFormatterObjCCF.py (1490 of 1906)
PASS: lldb-api :: lang/c/register_variables/TestRegisterVariables.py (1491 of 1906)
PASS: lldb-unit :: SymbolFile/NativePDB/./SymbolFileNativePDBTests/PDBFPOProgramToDWARFExpressionTests.UnresolvedDependentCyclicRegisterAssignmentReference (1492 of 1906)
PASS: lldb-api :: commands/expression/import-std-module/queue/TestQueue.py (1493 of 1906)
PASS: lldb-unit :: Utility/./UtilityTests/StreamTest.PutHex16ByteOrderBig (1494 of 1906)
PASS: lldb-unit :: SymbolFile/DWARF/./SymbolFileDWARFTests/SymbolFileDWARFTests.TestAbbrevOrder1Start1 (1495 of 1906)
PASS: lldb-unit :: Interpreter/./InterpreterTests/CompletionTest.DirCompletionAbsolute (1496 of 1906)
PASS: lldb-api :: python_api/process/TestProcessAPI.py (1497 of 1906)
PASS: lldb-unit :: Utility/./UtilityTests/StringExtractorTest.GetNameColonValueNoSemicolon (1498 of 1906)
UNSUPPORTED: lldb-shell :: SymbolFile/PDB/udt-layout.test (1499 of 1906)
PASS: lldb-api :: functionalities/thread/concurrent_events/TestConcurrentCrashWithSignal.py (1500 of 1906)
PASS: lldb-unit :: Symbol/./SymbolTests/TestClangASTImporter.ImportInvalidType (1501 of 1906)
UNSUPPORTED: lldb-api :: functionalities/data-formatter/data-formatter-stl/libstdcpp/vbool/TestDataFormatterStdVBool.py (1502 of 1906)
PASS: lldb-unit :: Utility/./UtilityTests/StringExtractorTest.DecodeHexU8_Underflow (1503 of 1906)
PASS: lldb-unit :: Utility/./UtilityTests/UriParserTest.Empty (1504 of 1906)
PASS: lldb-api :: functionalities/breakpoint/breakpoint_conditions/TestBreakpointConditions.py (1505 of 1906)
PASS: lldb-api :: commands/watchpoints/multiple_threads/TestWatchpointMultipleThreads.py (1506 of 1906)
PASS: lldb-api :: commands/command/script/TestCommandScript.py (1507 of 1906)
PASS: lldb-unit :: Utility/./UtilityTests/ScalarTest.RightShiftOperator (1508 of 1906)
PASS: lldb-unit :: Utility/./UtilityTests/TimerTest.CategoryTimesStats (1509 of 1906)
PASS: lldb-api :: commands/expression/namespace_local_var_same_name_obj_c/TestNamespaceLocalVarSameNameObjC.py (1510 of 1906)
PASS: lldb-api :: tools/lldb-server/TestGdbRemoteRegisterState.py (1511 of 1906)
PASS: lldb-unit :: Utility/./UtilityTests/BinaryStreamTest.PutULEB128FourBytes (1512 of 1906)
PASS: lldb-api :: lang/objc/objc-checker/TestObjCCheckers.py (1513 of 1906)
PASS: lldb-api :: commands/frame/diagnose/array/TestArray.py (1514 of 1906)
PASS: lldb-unit :: Process/minidump/./LLDBMinidumpTests/MinidumpParserTest.FindMemoryRange (1515 of 1906)
PASS: lldb-shell :: Driver/TestSingleQuote.test (1516 of 1906)
PASS: lldb-api :: lang/cpp/trivial_abi/TestTrivialABI.py (1517 of 1906)
PASS: lldb-api :: lang/cpp/dynamic-value/TestCppValueCast.py (1518 of 1906)
UNSUPPORTED: lldb-api :: functionalities/thread/create_during_step/TestCreateDuringStep.py (1519 of 1906)
PASS: lldb-api :: lang/cpp/std-function-step-into-callable/TestStdFunctionStepIntoCallable.py (1520 of 1906)
PASS: lldb-unit :: UnwindAssembly/x86/./UnwindAssemblyx86Tests/Testx86AssemblyInspectionEngine.TestSpillRegToStackViaMOVx86_64 (1521 of 1906)
PASS: lldb-shell :: ObjectFile/ELF/many-sections.s (1522 of 1906)
PASS: lldb-api :: commands/expression/invalid-args/TestInvalidArgsExpression.py (1523 of 1906)
PASS: lldb-unit :: ScriptInterpreter/Python/./ScriptInterpreterPythonTests/PythonDataObjectsTest.TestPythonTupleToStructuredList (1524 of 1906)
PASS: lldb-unit :: Utility/./UtilityTests/RecordReplayTest.InstrumentedFooSameThis (1525 of 1906)
PASS: lldb-unit :: Utility/./UtilityTests/StringExtractorTest.GetU32LittleEndian (1526 of 1906)
PASS: lldb-unit :: Utility/./UtilityTests/StringLexerTest.PutBack (1527 of 1906)
PASS: lldb-shell :: Settings/TestFrameFormatMangling.test (1528 of 1906)
PASS: lldb-unit :: Symbol/./SymbolTests/Type.CompilerContextPattern (1529 of 1906)
PASS: lldb-api :: functionalities/postmortem/elf-core/thread_crash/TestLinuxCoreThreads.py (1530 of 1906)
PASS: lldb-unit :: Utility/./UtilityTests/StreamTest.PutCString (1531 of 1906)
PASS: lldb-unit :: Host/./HostTests/MainLoopTest.DetectsEOF (1532 of 1906)
PASS: lldb-api :: functionalities/data-formatter/data-formatter-categories/TestDataFormatterCategories.py (1533 of 1906)
PASS: lldb-api :: lang/objc/radar-9691614/TestObjCMethodReturningBOOL.py (1534 of 1906)
PASS: lldb-api :: lang/objc/modules-app-update/TestClangModulesAppUpdate.py (1535 of 1906)
PASS: lldb-unit :: Utility/./UtilityTests/StreamTest.ShiftOperatorPtr (1536 of 1906)
PASS: lldb-api :: python_api/watchpoint/TestWatchpointIgnoreCount.py (1537 of 1906)
PASS: lldb-api :: functionalities/data-formatter/data-formatter-stl/libcxx/vbool/TestDataFormatterLibcxxVBool.py (1538 of 1906)
PASS: lldb-unit :: Utility/./UtilityTests/RangeTest.LessThanInvalid (1539 of 1906)
PASS: lldb-unit :: Utility/./UtilityTests/DataExtractorTest.GetMaxU64 (1540 of 1906)
PASS: lldb-api :: lang/objc/objc-super/TestObjCSuper.py (1541 of 1906)
PASS: lldb-shell :: ObjectFile/PECOFF/uuid.yaml (1542 of 1906)
PASS: lldb-api :: functionalities/type_completion/TestTypeCompletion.py (1543 of 1906)
PASS: lldb-unit :: Utility/./UtilityTests/ArchSpecTest.TestSetTriple (1544 of 1906)
PASS: lldb-api :: functionalities/breakpoint/global_constructor/TestBreakpointInGlobalConstructor.py (1545 of 1906)
UNSUPPORTED: lldb-api :: iohandler/completion/TestIOHandlerCompletion.py (1546 of 1906)
UNSUPPORTED: lldb-shell :: SymbolFile/NativePDB/typedefs.cpp (1547 of 1906)
PASS: lldb-unit :: Utility/./UtilityTests/LogChannelEnabledTest.LogThread (1548 of 1906)
PASS: lldb-unit :: Utility/./UtilityTests/BroadcasterTest.EventTypeHasListeners (1549 of 1906)
PASS: lldb-api :: functionalities/data-formatter/type_summary_list_script/TestTypeSummaryListScript.py (1550 of 1906)
PASS: lldb-api :: functionalities/thread/concurrent_events/TestConcurrentTwoBreakpointThreads.py (1551 of 1906)
PASS: lldb-shell :: Quit/TestQuitExitCode0.test (1552 of 1906)
UNSUPPORTED: lldb-api :: commands/expression/macros/TestMacros.py (1553 of 1906)
PASS: lldb-api :: lang/cpp/char1632_t/TestChar1632T.py (1554 of 1906)
UNSUPPORTED: lldb-api :: functionalities/tsan/global_location/TestTsanGlobalLocation.py (1555 of 1906)
PASS: lldb-api :: functionalities/breakpoint/scripted_bkpt/TestScriptedResolver.py (1556 of 1906)
PASS: lldb-unit :: Utility/./UtilityTests/StringListTest.GetSize (1557 of 1906)
PASS: lldb-shell :: SymbolFile/DWARF/inline-function-address-shared.test (1558 of 1906)
PASS: lldb-api :: lang/objc/modules-auto-import/TestModulesAutoImport.py (1559 of 1906)
UNSUPPORTED: lldb-api :: functionalities/tsan/thread_leak/TestTsanThreadLeak.py (1560 of 1906)
PASS: lldb-api :: tools/lldb-server/commandline/TestStubReverseConnect.py (1561 of 1906)
UNSUPPORTED: lldb-shell :: Register/x86-gp-read.test (1562 of 1906)
PASS: lldb-unit :: Language/Highlighting/./HighlighterTests/HighlighterTest.ClangEmptyInput (1563 of 1906)
PASS: lldb-unit :: Utility/./UtilityTests/BinaryStreamTest.PutSLEB128FourBytes (1564 of 1906)
PASS: lldb-unit :: Utility/./UtilityTests/UriParserTest.SchemeHostSeparator (1565 of 1906)
PASS: lldb-shell :: ObjectFile/ELF/gnu-debuglink.yaml (1566 of 1906)
PASS: lldb-api :: lang/objc/unicode-string/TestUnicodeString.py (1567 of 1906)
PASS: lldb-unit :: SymbolFile/NativePDB/./SymbolFileNativePDBTests/PDBFPOProgramToDWARFExpressionTests.SingleAssignmentRegisterRef (1568 of 1906)
UNSUPPORTED: lldb-shell :: SymbolFile/PDB/typedefs.test (1569 of 1906)
PASS: lldb-unit :: ScriptInterpreter/Python/./ScriptInterpreterPythonTests/PythonDataObjectsTest.TestPythonTupleValues (1570 of 1906)
PASS: lldb-shell :: Quit/TestQuitExitCodeNonInt.test (1571 of 1906)
PASS: lldb-unit :: Utility/./UtilityTests/StringExtractorTest.GetHexU8_Underflow_NoEof (1572 of 1906)
PASS: lldb-unit :: Breakpoint/./LLDBBreakpointTests/BreakpointIDTest.StringIsBreakpointName (1573 of 1906)
UNSUPPORTED: lldb-shell :: Register/x86-64-ymm16-read.test (1574 of 1906)
PASS: lldb-unit :: Utility/./UtilityTests/StringListTest.AppendListCStringArray (1575 of 1906)
PASS: lldb-shell :: Minidump/memory-region.yaml (1576 of 1906)
PASS: lldb-unit :: Symbol/./SymbolTests/TestClangASTContext.TestGetTypeClassTypeOf (1577 of 1906)
PASS: lldb-unit :: ObjectFile/ELF/./ObjectFileELFTests/ObjectFileELFTest.SectionsResolveConsistently (1578 of 1906)
PASS: lldb-unit :: Utility/./UtilityTests/StringListTest.LongestCommonPrefixEmpty (1579 of 1906)
PASS: lldb-unit :: Language/Highlighting/./HighlighterTests/HighlighterTest.ClangStringLiterals (1580 of 1906)
PASS: lldb-api :: lang/objc/foundation/TestConstStrings.py (1581 of 1906)
PASS: lldb-shell :: SymbolFile/NativePDB/globals-bss.cpp (1582 of 1906)
PASS: lldb-api :: commands/frame/recognizer/TestFrameRecognizer.py (1583 of 1906)
PASS: lldb-unit :: Process/gdb-remote/./ProcessGdbRemoteTests/GDBRemoteCommunicationClientTest.SendStopTracePacket (1584 of 1906)
PASS: lldb-unit :: Utility/./UtilityTests/BinaryStreamTest.PutSLEB128EightBytes (1585 of 1906)
PASS: lldb-api :: functionalities/data-formatter/data-formatter-cpp/TestDataFormatterCpp.py (1586 of 1906)
PASS: lldb-shell :: SymbolFile/NativePDB/globals-fundamental.cpp (1587 of 1906)
UNSUPPORTED: lldb-api :: functionalities/data-formatter/data-formatter-stl/libstdcpp/iterator/TestDataFormatterStdIterator.py (1588 of 1906)
PASS: lldb-unit :: SymbolFile/DWARF/./SymbolFileDWARFTests/DWARFASTParserClangTests.EnsureAllDIEsInDeclContextHaveBeenParsedParsesOnlyMatchingEntries (1589 of 1906)
PASS: lldb-unit :: ObjectFile/Breakpad/./ObjectFileBreakpadTests/ModuleRecord.parse (1590 of 1906)
PASS: lldb-unit :: SymbolFile/NativePDB/./SymbolFileNativePDBTests/PDBFPOProgramToDWARFExpressionTests.UnknownOp (1591 of 1906)
PASS: lldb-unit :: Utility/./UtilityTests/StreamTest.PutMaxHex64ByteOrderBig (1592 of 1906)
PASS: lldb-unit :: Utility/./UtilityTests/ScalarTest.ComparisonFloat (1593 of 1906)
PASS: lldb-unit :: Utility/./UtilityTests/LogTest.Register (1594 of 1906)
PASS: lldb-api :: commands/expression/call-throws/TestCallThatThrows.py (1595 of 1906)
PASS: lldb-unit :: UnwindAssembly/x86/./UnwindAssemblyx86Tests/Testx86AssemblyInspectionEngine.TestPushRBX (1596 of 1906)
PASS: lldb-unit :: Utility/./UtilityTests/RegisterValueTest.GetSet8 (1597 of 1906)
PASS: lldb-api :: commands/command/history/TestCommandHistory.py (1598 of 1906)
PASS: lldb-api :: macosx/function-starts/TestFunctionStarts.py (1599 of 1906)
PASS: lldb-shell :: ObjectFile/ELF/short-build-id.yaml (1600 of 1906)
PASS: lldb-unit :: Utility/./UtilityTests/GeneratorTest.GetOrCreate (1601 of 1906)
PASS: lldb-shell :: ObjectFile/MachO/lc_build_version_notools.yaml (1602 of 1906)
PASS: lldb-unit :: Utility/./UtilityTests/UriParserTest.BracketedHostnameWithColon (1603 of 1906)
PASS: lldb-api :: functionalities/data-formatter/data-formatter-stl/libcxx/forward_list/TestDataFormatterLibcxxForwardList.py (1604 of 1906)
PASS: lldb-unit :: Utility/./UtilityTests/StringListTest.CopyListSingle (1605 of 1906)
PASS: lldb-api :: functionalities/abbreviation/TestCommonShortSpellings.py (1606 of 1906)
PASS: lldb-unit :: DataFormatter/./LLDBFormatterTests/FormatManagerTests.CompatibleLangs (1607 of 1906)
PASS: lldb-unit :: Utility/./UtilityTests/DataExtractorTest.GetBitfield (1608 of 1906)
PASS: lldb-shell :: SymbolFile/NativePDB/global-classes.cpp (1609 of 1906)
PASS: lldb-api :: lang/objc/objc-property/TestObjCProperty.py (1610 of 1906)
PASS: lldb-unit :: Utility/./UtilityTests/Flags.IsClear (1611 of 1906)
PASS: lldb-shell :: Reproducer/TestDiscard.test (1612 of 1906)
PASS: lldb-unit :: Process/gdb-remote/./ProcessGdbRemoteTests/GDBRemoteCommunicationServerTest.SendErrorResponse_ErrorNumber (1613 of 1906)
PASS: lldb-unit :: Utility/./UtilityTests/StringListTest.SplitIntoLinesSingleTrailingCR (1614 of 1906)
PASS: lldb-unit :: Utility/./UtilityTests/DataExtractorTest.GetMaxU64_unchecked (1615 of 1906)
PASS: lldb-unit :: Utility/./UtilityTests/ArchSpecTest.TripleComponentsWereSpecified (1616 of 1906)
PASS: lldb-unit :: Symbol/./SymbolTests/PostfixExpression.ParseFPOProgram (1617 of 1906)
PASS: lldb-api :: functionalities/data-formatter/data-formatter-stl/libcxx/map/TestDataFormatterLibccMap.py (1618 of 1906)
PASS: lldb-unit :: Expression/./ExpressionTests/DiagnosticManagerTest.AppendMessageNoDiag (1619 of 1906)
PASS: lldb-unit :: Utility/./UtilityTests/Flags.Clear (1620 of 1906)
PASS: lldb-api :: commands/expression/call-function/TestCallStdStringFunction.py (1621 of 1906)
PASS: lldb-unit :: UnwindAssembly/x86/./UnwindAssemblyx86Tests/Testx86AssemblyInspectionEngine.TestPushR14 (1622 of 1906)
PASS: lldb-unit :: UnwindAssembly/x86/./UnwindAssemblyx86Tests/Testx86AssemblyInspectionEngine.TestPopR12 (1623 of 1906)
PASS: lldb-api :: commands/watchpoints/watchpoint_commands/condition/TestWatchpointConditionCmd.py (1624 of 1906)
PASS: lldb-api :: functionalities/data-formatter/type_summary_list_arg/TestTypeSummaryListArg.py (1625 of 1906)
PASS: lldb-unit :: Language/Highlighting/./HighlighterTests/HighlighterTest.ClangPreserveNewLine (1626 of 1906)
PASS: lldb-shell :: Reproducer/TestReuseDirectory.test (1627 of 1906)
PASS: lldb-unit :: Utility/./UtilityTests/RangeTest.Copy (1628 of 1906)
PASS: lldb-unit :: Utility/./UtilityTests/ConstStringTest.FromMidOfBufferStringRef (1629 of 1906)
PASS: lldb-api :: macosx/find-dsym/bundle-with-dot-in-filename/TestBundleWithDotInFilename.py (1630 of 1906)
UNSUPPORTED: lldb-shell :: Breakpoint/ppc64-localentry.test (1631 of 1906)
PASS: lldb-unit :: Utility/./UtilityTests/LogChannelTest.Disable (1632 of 1906)
PASS: lldb-api :: lang/objc/foundation/TestObjCMethods.py (1633 of 1906)
PASS: lldb-api :: python_api/value/linked_list/TestValueAPILinkedList.py (1634 of 1906)
PASS: lldb-unit :: Utility/./UtilityTests/StringListTest.SplitIntoLinesEmpty (1635 of 1906)
PASS: lldb-unit :: Utility/./UtilityTests/Flags.AllSet (1636 of 1906)
PASS: lldb-shell :: SymbolFile/NativePDB/tag-types.cpp (1637 of 1906)
PASS: lldb-api :: functionalities/data-formatter/data-formatter-stl/libcxx/function/TestLibCxxFunction.py (1638 of 1906)
PASS: lldb-api :: commands/expression/scoped_enums/TestScopedEnumType.py (1639 of 1906)
PASS: lldb-api :: commands/command/script_alias/TestCommandScriptAlias.py (1640 of 1906)
PASS: lldb-api :: python_api/lldbutil/frame/TestFrameUtils.py (1641 of 1906)
PASS: lldb-api :: functionalities/postmortem/mach-core/TestMachCore.py (1642 of 1906)
PASS: lldb-unit :: Process/minidump/./LLDBMinidumpTests/MinidumpParserTest.GetArchitectureWindows (1643 of 1906)
PASS: lldb-unit :: Utility/./UtilityTests/StreamTeeTest.SetStreamAtIndexOverwrite (1644 of 1906)
PASS: lldb-api :: functionalities/gdb_remote_client/TestArmRegisterDefinition.py (1645 of 1906)
PASS: lldb-api :: lang/cpp/exceptions/TestCPPExceptionBreakpoints.py (1646 of 1906)
PASS: lldb-unit :: UnwindAssembly/x86/./UnwindAssemblyx86Tests/Testx86AssemblyInspectionEngine.TestPushExtended (1647 of 1906)
PASS: lldb-unit :: ScriptInterpreter/Python/./ScriptInterpreterPythonTests/PythonDataObjectsTest.TestPythonTupleInitializerList (1648 of 1906)
PASS: lldb-unit :: Utility/./UtilityTests/BinaryStreamTest.PutSLEB128TwoBytes (1649 of 1906)
PASS: lldb-unit :: Symbol/./SymbolTests/TestClangASTContext.TestFunctionTemplateInRecordConstruction (1650 of 1906)
PASS: lldb-shell :: SymbolFile/DWARF/win-i386-line-table.s (1651 of 1906)
PASS: lldb-api :: lang/objc/rdar-10967107/TestRdar10967107.py (1652 of 1906)
PASS: lldb-api :: python_api/frame/get-variables/TestGetVariables.py (1653 of 1906)
PASS: lldb-unit :: Utility/./UtilityTests/ScalarTest.APIntConstructor (1654 of 1906)
PASS: lldb-api :: functionalities/data-formatter/poarray/TestPrintObjectArray.py (1655 of 1906)
PASS: lldb-api :: lang/objc/ptr_refs/TestPtrRefsObjC.py (1656 of 1906)
PASS: lldb-unit :: Utility/./UtilityTests/BinaryStreamTest.PutSLEB128OneByte (1657 of 1906)
PASS: lldb-unit :: SymbolFile/DWARF/./SymbolFileDWARFTests/SymbolFileDWARFTests.TestAbbrevOrder1Start5 (1658 of 1906)
PASS: lldb-api :: functionalities/non-overlapping-index-variable-i/TestIndexVariable.py (1659 of 1906)
PASS: lldb-api :: functionalities/breakpoint/breakpoint_names/TestBreakpointNames.py (1660 of 1906)
PASS: lldb-api :: functionalities/data-formatter/data-formatter-objc/nsstring/TestDataFormatterNSString.py (1661 of 1906)
PASS: lldb-api :: functionalities/thread/concurrent_events/TestConcurrentSignalDelayBreak.py (1662 of 1906)
PASS: lldb-unit :: UnwindAssembly/x86/./UnwindAssemblyx86Tests/Testx86AssemblyInspectionEngine.TestAddESP (1663 of 1906)
PASS: lldb-unit :: debugserver/./debugserverTests/RNBSocket.LoopBackConnectIPv6 (1664 of 1906)
PASS: lldb-unit :: Utility/./UtilityTests/UriParserTest.TypicalPortPath (1665 of 1906)
PASS: lldb-unit :: Process/gdb-remote/./ProcessGdbRemoteTests/GDBRemoteCommunicationClientTest.ReadRegister (1666 of 1906)
PASS: lldb-api :: functionalities/unwind/noreturn/TestNoreturnUnwind.py (1667 of 1906)
PASS: lldb-unit :: Utility/./UtilityTests/ConstStringTest.CompareStringRef (1668 of 1906)
PASS: lldb-unit :: Utility/./UtilityTests/AnsiTerminal.AtStart (1669 of 1906)
PASS: lldb-unit :: Utility/./UtilityTests/SerializationRountripTest.SerializeDeserializeObjectReference (1670 of 1906)
PASS: lldb-api :: tools/lldb-server/TestGdbRemoteExitCode.py (1671 of 1906)
PASS: lldb-api :: commands/expression/po_verbosity/TestPoVerbosity.py (1672 of 1906)
PASS: lldb-api :: functionalities/thread/concurrent_events/TestConcurrentBreakpointsDelayedBreakpointOneWatchpoint.py (1673 of 1906)
PASS: lldb-unit :: Utility/./UtilityTests/DeserializerTest.HasData (1674 of 1906)
PASS: lldb-api :: functionalities/gdb_remote_client/TestRegDefinitionInParts.py (1675 of 1906)
PASS: lldb-unit :: ScriptInterpreter/Python/./ScriptInterpreterPythonTests/PythonDataObjectsTest.TestPythonDictionaryManipulation (1676 of 1906)
PASS: lldb-api :: commands/expression/test/TestExprs.py (1677 of 1906)
PASS: lldb-unit :: Utility/./UtilityTests/EnvironmentTest.EnvpConstruction (1678 of 1906)
PASS: lldb-api :: commands/command/script/import/rdar-12586188/TestRdar12586188.py (1679 of 1906)
PASS: lldb-api :: functionalities/thread/concurrent_events/TestConcurrentManyCrash.py (1680 of 1906)
PASS: lldb-unit :: Utility/./UtilityTests/ProcessInstanceInfoMatch.Name (1681 of 1906)
PASS: lldb-unit :: Utility/./UtilityTests/StringListTest.Assignment (1682 of 1906)
UNSUPPORTED: lldb-api :: linux/mix-dwo-and-regular-objects/TestMixedDwarfBinary.py (1683 of 1906)
PASS: lldb-unit :: Utility/./UtilityTests/Flags.AnyClear (1684 of 1906)
PASS: lldb-shell :: SymbolFile/DWARF/debug_ranges-missing-section.s (1685 of 1906)
PASS: lldb-unit :: Process/gdb-remote/./ProcessGdbRemoteTests/GDBRemoteClientBaseTest.SendContinueAndAsyncPacket (1686 of 1906)
UNSUPPORTED: lldb-api :: functionalities/tsan/thread_numbers/TestTsanThreadNumbers.py (1687 of 1906)
PASS: lldb-unit :: Symbol/./SymbolTests/TestClangASTImporter.DeportDeclTagDecl (1688 of 1906)
PASS: lldb-unit :: Symbol/./SymbolTests/LineEntryTest.GetSameLineContiguousAddressRangeNestedInline (1689 of 1906)
PASS: lldb-api :: functionalities/thread/num_threads/TestNumThreads.py (1690 of 1906)
UNSUPPORTED: lldb-shell :: Register/arm-fp-read.test (1691 of 1906)
PASS: lldb-shell :: Breakpoint/single-file-split-dwarf.test (1692 of 1906)
PASS: lldb-unit :: Utility/./UtilityTests/RangeTest.ContainsRange (1693 of 1906)
PASS: lldb-unit :: Utility/./UtilityTests/StateTest.Formatv (1694 of 1906)
PASS: lldb-unit :: Utility/./UtilityTests/LogTest.Unregister (1695 of 1906)
PASS: lldb-unit :: Interpreter/./InterpreterTests/CompletionTest.DirCompletionUsername (1696 of 1906)
PASS: lldb-api :: commands/expression/timeout/TestCallWithTimeout.py (1697 of 1906)
PASS: lldb-unit :: Utility/./UtilityTests/NameMatchesTest.Contains (1698 of 1906)
PASS: lldb-unit :: Utility/./UtilityTests/StringListTest.InsertStringAtIndexEnd (1699 of 1906)
PASS: lldb-shell :: ObjectFile/ELF/PT_LOAD-overlap-PT_INTERP.yaml (1700 of 1906)
PASS: lldb-shell :: ObjectFile/ELF/duplicate-section.yaml (1701 of 1906)
PASS: lldb-unit :: Process/gdb-remote/./ProcessGdbRemoteTests/GDBRemoteClientBaseTest.SendContinueAndInterrupt (1702 of 1906)
PASS: lldb-api :: python_api/exprpath_synthetic/TestExprPathSynthetic.py (1703 of 1906)
PASS: lldb-unit :: Utility/./UtilityTests/BinaryStreamTest.PutULEB128ThreeBytes (1704 of 1906)
PASS: lldb-unit :: Utility/./UtilityTests/RangeTest.DoesAdjoinOrIntersect (1705 of 1906)
PASS: lldb-unit :: Utility/./UtilityTests/TimeoutTest.Format (1706 of 1906)
PASS: lldb-unit :: Utility/./UtilityTests/RangeTest.DefaultConstructor (1707 of 1906)
UNSUPPORTED: lldb-shell :: ObjectFile/ELF/minidebuginfo-set-and-hit-breakpoint.test (1708 of 1906)
PASS: lldb-api :: functionalities/thread/exit_during_step/TestExitDuringStep.py (1709 of 1906)
PASS: lldb-unit :: tools/lldb-server/tests/./LLDBServerTests/TestBase.LaunchModePreservesEnvironment (1710 of 1906)
PASS: lldb-unit :: Process/minidump/./LLDBMinidumpTests/MinidumpParserTest.GetMiscInfo_no_stream (1711 of 1906)
PASS: lldb-unit :: Utility/./UtilityTests/Flags.Test (1712 of 1906)
PASS: lldb-unit :: Symbol/./SymbolTests/TestClangASTImporter.CopyTypeTagDecl (1713 of 1906)
PASS: lldb-unit :: Utility/./UtilityTests/BinaryStreamTest.PutSLEB128One (1714 of 1906)
PASS: lldb-api :: functionalities/data-formatter/boolreference/TestFormattersBoolRefPtr.py (1715 of 1906)
PASS: lldb-api :: functionalities/thread/concurrent_events/TestConcurrentSignalDelayWatch.py (1716 of 1906)
PASS: lldb-shell :: SymbolFile/DWARF/clang-ast-from-dwarf-unamed-and-anon-structs.cpp (1717 of 1906)
PASS: lldb-api :: functionalities/thread/concurrent_events/TestConcurrentCrashWithWatchpoint.py (1718 of 1906)
PASS: lldb-shell :: ObjectFile/wasm/embedded-debug-sections.yaml (1719 of 1906)
PASS: lldb-unit :: SymbolFile/NativePDB/./SymbolFileNativePDBTests/PDBFPOProgramToDWARFExpressionTests.InvalidOpUnary (1720 of 1906)
PASS: lldb-shell :: ObjectFile/PECOFF/invalid-export-table.yaml (1721 of 1906)
UNSUPPORTED: lldb-api :: commands/register/register/intel_xtended_registers/mpx_bound_violation/TestBoundViolation.py (1722 of 1906)
PASS: lldb-api :: lang/objcxx/hide-runtime-values/TestObjCXXHideRuntimeValues.py (1723 of 1906)
PASS: lldb-unit :: Utility/./UtilityTests/StreamTeeTest.Assignment (1724 of 1906)
PASS: lldb-unit :: Utility/./UtilityTests/FileSpecTest.EqualDotsPosixRoot (1725 of 1906)
PASS: lldb-unit :: UnwindAssembly/x86/./UnwindAssemblyx86Tests/Testx86AssemblyInspectionEngine.TestPopESI (1726 of 1906)
PASS: lldb-api :: lang/c/blocks/TestBlocks.py (1727 of 1906)
PASS: lldb-api :: functionalities/float-display/TestFloatDisplay.py (1728 of 1906)
PASS: lldb-api :: lang/c/tls_globals/TestTlsGlobals.py (1729 of 1906)
PASS: lldb-shell :: Minidump/breakpad-symbols.test (1730 of 1906)
PASS: lldb-unit :: Symbol/./SymbolTests/TestClangASTImporter.MetadataPropagationIndirectImport (1731 of 1906)
PASS: lldb-api :: functionalities/thread/concurrent_events/TestConcurrentBreakpointOneDelayBreakpointThreads.py (1732 of 1906)
PASS: lldb-unit :: Utility/./UtilityTests/AnsiTerminal.Incomplete (1733 of 1906)
PASS: lldb-shell :: SymbolFile/DWARF/find-variable-dwo.cpp (1734 of 1906)
UNSUPPORTED: lldb-api :: python_api/disassemble-raw-data/TestDisassemble_VST1_64.py (1735 of 1906)
PASS: lldb-unit :: Utility/./UtilityTests/StreamTest.ChangingByteOrder (1736 of 1906)
PASS: lldb-unit :: Utility/./UtilityTests/LogTest.LLDB_LOG_nullptr (1737 of 1906)
PASS: lldb-api :: macosx/thread-names/TestInterruptThreadNames.py (1738 of 1906)
PASS: lldb-unit :: ScriptInterpreter/Python/./ScriptInterpreterPythonTests/PythonDataObjectsTest.TestPythonCallableCheck (1739 of 1906)
PASS: lldb-api :: lang/cpp/breakpoint_in_member_func_w_non_primitive_params/TestBreakpointInMemberFuncWNonPrimitiveParams.py (1740 of 1906)
PASS: lldb-unit :: Expression/./ExpressionTests/CppModuleConfigurationTest.LibCppV2 (1741 of 1906)
PASS: lldb-api :: macosx/load-kext/TestLoadKext.py (1742 of 1906)
PASS: lldb-api :: tools/lldb-server/register-reading/TestGdbRemoteGPacket.py (1743 of 1906)
PASS: lldb-api :: functionalities/load_using_paths/TestLoadUsingPaths.py (1744 of 1906)
PASS: lldb-api :: macosx/version_zero/TestGetVersionZeroVersion.py (1745 of 1906)
PASS: lldb-unit :: Utility/./UtilityTests/StringListTest.DefaultConstructor (1746 of 1906)
PASS: lldb-shell :: SymbolFile/DWARF/find-variable-file.cpp (1747 of 1906)
PASS: lldb-unit :: Language/Highlighting/./HighlighterTests/HighlighterTest.DefaultHighlighterWithCursorOutOfBounds (1748 of 1906)
PASS: lldb-shell :: SymbolFile/DWARF/find-basic-function.cpp (1749 of 1906)
PASS: lldb-api :: functionalities/wrong_commands/TestWrongCommands.py (1750 of 1906)
PASS: lldb-shell :: Minidump/Windows/Sigsegv/sigsegv.test (1751 of 1906)
PASS: lldb-unit :: Utility/./UtilityTests/GeneratorTest.Get (1752 of 1906)
PASS: lldb-unit :: ScriptInterpreter/Python/./ScriptInterpreterPythonTests/PythonDataObjectsTest.TestGlobalNameResolutionNoDot (1753 of 1906)
PASS: lldb-unit :: Utility/./UtilityTests/SerializationRountripTest.SerializeDeserializePodReferences (1754 of 1906)
PASS: lldb-api :: arm/emulation/TestEmulations.py (1755 of 1906)
PASS: lldb-shell :: Settings/TestModuleCacheSanity.test (1756 of 1906)
PASS: lldb-api :: commands/frame/diagnose/dereference-argument/TestDiagnoseDereferenceArgument.py (1757 of 1906)
PASS: lldb-unit :: Utility/./UtilityTests/RangeTest.Constructor (1758 of 1906)
PASS: lldb-shell :: SymbolFile/DWARF/childless-compile-unit.s (1759 of 1906)
UNSUPPORTED: lldb-shell :: ExecControl/StopHook/stop-hook-threads.test (1760 of 1906)
PASS: lldb-unit :: Language/CPlusPlus/./LanguageCPlusPlusTests/CPlusPlusLanguage.FindAlternateFunctionManglings (1761 of 1906)
PASS: lldb-unit :: Utility/./UtilityTests/ArgsTest.TestTrailingBackslash (1762 of 1906)
PASS: lldb-unit :: Utility/./UtilityTests/SerializationRountripTest.SerializeDeserializePodPointers (1763 of 1906)
UNSUPPORTED: lldb-api :: benchmarks/expression/TestRepeatedExprs.py (1764 of 1906)
PASS: lldb-unit :: Utility/./UtilityTests/StringExtractorTest.GetHexU8_Exact (1765 of 1906)
UNSUPPORTED: lldb-shell :: SymbolFile/PDB/pointers.test (1766 of 1906)
PASS: lldb-unit :: Utility/./UtilityTests/CompletionRequest.TryCompleteCurrentArgBad (1767 of 1906)
PASS: lldb-shell :: SymbolFile/Breakpad/stack-cfi-parsing.test (1768 of 1906)
PASS: lldb-unit :: Target/./TargetTests/ModuleCacheTest.GetAndPutUuidExists (1769 of 1906)
PASS: lldb-api :: functionalities/gdb_remote_client/TestJLink6Armv7RegisterDefinition.py (1770 of 1906)
PASS: lldb-api :: commands/breakpoint/command/list/TestBreakpointCommandList.py (1771 of 1906)
PASS: lldb-api :: lang/objc/modules-inline-functions/TestModulesInlineFunctions.py (1772 of 1906)
PASS: lldb-api :: macosx/safe-to-func-call/TestSafeFuncCalls.py (1773 of 1906)
PASS: lldb-unit :: ScriptInterpreter/Python/./ScriptInterpreterPythonTests/PythonDataObjectsTest.TestInstanceNameResolutionNoDot (1774 of 1906)
PASS: lldb-shell :: ObjectFile/ELF/minidebuginfo-corrupt-xz.yaml (1775 of 1906)
PASS: lldb-api :: functionalities/thread/jump/TestThreadJump.py (1776 of 1906)
PASS: lldb-shell :: SymbolFile/DWARF/debug_rnglists-dwo.s (1777 of 1906)
PASS: lldb-unit :: Process/gdb-remote/./ProcessGdbRemoteTests/GDBRemoteCommunicationClientTest.GetModulesInfo (1778 of 1906)
PASS: lldb-api :: commands/expression/options/TestExprOptions.py (1779 of 1906)
PASS: lldb-api :: tools/lldb-server/TestGdbRemoteExpeditedRegisters.py (1780 of 1906)
PASS: lldb-api :: commands/expression/issue_11588/Test11588.py (1781 of 1906)
PASS: lldb-unit :: Utility/./UtilityTests/StreamTest.PutHex64ByteOrderBig (1782 of 1906)
PASS: lldb-api :: functionalities/data-formatter/data-formatter-objc/TestDataFormatterObjCExpr.py (1783 of 1906)
PASS: lldb-api :: functionalities/breakpoint/breakpoint_set_restart/TestBreakpointSetRestart.py (1784 of 1906)
PASS: lldb-unit :: Expression/./ExpressionTests/DiagnosticManagerTest.AppendMessageAttachToLastDiag (1785 of 1906)
PASS: lldb-api :: python_api/get-value-32bit-int/TestGetValue32BitInt.py (1786 of 1906)
PASS: lldb-api :: lang/objc/modules/TestObjCModules.py (1787 of 1906)
PASS: lldb-shell :: ObjectFile/MachO/subsections.yaml (1788 of 1906)
PASS: lldb-shell :: Commands/command-script-import.test (1789 of 1906)
PASS: lldb-api :: lang/cpp/gmodules-templates/TestGModules.py (1790 of 1906)
PASS: lldb-unit :: Process/minidump/./LLDBMinidumpTests/MinidumpParserTest.GetFilteredModuleList (1791 of 1906)
PASS: lldb-unit :: Utility/./UtilityTests/LogChannelTest.EnableOptions (1792 of 1906)
PASS: lldb-api :: lang/cpp/stl/TestSTL.py (1793 of 1906)
PASS: lldb-shell :: SymbolFile/DWARF/debug_line-relative_path.s (1794 of 1906)
PASS: lldb-api :: functionalities/gdb_remote_client/TestTargetXMLArch.py (1795 of 1906)
UNSUPPORTED: lldb-api :: tools/lldb-server/TestGdbRemoteModuleInfo.py (1796 of 1906)
UNSUPPORTED: lldb-api :: functionalities/darwin_log/source/debug/TestDarwinLogSourceDebug.py (1797 of 1906)
PASS: lldb-unit :: Symbol/./SymbolTests/TestClangASTImporter.RecordLayout (1798 of 1906)
PASS: lldb-unit :: Utility/./UtilityTests/ArgsTest.TestQuotedUnknownEscape (1799 of 1906)
PASS: lldb-unit :: Language/Highlighting/./HighlighterTests/HighlighterTest.ClangCursorPosBeforeOtherToken (1800 of 1906)
UNSUPPORTED: lldb-shell :: ScriptInterpreter/Lua/bindings.test (1801 of 1906)
PASS: lldb-unit :: Utility/./UtilityTests/ScalarTest.CastOperations (1802 of 1906)
PASS: lldb-unit :: SymbolFile/NativePDB/./SymbolFileNativePDBTests/PDBFPOProgramToDWARFExpressionTests.MissingTargetRegister (1803 of 1906)
PASS: lldb-api :: lang/cpp/dynamic-value-same-basename/TestDynamicValueSameBase.py (1804 of 1906)
PASS: lldb-unit :: Utility/./UtilityTests/StringExtractorTest.GetHexU8_Underflow (1805 of 1906)
PASS: lldb-unit :: Language/Highlighting/./HighlighterTests/HighlighterTest.ClangCursorPosInOtherToken (1806 of 1906)
PASS: lldb-api :: functionalities/stats_api/TestStatisticsAPI.py (1807 of 1906)
PASS: lldb-shell :: Settings/TestEchoCommands.test (1808 of 1906)
UNSUPPORTED: lldb-api :: functionalities/darwin_log/filter/regex/activity-chain/TestDarwinLogFilterRegexActivityChain.py (1809 of 1906)
PASS: lldb-api :: lang/cpp/const_this/TestConstThis.py (1810 of 1906)
PASS: lldb-api :: functionalities/fat_archives/TestFatArchives.py (1811 of 1906)
PASS: lldb-api :: lang/objc/foundation/TestObjCMethodsNSArray.py (1812 of 1906)
PASS: lldb-unit :: ObjectFile/Breakpad/./ObjectFileBreakpadTests/LineRecord.parse (1813 of 1906)
PASS: lldb-unit :: Symbol/./SymbolTests/TestClangASTImporter.MetadataPropagationAfterCopying (1814 of 1906)
PASS: lldb-shell :: ObjectFile/ELF/compressed-sections.yaml (1815 of 1906)
PASS: lldb-unit :: Host/./HostTests/TaskPoolTest.RunTasks (1816 of 1906)
UNSUPPORTED: lldb-shell :: Unwind/eh-frame-small-fde.test (1817 of 1906)
UNSUPPORTED: lldb-shell :: ScriptInterpreter/Lua/nested_sessions.test (1818 of 1906)
PASS: lldb-api :: commands/expression/radar_8638051/Test8638051.py (1819 of 1906)
PASS: lldb-shell :: SymbolFile/DWARF/deterministic-build.cpp (1820 of 1906)
PASS: lldb-unit :: Utility/./UtilityTests/ScalarTest.Scalar_512 (1821 of 1906)
PASS: lldb-shell :: SymbolFile/Breakpad/unwind-via-stack-win.test (1822 of 1906)
PASS: lldb-unit :: Utility/./UtilityTests/StringExtractorTest.DecodeHexU8_Extra (1823 of 1906)
PASS: lldb-unit :: Utility/./UtilityTests/RangeTest.SetRangeBase (1824 of 1906)
PASS: lldb-api :: macosx/find-app-in-bundle/TestFindAppInBundle.py (1825 of 1906)
PASS: lldb-unit :: ObjectFile/PECOFF/./ObjectFilePECOFFTests/PECallFrameInfoTest.Frame_reg_eh (1826 of 1906)
PASS: lldb-unit :: Process/minidump/./LLDBMinidumpTests/RegisterContextMinidump.CheckRegisterContextMinidump_ARM (1827 of 1906)
PASS: lldb-unit :: Expression/./ExpressionTests/DiagnosticManagerTest.GetStringBasic (1828 of 1906)
PASS: lldb-unit :: Utility/./UtilityTests/ArgsTest.DoubleQuotedItem (1829 of 1906)
PASS: lldb-unit :: Utility/./UtilityTests/BinaryStreamTest.PutSLEB128ThreeBytes (1830 of 1906)
PASS: lldb-unit :: Utility/./UtilityTests/TimeoutTest.Construction (1831 of 1906)
PASS: lldb-api :: lang/c/inlines/TestRedefinitionsInInlines.py (1832 of 1906)
PASS: lldb-unit :: Utility/./UtilityTests/RecordReplayTest.InstrumentedBarPtr (1833 of 1906)
PASS: lldb-api :: python_api/class_members/TestSBTypeClassMembers.py (1834 of 1906)
PASS: lldb-api :: functionalities/breakpoint/require_hw_breakpoints/TestRequireHWBreakpoints.py (1835 of 1906)
PASS: lldb-api :: commands/watchpoints/watchpoint_commands/command/TestWatchpointCommandPython.py (1836 of 1906)
UNSUPPORTED: lldb-api :: tools/lldb-server/signal-filtering/TestGdbRemote_QPassSignals.py (1837 of 1906)
UNSUPPORTED: lldb-shell :: Register/x86-64-xmm16-read.test (1838 of 1906)
PASS: lldb-shell :: SymbolFile/DWARF/array-sizes.s (1839 of 1906)
PASS: lldb-unit :: Utility/./UtilityTests/StreamTest.PutNHex8 (1840 of 1906)
PASS: lldb-unit :: Utility/./UtilityTests/ArgsTest.TestMultipleArgs (1841 of 1906)
PASS: lldb-api :: functionalities/thread/concurrent_events/TestConcurrentTwoWatchpointsOneDelayBreakpoint.py (1842 of 1906)
UNSUPPORTED: lldb-api :: functionalities/asan/TestReportData.py (1843 of 1906)
PASS: lldb-unit :: Symbol/./SymbolTests/DWARFCallFrameInfoTest.Basic_eh (1844 of 1906)
PASS: lldb-api :: lang/cpp/this/TestCPPThis.py (1845 of 1906)
PASS: lldb-api :: python_api/sbtype_typeclass/TestSBTypeTypeClass.py (1846 of 1906)
PASS: lldb-unit :: Utility/./UtilityTests/DataExtractorTest.GetCStrEmpty (1847 of 1906)
PASS: lldb-unit :: Utility/./UtilityTests/StringExtractorTest.GetHexU8_Extra_NoEof (1848 of 1906)
PASS: lldb-shell :: SymbolFile/DWARF/forward-declarations.s (1849 of 1906)
PASS: lldb-unit :: Utility/./UtilityTests/ArchSpecTest.MergeFrom (1850 of 1906)
PASS: lldb-api :: commands/disassemble/basic/TestDisassembleBreakpoint.py (1851 of 1906)
PASS: lldb-api :: functionalities/data-formatter/nsarraysynth/TestNSArraySynthetic.py (1852 of 1906)
PASS: lldb-api :: macosx/queues/TestQueues.py (1853 of 1906)
PASS: lldb-unit :: Utility/./UtilityTests/ArchSpecTest.TestParseMachCPUDashSubtypeTripleSimple (1854 of 1906)
PASS: lldb-unit :: ScriptInterpreter/Python/./ScriptInterpreterPythonTests/PythonDataObjectsTest.TestPythonByteArray (1855 of 1906)
PASS: lldb-unit :: Host/./HostTests/FileSystemTest.FileAndDirectoryComponents (1856 of 1906)
PASS: lldb-api :: functionalities/data-formatter/data-formatter-stl/libcxx/multiset/TestDataFormatterLibcxxMultiSet.py (1857 of 1906)
PASS: lldb-unit :: Utility/./UtilityTests/StreamTeeTest.GetStreamAtIndexOutOfBoundsEmpty (1858 of 1906)
PASS: lldb-unit :: Expression/./ExpressionTests/DiagnosticManagerTest.PutStringSeverities (1859 of 1906)
XFAIL: lldb-shell :: Register/x86-mm-xmm-write.test (1860 of 1906)
PASS: lldb-unit :: Utility/./UtilityTests/StringListTest.CopyListEmpty (1861 of 1906)
PASS: lldb-shell :: Commands/command-source.test (1862 of 1906)
PASS: lldb-unit :: Utility/./UtilityTests/StringExtractorTest.GetHexBytes_FullString (1863 of 1906)
PASS: lldb-unit :: UnwindAssembly/x86/./UnwindAssemblyx86Tests/Testx86AssemblyInspectionEngine.TestPushEBX (1864 of 1906)
PASS: lldb-unit :: Utility/./UtilityTests/FileSpecTest.EqualDotsWindows (1865 of 1906)
PASS: lldb-api :: python_api/sbvalue_const_addrof/TestSBValueConstAddrOf.py (1866 of 1906)
PASS: lldb-api :: commands/expression/context-object-objc/TestContextObjectObjc.py (1867 of 1906)
UNSUPPORTED: lldb-shell :: SymbolFile/dissassemble-entry-point.s (1868 of 1906)
PASS: lldb-unit :: Utility/./UtilityTests/StreamTeeTest.Constructor1Stream (1869 of 1906)
PASS: lldb-unit :: Utility/./UtilityTests/UriParserTest.SchemeHostSeparator3 (1870 of 1906)
PASS: lldb-unit :: ScriptInterpreter/Python/./ScriptInterpreterPythonTests/PythonDataObjectsTest.TestPythonListToStructuredList (1871 of 1906)
PASS: lldb-api :: functionalities/param_entry_vals/basic_entry_values_x86_64/TestBasicEntryValuesX86_64.py (1872 of 1906)
PASS: lldb-unit :: Core/./LLDBCoreTests/RichManglingContextTest.Basic (1873 of 1906)
PASS: lldb-unit :: Target/./TargetTests/ModuleCacheTest.GetAndPutStrangeHostname (1874 of 1906)
PASS: lldb-unit :: Utility/./UtilityTests/StringListTest.JoinNonSpace (1875 of 1906)
PASS: lldb-api :: tools/lldb-vscode/attach/TestVSCode_attach.py (1876 of 1906)
PASS: lldb-unit :: Language/Highlighting/./HighlighterTests/HighlighterTest.ClangTrailingBackslashWithWhitespace (1877 of 1906)
PASS: lldb-unit :: Process/minidump/./LLDBMinidumpTests/MinidumpParserTest.MinidumpDuplicateModuleMinAddress (1878 of 1906)
PASS: lldb-unit :: Utility/./UtilityTests/StringLexerTest.HasAtLeast (1879 of 1906)
PASS: lldb-api :: lang/cpp/bool/TestCPPBool.py (1880 of 1906)
UNSUPPORTED: lldb-api :: tools/lldb-vscode/completions/TestVSCode_completions.py (1881 of 1906)
PASS: lldb-shell :: Reproducer/TestDump.test (1882 of 1906)
PASS: lldb-unit :: Symbol/./SymbolTests/PostfixExpression.ParseOneExpression (1883 of 1906)
UNRESOLVED: lldb-api :: functionalities/breakpoint/comp_dir_symlink/TestCompDirSymLink.py (1884 of 1906)
******************** TEST 'lldb-api :: functionalities/breakpoint/comp_dir_symlink/TestCompDirSymLink.py' FAILED ********************
Unable to find 'RESULT: PASSED' in dotest output (exit code -6):

Hide Details

lldb version 11.0.99 clang revision 0478eadf73c191199cba12c85785cfafb8bfa174 llvm revision 0478eadf73c191199cba12c85785cfafb8bfa174 AddressSanitizer:DEADLYSIGNAL ================================================================= ==34779==ERROR: AddressSanitizer: SEGV on unknown address 0x000000000000 (pc 0x7fff77668712 bp 0x7ffee9768f10 sp 0x7ffee9768f10 T0) ==34779==The signal is caused by a READ memory access. ==34779==Hint: address points to the zero page. #0 0x7fff77668712 in _platform_strlen+0x12 (libsystem_platform.dylib:x86_64+0x1712) #1 0x1064cf91b in wrap_readlink+0x5b (libclang_rt.asan_osx_dynamic.dylib:x86_64+0x3991b) #2 0x10db45517 in lldb_private::FileSystem::Readlink(lldb_private::FileSpec const&, lldb_private::FileSpec&) FileSystemPosix.cpp:46 #3 0x10d8d803d in lldb_private::ModuleListProperties::UpdateSymlinkMappings() ModuleList.cpp:122 #4 0x10dbd8d24 in lldb_private::OptionValueFileSpecList::SetValueFromString(llvm::StringRef, lldb_private::VarSetOperationType) OptionValueFileSpecList.cpp #5 0x10dbe4f11 in lldb_private::OptionValueProperties::SetSubValue(lldb_private::ExecutionContext const*, lldb_private::VarSetOperationType, llvm::StringRef, llvm::StringRef) OptionValueProperties.cpp:209 #6 0x10d969fb0 in lldb_private::Properties::SetPropertyValue(lldb_private::ExecutionContext const*, lldb_private::VarSetOperationType, llvm::StringRef, llvm::StringRef) UserSettingsController.cpp:49 #7 0x10d8069fb in lldb_private::Debugger::SetPropertyValue(lldb_private::ExecutionContext const*, lldb_private::VarSetOperationType, llvm::StringRef, llvm::StringRef) Debugger.cpp:275 #8 0x1103c5cef in CommandObjectSettingsSet::DoExecute(llvm::StringRef, lldb_private::CommandReturnObject&) CommandObjectSettings.cpp:222 #9 0x10db9da02 in lldb_private::CommandObjectRaw::Execute(char const*, lldb_private::CommandReturnObject&) CommandObject.cpp:1003 #10 0x10db7820a in lldb_private::CommandInterpreter::HandleCommand(char const*, lldb_private::LazyBool, lldb_private::CommandReturnObject&, lldb_private::ExecutionContext*, bool, bool) CommandInterpreter.cpp:1762 #11 0x10ccfeab7 in lldb::SBCommandInterpreter::HandleCommand(char const*, lldb::SBExecutionContext&, lldb::SBCommandReturnObject&, bool) SBCommandInterpreter.cpp:281 #12 0x10ccfddaa in lldb::SBCommandInterpreter::HandleCommand(char const*, lldb::SBCommandReturnObject&, bool) SBCommandInterpreter.cpp:259 #13 0x10d4b2f58 in _wrap_SBCommandInterpreter_HandleCommand(_object*, _object*) LLDBWrapPython.cpp:14074 #14 0x107223bda in PyCFunction_Call+0x140 (Python:x86_64+0x19bda) #15 0x1072b29e2 in _PyEval_EvalFrameDefault+0x1f45 (Python:x86_64+0xa89e2) #16 0x1072ba2da in _PyEval_EvalCodeWithName+0x72a (Python:x86_64+0xb02da) #17 0x10722388b in _PyFunction_FastCallKeywords+0xe0 (Python:x86_64+0x1988b) #18 0x1072b997d in call_function+0x256 (Python:x86_64+0xaf97d) #19 0x1072b25d5 in _PyEval_EvalFrameDefault+0x1b38 (Python:x86_64+0xa85d5) #20 0x1072ba2da in _PyEval_EvalCodeWithName+0x72a (Python:x86_64+0xb02da) #21 0x10722388b in _PyFunction_FastCallKeywords+0xe0 (Python:x86_64+0x1988b) #22 0x1072b997d in call_function+0x256 (Python:x86_64+0xaf97d) #23 0x1072b25d5 in _PyEval_EvalFrameDefault+0x1b38 (Python:x86_64+0xa85d5) #24 0x107223ca1 in function_code_fastcall+0x6f (Python:x86_64+0x19ca1) #25 0x1072b997d in call_function+0x256 (Python:x86_64+0xaf97d) #26 0x1072b25d5 in _PyEval_EvalFrameDefault+0x1b38 (Python:x86_64+0xa85d5) #27 0x107223ca1 in function_code_fastcall+0x6f (Python:x86_64+0x19ca1) #28 0x1072b2905 in _PyEval_EvalFrameDefault+0x1e68 (Python:x86_64+0xa8905) #29 0x1072ba2da in _PyEval_EvalCodeWithName+0x72a (Python:x86_64+0xb02da) #30 0x10722388b in _PyFunction_FastCallKeywords+0xe0 (Python:x86_64+0x1988b) #31 0x1072b997d in call_function+0x256 (Python:x86_64+0xaf97d) #32 0x1072b268c in _PyEval_EvalFrameDefault+0x1bef (Python:x86_64+0xa868c) #33 0x1072ba2da in _PyEval_EvalCodeWithName+0x72a (Python:x86_64+0xb02da) #34 0x10722388b in _PyFunction_FastCallKeywords+0xe0 (Python:x86_64+0x1988b) #35 0x1072b997d in call_function+0x256 (Python:x86_64+0xaf97d) #36 0x1072b268c in _PyEval_EvalFrameDefault+0x1bef (Python:x86_64+0xa868c) #37 0x107223ca1 in function_code_fastcall+0x6f (Python:x86_64+0x19ca1) #38 0x1072b997d in call_function+0x256 (Python:x86_64+0xaf97d) #39 0x1072b25d5 in _PyEval_EvalFrameDefault+0x1b38 (Python:x86_64+0xa85d5) #40 0x1072ba2da in _PyEval_EvalCodeWithName+0x72a (Python:x86_64+0xb02da) #41 0x1072234f4 in _PyFunction_FastCallDict+0x1b8 (Python:x86_64+0x194f4) #42 0x107224624 in _PyObject_Call_Prepend+0x95 (Python:x86_64+0x1a624) #43 0x1072239d4 in PyObject_Call+0x87 (Python:x86_64+0x199d4) #44 0x1072b2905 in _PyEval_EvalFrameDefault+0x1e68 (Python:x86_64+0xa8905) #45 0x1072ba2da in _PyEval_EvalCodeWithName+0x72a (Python:x86_64+0xb02da) #46 0x1072234f4 in _PyFunction_FastCallDict+0x1b8 (Python:x86_64+0x194f4) #47 0x107224624 in _PyObject_Call_Prepend+0x95 (Python:x86_64+0x1a624) #48 0x1072614af in slot_tp_call+0x46 (Python:x86_64+0x574af) #49 0x10722372c in _PyObject_FastCallKeywords+0x166 (Python:x86_64+0x1972c) #50 0x1072b9976 in call_function+0x24f (Python:x86_64+0xaf976) #51 0x1072b268c in _PyEval_EvalFrameDefault+0x1bef (Python:x86_64+0xa868c) #52 0x1072ba2da in _PyEval_EvalCodeWithName+0x72a (Python:x86_64+0xb02da) #53 0x10722388b in _PyFunction_FastCallKeywords+0xe0 (Python:x86_64+0x1988b) #54 0x1072b997d in call_function+0x256 (Python:x86_64+0xaf97d) #55 0x1072b25d5 in _PyEval_EvalFrameDefault+0x1b38 (Python:x86_64+0xa85d5) #56 0x1072ba2da in _PyEval_EvalCodeWithName+0x72a (Python:x86_64+0xb02da) #57 0x10722388b in _PyFunction_FastCallKeywords+0xe0 (Python:x86_64+0x1988b) #58 0x1072b997d in call_function+0x256 (Python:x86_64+0xaf97d) #59 0x1072b25d5 in _PyEval_EvalFrameDefault+0x1b38 (Python:x86_64+0xa85d5) #60 0x107223ca1 in function_code_fastcall+0x6f (Python:x86_64+0x19ca1) #61 0x107224624 in _PyObject_Call_Prepend+0x95 (Python:x86_64+0x1a624) #62 0x1072239d4 in PyObject_Call+0x87 (Python:x86_64+0x199d4) #63 0x1072b2905 in _PyEval_EvalFrameDefault+0x1e68 (Python:x86_64+0xa8905) #64 0x1072ba2da in _PyEval_EvalCodeWithName+0x72a (Python:x86_64+0xb02da) #65 0x1072234f4 in _PyFunction_FastCallDict+0x1b8 (Python:x86_64+0x194f4) #66 0x107224624 in _PyObject_Call_Prepend+0x95 (Python:x86_64+0x1a624) #67 0x1072614af in slot_tp_call+0x46 (Python:x86_64+0x574af) #68 0x10722372c in _PyObject_FastCallKeywords+0x166 (Python:x86_64+0x1972c) #69 0x1072b9976 in call_function+0x24f (Python:x86_64+0xaf976) #70 0x1072b268c in _PyEval_EvalFrameDefault+0x1bef (Python:x86_64+0xa868c) #71 0x107223ca1 in function_code_fastcall+0x6f (Python:x86_64+0x19ca1) #72 0x1072b997d in call_function+0x256 (Python:x86_64+0xaf97d) #73 0x1072b25d5 in _PyEval_EvalFrameDefault+0x1b38 (Python:x86_64+0xa85d5) #74 0x107223ca1 in function_code_fastcall+0x6f (Python:x86_64+0x19ca1) #75 0x1072b997d in call_function+0x256 (Python:x86_64+0xaf97d) #76 0x1072b25ee in _PyEval_EvalFrameDefault+0x1b51 (Python:x86_64+0xa85ee) #77 0x1072ba2da in _PyEval_EvalCodeWithName+0x72a (Python:x86_64+0xb02da) #78 0x1072b0a14 in PyEval_EvalCode+0x29 (Python:x86_64+0xa6a14) #79 0x1072df2aa in run_mod+0x35 (Python:x86_64+0xd52aa) #80 0x1072de2c5 in PyRun_FileExFlags+0xa3 (Python:x86_64+0xd42c5) #81 0x1072dd9a4 in PyRun_SimpleFileExFlags+0x114 (Python:x86_64+0xd39a4) #82 0x1072f5010 in pymain_main+0x13de (Python:x86_64+0xeb010) #83 0x1072f57b7 in _Py_UnixMain+0x67 (Python:x86_64+0xeb7b7) #84 0x7fff77482084 in start+0x0 (libdyld.dylib:x86_64+0x17084)

Hide Details

==34779==Register values: rax = 0x00000001071988f0 rbx = 0x0000000000000000 rcx = 0x0000000000000000 rdx = 0x0000000000000000 rdi = 0x0000000000000000 rsi = 0x000000010a565020 rbp = 0x00007ffee9768f10 rsp = 0x00007ffee9768f10 r8 = 0x0000000003184397 r9 = 0xffffffff00000000 r10 = 0x0000631000079b18 r11 = 0x0000000000000001 r12 = 0x000000010a4648c0 r13 = 0x00001000214aca00 r14 = 0x00000000000003ff r15 = 0x000000010a565020 AddressSanitizer can not provide additional info. SUMMARY: AddressSanitizer: SEGV (libsystem_platform.dylib:x86_64+0x1712) in _platform_strlen+0x12 ==34779==ABORTING

Hide Details

******************** PASS: lldb-unit :: UnwindAssembly/x86/./UnwindAssemblyx86Tests/Testx86AssemblyInspectionEngine.TestPushEAX (1885 of 1906) PASS: lldb-shell :: SymbolFile/DWARF/dwarf5-partial-index.cpp (1886 of 1906) UNSUPPORTED: lldb-api :: functionalities/ubsan/basic/TestUbsanBasic.py (1887 of 1906) UNSUPPORTED: lldb-shell :: SymbolFile/NativePDB/stack_unwinding01.cpp (1888 of 1906) PASS: lldb-shell :: SymbolFile/DWARF/dwarf5-debug_line.s (1889 of 1906) PASS: lldb-api :: lang/objcxx/cxx-bridged-po/TestObjCXXBridgedPO.py (1890 of 1906) PASS: lldb-api :: commands/process/attach/TestProcessAttach.py (1891 of 1906) PASS: lldb-unit :: Utility/./UtilityTests/BinaryStreamTest.PutULEB128EightBytes (1892 of 1906) PASS: lldb-api :: functionalities/data-formatter/data-formatter-skip-summary/TestDataFormatterSkipSummary.py (1893 of 1906) PASS: lldb-unit :: Expression/./ExpressionTests/DiagnosticManagerTest.HasFixits (1894 of 1906) PASS: lldb-api :: functionalities/thread/concurrent_events/TestConcurrentWatchpointWithDelayWatchpointThreads.py (1895 of 1906) PASS: lldb-unit :: Utility/./UtilityTests/SerializationRountripTest.SerializeDeserializePod (1896 of 1906) PASS: lldb-api :: functionalities/data-formatter/data-formatter-enum-format/TestDataFormatterEnumFormat.py (1897 of 1906) PASS: lldb-api :: commands/watchpoints/hello_watchpoint/TestMyFirstWatchpoint.py (1898 of 1906) PASS: lldb-unit :: Host/./HostTests/TaskPoolTest.TaskMap (1899 of 1906) PASS: lldb-unit :: ObjectFile/Breakpad/./ObjectFileBreakpadTests/PublicRecord.parse (1900 of 1906) PASS: lldb-shell :: ObjectFile/ELF/PT_LOAD-overlap.yaml (1901 of 1906) PASS: lldb-unit :: Utility/./UtilityTests/Flags.GetBitSize (1902 of 1906) PASS: lldb-unit :: Utility/./UtilityTests/ArgsTest.ReplaceArgumentAtIndexEqual (1903 of 1906) PASS: lldb-api :: functionalities/data-formatter/nsdictionarysynth/TestNSDictionarySynthetic.py (1904 of 1906) PASS: lldb-api :: functionalities/thread/concurrent_events/TestConcurrentCrashWithWatchpointBreakpointSignal.py (1905 of 1906) PASS: lldb-api :: commands/expression/call-function/TestCallStopAndContinue.py (1906 of 1906)

Hide Details

Testing Time: 4204.71s ******************** Unresolved Tests (1): lldb-api :: functionalities/breakpoint/comp_dir_symlink/TestCompDirSymLink.py

Hide Details

Hide Details

Slowest Tests: -------------------------------------------------------------------------- 89.59s: lldb-api :: functionalities/data-formatter/compactvectors/TestCompactVectors.py 93.18s: lldb-api :: types/TestShortType.py 96.19s: lldb-api :: types/TestLongTypes.py 100.68s: lldb-api :: python_api/lldbutil/iter/TestLLDBIterator.py 113.10s: lldb-api :: lang/objc/foundation/TestObjCMethodsNSError.py 114.24s: lldb-api :: lang/objc/foundation/TestObjCMethodsString.py 114.89s: lldb-api :: lang/objc/objc-new-syntax/TestObjCNewSyntaxArray.py 115.68s: lldb-api :: lang/objc/objc-new-syntax/TestObjCNewSyntaxDictionary.py 119.21s: lldb-api :: tools/lldb-server/TestGdbRemote_qThreadStopInfo.py 131.95s: lldb-api :: types/TestLongTypesExpr.py 138.91s: lldb-api :: lang/objc/real-definition/TestRealDefinition.py 151.20s: lldb-api :: lang/objc/objc-new-syntax/TestObjCNewSyntaxLiteral.py 162.01s: lldb-api :: lang/cpp/namespace/TestNamespaceLookup.py 184.85s: lldb-api :: lang/objc/exceptions/TestObjCExceptions.py 212.64s: lldb-api :: lang/objc/foundation/TestObjCMethods.py 236.16s: lldb-api :: lang/objc/hidden-ivars/TestHiddenIvars.py 249.78s: lldb-api :: tools/lldb-server/TestGdbRemoteThreadsInStopReply.py 251.27s: lldb-api :: api/multithreaded/TestMultithreaded.py 268.59s: lldb-api :: lang/cpp/enum_types/TestCPP11EnumTypes.py 361.39s: lldb-api :: tools/lldb-server/TestLldbGdbServer.py

Hide Details

Tests Times: -------------------------------------------------------------------------- [ Range ] :: [ Percentage ] :: [ Count ] -------------------------------------------------------------------------- [ 0s, 20s) :: [********************************** ] :: [1657/1906] [ 20s, 40s) :: [** ] :: [ 120/1906] [ 40s, 60s) :: [* ] :: [ 77/1906] [ 60s, 80s) :: [ ] :: [ 25/1906] [ 80s,100s) :: [ ] :: [ 9/1906] [100s,120s) :: [ ] :: [ 3/1906] [120s,140s) :: [ ] :: [ 5/1906] [140s,160s) :: [ ] :: [ 2/1906] [160s,180s) :: [ ] :: [ 1/1906] [180s,200s) :: [ ] :: [ 1/1906] [200s,220s) :: [ ] :: [ 0/1906] [220s,240s) :: [ ] :: [ 1/1906] [240s,260s) :: [ ] :: [ 1/1906] [260s,280s) :: [ ] :: [ 2/1906] [280s,300s) :: [ ] :: [ 1/1906] [300s,320s) :: [ ] :: [ 0/1906] [320s,340s) :: [ ] :: [ 0/1906] [340s,360s) :: [ ] :: [ 0/1906] [360s,380s) :: [ ] :: [ 1/1906] Expected Passes : 1735 Expected Failures : 6 Unsupported Tests : 164 Unresolved Tests : 1 FAILED: tools/lldb/test/CMakeFiles/check-lldb-lit cd /Users/buildslave/jenkins/workspace/lldb-cmake-sanitized/lldb-build/tools/lldb/test && /usr/local/bin/python /Users/buildslave/jenkins/workspace/lldb-cmake-sanitized/lldb-build/./bin/llvm-lit -v --time-tests --shuffle --xunit-xml-output=/Users/buildslave/jenkins/workspace/lldb-cmake-sanitized/test/results.xml -v -j 4 --timeout 1200 /Users/buildslave/jenkins/workspace/lldb-cmake-sanitized/lldb-build/tools/lldb/test ninja: build stopped: subcommand failed. Command failed: Command '['/usr/bin/env', 'TERM=vt100', '/usr/local/bin/ninja', '-v', 'check-lldb']' returned non-zero exit status 1. Command: ['/usr/bin/env', 'TERM=vt100', '/usr/local/bin/ninja', '-v', 'check-lldb'] [Pipeline] } [Pipeline] // timeout [Pipeline] } [Pipeline] // stage [Pipeline] stage [Pipeline] { (Declarative: Post Actions) [Pipeline] scanForIssues No credentials specified [Clang (LLVM based)] Sleeping for 5 seconds due to JENKINS-32191... [Clang (LLVM based)] Parsing console log (workspace: '/Users/buildslave/jenkins/workspace/lldb-cmake-sanitized') [Pipeline] junit Recording test results [Pipeline] } [Pipeline] // stage [Pipeline] } [Pipeline] // withEnv [Pipeline] } [Pipeline] // node [Pipeline] End of Pipeline ERROR: script returned exit code 1 Finished: FAILURE