Console Output

Skipping 7,894 KB.. Full Log
PASS: lldb-shell :: Quit/TestQuitExitCode-30.test (545 of 1935)
PASS: lldb-api :: python_api/value/change_values/TestChangeValueAPI.py (546 of 1935)
PASS: lldb-unit :: Expression/./ExpressionTests/CppModuleConfigurationTest.AmbiguousCLib (547 of 1935)
PASS: lldb-unit :: Expression/./ExpressionTests/CppModuleConfigurationTest.Xcode (548 of 1935)
PASS: lldb-api :: functionalities/data-formatter/data-formatter-synthval/TestDataFormatterSynthVal.py (549 of 1935)
PASS: lldb-api :: functionalities/conditional_break/TestConditionalBreak.py (550 of 1935)
PASS: lldb-api :: functionalities/memory-region/TestMemoryRegion.py (551 of 1935)
PASS: lldb-unit :: Utility/./UtilityTests/StringListTest.LongestCommonPrefixSingleElement (552 of 1935)
PASS: lldb-unit :: Utility/./UtilityTests/StringExtractorTest.GetHexBytes (553 of 1935)
PASS: lldb-unit :: Utility/./UtilityTests/StreamTest.ShiftOperatorStrings (554 of 1935)
PASS: lldb-unit :: Host/./HostTests/NativeProcessProtocolTest.ReadCStringFromMemory (555 of 1935)
PASS: lldb-unit :: Utility/./UtilityTests/BinaryStreamTest.PutULEB128TwoBytes (556 of 1935)
PASS: lldb-api :: lang/cpp/signed_types/TestSignedTypes.py (557 of 1935)
UNSUPPORTED: lldb-api :: terminal/TestEditline.py (558 of 1935)
PASS: lldb-api :: commands/platform/basic/TestPlatformPython.py (559 of 1935)
PASS: lldb-unit :: DataFormatter/./LLDBFormatterTests/FormatManagerTests.CompatibleLangs (560 of 1935)
PASS: lldb-shell :: ObjectFile/ELF/section-permissions.yaml (561 of 1935)
PASS: lldb-shell :: Reproducer/Modules/TestModuleCXX.test (562 of 1935)
PASS: lldb-unit :: Process/gdb-remote/./ProcessGdbRemoteTests/GDBRemoteCommunicationClientTest.GetModulesInfo_UUID20 (563 of 1935)
PASS: lldb-api :: lang/objc/objc-struct-argument/TestObjCStructArgument.py (564 of 1935)
PASS: lldb-unit :: Utility/./UtilityTests/BinaryStreamTest.PutSLEB128EightBytes (565 of 1935)
PASS: lldb-unit :: Utility/./UtilityTests/CompletionRequest.Constructor (566 of 1935)
PASS: lldb-api :: commands/watchpoints/watchpoint_commands/command/TestWatchpointCommandLLDB.py (567 of 1935)
PASS: lldb-unit :: Host/./HostTests/FileSystemTest.Resolve (568 of 1935)
UNSUPPORTED: lldb-api :: functionalities/tsan/cpp_global_location/TestTsanCPPGlobalLocation.py (569 of 1935)
PASS: lldb-unit :: UnwindAssembly/x86/./UnwindAssemblyx86Tests/Testx86AssemblyInspectionEngine.TestPopEBP (570 of 1935)
PASS: lldb-unit :: Utility/./UtilityTests/ScalarTest.Comparison (571 of 1935)
PASS: lldb-unit :: Utility/./UtilityTests/StreamTest.PutULEB128 (572 of 1935)
PASS: lldb-api :: lang/objc/foundation/TestObjectDescriptionAPI.py (573 of 1935)
PASS: lldb-api :: lang/cpp/rvalue-references/TestRvalueReferences.py (574 of 1935)
PASS: lldb-unit :: Utility/./UtilityTests/StreamTest.ShiftOperatorPtr (575 of 1935)
UNSUPPORTED: lldb-shell :: SymbolFile/PDB/expressions.test (576 of 1935)
UNSUPPORTED: lldb-api :: functionalities/thread/concurrent_events/TestConcurrentManySignals.py (577 of 1935)
PASS: lldb-shell :: Driver/TestCommands.test (578 of 1935)
PASS: lldb-unit :: Utility/./UtilityTests/DataExtractorTest.GetMaxS64 (579 of 1935)
PASS: lldb-shell :: Reproducer/TestWorkingDir.test (580 of 1935)
PASS: lldb-api :: commands/expression/test/TestExprs2.py (581 of 1935)
UNSUPPORTED: lldb-shell :: BuildScript/toolchain-clang-cl.test (582 of 1935)
PASS: lldb-shell :: ObjectFile/MachO/lc_version_min.yaml (583 of 1935)
PASS: lldb-api :: commands/expression/dollar-in-variable/TestDollarInVariable.py (584 of 1935)
PASS: lldb-api :: lang/objc/real-definition/TestRealDefinition.py (585 of 1935)
PASS: lldb-api :: functionalities/data-formatter/data-formatter-stl/libcxx/queue/TestDataFormatterLibcxxQueue.py (586 of 1935)
PASS: lldb-unit :: Utility/./UtilityTests/AnsiTerminal.Basic (587 of 1935)
PASS: lldb-api :: lang/c/global_variables/TestGlobalVariables.py (588 of 1935)
PASS: lldb-unit :: Symbol/./SymbolTests/TestTypeSystemClang.TestDeletingImplicitCopyCstrDueToMoveCStr (589 of 1935)
PASS: lldb-unit :: Process/gdb-remote/./ProcessGdbRemoteTests/GDBRemoteCommunicationClientTest.TestPacketSpeedJSON (590 of 1935)
PASS: lldb-unit :: Utility/./UtilityTests/ArgsTest.TestArgv (591 of 1935)
PASS: lldb-api :: lang/objc/objc-baseclass-sbtype/TestObjCBaseClassSBType.py (592 of 1935)
PASS: lldb-api :: functionalities/postmortem/wow64_minidump/TestWow64MiniDump.py (593 of 1935)
PASS: lldb-api :: lang/cpp/class_types/TestClassTypes.py (594 of 1935)
UNSUPPORTED: lldb-shell :: Register/arm-fp-read.test (595 of 1935)
PASS: lldb-shell :: Commands/command-backtrace.test (596 of 1935)
PASS: lldb-api :: macosx/duplicate-archive-members/TestDuplicateMembers.py (597 of 1935)
PASS: lldb-api :: lang/cpp/llvm-style/TestLLVMStyle.py (598 of 1935)
PASS: lldb-unit :: Host/./HostTests/FileSystemTest.Exists (599 of 1935)
PASS: lldb-unit :: Language/Highlighting/./HighlighterTests/HighlighterTest.ClangTrailingBackslashBeforeNewline (600 of 1935)
PASS: lldb-api :: functionalities/data-formatter/data-formatter-stl/libcxx/optional/TestDataFormatterLibcxxOptional.py (601 of 1935)
PASS: lldb-api :: python_api/lldbutil/TestSwigVersion.py (602 of 1935)
PASS: lldb-api :: lang/c/vla/TestVLA.py (603 of 1935)
PASS: lldb-unit :: Utility/./UtilityTests/StreamTeeTest.SetStreamAtIndexOutOfBounds (604 of 1935)
PASS: lldb-unit :: Target/./TargetTests/ExecutionContextTest.GetByteOrder (605 of 1935)
PASS: lldb-api :: lang/objc/foundation/TestConstStrings.py (606 of 1935)
UNSUPPORTED: lldb-api :: commands/expression/completion-crash-invalid-iterator/TestInvalidIteratorCompletionCrash.py (607 of 1935)
PASS: lldb-unit :: UnwindAssembly/x86/./UnwindAssemblyx86Tests/Testx86AssemblyInspectionEngine.TestCALLNextInsn (608 of 1935)
PASS: lldb-unit :: Utility/./UtilityTests/StringListTest.AppendStringMove (609 of 1935)
PASS: lldb-shell :: Reproducer/TestRelativePath.test (610 of 1935)
PASS: lldb-unit :: Expression/./ExpressionTests/CppModuleConfigurationTest.AmbiguousLibCpp (611 of 1935)
PASS: lldb-api :: commands/help/TestHelp.py (612 of 1935)
PASS: lldb-api :: lang/cpp/overloaded-functions/TestOverloadedFunctions.py (613 of 1935)
PASS: lldb-unit :: Utility/./UtilityTests/StreamTest.PutRawBytesToLittleEndian (614 of 1935)
PASS: lldb-unit :: ObjectFile/Breakpad/./ObjectFileBreakpadTests/LineRecord.parse (615 of 1935)
PASS: lldb-api :: functionalities/data-formatter/data-formatter-objc/nsstring/TestDataFormatterNSString.py (616 of 1935)
PASS: lldb-unit :: Target/./TargetTests/PathMappingListTest.RelativeTests (617 of 1935)
PASS: lldb-unit :: Symbol/./SymbolTests/PostfixExpression.ToDWARF (618 of 1935)
PASS: lldb-unit :: SymbolFile/NativePDB/./SymbolFileNativePDBTests/PDBFPOProgramToDWARFExpressionTests.MissingTargetRegister (619 of 1935)
PASS: lldb-unit :: Utility/./UtilityTests/SubsystemRAIITest.SubsystemWithErrorSuccess (620 of 1935)
PASS: lldb-api :: tools/lldb-vscode/attach/TestVSCode_attach.py (621 of 1935)
PASS: lldb-unit :: Utility/./UtilityTests/ArchSpecTest.TestSetTriple (622 of 1935)
PASS: lldb-unit :: Process/gdb-remote/./ProcessGdbRemoteTests/GDBRemoteCommunicationClientTest.SendGetDataPacket (623 of 1935)
PASS: lldb-api :: commands/expression/import-std-module/forward_list/TestForwardListFromStdModule.py (624 of 1935)
PASS: lldb-unit :: Utility/./UtilityTests/LogChannelTest.EnableOptions (625 of 1935)
PASS: lldb-api :: api/listeners/TestListener.py (626 of 1935)
PASS: lldb-api :: functionalities/tail_call_frames/thread_step_out_or_return/TestSteppingOutWithArtificialFrames.py (627 of 1935)
PASS: lldb-unit :: UnwindAssembly/x86/./UnwindAssemblyx86Tests/Testx86AssemblyInspectionEngine.TestStackRealign32BitDisp_x86_64 (628 of 1935)
PASS: lldb-unit :: Utility/./UtilityTests/LogChannelTest.Enable (629 of 1935)
PASS: lldb-shell :: ObjectFile/MachO/symtab.yaml (630 of 1935)
PASS: lldb-api :: lang/cpp/dynamic-value-same-basename/TestDynamicValueSameBase.py (631 of 1935)
PASS: lldb-shell :: SymbolFile/Breakpad/stack-cfi-parsing.test (632 of 1935)
PASS: lldb-api :: commands/gui/invalid-args/TestInvalidArgsGui.py (633 of 1935)
PASS: lldb-unit :: Target/./TargetTests/ModuleCacheTest.GetAndPutUuidExists (634 of 1935)
PASS: lldb-api :: lang/cpp/nested-class-other-compilation-unit/TestNestedClassWithParentInAnotherCU.py (635 of 1935)
PASS: lldb-api :: tools/lldb-server/TestGdbRemote_vCont.py (636 of 1935)
PASS: lldb-unit :: Symbol/./SymbolTests/DWARFCallFrameInfoTest.Basic_dwarf4 (637 of 1935)
PASS: lldb-unit :: Utility/./UtilityTests/StringExtractorTest.GetHexBytes_Underflow (638 of 1935)
PASS: lldb-api :: functionalities/data-formatter/data-formatter-smart-array/TestDataFormatterSmartArray.py (639 of 1935)
PASS: lldb-api :: lang/cpp/namespace/TestNamespace.py (640 of 1935)
UNSUPPORTED: lldb-api :: benchmarks/expression/TestRepeatedExprs.py (641 of 1935)
PASS: lldb-api :: commands/expression/static-initializers/TestStaticInitializers.py (642 of 1935)
PASS: lldb-shell :: SymbolFile/DWARF/debug_loc.s (643 of 1935)
PASS: lldb-api :: functionalities/data-formatter/data-formatter-stl/libcxx/vbool/TestDataFormatterLibcxxVBool.py (644 of 1935)
PASS: lldb-api :: commands/expression/import-std-module/vector-bool/TestVectorBoolFromStdModule.py (645 of 1935)
PASS: lldb-shell :: ObjectFile/ELF/PT_LOAD.yaml (646 of 1935)
PASS: lldb-unit :: Utility/./UtilityTests/StringExtractorTest.GetU64BigEndian (647 of 1935)
PASS: lldb-unit :: Symbol/./SymbolTests/TestTypeSystemClang.TestGetBasicTypeFromName (648 of 1935)
PASS: lldb-unit :: Target/./TargetTests/ExecutionContextTest.GetByteOrderTarget (649 of 1935)
PASS: lldb-unit :: ScriptInterpreter/Python/./ScriptInterpreterPythonTests/PythonDataObjectsTest.TestTypeNameResolutionNoDot (650 of 1935)
PASS: lldb-unit :: Core/./LLDBCoreTests/StreamCallbackTest.Callback (651 of 1935)
PASS: lldb-unit :: Utility/./UtilityTests/ArgsTest.EscapeLLDBCommandArgument (652 of 1935)
PASS: lldb-unit :: Breakpoint/./LLDBBreakpointTests/BreakpointIDTest.StringIsBreakpointName (653 of 1935)
UNSUPPORTED: lldb-shell :: Register/x86-64-xmm16-read.test (654 of 1935)
PASS: lldb-unit :: Utility/./UtilityTests/StringListTest.GetMaxStringLengthDecreasingSize (655 of 1935)
PASS: lldb-unit :: Utility/./UtilityTests/UriParserTest.Empty (656 of 1935)
PASS: lldb-api :: commands/expression/persist_objc_pointeetype/TestPersistObjCPointeeType.py (657 of 1935)
UNSUPPORTED: lldb-shell :: SymbolFile/PDB/variables.test (658 of 1935)
PASS: lldb-api :: functionalities/tail_call_frames/disambiguate_paths_to_common_sink/TestDisambiguatePathsToCommonSink.py (659 of 1935)
PASS: lldb-unit :: Utility/./UtilityTests/ArgsTest.TestSingleArg (660 of 1935)
PASS: lldb-unit :: Utility/./UtilityTests/StringListTest.InsertStringAtIndexMove (661 of 1935)
PASS: lldb-api :: functionalities/thread/backtrace_limit/TestBacktraceLimit.py (662 of 1935)
PASS: lldb-unit :: SymbolFile/NativePDB/./SymbolFileNativePDBTests/PDBFPOProgramToDWARFExpressionTests.SingleAssignmentRegisterRef (663 of 1935)
PASS: lldb-unit :: Symbol/./SymbolTests/TestTypeSystemClang.TestDisplayNameEmpty (664 of 1935)
PASS: lldb-unit :: Utility/./UtilityTests/VMRange.ContainsRange (665 of 1935)
PASS: lldb-api :: python_api/watchpoint/condition/TestWatchpointConditionAPI.py (666 of 1935)
PASS: lldb-unit :: Utility/./UtilityTests/Flags.AnyClear (667 of 1935)
PASS: lldb-unit :: Utility/./UtilityTests/StringListTest.GetMaxStringLengthMixed (668 of 1935)
PASS: lldb-api :: lang/cpp/accelerator-table/TestCPPAccelerator.py (669 of 1935)
PASS: lldb-api :: functionalities/thread/step_out/TestThreadStepOut.py (670 of 1935)
PASS: lldb-unit :: Symbol/./SymbolTests/TestClangASTImporter.ImportInvalidType (671 of 1935)
PASS: lldb-unit :: Utility/./UtilityTests/ArgsTest.ReplaceArgumentAtIndexLonger (672 of 1935)
PASS: lldb-unit :: Utility/./UtilityTests/VMRange.Clear (673 of 1935)
PASS: lldb-unit :: Utility/./UtilityTests/NameMatchesTest.Contains (674 of 1935)
PASS: lldb-unit :: Language/Highlighting/./HighlighterTests/HighlighterTest.ClangOperators (675 of 1935)
PASS: lldb-shell :: SymbolFile/DWARF/parallel-indexing-stress.s (676 of 1935)
PASS: lldb-unit :: Utility/./UtilityTests/UriParserTest.SchemeHostSeparator2 (677 of 1935)
UNSUPPORTED: lldb-shell :: SymbolFile/PDB/enums-layout.test (678 of 1935)
PASS: lldb-api :: types/TestIntegerType.py (679 of 1935)
PASS: lldb-unit :: Process/gdb-remote/./ProcessGdbRemoteTests/GDBRemoteCommunicationClientTest.SendStopTracePacket (680 of 1935)
PASS: lldb-unit :: Symbol/./SymbolTests/TestClangASTImporter.CanImportInvalidType (681 of 1935)
PASS: lldb-shell :: SymbolFile/Breakpad/unwind-via-stack-cfi.test (682 of 1935)
PASS: lldb-api :: functionalities/thread/concurrent_events/TestConcurrentNWatchNBreak.py (683 of 1935)
PASS: lldb-api :: commands/expression/ignore-artificial-constructors/TestIgnoreArtificialConstructors.py (684 of 1935)
PASS: lldb-api :: functionalities/multiword-commands/TestMultiWordCommands.py (685 of 1935)
PASS: lldb-unit :: Utility/./UtilityTests/StringExtractorTest.InitEmpty (686 of 1935)
PASS: lldb-api :: lang/objc/objc-ivar-stripped/TestObjCIvarStripped.py (687 of 1935)
UNSUPPORTED: lldb-api :: functionalities/data-formatter/data-formatter-stl/libstdcpp/list/TestDataFormatterStdList.py (688 of 1935)
PASS: lldb-unit :: ObjectFile/PECOFF/./ObjectFilePECOFFTests/PECallFrameInfoTest.Frame_reg_eh (689 of 1935)
PASS: lldb-unit :: Utility/./UtilityTests/ArchSpecTest.Compatibility (690 of 1935)
PASS: lldb-unit :: Utility/./UtilityTests/RegularExpression.Empty (691 of 1935)
PASS: lldb-shell :: BuildScript/compiler-full-path.test (692 of 1935)
PASS: lldb-shell :: Reproducer/TestDump.test (693 of 1935)
UNSUPPORTED: lldb-api :: lang/cpp/static_members/TestCPPStaticMembers.py (694 of 1935)
PASS: lldb-unit :: ScriptInterpreter/Python/./ScriptInterpreterPythonTests/PythonDataObjectsTest.TestPythonByteArray (695 of 1935)
PASS: lldb-unit :: ScriptInterpreter/Python/./ScriptInterpreterPythonTests/PythonDataObjectsTest.TestPythonListManipulation (696 of 1935)
PASS: lldb-unit :: Language/Highlighting/./HighlighterTests/HighlighterTest.ClangCommas (697 of 1935)
PASS: lldb-api :: functionalities/gdb_remote_client/TestRegDefinitionInParts.py (698 of 1935)
PASS: lldb-unit :: Utility/./UtilityTests/SerializationRountripTest.SerializeDeserializePodPointers (699 of 1935)
PASS: lldb-unit :: Utility/./UtilityTests/StreamTest.PutCharNull (700 of 1935)
PASS: lldb-api :: lang/cpp/member-and-local-vars-with-same-name/TestMembersAndLocalsWithSameName.py (701 of 1935)
PASS: lldb-unit :: Utility/./UtilityTests/StringExtractorTest.GetNameColonValueNoSemicolon (702 of 1935)
PASS: lldb-api :: commands/expression/call-function/TestCallStdStringFunction.py (703 of 1935)
PASS: lldb-shell :: Quit/TestQuitExitCode0.test (704 of 1935)
PASS: lldb-unit :: Utility/./UtilityTests/ArgsTest.ReplaceArgumentAtIndexFarOutOfRange (705 of 1935)
PASS: lldb-api :: functionalities/data-formatter/data-formatter-objc/TestDataFormatterObjCExpr.py (706 of 1935)
PASS: lldb-api :: lang/cpp/this/TestCPPThis.py (707 of 1935)
PASS: lldb-api :: python_api/get-value-32bit-int/TestGetValue32BitInt.py (708 of 1935)
PASS: lldb-unit :: Editline/./EditlineTests/EditlineTestFixture.EditlineReceivesSingleLineText (709 of 1935)
PASS: lldb-shell :: SymbolFile/NativePDB/ast-types.cpp (710 of 1935)
UNSUPPORTED: lldb-api :: commands/target/auto-install-main-executable/TestAutoInstallMainExecutable.py (711 of 1935)
PASS: lldb-api :: tools/lldb-server/TestGdbRemoteRegisterState.py (712 of 1935)
PASS: lldb-unit :: Utility/./UtilityTests/StatusTest.Formatv (713 of 1935)
PASS: lldb-unit :: UnwindAssembly/x86/./UnwindAssemblyx86Tests/Testx86AssemblyInspectionEngine.TestReturnDetect (714 of 1935)
PASS: lldb-unit :: Symbol/./SymbolTests/Type.CompilerContextPattern (715 of 1935)
PASS: lldb-shell :: ObjectFile/ELF/netbsd-core-amd64.test (716 of 1935)
PASS: lldb-unit :: UnwindAssembly/x86/./UnwindAssemblyx86Tests/Testx86AssemblyInspectionEngine.TestSimple32bitFrameFunction (717 of 1935)
PASS: lldb-unit :: Utility/./UtilityTests/OptionsWithRawTest.EmptySuffix (718 of 1935)
PASS: lldb-unit :: Symbol/./SymbolTests/SymbolsTest.TerminateLocateExecutableSymbolFileForUnknownExecutableAndUnknownSymbolFile (719 of 1935)
UNSUPPORTED: lldb-api :: functionalities/breakpoint/breakpoint_callback_command_source/TestBreakpointCallbackCommandSource.py (720 of 1935)
PASS: lldb-unit :: Utility/./UtilityTests/StructuredDataTest.ParseJSONFromFile (721 of 1935)
PASS: lldb-unit :: Language/Highlighting/./HighlighterTests/HighlighterTest.ClangCursorPos (722 of 1935)
PASS: lldb-api :: python_api/watchpoint/watchlocation/TestSetWatchlocation.py (723 of 1935)
PASS: lldb-unit :: Utility/./UtilityTests/AnsiTerminal.AtEnd (724 of 1935)
PASS: lldb-unit :: Interpreter/./InterpreterTests/CompletionTest.DirCompletionUsername (725 of 1935)
PASS: lldb-unit :: Utility/./UtilityTests/BinaryStreamTest.PutSLEB128Zero (726 of 1935)
UNSUPPORTED: lldb-api :: tools/lldb-vscode/completions/TestVSCode_completions.py (727 of 1935)
PASS: lldb-api :: lang/cpp/virtual-overload/TestVirtualOverload.py (728 of 1935)
PASS: lldb-unit :: Utility/./UtilityTests/StreamTest.PutBytesAsRawHex8ToLittleEndian (729 of 1935)
PASS: lldb-shell :: BuildScript/script-args.test (730 of 1935)
PASS: lldb-api :: lang/objcxx/class-name-clash/TestNameClash.py (731 of 1935)
PASS: lldb-unit :: Symbol/./SymbolTests/LineEntryTest.GetSameLineContiguousAddressRangeNoInlines (732 of 1935)
PASS: lldb-shell :: SymbolFile/DWARF/find-method-local-struct.cpp (733 of 1935)
PASS: lldb-unit :: Language/Highlighting/./HighlighterTests/HighlighterTest.HighlighterSelectionType (734 of 1935)
PASS: lldb-unit :: Expression/./ExpressionTests/DWARFExpression.DW_OP_piece (735 of 1935)
PASS: lldb-unit :: Target/./TargetTests/ModuleCacheTest.GetAndPutStrangeHostname (736 of 1935)
PASS: lldb-shell :: SymbolFile/DWARF/dwarf5_locations.s (737 of 1935)
PASS: lldb-api :: commands/expression/call-throws/TestCallThatThrows.py (738 of 1935)
PASS: lldb-api :: lang/c/register_variables/TestRegisterVariables.py (739 of 1935)
PASS: lldb-api :: sample_test/TestSampleInlineTest.py (740 of 1935)
PASS: lldb-api :: lang/objc/modules-inline-functions/TestModulesInlineFunctions.py (741 of 1935)
UNSUPPORTED: lldb-shell :: Register/x86-ymm-write.test (742 of 1935)
UNSUPPORTED: lldb-api :: functionalities/tsan/basic/TestTsanBasic.py (743 of 1935)
PASS: lldb-unit :: Expression/./ExpressionTests/DiagnosticManagerTest.PutStringMultiple (744 of 1935)
PASS: lldb-unit :: debugserver/./debugserverTests/RNBSocket.AnyListen (745 of 1935)
PASS: lldb-api :: functionalities/tail_call_frames/cross_object/TestCrossObjectTailCalls.py (746 of 1935)
PASS: lldb-unit :: Core/./LLDBCoreTests/RichManglingContextTest.IPDRealloc (747 of 1935)
PASS: lldb-unit :: ScriptInterpreter/Python/./ScriptInterpreterPythonTests/PythonDataObjectsTest.TestGlobalNameResolutionNoDot (748 of 1935)
PASS: lldb-api :: functionalities/data-formatter/data-formatter-disabling/TestDataFormatterDisabling.py (749 of 1935)
PASS: lldb-unit :: Utility/./UtilityTests/AnsiTerminal.Incomplete (750 of 1935)
PASS: lldb-api :: functionalities/breakpoint/comp_dir_symlink/TestCompDirSymLink.py (751 of 1935)
PASS: lldb-api :: functionalities/breakpoint/breakpoint_set_restart/TestBreakpointSetRestart.py (752 of 1935)
PASS: lldb-api :: commands/frame/var/TestFrameVar.py (753 of 1935)
PASS: lldb-unit :: Utility/./UtilityTests/StreamTest.PutBytesAsRawHex8ToMixedEndian (754 of 1935)
PASS: lldb-api :: lang/c/strings/TestCStrings.py (755 of 1935)
PASS: lldb-api :: python_api/process/TestProcessAPI.py (756 of 1935)
PASS: lldb-unit :: Host/./HostTests/Host.WaitStatusFormat (757 of 1935)
PASS: lldb-api :: lang/objc/objc++/TestObjCXX.py (758 of 1935)
PASS: lldb-api :: functionalities/load_using_paths/TestLoadUsingPaths.py (759 of 1935)
PASS: lldb-unit :: SymbolFile/DWARF/./SymbolFileDWARFTests/SymbolFileDWARFTests.TestAbbrevNullAttrValidForm (760 of 1935)
PASS: lldb-unit :: Utility/./UtilityTests/CompletionRequest.TryCompleteCurrentArgBad (761 of 1935)
PASS: lldb-unit :: Utility/./UtilityTests/StringListTest.AppendStringCString (762 of 1935)
PASS: lldb-unit :: ScriptInterpreter/Python/./ScriptInterpreterPythonTests/PythonDataObjectsTest.TestRun (763 of 1935)
PASS: lldb-unit :: Process/minidump/./LLDBMinidumpTests/MinidumpParserTest.GetExceptionStream (764 of 1935)
PASS: lldb-api :: python_api/frame/inlines/TestInlinedFrame.py (765 of 1935)
PASS: lldb-unit :: UnwindAssembly/x86/./UnwindAssemblyx86Tests/Testx86AssemblyInspectionEngine.TestPushECX (766 of 1935)
PASS: lldb-unit :: Utility/./UtilityTests/OptionsWithRawTest.UnterminatedQuote (767 of 1935)
PASS: lldb-shell :: ObjectFile/ELF/basic-info.yaml (768 of 1935)
PASS: lldb-unit :: Utility/./UtilityTests/ScalarTest.GetBytes (769 of 1935)
PASS: lldb-api :: functionalities/thread/jump/TestThreadJump.py (770 of 1935)
UNSUPPORTED: lldb-api :: benchmarks/continue/TestBenchmarkContinue.py (771 of 1935)
PASS: lldb-api :: functionalities/thread/concurrent_events/TestConcurrentBreakpointsDelayedBreakpointOneWatchpoint.py (772 of 1935)
PASS: lldb-unit :: ObjectFile/ELF/./ObjectFileELFTests/ObjectFileELFTest.GetModuleSpecifications_EarlySectionHeaders (773 of 1935)
PASS: lldb-api :: functionalities/data-formatter/data-formatter-objc/TestDataFormatterObjNSException.py (774 of 1935)
PASS: lldb-api :: functionalities/unwind/noreturn/module-end/TestNoReturnModuleEnd.py (775 of 1935)
PASS: lldb-shell :: ObjectFile/wasm/stripped-debug-sections.yaml (776 of 1935)
PASS: lldb-api :: commands/expression/ir-interpreter-phi-nodes/TestIRInterpreterPHINodes.py (777 of 1935)
PASS: lldb-unit :: UnwindAssembly/x86/./UnwindAssemblyx86Tests/Testx86AssemblyInspectionEngine.TestPushEDX (778 of 1935)
PASS: lldb-unit :: Utility/./UtilityTests/BinaryStreamTest.PutSLEB128SixBytes (779 of 1935)
PASS: lldb-api :: commands/watchpoints/watchpoint_events/TestWatchpointEvents.py (780 of 1935)
PASS: lldb-api :: commands/expression/calculator_mode/TestCalculatorMode.py (781 of 1935)
PASS: lldb-api :: commands/expression/test/TestExprs.py (782 of 1935)
PASS: lldb-api :: functionalities/avoids-fd-leak/TestFdLeak.py (783 of 1935)
PASS: lldb-shell :: SymbolFile/NativePDB/ast-functions.cpp (784 of 1935)
PASS: lldb-api :: commands/watchpoints/watchpoint_on_vectors/TestValueOfVectorVariable.py (785 of 1935)
PASS: lldb-api :: lang/objc/variadic_methods/TestVariadicMethods.py (786 of 1935)
PASS: lldb-api :: commands/settings/quoting/TestQuoting.py (787 of 1935)
PASS: lldb-unit :: Host/./HostTests/TaskPoolTest.RunTasks (788 of 1935)
PASS: lldb-api :: functionalities/signal/raise/TestRaise.py (789 of 1935)
PASS: lldb-api :: functionalities/gdb_remote_client/TestWriteMemory.py (790 of 1935)
PASS: lldb-api :: functionalities/data-formatter/data-formatter-stl/libcxx/initializerlist/TestInitializerList.py (791 of 1935)
PASS: lldb-unit :: Expression/./ExpressionTests/DiagnosticManagerTest.GetStringMultipleDiags (792 of 1935)
PASS: lldb-unit :: Utility/./UtilityTests/StringExtractorTest.GetHexBytesAvail_OddPair2 (793 of 1935)
PASS: lldb-unit :: Utility/./UtilityTests/TimeoutTest.Construction (794 of 1935)
PASS: lldb-api :: commands/expression/persistent_variables/TestPersistentVariables.py (795 of 1935)
PASS: lldb-api :: commands/frame/var-scope/TestFrameVariableScope.py (796 of 1935)
PASS: lldb-unit :: Utility/./UtilityTests/ReproducerTest.SetReplay (797 of 1935)
PASS: lldb-unit :: Utility/./UtilityTests/StringListTest.CopyListSingle (798 of 1935)
UNSUPPORTED: lldb-shell :: SymbolFile/NativePDB/stack_unwinding01.cpp (799 of 1935)
PASS: lldb-api :: functionalities/thread/concurrent_events/TestConcurrentWatchpointDelayWatchpointOneBreakpoint.py (800 of 1935)
PASS: lldb-api :: commands/watchpoints/watchpoint_size/TestWatchpointSizes.py (801 of 1935)
PASS: lldb-api :: commands/watchpoints/multiple_hits/TestMultipleHits.py (802 of 1935)
PASS: lldb-unit :: Utility/./UtilityTests/StringExtractorTest.GetU32LittleEndian (803 of 1935)
PASS: lldb-unit :: Expression/./ExpressionTests/CppModuleConfigurationTest.UnknownLibCppFile (804 of 1935)
PASS: lldb-shell :: ExecControl/StopHook/stop-hook.test (805 of 1935)
PASS: lldb-unit :: Utility/./UtilityTests/LogTest.Unregister (806 of 1935)
PASS: lldb-api :: functionalities/data-formatter/data-formatter-ptr-to-array/TestPtrToArrayFormatting.py (807 of 1935)
PASS: lldb-unit :: Utility/./UtilityTests/ArgsTest.AppendArguments (808 of 1935)
PASS: lldb-shell :: Settings/TestDisableColor.test (809 of 1935)
PASS: lldb-api :: lang/objc/foundation/TestObjCMethodsString.py (810 of 1935)
PASS: lldb-api :: lang/cpp/bitfields/TestCppBitfields.py (811 of 1935)
PASS: lldb-api :: lang/objc/forward-decl/TestForwardDecl.py (812 of 1935)
UNSUPPORTED: lldb-api :: python_api/event/TestEvents.py (813 of 1935)
PASS: lldb-unit :: Utility/./UtilityTests/StringLexerTest.GetUnlexed (814 of 1935)
PASS: lldb-api :: commands/watchpoints/hello_watchpoint/TestMyFirstWatchpoint.py (815 of 1935)
PASS: lldb-unit :: Symbol/./SymbolTests/LineEntryTest.GetSameLineContiguousAddressRangeOneInline (816 of 1935)
PASS: lldb-unit :: Host/./HostTests/ProcessLaunchInfoTest.Constructor (817 of 1935)
PASS: lldb-unit :: Expression/./ExpressionTests/CppModuleConfigurationTest.MissingLibCpp (818 of 1935)
PASS: lldb-api :: functionalities/breakpoint/breakpoint_by_line_and_column/TestBreakpointByLineAndColumn.py (819 of 1935)
PASS: lldb-unit :: Utility/./UtilityTests/LogChannelEnabledTest.log_options (820 of 1935)
PASS: lldb-shell :: Register/x86-64-ymm-read.test (821 of 1935)
PASS: lldb-api :: lang/cpp/namespace_definitions/TestNamespaceDefinitions.py (822 of 1935)
PASS: lldb-unit :: Utility/./UtilityTests/StreamTeeTest.GetStreamAtIndexOutOfBounds (823 of 1935)
PASS: lldb-unit :: ObjectFile/ELF/./ObjectFileELFTests/ObjectFileELFTest.GetSymtab_NoSymEntryPointArmAddressClass (824 of 1935)
PASS: lldb-api :: commands/expression/import-std-module/shared_ptr/TestSharedPtrFromStdModule.py (825 of 1935)
PASS: lldb-shell :: Quit/TestQuitExitCodeHex0.test (826 of 1935)
PASS: lldb-unit :: Process/minidump/./LLDBMinidumpTests/MinidumpParserTest.GetThreadContext_x86_64 (827 of 1935)
PASS: lldb-shell :: ObjectFile/PECOFF/sections.yaml (828 of 1935)
PASS: lldb-api :: commands/expression/import-std-module/forward_list-dbg-info-content/TestDbgInfoContentForwardListFromStdModule.py (829 of 1935)
PASS: lldb-shell :: Watchpoint/SetErrorCases.test (830 of 1935)
PASS: lldb-shell :: ObjectFile/ELF/short-build-id.yaml (831 of 1935)
PASS: lldb-api :: functionalities/gdb_remote_client/TestJLink6Armv7RegisterDefinition.py (832 of 1935)
PASS: lldb-shell :: SymbolFile/DWARF/debug-types-missing-signature.test (833 of 1935)
PASS: lldb-api :: commands/expression/argument_passing_restrictions/TestArgumentPassingRestrictions.py (834 of 1935)
PASS: lldb-api :: python_api/interpreter/TestCommandInterpreterAPI.py (835 of 1935)
PASS: lldb-api :: commands/expression/codegen-crash-typedefdecl-not-in_declcontext/TestCodegenCrashTypedefDeclNotInDeclContext.py (836 of 1935)
PASS: lldb-api :: functionalities/thread/exit_during_step/TestExitDuringStep.py (837 of 1935)
PASS: lldb-unit :: ScriptInterpreter/Python/./ScriptInterpreterPythonTests/PythonDataObjectsTest.TestPythonBytes (838 of 1935)
PASS: lldb-api :: lang/c/tls_globals/TestTlsGlobals.py (839 of 1935)
PASS: lldb-shell :: SymbolFile/NativePDB/function-types-builtins.cpp (840 of 1935)
PASS: lldb-api :: commands/expression/xvalue/TestXValuePrinting.py (841 of 1935)
PASS: lldb-api :: lang/cpp/trivial_abi/TestTrivialABI.py (842 of 1935)
PASS: lldb-unit :: Utility/./UtilityTests/SerializationRountripTest.SerializeDeserializeCStringArrayNullptr (843 of 1935)
PASS: lldb-unit :: Expression/./ExpressionTests/DiagnosticManagerTest.PutString (844 of 1935)
UNSUPPORTED: lldb-api :: linux/thread/create_during_instruction_step/TestCreateDuringInstructionStep.py (845 of 1935)
PASS: lldb-shell :: ObjectFile/ELF/aarch64-relocations.yaml (846 of 1935)
PASS: lldb-unit :: Utility/./UtilityTests/StringListTest.ForRange (847 of 1935)
PASS: lldb-api :: functionalities/archives/TestBSDArchives.py (848 of 1935)
PASS: lldb-unit :: Utility/./UtilityTests/FileSpecTest.GetPath (849 of 1935)
PASS: lldb-shell :: Minidump/breakpad-symbols.test (850 of 1935)
PASS: lldb-unit :: Utility/./UtilityTests/RegularExpression.Match (851 of 1935)
PASS: lldb-unit :: Utility/./UtilityTests/StreamTeeTest.CopyConstructor (852 of 1935)
PASS: lldb-shell :: SymbolFile/DWARF/split-dwarf-inlining.cpp (853 of 1935)
PASS: lldb-api :: lang/objc/objc-new-syntax/TestObjCNewSyntaxLiteral.py (854 of 1935)
PASS: lldb-unit :: Utility/./UtilityTests/LogChannelTest.List (855 of 1935)
PASS: lldb-unit :: Utility/./UtilityTests/ArgsTest.TestAppendArg (856 of 1935)
PASS: lldb-api :: commands/expression/persistent_types/TestPersistentTypes.py (857 of 1935)
UNSUPPORTED: lldb-api :: commands/watchpoints/hello_watchlocation/TestWatchLocation.py (858 of 1935)
PASS: lldb-unit :: UnwindAssembly/x86/./UnwindAssemblyx86Tests/Testx86AssemblyInspectionEngine.Test64bitFramelessBigStackFrame (859 of 1935)
PASS: lldb-api :: functionalities/data-formatter/boolreference/TestFormattersBoolRefPtr.py (860 of 1935)
PASS: lldb-unit :: Utility/./UtilityTests/ConstStringTest.MangledCounterpart (861 of 1935)
PASS: lldb-unit :: Utility/./UtilityTests/ScalarTest.Equality (862 of 1935)
PASS: lldb-unit :: ScriptInterpreter/Python/./ScriptInterpreterPythonTests/PythonDataObjectsTest.TestPythonFile (863 of 1935)
PASS: lldb-shell :: Unwind/thread-step-out-ret-addr-check.test (864 of 1935)
PASS: lldb-api :: lang/cpp/nsimport/TestCppNsImport.py (865 of 1935)
PASS: lldb-unit :: Utility/./UtilityTests/ScalarTest.Promotion (866 of 1935)
PASS: lldb-api :: commands/expression/completion-crash-incomplete-record/TestCompletionCrashIncompleteRecord.py (867 of 1935)
PASS: lldb-unit :: Utility/./UtilityTests/StringListTest.Join (868 of 1935)
PASS: lldb-api :: commands/watchpoints/step_over_watchpoint/TestStepOverWatchpoint.py (869 of 1935)
PASS: lldb-unit :: ScriptInterpreter/Python/./ScriptInterpreterPythonTests/PythonDataObjectsTest.TestInstanceNameResolutionNoDot (870 of 1935)
PASS: lldb-unit :: Utility/./UtilityTests/UriParserTest.MinimalPort (871 of 1935)
PASS: lldb-api :: functionalities/tail_call_frames/sbapi_support/TestTailCallFrameSBAPI.py (872 of 1935)
PASS: lldb-unit :: debugserver/./debugserverTests/RNBSocket.LoopBackConnectIPv4 (873 of 1935)
PASS: lldb-unit :: UnwindAssembly/x86/./UnwindAssemblyx86Tests/Testx86AssemblyInspectionEngine.Test32BitOnlyInstruction (874 of 1935)
PASS: lldb-unit :: Process/gdb-remote/./ProcessGdbRemoteTests/GDBRemoteCommunicationServerTest.SendErrorResponse_Status (875 of 1935)
PASS: lldb-unit :: Utility/./UtilityTests/StringLexerTest.HasAtLeast (876 of 1935)
PASS: lldb-unit :: Utility/./UtilityTests/VMRange.IsValid (877 of 1935)
UNSUPPORTED: lldb-api :: functionalities/unwind/ehframe/TestEhFrameUnwind.py (878 of 1935)
PASS: lldb-unit :: ScriptInterpreter/Python/./ScriptInterpreterPythonTests/PythonDataObjectsTest.TestPythonCallableInvoke (879 of 1935)
PASS: lldb-shell :: Breakpoint/debug_rnglist_rlestartend.test (880 of 1935)
PASS: lldb-api :: functionalities/rerun/TestRerun.py (881 of 1935)
PASS: lldb-api :: functionalities/data-formatter/data-formatter-stl/libcxx/tuple/TestDataFormatterLibcxxTuple.py (882 of 1935)
PASS: lldb-unit :: UnwindAssembly/x86/./UnwindAssemblyx86Tests/Testx86AssemblyInspectionEngine.TestPopRBPWithREX (883 of 1935)
PASS: lldb-unit :: Process/gdb-remote/./ProcessGdbRemoteTests/GDBRemoteCommunicationClientTest.WriteRegisterNoSuffix (884 of 1935)
PASS: lldb-unit :: UnwindAssembly/x86/./UnwindAssemblyx86Tests/Testx86AssemblyInspectionEngine.TestPopEDI (885 of 1935)
PASS: lldb-unit :: Host/./HostTests/ConnectionFileDescriptorTest.TCPGetURIv4 (886 of 1935)
PASS: lldb-shell :: Process/TestEnvironment.test (887 of 1935)
PASS: lldb-api :: lang/cpp/exceptions/TestCPPExceptionBreakpoints.py (888 of 1935)
PASS: lldb-unit :: Utility/./UtilityTests/GeneratorTest.Get (889 of 1935)
PASS: lldb-api :: functionalities/data-formatter/data-formatter-stl/libcxx/list/loop/TestDataFormatterLibcxxListLoop.py (890 of 1935)
PASS: lldb-shell :: Commands/command-source.test (891 of 1935)
PASS: lldb-shell :: Settings/TestSettingsSet.test (892 of 1935)
PASS: lldb-shell :: Breakpoint/split-dwarf5-debug-stroffsets.test (893 of 1935)
PASS: lldb-api :: functionalities/thread/concurrent_events/TestConcurrentWatchBreak.py (894 of 1935)
PASS: lldb-unit :: Process/minidump/./LLDBMinidumpTests/MinidumpParserTest.InvalidMinidump (895 of 1935)
PASS: lldb-api :: python_api/class_members/TestSBTypeClassMembers.py (896 of 1935)
UNSUPPORTED: lldb-shell :: SymbolFile/PDB/class-layout.test (897 of 1935)
PASS: lldb-unit :: Utility/./UtilityTests/UriParserTest.LongPath (898 of 1935)
PASS: lldb-unit :: Utility/./UtilityTests/StringListTest.AppendStringStdString (899 of 1935)
PASS: lldb-api :: commands/expression/rdar42038760/TestScalarURem.py (900 of 1935)
PASS: lldb-api :: types/TestFloatTypesExpr.py (901 of 1935)
PASS: lldb-api :: functionalities/stats_api/TestStatisticsAPI.py (902 of 1935)
PASS: lldb-api :: python_api/symbol-context/TestSymbolContext.py (903 of 1935)
PASS: lldb-unit :: SymbolFile/NativePDB/./SymbolFileNativePDBTests/PDBFPOProgramToDWARFExpressionTests.InvalidAssignmentMultiple (904 of 1935)
PASS: lldb-unit :: Utility/./UtilityTests/StreamTest.PutHex8 (905 of 1935)
PASS: lldb-shell :: Breakpoint/debug_rnglist_basic.test (906 of 1935)
PASS: lldb-unit :: Utility/./UtilityTests/SerializationRountripTest.SerializeDeserializeCString (907 of 1935)
PASS: lldb-shell :: ObjectFile/ELF/compressed-sections.yaml (908 of 1935)
PASS: lldb-shell :: Reproducer/TestDiscard.test (909 of 1935)
PASS: lldb-api :: functionalities/breakpoint/auto_continue/TestBreakpointAutoContinue.py (910 of 1935)
PASS: lldb-shell :: SymbolFile/DWARF/debug_ranges-missing-section.s (911 of 1935)
PASS: lldb-shell :: SymbolFile/NativePDB/bitfields.cpp (912 of 1935)
PASS: lldb-api :: functionalities/breakpoint/breakpoint_conditions/TestBreakpointConditions.py (913 of 1935)
PASS: lldb-api :: lang/objc/orderedset/TestOrderedSet.py (914 of 1935)
PASS: lldb-shell :: Quit/TestQuitExitCode30.test (915 of 1935)
PASS: lldb-api :: commands/frame/diagnose/complicated-expression/TestComplicatedExpression.py (916 of 1935)
PASS: lldb-unit :: UnwindAssembly/x86/./UnwindAssemblyx86Tests/Testx86AssemblyInspectionEngine.TestAddESP (917 of 1935)
UNSUPPORTED: lldb-api :: lang/objc/objc-dynamic-value/TestObjCDynamicValue.py (918 of 1935)
PASS: lldb-api :: functionalities/dead-strip/TestDeadStrip.py (919 of 1935)
PASS: lldb-unit :: Language/CPlusPlus/./LanguageCPlusPlusTests/CPlusPlusLanguage.MethodNameParsing (920 of 1935)
PASS: lldb-api :: functionalities/breakpoint/breakpoint_ids/TestBreakpointIDs.py (921 of 1935)
PASS: lldb-api :: python_api/thread/TestThreadAPI.py (922 of 1935)
UNSUPPORTED: lldb-api :: benchmarks/stepping/TestSteppingSpeed.py (923 of 1935)
PASS: lldb-api :: functionalities/inferior-crashing/recursive-inferior/TestRecursiveInferiorStep.py (924 of 1935)
PASS: lldb-unit :: ScriptInterpreter/Python/./ScriptInterpreterPythonTests/PythonDataObjectsTest.TestExtractingUInt64ThroughStructuredData (925 of 1935)
XFAIL: lldb-shell :: Register/x86-64-write.test (926 of 1935)
PASS: lldb-unit :: Expression/./ExpressionTests/CppModuleConfigurationTest.Linux (927 of 1935)
PASS: lldb-api :: commands/expression/namespace_local_var_same_name_obj_c/TestNamespaceLocalVarSameNameObjC.py (928 of 1935)
PASS: lldb-shell :: ScriptInterpreter/None/none.test (929 of 1935)
PASS: lldb-unit :: Process/minidump/./LLDBMinidumpTests/MinidumpParserTest.FindMemoryRangeWithFullMemoryMinidump (930 of 1935)
PASS: lldb-api :: functionalities/data-formatter/synthcapping/TestSyntheticCapping.py (931 of 1935)
PASS: lldb-unit :: Utility/./UtilityTests/BroadcasterTest.EventTypeHasListeners (932 of 1935)
PASS: lldb-api :: macosx/thread-names/TestInterruptThreadNames.py (933 of 1935)
PASS: lldb-unit :: Utility/./UtilityTests/VMRange.Ordering (934 of 1935)
PASS: lldb-api :: functionalities/data-formatter/data-formatter-synthtype/TestDataFormatterSynthType.py (935 of 1935)
PASS: lldb-unit :: Utility/./UtilityTests/CompletionRequest.FakeLastArg (936 of 1935)
PASS: lldb-shell :: SymbolFile/DWARF/find-variable-dwo.cpp (937 of 1935)
PASS: lldb-shell :: SymbolFile/NativePDB/globals-bss.cpp (938 of 1935)
PASS: lldb-unit :: Language/Highlighting/./HighlighterTests/HighlighterTest.ClangCursorPosEndOfLine (939 of 1935)
PASS: lldb-api :: lang/c/unicode/TestUnicodeSymbols.py (940 of 1935)
PASS: lldb-unit :: Expression/./ExpressionTests/DWARFExpression.DW_OP_pick (941 of 1935)
PASS: lldb-unit :: Utility/./UtilityTests/DataExtractorTest.GetMaxU64_unchecked (942 of 1935)
PASS: lldb-unit :: Utility/./UtilityTests/StringListTest.JoinNonSpace (943 of 1935)
PASS: lldb-unit :: Host/./HostTests/FileSystemTest.GetPermissions (944 of 1935)
PASS: lldb-unit :: Utility/./UtilityTests/UUIDTest.SetFromStringRef (945 of 1935)
PASS: lldb-shell :: Quit/TestQuitExitCodeHexA.test (946 of 1935)
PASS: lldb-shell :: ObjectFile/Breakpad/uuid-matching-mac.test (947 of 1935)
PASS: lldb-shell :: Settings/TestEchoCommands.test (948 of 1935)
PASS: lldb-api :: commands/expression/context-object/TestContextObject.py (949 of 1935)
PASS: lldb-api :: commands/expression/expr-in-syscall/TestExpressionInSyscall.py (950 of 1935)
PASS: lldb-shell :: Commands/command-regex-delete.test (951 of 1935)
PASS: lldb-unit :: Utility/./UtilityTests/ArgsTest.DoubleQuotedItem (952 of 1935)
PASS: lldb-unit :: Utility/./UtilityTests/FileSpecTest.CopyByAppendingPathComponent (953 of 1935)
PASS: lldb-shell :: Settings/TestDisassemblyFormat.test (954 of 1935)
PASS: lldb-unit :: Process/gdb-remote/./ProcessGdbRemoteTests/GDBRemoteCommunicationClientTest.GetModulesInfoInvalidResponse (955 of 1935)
PASS: lldb-api :: functionalities/data-formatter/language_category_updates/TestDataFormatterLanguageCategoryUpdates.py (956 of 1935)
PASS: lldb-api :: functionalities/abbreviation/TestCommonShortSpellings.py (957 of 1935)
PASS: lldb-unit :: SymbolFile/NativePDB/./SymbolFileNativePDBTests/PDBFPOProgramToDWARFExpressionTests.InvalidOpUnary (958 of 1935)
PASS: lldb-api :: functionalities/lazy-loading/TestLazyLoading.py (959 of 1935)
PASS: lldb-unit :: Utility/./UtilityTests/AnsiTerminal.AtStart (960 of 1935)
PASS: lldb-shell :: SymbolFile/Breakpad/unwind-via-raSearch.test (961 of 1935)
PASS: lldb-api :: commands/frame/diagnose/local-variable/TestLocalVariable.py (962 of 1935)
UNSUPPORTED: lldb-shell :: ObjectFile/ELF/minidebuginfo-no-lzma.yaml (963 of 1935)
UNSUPPORTED: lldb-api :: functionalities/darwin_log/filter/regex/activity/TestDarwinLogFilterRegexActivity.py (964 of 1935)
PASS: lldb-unit :: Process/gdb-remote/./ProcessGdbRemoteTests/GDBRemoteCommunicationClientTest.GetMemoryRegionInfoInvalidResponse (965 of 1935)
PASS: lldb-unit :: Language/Highlighting/./HighlighterTests/HighlighterTest.ClangCursorPosBeforeOtherToken (966 of 1935)
PASS: lldb-api :: commands/expression/scoped_enums/TestScopedEnumType.py (967 of 1935)
UNSUPPORTED: lldb-shell :: Watchpoint/netbsd-nouserdbregs.test (968 of 1935)
PASS: lldb-unit :: Utility/./UtilityTests/CompletionRequest.DuplicateFilteringWithComments (969 of 1935)
PASS: lldb-api :: lang/objc/objc_direct-methods/TestObjCDirectMethods.py (970 of 1935)
PASS: lldb-api :: lang/cpp/unsigned_types/TestUnsignedTypes.py (971 of 1935)
PASS: lldb-unit :: UnwindAssembly/x86/./UnwindAssemblyx86Tests/Testx86AssemblyInspectionEngine.TestPushEDI (972 of 1935)
PASS: lldb-api :: lang/cpp/gmodules/TestWithModuleDebugging.py (973 of 1935)
UNSUPPORTED: lldb-api :: benchmarks/libcxxlist/TestBenchmarkLibcxxList.py (974 of 1935)
PASS: lldb-unit :: Symbol/./SymbolTests/TestTypeSystemClang.TestConvertAccessTypeToAccessSpecifier (975 of 1935)
PASS: lldb-api :: lang/c/array_types/TestArrayTypes.py (976 of 1935)
PASS: lldb-unit :: UnwindAssembly/x86/./UnwindAssemblyx86Tests/Testx86AssemblyInspectionEngine.TestPushImm (977 of 1935)
PASS: lldb-unit :: Utility/./UtilityTests/StreamTest.PutBytesAsRawHex8ToBigEndian (978 of 1935)
PASS: lldb-unit :: Symbol/./SymbolTests/TestClangASTImporter.CopyDeclTagDecl (979 of 1935)
PASS: lldb-shell :: SymbolFile/NativePDB/break-by-function.cpp (980 of 1935)
PASS: lldb-api :: functionalities/data-formatter/pyobjsynthprovider/TestPyObjSynthProvider.py (981 of 1935)
PASS: lldb-unit :: UnwindAssembly/x86/./UnwindAssemblyx86Tests/Testx86AssemblyInspectionEngine.TestPushR12 (982 of 1935)
PASS: lldb-api :: functionalities/gdb_remote_client/TestGDBRemoteLoad.py (983 of 1935)
UNSUPPORTED: lldb-api :: functionalities/tsan/thread_numbers/TestTsanThreadNumbers.py (984 of 1935)
PASS: lldb-api :: commands/command/script/import/rdar-12586188/TestRdar12586188.py (985 of 1935)
PASS: lldb-api :: lang/cpp/modules-import/TestCXXModulesImport.py (986 of 1935)
PASS: lldb-unit :: Utility/./UtilityTests/UriParserTest.BracketedHostnamePort (987 of 1935)
PASS: lldb-shell :: ObjectFile/ELF/build-id-case.yaml (988 of 1935)
PASS: lldb-shell :: SymbolFile/DWARF/clang-ast-from-dwarf-unamed-and-anon-structs.cpp (989 of 1935)
PASS: lldb-api :: functionalities/dynamic_value_child_count/TestDynamicValueChildCount.py (990 of 1935)
PASS: lldb-api :: functionalities/source-map/TestTargetSourceMap.py (991 of 1935)
PASS: lldb-unit :: Host/./HostTests/File.GetWaitableHandleFileno (992 of 1935)
PASS: lldb-unit :: Utility/./UtilityTests/StreamTest.PutHex16ByteOrderBig (993 of 1935)
PASS: lldb-shell :: ObjectFile/PECOFF/basic-info-arm64.yaml (994 of 1935)
PASS: lldb-shell :: Reproducer/Functionalities/TestStepping.test (995 of 1935)
PASS: lldb-unit :: Utility/./UtilityTests/StreamTest.AddressRange (996 of 1935)
PASS: lldb-unit :: Utility/./UtilityTests/RangeTest.Slide (997 of 1935)
PASS: lldb-unit :: Core/./LLDBCoreTests/RichManglingContextTest.SwitchProvider (998 of 1935)
PASS: lldb-unit :: Expression/./ExpressionTests/DiagnosticManagerTest.PutStringSeverities (999 of 1935)
PASS: lldb-api :: functionalities/data-formatter/data-formatter-stl/libcxx/function/TestLibCxxFunction.py (1000 of 1935)
PASS: lldb-unit :: ScriptInterpreter/Python/./ScriptInterpreterPythonTests/PythonDataObjectsTest.TestPythonDictionaryToStructuredDictionary (1001 of 1935)
PASS: lldb-api :: functionalities/multidebugger_commands/TestMultipleDebuggersCommands.py (1002 of 1935)
PASS: lldb-shell :: SymbolFile/NativePDB/function-types-classes.cpp (1003 of 1935)
PASS: lldb-api :: functionalities/thread/concurrent_events/TestConcurrentManyBreakpoints.py (1004 of 1935)
PASS: lldb-api :: python_api/frame/TestFrames.py (1005 of 1935)
PASS: lldb-api :: commands/expression/top-level/TestTopLevelExprs.py (1006 of 1935)
PASS: lldb-unit :: Utility/./UtilityTests/RangeTest.Copy (1007 of 1935)
XFAIL: lldb-shell :: Unwind/prefer-debug-over-eh-frame.test (1008 of 1935)
UNSUPPORTED: lldb-api :: functionalities/darwin_log/basic/TestDarwinLogBasic.py (1009 of 1935)
PASS: lldb-unit :: UnwindAssembly/x86/./UnwindAssemblyx86Tests/Testx86AssemblyInspectionEngine.TestDisassemblyMidFunctionEpilogues (1010 of 1935)
UNSUPPORTED: lldb-shell :: SymbolFile/PDB/variables-locations.test (1011 of 1935)
PASS: lldb-shell :: Breakpoint/dummy-target.test (1012 of 1935)
UNSUPPORTED: lldb-shell :: Minidump/Windows/arm-fp-unwind.test (1013 of 1935)
PASS: lldb-unit :: ScriptInterpreter/Python/./ScriptInterpreterPythonTests/PythonDataObjectsTest.TestPythonTupleSize (1014 of 1935)
PASS: lldb-api :: macosx/version_zero/TestGetVersionZeroVersion.py (1015 of 1935)
PASS: lldb-unit :: Utility/./UtilityTests/StringExtractorTest.GetHexBytesAvail (1016 of 1935)
PASS: lldb-unit :: Utility/./UtilityTests/StringExtractorTest.GetHexBytesAvail_Underflow (1017 of 1935)
PASS: lldb-api :: python_api/sbtype_typeclass/TestSBTypeTypeClass.py (1018 of 1935)
PASS: lldb-api :: functionalities/thread/concurrent_events/TestConcurrentSignalNWatchNBreak.py (1019 of 1935)
PASS: lldb-unit :: Utility/./UtilityTests/ProcessInfoTest.Constructor (1020 of 1935)
PASS: lldb-unit :: ScriptInterpreter/Python/./ScriptInterpreterPythonTests/PythonDataObjectsTest.TestPythonDictionaryManipulation (1021 of 1935)
PASS: lldb-api :: lang/cpp/namespace/TestNamespaceLookup.py (1022 of 1935)
PASS: lldb-unit :: Process/minidump/./LLDBMinidumpTests/MinidumpParserTest.GetMemoryRegionInfoFromMemoryList (1023 of 1935)
PASS: lldb-unit :: SymbolFile/NativePDB/./SymbolFileNativePDBTests/PDBFPOProgramToDWARFExpressionTests.UnknownOp (1024 of 1935)
PASS: lldb-unit :: UnwindAssembly/x86/./UnwindAssemblyx86Tests/Testx86AssemblyInspectionEngine.TestLEAVE (1025 of 1935)
PASS: lldb-api :: python_api/watchpoint/TestWatchpointIgnoreCount.py (1026 of 1935)
PASS: lldb-api :: commands/expression/import-std-module/basic/TestImportStdModule.py (1027 of 1935)
PASS: lldb-shell :: ObjectFile/MachO/lc_build_version_notools.yaml (1028 of 1935)
UNSUPPORTED: lldb-api :: lang/objc/bitfield_ivars/TestBitfieldIvars.py (1029 of 1935)
PASS: lldb-api :: lang/cpp/wchar_t/TestCxxWCharT.py (1030 of 1935)
PASS: lldb-api :: functionalities/data-formatter/data-formatter-named-summaries/TestDataFormatterNamedSummaries.py (1031 of 1935)
PASS: lldb-api :: python_api/module_section/TestModuleAndSection.py (1032 of 1935)
PASS: lldb-unit :: Utility/./UtilityTests/OptionsWithRawTest.EmptySuffixSingleWhitespace (1033 of 1935)
PASS: lldb-unit :: Language/Highlighting/./HighlighterTests/HighlighterTest.HighlighterSelectionPath (1034 of 1935)
PASS: lldb-api :: lang/objc/conflicting-definition/TestConflictingDefinition.py (1035 of 1935)
PASS: lldb-unit :: Expression/./ExpressionTests/ClangExpressionDeclMapTest.TestPersistentDeclLookup (1036 of 1935)
PASS: lldb-api :: lang/objc/objc-foundation-dictionary-empty/TestNSDictionary0.py (1037 of 1935)
PASS: lldb-unit :: Utility/./UtilityTests/StringExtractorTest.GetNameColonValueSuccess (1038 of 1935)
PASS: lldb-api :: functionalities/breakpoint/require_hw_breakpoints/TestRequireHWBreakpoints.py (1039 of 1935)
PASS: lldb-unit :: Expression/./ExpressionTests/CppModuleConfigurationTest.IgnoreLibStdCpp (1040 of 1935)
PASS: lldb-shell :: Settings/TestFrameFormatColor.test (1041 of 1935)
PASS: lldb-api :: lang/objc/objc-property/TestObjCProperty.py (1042 of 1935)
PASS: lldb-api :: tools/lldb-server/TestGdbRemoteHostInfo.py (1043 of 1935)
PASS: lldb-api :: functionalities/breakpoint/breakpoint_names/TestBreakpointNames.py (1044 of 1935)
PASS: lldb-unit :: Utility/./UtilityTests/RangeTest.ContainsEndInclusiveInvalid (1045 of 1935)
PASS: lldb-api :: lang/objc/rdar-11355592/TestRdar11355592.py (1046 of 1935)
PASS: lldb-api :: functionalities/data-formatter/data-formatter-objc/TestDataFormatterObjCNSError.py (1047 of 1935)
PASS: lldb-unit :: Utility/./UtilityTests/ArchSpecTest.OperatorBool (1048 of 1935)
PASS: lldb-unit :: Utility/./UtilityTests/ReproducerTest.SetCapture (1049 of 1935)
PASS: lldb-shell :: Recognizer/assert.test (1050 of 1935)
PASS: lldb-api :: python_api/watchpoint/TestWatchpointIter.py (1051 of 1935)
UNSUPPORTED: lldb-shell :: SymbolFile/PDB/calling-conventions.test (1052 of 1935)
XFAIL: lldb-shell :: Register/x86-64-ymm-write.test (1053 of 1935)
PASS: lldb-api :: commands/expression/import_builtin_fileid/TestImportBuiltinFileID.py (1054 of 1935)
PASS: lldb-api :: functionalities/signal/handle-abrt/TestHandleAbort.py (1055 of 1935)
UNSUPPORTED: lldb-shell :: ScriptInterpreter/Lua/lua.test (1056 of 1935)
PASS: lldb-unit :: Utility/./UtilityTests/UriParserTest.BracketedHostname (1057 of 1935)
PASS: lldb-api :: python_api/hello_world/TestHelloWorld.py (1058 of 1935)
PASS: lldb-api :: functionalities/breakpoint/address_breakpoints/TestAddressBreakpoints.py (1059 of 1935)
PASS: lldb-unit :: Utility/./UtilityTests/Flags.AnySet (1060 of 1935)
PASS: lldb-unit :: Host/./HostTests/MainLoopTest.ReadObject (1061 of 1935)
PASS: lldb-shell :: SymbolFile/DWARF/DW_OP_piece-smaller-than-struct.s (1062 of 1935)
PASS: lldb-unit :: Utility/./UtilityTests/BinaryStreamTest.PutULEB128SevenBytes (1063 of 1935)
PASS: lldb-api :: functionalities/thread/concurrent_events/TestConcurrentManyCrash.py (1064 of 1935)
PASS: lldb-unit :: Utility/./UtilityTests/ArchSpecTest.TripleComponentsWereSpecified (1065 of 1935)
PASS: lldb-api :: tools/lldb-server/TestAppleSimulatorOSType.py (1066 of 1935)
PASS: lldb-shell :: Unwind/eh-frame-dwarf-unwind.test (1067 of 1935)
PASS: lldb-api :: functionalities/thread/concurrent_events/TestConcurrentTwoWatchpointThreads.py (1068 of 1935)
PASS: lldb-api :: macosx/function-starts/TestFunctionStarts.py (1069 of 1935)
PASS: lldb-unit :: SymbolFile/NativePDB/./SymbolFileNativePDBTests/PDBFPOProgramToDWARFExpressionTests.InvalidOpBinary (1070 of 1935)
PASS: lldb-api :: functionalities/var_path/TestVarPath.py (1071 of 1935)
UNSUPPORTED: lldb-api :: functionalities/tty/TestTerminal.py (1072 of 1935)
PASS: lldb-unit :: Process/minidump/./LLDBMinidumpTests/MinidumpParserTest.MinidumpDuplicateModuleMinAddress (1073 of 1935)
PASS: lldb-unit :: Utility/./UtilityTests/StringListTest.GetSize (1074 of 1935)
PASS: lldb-unit :: Utility/./UtilityTests/DeserializerTest.HasData (1075 of 1935)
PASS: lldb-unit :: SymbolFile/DWARF/./SymbolFileDWARFTests/SymbolFileDWARFTests.TestAbbrevValidAttrNullForm (1076 of 1935)
PASS: lldb-api :: lang/c/anonymous/TestAnonymous.py (1077 of 1935)
PASS: lldb-unit :: Utility/./UtilityTests/StringListTest.LongestCommonPrefixEmpty (1078 of 1935)
UNSUPPORTED: lldb-shell :: ScriptInterpreter/Lua/command_script_import.test (1079 of 1935)
PASS: lldb-api :: functionalities/data-formatter/data-formatter-stl/libcxx/bitset/TestDataFormatterLibcxxBitset.py (1080 of 1935)
PASS: lldb-api :: functionalities/inline-stepping/TestInlineStepping.py (1081 of 1935)
PASS: lldb-api :: python_api/function_symbol/TestDisasmAPI.py (1082 of 1935)
PASS: lldb-unit :: Utility/./UtilityTests/ProcessInstanceInfo.DumpTable_invalidUID (1083 of 1935)
UNSUPPORTED: lldb-api :: functionalities/darwin_log/filter/regex/category/TestDarwinLogFilterRegexCategory.py (1084 of 1935)
PASS: lldb-api :: types/TestCharTypeExpr.py (1085 of 1935)
PASS: lldb-unit :: Utility/./UtilityTests/BinaryStreamTest.PutULEB128FiveBytes (1086 of 1935)
PASS: lldb-unit :: Utility/./UtilityTests/RangeTest.Clear (1087 of 1935)
PASS: lldb-unit :: Expression/./ExpressionTests/DiagnosticManagerTest.FixedExpression (1088 of 1935)
PASS: lldb-unit :: Utility/./UtilityTests/StringListTest.InsertStringAtIndexOutOfBounds (1089 of 1935)
PASS: lldb-api :: functionalities/breakpoint/address_breakpoints/TestBadAddressBreakpoints.py (1090 of 1935)
PASS: lldb-api :: lang/cpp/namespace_conflicts/TestNamespaceConflicts.py (1091 of 1935)
PASS: lldb-unit :: Core/./LLDBCoreTests/MangledTest.ResultForBlockInvocation (1092 of 1935)
PASS: lldb-api :: python_api/value/empty_class/TestValueAPIEmptyClass.py (1093 of 1935)
PASS: lldb-unit :: Utility/./UtilityTests/VMRange.Comparison (1094 of 1935)
PASS: lldb-api :: lang/cpp/gmodules-templates/TestGModules.py (1095 of 1935)
PASS: lldb-unit :: Utility/./UtilityTests/ArgsTest.TestSingleQuotedArgWithSpace (1096 of 1935)
PASS: lldb-unit :: Utility/./UtilityTests/TimerTest.CategoryTimes (1097 of 1935)
PASS: lldb-api :: commands/expression/timeout/TestCallWithTimeout.py (1098 of 1935)
UNRESOLVED: lldb-api :: functionalities/gdb_remote_client/TestWasm.py (1099 of 1935)
******************** TEST 'lldb-api :: functionalities/gdb_remote_client/TestWasm.py' FAILED ********************
Script:
--
/usr/local/bin/python /Users/buildslave/jenkins/workspace/lldb-cmake-sanitized/llvm-project/lldb/test/API/dotest.py --arch x86_64 -s /Users/buildslave/jenkins/workspace/lldb-cmake-sanitized/lldb-build/lldb-test-traces -S nm -u CXXFLAGS -u CFLAGS --codesign-identity lldb_codesign --server /Users/buildslave/jenkins/workspace/lldb-cmake-sanitized/lldb-build/./bin/debugserver --arch x86_64 --build-dir /Users/buildslave/jenkins/workspace/lldb-cmake-sanitized/lldb-build/lldb-test-build.noindex -s=/Users/buildslave/jenkins/workspace/lldb-cmake-sanitized/test/logs -t --env TERM=vt100 --env LLVM_LIBS_DIR=/Users/buildslave/jenkins/workspace/lldb-cmake-sanitized/lldb-build/./lib --inferior-env ASAN_OPTIONS=detect_stack_use_after_return=1 --inferior-env DYLD_INSERT_LIBRARIES=/Users/buildslave/jenkins/workspace/lldb-cmake-sanitized/host-compiler/lib/clang/11.0.0/lib/darwin/libclang_rt.asan_osx_dynamic.dylib --build-dir /Users/buildslave/jenkins/workspace/lldb-cmake-sanitized/lldb-build/lldb-test-build.noindex --lldb-module-cache-dir /Users/buildslave/jenkins/workspace/lldb-cmake-sanitized/lldb-build/lldb-test-build.noindex/module-cache-lldb/lldb-api --clang-module-cache-dir /Users/buildslave/jenkins/workspace/lldb-cmake-sanitized/lldb-build/lldb-test-build.noindex/module-cache-clang/lldb-api --executable /Users/buildslave/jenkins/workspace/lldb-cmake-sanitized/lldb-build/./bin/lldb --compiler /Users/buildslave/jenkins/workspace/lldb-cmake-sanitized/lldb-build/./bin/clang --dsymutil /Users/buildslave/jenkins/workspace/lldb-cmake-sanitized/lldb-build/./bin/dsymutil --filecheck /Users/buildslave/jenkins/workspace/lldb-cmake-sanitized/lldb-build/./bin/FileCheck --lldb-libs-dir /Users/buildslave/jenkins/workspace/lldb-cmake-sanitized/lldb-build/./lib /Users/buildslave/jenkins/workspace/lldb-cmake-sanitized/llvm-project/lldb/test/API/functionalities/gdb_remote_client -p TestWasm.py
--
Exit Code: -6

Hide Details

Command Output (stdout): -- lldb version 11.0.99 clang revision 7593a480dbce4e26f7dda4aa8f15bffd03acbfdb llvm revision 7593a480dbce4e26f7dda4aa8f15bffd03acbfdb

Hide Details

-- Command Output (stderr): -- ================================================================= ==92271==ERROR: AddressSanitizer: container-overflow on address 0x615000016404 at pc 0x000103c3c8e3 bp 0x7ffeec00a130 sp 0x7ffeec0098f8 READ of size 512 at 0x615000016404 thread T0 #0 0x103c3c8e2 in __asan_memcpy+0x1b2 (libclang_rt.asan_osx_dynamic.dylib:x86_64+0x418e2) #1 0x10c483115 in lldb_private::MemoryCache::Read(unsigned long long, void*, unsigned long, lldb_private::Status&) Memory.cpp:189 #2 0x10bfd7b29 in lldb_private::Module::GetMemoryObjectFile(std::__1::shared_ptr<lldb_private::Process> const&, unsigned long long, lldb_private::Status&, unsigned long) Module.cpp:298 #3 0x10c4d992f in lldb_private::Process::ReadModuleFromMemory(lldb_private::FileSpec const&, unsigned long long, unsigned long) Process.cpp:2402 #4 0x10bf6ddbb in lldb_private::DynamicLoader::LoadModuleAtAddress(lldb_private::FileSpec const&, unsigned long long, unsigned long long, bool) DynamicLoader.cpp:212 #5 0x10cd0989a in lldb_private::process_gdb_remote::ProcessGDBRemote::LoadModuleAtAddress(lldb_private::FileSpec const&, unsigned long long, unsigned long long, bool) ProcessGDBRemote.cpp:4767 #6 0x10cd09e78 in lldb_private::process_gdb_remote::ProcessGDBRemote::LoadModules() ProcessGDBRemote.cpp:4801 #7 0x10c8003fa in lldb_private::wasm::DynamicLoaderWasmDYLD::DidAttach() DynamicLoaderWasmDYLD.cpp:63 #8 0x10c4de4d7 in lldb_private::Process::CompleteAttach() Process.cpp:2930 #9 0x10c4e161f in lldb_private::Process::ConnectRemote(lldb_private::Stream*, llvm::StringRef) Process.cpp:3015 #10 0x10b871eae in lldb::SBTarget::ConnectRemote(lldb::SBListener&, char const*, char const*, lldb::SBError&) SBTarget.cpp:559 #11 0x10bd5ed71 in _wrap_SBTarget_ConnectRemote(_object*, _object*) LLDBWrapPython.cpp:52799 #12 0x104995226 in _PyMethodDef_RawFastCallKeywords+0xeb (Python:x86_64+0x1a226) #13 0x1049948c6 in _PyCFunction_FastCallKeywords+0x2b (Python:x86_64+0x198c6) #14 0x104a2a905 in call_function+0x1de (Python:x86_64+0xaf905) #15 0x104a235ee in _PyEval_EvalFrameDefault+0x1b51 (Python:x86_64+0xa85ee) #16 0x104994ca1 in function_code_fastcall+0x6f (Python:x86_64+0x19ca1) #17 0x104a2a97d in call_function+0x256 (Python:x86_64+0xaf97d) #18 0x104a235d5 in _PyEval_EvalFrameDefault+0x1b38 (Python:x86_64+0xa85d5) #19 0x104994ca1 in function_code_fastcall+0x6f (Python:x86_64+0x19ca1) #20 0x104a2a97d in call_function+0x256 (Python:x86_64+0xaf97d) #21 0x104a235d5 in _PyEval_EvalFrameDefault+0x1b38 (Python:x86_64+0xa85d5) #22 0x104994ca1 in function_code_fastcall+0x6f (Python:x86_64+0x19ca1) #23 0x104a2a97d in call_function+0x256 (Python:x86_64+0xaf97d) #24 0x104a2368c in _PyEval_EvalFrameDefault+0x1bef (Python:x86_64+0xa868c) #25 0x104994ca1 in function_code_fastcall+0x6f (Python:x86_64+0x19ca1) #26 0x104a2a97d in call_function+0x256 (Python:x86_64+0xaf97d) #27 0x104a235d5 in _PyEval_EvalFrameDefault+0x1b38 (Python:x86_64+0xa85d5) #28 0x104a2b2da in _PyEval_EvalCodeWithName+0x72a (Python:x86_64+0xb02da) #29 0x1049944f4 in _PyFunction_FastCallDict+0x1b8 (Python:x86_64+0x194f4) #30 0x104995624 in _PyObject_Call_Prepend+0x95 (Python:x86_64+0x1a624) #31 0x1049949d4 in PyObject_Call+0x87 (Python:x86_64+0x199d4) #32 0x104a23905 in _PyEval_EvalFrameDefault+0x1e68 (Python:x86_64+0xa8905) #33 0x104a2b2da in _PyEval_EvalCodeWithName+0x72a (Python:x86_64+0xb02da) #34 0x1049944f4 in _PyFunction_FastCallDict+0x1b8 (Python:x86_64+0x194f4) #35 0x104995624 in _PyObject_Call_Prepend+0x95 (Python:x86_64+0x1a624) #36 0x1049d24af in slot_tp_call+0x46 (Python:x86_64+0x574af) #37 0x10499472c in _PyObject_FastCallKeywords+0x166 (Python:x86_64+0x1972c) #38 0x104a2a976 in call_function+0x24f (Python:x86_64+0xaf976) #39 0x104a2368c in _PyEval_EvalFrameDefault+0x1bef (Python:x86_64+0xa868c) #40 0x104a2b2da in _PyEval_EvalCodeWithName+0x72a (Python:x86_64+0xb02da) #41 0x10499488b in _PyFunction_FastCallKeywords+0xe0 (Python:x86_64+0x1988b) #42 0x104a2a97d in call_function+0x256 (Python:x86_64+0xaf97d) #43 0x104a235d5 in _PyEval_EvalFrameDefault+0x1b38 (Python:x86_64+0xa85d5) #44 0x104a2b2da in _PyEval_EvalCodeWithName+0x72a (Python:x86_64+0xb02da) #45 0x10499488b in _PyFunction_FastCallKeywords+0xe0 (Python:x86_64+0x1988b) #46 0x104a2a97d in call_function+0x256 (Python:x86_64+0xaf97d) #47 0x104a235d5 in _PyEval_EvalFrameDefault+0x1b38 (Python:x86_64+0xa85d5) #48 0x104994ca1 in function_code_fastcall+0x6f (Python:x86_64+0x19ca1) #49 0x104995624 in _PyObject_Call_Prepend+0x95 (Python:x86_64+0x1a624) #50 0x1049949d4 in PyObject_Call+0x87 (Python:x86_64+0x199d4) #51 0x104a23905 in _PyEval_EvalFrameDefault+0x1e68 (Python:x86_64+0xa8905) #52 0x104a2b2da in _PyEval_EvalCodeWithName+0x72a (Python:x86_64+0xb02da) #53 0x1049944f4 in _PyFunction_FastCallDict+0x1b8 (Python:x86_64+0x194f4) #54 0x104995624 in _PyObject_Call_Prepend+0x95 (Python:x86_64+0x1a624) #55 0x1049d24af in slot_tp_call+0x46 (Python:x86_64+0x574af) #56 0x10499472c in _PyObject_FastCallKeywords+0x166 (Python:x86_64+0x1972c) #57 0x104a2a976 in call_function+0x24f (Python:x86_64+0xaf976) #58 0x104a2368c in _PyEval_EvalFrameDefault+0x1bef (Python:x86_64+0xa868c) #59 0x104994ca1 in function_code_fastcall+0x6f (Python:x86_64+0x19ca1) #60 0x104a2a97d in call_function+0x256 (Python:x86_64+0xaf97d) #61 0x104a235d5 in _PyEval_EvalFrameDefault+0x1b38 (Python:x86_64+0xa85d5) #62 0x104994ca1 in function_code_fastcall+0x6f (Python:x86_64+0x19ca1) #63 0x104a2a97d in call_function+0x256 (Python:x86_64+0xaf97d) #64 0x104a235ee in _PyEval_EvalFrameDefault+0x1b51 (Python:x86_64+0xa85ee) #65 0x104a2b2da in _PyEval_EvalCodeWithName+0x72a (Python:x86_64+0xb02da) #66 0x104a21a14 in PyEval_EvalCode+0x29 (Python:x86_64+0xa6a14) #67 0x104a502aa in run_mod+0x35 (Python:x86_64+0xd52aa) #68 0x104a4f2c5 in PyRun_FileExFlags+0xa3 (Python:x86_64+0xd42c5) #69 0x104a4e9a4 in PyRun_SimpleFileExFlags+0x114 (Python:x86_64+0xd39a4) #70 0x104a66010 in pymain_main+0x13de (Python:x86_64+0xeb010) #71 0x104a667b7 in _Py_UnixMain+0x67 (Python:x86_64+0xeb7b7) #72 0x7fff7ad31084 in start+0x0 (libdyld.dylib:x86_64+0x17084)

Hide Details

0x615000016580 is located 0 bytes to the right of 512-byte region [0x615000016380,0x615000016580) allocated by thread T0 here: #0 0x103c4b60d in wrap__Znwm+0x7d (libclang_rt.asan_osx_dynamic.dylib:x86_64+0x5060d) #1 0x10c6b3580 in std::__1::vector<unsigned char, std::__1::allocator<unsigned char> >::__vallocate(unsigned long) new:253 #2 0x10c6af12f in std::__1::vector<unsigned char, std::__1::allocator<unsigned char> >::assign(unsigned long, unsigned char const&) vector:1481 #3 0x10c6aef7a in lldb_private::DataBufferHeap::DataBufferHeap(unsigned long long, unsigned char) DataBufferHeap.cpp:20 #4 0x10c4834bd in lldb_private::MemoryCache::Read(unsigned long long, void*, unsigned long, lldb_private::Status&) Memory.cpp:228 #5 0x10bfd7b29 in lldb_private::Module::GetMemoryObjectFile(std::__1::shared_ptr<lldb_private::Process> const&, unsigned long long, lldb_private::Status&, unsigned long) Module.cpp:298 #6 0x10c4d992f in lldb_private::Process::ReadModuleFromMemory(lldb_private::FileSpec const&, unsigned long long, unsigned long) Process.cpp:2402 #7 0x10bf6ddbb in lldb_private::DynamicLoader::LoadModuleAtAddress(lldb_private::FileSpec const&, unsigned long long, unsigned long long, bool) DynamicLoader.cpp:212 #8 0x10cd0989a in lldb_private::process_gdb_remote::ProcessGDBRemote::LoadModuleAtAddress(lldb_private::FileSpec const&, unsigned long long, unsigned long long, bool) ProcessGDBRemote.cpp:4767 #9 0x10cd09e78 in lldb_private::process_gdb_remote::ProcessGDBRemote::LoadModules() ProcessGDBRemote.cpp:4801 #10 0x10c8003fa in lldb_private::wasm::DynamicLoaderWasmDYLD::DidAttach() DynamicLoaderWasmDYLD.cpp:63 #11 0x10c4de4d7 in lldb_private::Process::CompleteAttach() Process.cpp:2930 #12 0x10c4e161f in lldb_private::Process::ConnectRemote(lldb_private::Stream*, llvm::StringRef) Process.cpp:3015 #13 0x10b871eae in lldb::SBTarget::ConnectRemote(lldb::SBListener&, char const*, char const*, lldb::SBError&) SBTarget.cpp:559 #14 0x10bd5ed71 in _wrap_SBTarget_ConnectRemote(_object*, _object*) LLDBWrapPython.cpp:52799 #15 0x104995226 in _PyMethodDef_RawFastCallKeywords+0xeb (Python:x86_64+0x1a226) #16 0x1049948c6 in _PyCFunction_FastCallKeywords+0x2b (Python:x86_64+0x198c6) #17 0x104a2a905 in call_function+0x1de (Python:x86_64+0xaf905) #18 0x104a235ee in _PyEval_EvalFrameDefault+0x1b51 (Python:x86_64+0xa85ee) #19 0x104994ca1 in function_code_fastcall+0x6f (Python:x86_64+0x19ca1) #20 0x104a2a97d in call_function+0x256 (Python:x86_64+0xaf97d) #21 0x104a235d5 in _PyEval_EvalFrameDefault+0x1b38 (Python:x86_64+0xa85d5) #22 0x104994ca1 in function_code_fastcall+0x6f (Python:x86_64+0x19ca1) #23 0x104a2a97d in call_function+0x256 (Python:x86_64+0xaf97d) #24 0x104a235d5 in _PyEval_EvalFrameDefault+0x1b38 (Python:x86_64+0xa85d5) #25 0x104994ca1 in function_code_fastcall+0x6f (Python:x86_64+0x19ca1) #26 0x104a2a97d in call_function+0x256 (Python:x86_64+0xaf97d) #27 0x104a2368c in _PyEval_EvalFrameDefault+0x1bef (Python:x86_64+0xa868c) #28 0x104994ca1 in function_code_fastcall+0x6f (Python:x86_64+0x19ca1) #29 0x104a2a97d in call_function+0x256 (Python:x86_64+0xaf97d)

Hide Details

HINT: if you don't care about these errors you may set ASAN_OPTIONS=detect_container_overflow=0. If you suspect a false positive see also: https://github.com/google/sanitizers/wiki/AddressSanitizerContainerOverflow. SUMMARY: AddressSanitizer: container-overflow (libclang_rt.asan_osx_dynamic.dylib:x86_64+0x418e2) in __asan_memcpy+0x1b2 Shadow bytes around the buggy address: 0x1c2a00002c30: 00 00 00 00 00 00 00 00 00 00 00 00 00 00 00 00 0x1c2a00002c40: 00 00 00 00 00 00 00 00 00 00 00 00 00 00 00 00 0x1c2a00002c50: 00 00 00 00 00 00 00 00 00 00 00 00 00 00 00 00 0x1c2a00002c60: fa fa fa fa fa fa fa fa fa fa fa fa fa fa fa fa 0x1c2a00002c70: 00 00 00 00 00 00 00 00 00 00 00 00 00 00 00 00 =>0x1c2a00002c80:[04]fc fc fc fc fc fc fc fc fc fc fc fc fc fc fc 0x1c2a00002c90: fc fc fc fc fc fc fc fc fc fc fc fc fc fc fc fc 0x1c2a00002ca0: fc fc fc fc fc fc fc fc fc fc fc fc fc fc fc fc 0x1c2a00002cb0: fa fa fa fa fa fa fa fa fa fa fa fa fa fa fa fa 0x1c2a00002cc0: fd fd fd fd fd fd fd fd fd fd fd fd fd fd fd fd 0x1c2a00002cd0: fd fd fd fd fd fd fd fd fd fd fd fd fd fd fd fd Shadow byte legend (one shadow byte represents 8 application bytes): Addressable: 00 Partially addressable: 01 02 03 04 05 06 07 Heap left redzone: fa Freed heap region: fd Stack left redzone: f1 Stack mid redzone: f2 Stack right redzone: f3 Stack after return: f5 Stack use after scope: f8 Global redzone: f9 Global init order: f6 Poisoned by user: f7 Container overflow: fc Array cookie: ac Intra object redzone: bb ASan internal: fe Left alloca redzone: ca Right alloca redzone: cb Shadow gap: cc ==92271==ABORTING

Hide Details

--

Hide Details

******************** PASS: lldb-unit :: ObjectFile/Breakpad/./ObjectFileBreakpadTests/FileRecord.parse (1100 of 1935) PASS: lldb-api :: lang/objc/objc-dyn-sbtype/TestObjCDynamicSBType.py (1101 of 1935) PASS: lldb-api :: lang/cpp/lambdas/TestLambdas.py (1102 of 1935) PASS: lldb-unit :: Utility/./UtilityTests/RangeTest.LessThan (1103 of 1935) PASS: lldb-unit :: SymbolFile/DWARF/./SymbolFileDWARFTests/SymbolFileDWARFTests.TestAbbrevOrder1Start1 (1104 of 1935) PASS: lldb-api :: commands/target/dump-symtab-demangle/TestDumpSymtabDemangle.py (1105 of 1935) PASS: lldb-api :: lang/objc/objc-ivar-protocols/TestIvarProtocols.py (1106 of 1935) PASS: lldb-api :: macosx/safe-to-func-call/TestSafeFuncCalls.py (1107 of 1935) UNSUPPORTED: lldb-shell :: SymbolFile/PDB/function-nested-block.test (1108 of 1935) PASS: lldb-api :: functionalities/breakpoint/breakpoint_command/TestBreakpointCommand.py (1109 of 1935) PASS: lldb-unit :: Utility/./UtilityTests/VMRange.Reset (1110 of 1935) PASS: lldb-unit :: Utility/./UtilityTests/ArgsTest.TestInsertArg (1111 of 1935) PASS: lldb-api :: lang/objc/modules/TestObjCModules.py (1112 of 1935) PASS: lldb-unit :: Utility/./UtilityTests/StringListTest.SetSize (1113 of 1935) PASS: lldb-api :: commands/frame/select/TestFrameSelect.py (1114 of 1935) PASS: lldb-api :: functionalities/tail_call_frames/inlining_and_tail_calls/TestInliningAndTailCalls.py (1115 of 1935) PASS: lldb-api :: lang/cpp/constructors/TestCppConstructors.py (1116 of 1935) PASS: lldb-api :: commands/log/basic/TestLogging.py (1117 of 1935) PASS: lldb-unit :: Symbol/./SymbolTests/TestClangASTImporter.MetadataPropagationIndirectImport (1118 of 1935) PASS: lldb-unit :: Utility/./UtilityTests/StreamTeeTest.GetStreamAtIndexOutOfBoundsEmpty (1119 of 1935) PASS: lldb-shell :: ObjectFile/wasm/unified-debug-sections.yaml (1120 of 1935) PASS: lldb-api :: commands/expression/regression-access-function-template-in-record/TestRegressionAccessFunctionTemplateInRecord.py (1121 of 1935) PASS: lldb-api :: commands/target/stop-hooks/TestStopHooks.py (1122 of 1935) PASS: lldb-api :: commands/disassemble/basic/TestFrameDisassemble.py (1123 of 1935) PASS: lldb-unit :: Utility/./UtilityTests/ConstStringTest.CompareConstString (1124 of 1935) PASS: lldb-api :: python_api/signals/TestSignalsAPI.py (1125 of 1935) PASS: lldb-unit :: Utility/./UtilityTests/ConstStringTest.format_provider (1126 of 1935) PASS: lldb-api :: functionalities/breakpoint/inlined_breakpoints/TestInlinedBreakpoints.py (1127 of 1935) PASS: lldb-shell :: SymbolFile/DWARF/compilercontext.ll (1128 of 1935) PASS: lldb-shell :: SymbolFile/DWARF/find-basic-variable.cpp (1129 of 1935) PASS: lldb-api :: functionalities/thread/backtrace_all/TestBacktraceAll.py (1130 of 1935) PASS: lldb-api :: lang/cpp/breakpoint_in_member_func_w_non_primitive_params/TestBreakpointInMemberFuncWNonPrimitiveParams.py (1131 of 1935) PASS: lldb-unit :: Utility/./UtilityTests/StringLexerTest.PutBack (1132 of 1935) PASS: lldb-api :: functionalities/postmortem/mach-core/TestMachCore.py (1133 of 1935) PASS: lldb-shell :: SymbolFile/DWARF/debug-types-dwo-cross-reference.cpp (1134 of 1935) PASS: lldb-api :: functionalities/data-formatter/data-formatter-stl/libcxx/map/TestDataFormatterLibccMap.py (1135 of 1935) PASS: lldb-api :: python_api/value_var_update/TestValueVarUpdate.py (1136 of 1935) PASS: lldb-shell :: Expr/TestMultilineExpr.test (1137 of 1935) PASS: lldb-api :: functionalities/breakpoint/global_constructor/TestBreakpointInGlobalConstructor.py (1138 of 1935) PASS: lldb-shell :: SymbolFile/DWARF/find-variable-file.cpp (1139 of 1935) PASS: lldb-unit :: Utility/./UtilityTests/ArgsTest.BareSingleQuote (1140 of 1935) PASS: lldb-unit :: Utility/./UtilityTests/BroadcasterTest.BroadcastEvent (1141 of 1935) PASS: lldb-unit :: Utility/./UtilityTests/BinaryStreamTest.PutULEB128Zero (1142 of 1935) PASS: lldb-api :: lang/c/shared_lib/TestSharedLib.py (1143 of 1935) PASS: lldb-unit :: ScriptInterpreter/Python/./ScriptInterpreterPythonTests/PythonDataObjectsTest.TestPythonInteger (1144 of 1935) PASS: lldb-api :: driver/batch_mode/TestBatchMode.py (1145 of 1935) PASS: lldb-api :: functionalities/gdb_remote_client/TestNoGPacketSupported.py (1146 of 1935) PASS: lldb-unit :: Utility/./UtilityTests/StreamTeeTest.Write (1147 of 1935) PASS: lldb-api :: python_api/lldbutil/frame/TestFrameUtils.py (1148 of 1935) PASS: lldb-api :: functionalities/return-value/TestReturnValue.py (1149 of 1935) PASS: lldb-api :: functionalities/thread/concurrent_events/TestConcurrentSignalDelayBreak.py (1150 of 1935) UNSUPPORTED: lldb-api :: benchmarks/expression/TestExpressionCmd.py (1151 of 1935) PASS: lldb-shell :: SymbolFile/DWARF/dwarf5-atomic.s (1152 of 1935) PASS: lldb-api :: python_api/lldbutil/iter/TestRegistersIterator.py (1153 of 1935) UNSUPPORTED: lldb-api :: benchmarks/libcxxmap/TestBenchmarkLibcxxMap.py (1154 of 1935) PASS: lldb-unit :: Expression/./ExpressionTests/DiagnosticManagerTest.HasFixits (1155 of 1935) PASS: lldb-api :: functionalities/gdb_remote_client/TestThreadSelectionBug.py (1156 of 1935) PASS: lldb-unit :: Expression/./ExpressionTests/ClangExpressionDeclMapTest.TestUnknownIdentifierLookup (1157 of 1935) PASS: lldb-unit :: Utility/./UtilityTests/StringExtractorTest.DecodeHexU8_Underflow (1158 of 1935) PASS: lldb-unit :: Process/gdb-remote/./ProcessGdbRemoteTests/GDBRemoteClientBaseTest.SendContinueAndInterrupt (1159 of 1935) PASS: lldb-api :: macosx/load-kext/TestLoadKext.py (1160 of 1935) PASS: lldb-unit :: Utility/./UtilityTests/SubsystemRAIITest.SubsystemWithErrorFailure (1161 of 1935) PASS: lldb-api :: functionalities/data-formatter/data-formatter-objc/TestDataFormatterObjCKVO.py (1162 of 1935) PASS: lldb-unit :: Utility/./UtilityTests/RangeDataVector.FindEntryThatContains (1163 of 1935) PASS: lldb-unit :: Utility/./UtilityTests/Flags.AllClear (1164 of 1935) UNSUPPORTED: lldb-shell :: SymbolFile/PDB/pointers.test (1165 of 1935) PASS: lldb-api :: functionalities/data-formatter/data-formatter-stl/libcxx/iterator/TestDataFormatterLibccIterator.py (1166 of 1935) PASS: lldb-unit :: Utility/./UtilityTests/StreamTest.PutCStringWithStringRef (1167 of 1935) PASS: lldb-api :: functionalities/gdb_remote_client/TestArmRegisterDefinition.py (1168 of 1935) PASS: lldb-unit :: UnwindAssembly/x86/./UnwindAssemblyx86Tests/Testx86AssemblyInspectionEngine.Test32bitFramelessBigStackFrame (1169 of 1935) PASS: lldb-api :: commands/process/attach-resume/TestAttachResume.py (1170 of 1935) PASS: lldb-api :: commands/expression/class_template_specialization_empty_pack/TestClassTemplateSpecializationParametersHandling.py (1171 of 1935) PASS: lldb-api :: commands/expression/persistent_types/TestNestedPersistentTypes.py (1172 of 1935) PASS: lldb-api :: python_api/sblaunchinfo/TestSBLaunchInfo.py (1173 of 1935) PASS: lldb-unit :: Utility/./UtilityTests/StringListTest.InsertStringAtIndexEnd (1174 of 1935) PASS: lldb-unit :: Utility/./UtilityTests/StringExtractorTest.GetHexU8_InvalidHex_NoEof (1175 of 1935) UNSUPPORTED: lldb-api :: functionalities/breakpoint/breakpoint_in_delayslot/TestAvoidBreakpointInDelaySlot.py (1176 of 1935) PASS: lldb-unit :: Utility/./UtilityTests/RangeTest.SlideZero (1177 of 1935) PASS: lldb-unit :: Utility/./UtilityTests/StreamTest.PutHex32ByteOrderLittle (1178 of 1935) PASS: lldb-unit :: Utility/./UtilityTests/RangeTest.Union (1179 of 1935) PASS: lldb-unit :: Utility/./UtilityTests/SharedCluster.ClusterManager (1180 of 1935) PASS: lldb-unit :: Utility/./UtilityTests/SerializationRountripTest.SerializeDeserializeCStringArray (1181 of 1935) PASS: lldb-api :: functionalities/postmortem/elf-core/TestLinuxCore.py (1182 of 1935) PASS: lldb-unit :: Utility/./UtilityTests/EnvironmentTest.EnvpConversion (1183 of 1935) PASS: lldb-shell :: SymbolFile/DWARF/debug_ranges.s (1184 of 1935) PASS: lldb-api :: functionalities/breakpoint/source_regexp/TestSourceRegexBreakpoints.py (1185 of 1935) PASS: lldb-shell :: SymbolFile/DWARF/anon_class_w_and_wo_export_symbols.ll (1186 of 1935) PASS: lldb-api :: functionalities/breakpoint/serialize/TestBreakpointSerialization.py (1187 of 1935) PASS: lldb-unit :: Process/gdb-remote/./ProcessGdbRemoteTests/GDBRemoteCommunicationTest.ReadPacket_checksum (1188 of 1935) UNSUPPORTED: lldb-api :: commands/watchpoints/variable_out_of_scope/TestWatchedVarHitWhenInScope.py (1189 of 1935) PASS: lldb-api :: functionalities/breakpoint/breakpoint_options/TestBreakpointOptions.py (1190 of 1935) PASS: lldb-api :: functionalities/thread/concurrent_events/TestConcurrentSignalDelayWatch.py (1191 of 1935) PASS: lldb-shell :: SymbolFile/DWARF/dir-separator-no-comp-dir.s (1192 of 1935) PASS: lldb-api :: functionalities/data-formatter/data-formatter-script/TestDataFormatterScript.py (1193 of 1935) PASS: lldb-shell :: SymbolFile/DWARF/dir-separator-posix.s (1194 of 1935) PASS: lldb-api :: functionalities/gdb_remote_client/TestRecognizeBreakpoint.py (1195 of 1935) UNSUPPORTED: lldb-shell :: Breakpoint/case-insensitive.test (1196 of 1935) PASS: lldb-unit :: Utility/./UtilityTests/StringExtractorTest.DecodeHexU8_InvalidHex2 (1197 of 1935) PASS: lldb-api :: functionalities/abbreviation/TestAbbreviations.py (1198 of 1935) PASS: lldb-api :: commands/expression/call-function/TestCallStopAndContinue.py (1199 of 1935) PASS: lldb-unit :: Target/./TargetTests/MemoryRegionInfoTest.Formatv (1200 of 1935) PASS: lldb-unit :: Utility/./UtilityTests/Flags.Test (1201 of 1935) PASS: lldb-unit :: Utility/./UtilityTests/OptionsWithRawTest.QuotedSuffix (1202 of 1935) PASS: lldb-api :: macosx/find-dsym/bundle-with-dot-in-filename/TestBundleWithDotInFilename.py (1203 of 1935) PASS: lldb-shell :: ObjectFile/PECOFF/symbol.yaml (1204 of 1935) UNSUPPORTED: lldb-api :: api/multiple-debuggers/TestMultipleDebuggers.py (1205 of 1935) PASS: lldb-shell :: ObjectFile/wasm/embedded-debug-sections.yaml (1206 of 1935) PASS: lldb-unit :: Symbol/./SymbolTests/TestTypeSystemClang.TestGetEnumIntegerTypeBasicTypes (1207 of 1935) PASS: lldb-unit :: Utility/./UtilityTests/StringExtractorTest.GetHexBytes_OddPair (1208 of 1935) PASS: lldb-unit :: Utility/./UtilityTests/DataExtractorTest.GetCStrAtNullOffset (1209 of 1935) PASS: lldb-unit :: Host/./HostTests/NativeProcessProtocolTest.ReadCStringFromMemory_CrossPageBoundary (1210 of 1935) PASS: lldb-api :: commands/frame/recognizer/TestFrameRecognizer.py (1211 of 1935) UNSUPPORTED: lldb-api :: functionalities/longjmp/TestLongjmp.py (1212 of 1935) UNSUPPORTED: lldb-api :: functionalities/unwind/standard/TestStandardUnwind.py (1213 of 1935) PASS: lldb-api :: types/TestShortTypeExpr.py (1214 of 1935) UNSUPPORTED: lldb-api :: lang/cpp/printf/TestPrintf.py (1215 of 1935) PASS: lldb-api :: functionalities/thread/concurrent_events/TestConcurrentTwoBreakpointsOneSignal.py (1216 of 1935) PASS: lldb-api :: commands/expression/import-std-module/list/TestListFromStdModule.py (1217 of 1935) PASS: lldb-api :: commands/watchpoints/watchpoint_commands/condition/TestWatchpointConditionCmd.py (1218 of 1935) PASS: lldb-unit :: Process/minidump/./LLDBMinidumpTests/MinidumpParserTest.GetMiscInfo_no_stream (1219 of 1935) UNSUPPORTED: lldb-shell :: SymbolFile/PDB/vbases.test (1220 of 1935) PASS: lldb-unit :: Host/./HostTests/MainLoopTest.UnmonitoredSignal (1221 of 1935) PASS: lldb-api :: functionalities/data-formatter/var-in-aggregate-misuse/TestVarInAggregateMisuse.py (1222 of 1935) PASS: lldb-unit :: Utility/./UtilityTests/FileSpecTest.EqualDotsWindows (1223 of 1935) PASS: lldb-unit :: SymbolFile/NativePDB/./SymbolFileNativePDBTests/PDBFPOProgramToDWARFExpressionTests.UnresolvedCyclicRegisterAssignmentReference (1224 of 1935) PASS: lldb-api :: lang/objc/objc-ivar-offsets/TestObjCIvarOffsets.py (1225 of 1935) PASS: lldb-unit :: SymbolFile/NativePDB/./SymbolFileNativePDBTests/PDBFPOProgramToDWARFExpressionTests.MultipleIndependentAssignments (1226 of 1935) PASS: lldb-api :: commands/expression/no-deadlock/TestExprDoesntBlock.py (1227 of 1935) PASS: lldb-unit :: debugserver/./debugserverTests/RNBSocket.LoopBackListenIPv4 (1228 of 1935) PASS: lldb-unit :: ScriptInterpreter/Python/./ScriptInterpreterPythonTests/PythonDataObjectsTest.TestResetting (1229 of 1935) UNSUPPORTED: lldb-api :: functionalities/data-formatter/data-formatter-stl/libstdcpp/vbool/TestDataFormatterStdVBool.py (1230 of 1935) PASS: lldb-unit :: Utility/./UtilityTests/RangeTest.DoesAdjoinOrIntersect (1231 of 1935) PASS: lldb-api :: commands/expression/options/TestExprOptions.py (1232 of 1935) UNSUPPORTED: lldb-shell :: ObjectFile/PECOFF/disassemble-thumb.yaml (1233 of 1935) PASS: lldb-shell :: Reproducer/TestFileRepro.test (1234 of 1935) PASS: lldb-api :: functionalities/thread/thread_specific_break/TestThreadSpecificBreakpoint.py (1235 of 1935) PASS: lldb-shell :: Host/TestCustomShell.test (1236 of 1935) PASS: lldb-unit :: ScriptInterpreter/Python/./ScriptInterpreterPythonTests/PythonDataObjectsTest.TestCallable (1237 of 1935) PASS: lldb-unit :: Utility/./UtilityTests/StreamTeeTest.AppendStream (1238 of 1935) PASS: lldb-api :: functionalities/object-file/TestImageListMultiArchitecture.py (1239 of 1935) UNSUPPORTED: lldb-shell :: Register/x86-zmm-read.test (1240 of 1935) PASS: lldb-shell :: Reproducer/TestReuseDirectory.test (1241 of 1935) PASS: lldb-shell :: SymbolFile/NativePDB/tag-types.cpp (1242 of 1935) PASS: lldb-api :: tools/lldb-vscode/variables/TestVSCode_variables.py (1243 of 1935) PASS: lldb-unit :: Host/./HostTests/FileSystemTest.EnumerateDirectory (1244 of 1935) PASS: lldb-api :: functionalities/thread/concurrent_events/TestConcurrentWatchBreakDelay.py (1245 of 1935) PASS: lldb-unit :: ScriptInterpreter/Python/./ScriptInterpreterPythonTests/PythonDataObjectsTest.TestPythonListToStructuredList (1246 of 1935) PASS: lldb-api :: functionalities/breakpoint/move_nearest/TestMoveNearest.py (1247 of 1935) PASS: lldb-unit :: Utility/./UtilityTests/VASprintfTest.EncodingError (1248 of 1935) PASS: lldb-unit :: Expression/./ExpressionTests/DiagnosticManagerTest.GetStringPreserveOrder (1249 of 1935) PASS: lldb-unit :: Utility/./UtilityTests/GeneratorTest.Create (1250 of 1935) PASS: lldb-api :: lang/cpp/incomplete-types/TestCppIncompleteTypes.py (1251 of 1935) PASS: lldb-unit :: Utility/./UtilityTests/ScalarTest.APIntConstructor (1252 of 1935) PASS: lldb-api :: lang/cpp/dynamic-value/TestDynamicValue.py (1253 of 1935) PASS: lldb-api :: functionalities/memory/read/TestMemoryRead.py (1254 of 1935) PASS: lldb-unit :: UnwindAssembly/x86/./UnwindAssemblyx86Tests/Testx86AssemblyInspectionEngine.TestPushExtended (1255 of 1935) PASS: lldb-unit :: Utility/./UtilityTests/StringExtractorTest.DecodeHexU8_Exact (1256 of 1935) PASS: lldb-api :: functionalities/history/TestHistoryRecall.py (1257 of 1935) PASS: lldb-api :: functionalities/data-formatter/nsarraysynth/TestNSArraySynthetic.py (1258 of 1935) PASS: lldb-api :: commands/frame/language/TestGuessLanguage.py (1259 of 1935) PASS: lldb-unit :: ScriptInterpreter/Python/./ScriptInterpreterPythonTests/PythonDataObjectsTest.TestPythonBoolean (1260 of 1935) PASS: lldb-api :: lang/objc/objc-struct-return/TestObjCStructReturn.py (1261 of 1935) PASS: lldb-api :: lang/c/offsetof/TestOffsetof.py (1262 of 1935) PASS: lldb-api :: commands/command/history/TestCommandHistory.py (1263 of 1935) PASS: lldb-unit :: Process/minidump/./LLDBMinidumpTests/MinidumpParserTest.GetThreadContext_x86_32_wow64 (1264 of 1935) PASS: lldb-unit :: Symbol/./SymbolTests/TestTypeSystemClang.TestFunctionTemplateInRecordConstruction (1265 of 1935) PASS: lldb-shell :: ObjectFile/ELF/many-sections.s (1266 of 1935) PASS: lldb-shell :: SymbolFile/DWARF/debug_rnglists.s (1267 of 1935) PASS: lldb-unit :: Expression/./ExpressionTests/DiagnosticManagerTest.GetStringSeverityLabels (1268 of 1935) PASS: lldb-api :: functionalities/thread/concurrent_events/TestConcurrentSignalBreak.py (1269 of 1935) PASS: lldb-api :: python_api/value/linked_list/TestValueAPILinkedList.py (1270 of 1935) PASS: lldb-api :: lang/objc/foundation/TestObjCMethodsNSArray.py (1271 of 1935) PASS: lldb-api :: python_api/process/io/TestProcessIO.py (1272 of 1935) PASS: lldb-shell :: Settings/TestStopCommandSourceOnError.test (1273 of 1935) PASS: lldb-unit :: Utility/./UtilityTests/UriParserTest.SchemeHostSeparator4 (1274 of 1935) PASS: lldb-unit :: Utility/./UtilityTests/NameMatchesTest.Ignore (1275 of 1935) PASS: lldb-unit :: Utility/./UtilityTests/FileSpecTest.AppendPathComponent (1276 of 1935) UNSUPPORTED: lldb-api :: functionalities/exec/TestExec.py (1277 of 1935) PASS: lldb-unit :: Host/./HostTests/SocketTest.TCPGetConnectURI (1278 of 1935) PASS: lldb-api :: lang/objc/foundation/TestSymbolTable.py (1279 of 1935) PASS: lldb-shell :: ObjectFile/ELF/avr-basic-info.yaml (1280 of 1935) PASS: lldb-unit :: Utility/./UtilityTests/OptionsWithRawTest.ArgsButNoDelimiter (1281 of 1935) PASS: lldb-unit :: Host/./HostTests/NativeProcessProtocolTest.ReadMemoryWithoutTrap (1282 of 1935) PASS: lldb-unit :: Utility/./UtilityTests/StreamTest.AddressRangeEmptyRange (1283 of 1935) PASS: lldb-unit :: Language/Highlighting/./HighlighterTests/HighlighterTest.ClangTrailingBackslashMissingNewLine (1284 of 1935) PASS: lldb-unit :: Utility/./UtilityTests/TimeoutTest.Format (1285 of 1935) PASS: lldb-unit :: Utility/./UtilityTests/ProcessInstanceInfo.DumpTable (1286 of 1935) PASS: lldb-unit :: ScriptInterpreter/Python/./ScriptInterpreterPythonTests/PythonDataObjectsTest.TestPythonStringToStructuredString (1287 of 1935) PASS: lldb-unit :: Utility/./UtilityTests/RangeDataVector.CustomSort (1288 of 1935) PASS: lldb-api :: functionalities/data-formatter/data-formatter-objc/cmtime/TestDataFormatterCMTime.py (1289 of 1935) PASS: lldb-unit :: ScriptInterpreter/Python/./ScriptInterpreterPythonTests/PythonDataObjectsTest.TestPythonIntegerToStr (1290 of 1935) PASS: lldb-shell :: SymbolFile/DWARF/find-qualified-variable.cpp (1291 of 1935) UNSUPPORTED: lldb-shell :: SymbolFile/PDB/compilands.test (1292 of 1935) PASS: lldb-unit :: ObjectFile/ELF/./ObjectFileELFTests/ObjectFileELFTest.GetSymtab_NoSymEntryPointArmThumbAddressClass (1293 of 1935) PASS: lldb-unit :: Utility/./UtilityTests/SerializationRountripTest.SerializeDeserializePod (1294 of 1935) PASS: lldb-unit :: Symbol/./SymbolTests/Type.GetTypeScopeAndBasename (1295 of 1935) PASS: lldb-api :: functionalities/tail_call_frames/thread_step_out_message/TestArtificialFrameStepOutMessage.py (1296 of 1935) PASS: lldb-shell :: ObjectFile/Breakpad/sections.test (1297 of 1935) PASS: lldb-shell :: Heap/heap-cstr.test (1298 of 1935) PASS: lldb-api :: lang/cpp/bool/TestCPPBool.py (1299 of 1935) PASS: lldb-api :: types/TestShortType.py (1300 of 1935) PASS: lldb-unit :: Utility/./UtilityTests/RangeDataVector.FindEntryThatContains_Overlap (1301 of 1935) PASS: lldb-shell :: ObjectFile/ELF/PT_LOAD-overlap-section.yaml (1302 of 1935) PASS: lldb-unit :: Target/./TargetTests/ModuleCacheTest.GetAndPut (1303 of 1935) PASS: lldb-api :: commands/expression/radar_8638051/Test8638051.py (1304 of 1935) PASS: lldb-api :: lang/objc/objc-runtime-ivars/TestRuntimeIvars.py (1305 of 1935) PASS: lldb-unit :: Utility/./UtilityTests/Predicate.WaitForValueNotEqualTo (1306 of 1935) PASS: lldb-api :: functionalities/data-formatter/data-formatter-objc/TestDataFormatterObjCCF.py (1307 of 1935) PASS: lldb-unit :: SymbolFile/DWARF/./SymbolFileDWARFTests/SymbolFileDWARFTests.TestAbbrevInvalidNULLTag (1308 of 1935) PASS: lldb-unit :: Utility/./UtilityTests/RangeTest.LessThanInvalid (1309 of 1935) PASS: lldb-unit :: Utility/./UtilityTests/VMRange.SetEndAddress (1310 of 1935) PASS: lldb-api :: functionalities/data-formatter/data-formatter-python-synth/TestDataFormatterPythonSynth.py (1311 of 1935) PASS: lldb-unit :: Expression/./ExpressionTests/DiagnosticManagerTest.AppendMessageNoDiag (1312 of 1935) UNSUPPORTED: lldb-api :: functionalities/data-formatter/data-formatter-stl/libstdcpp/unique_ptr/TestDataFormatterStdUniquePtr.py (1313 of 1935) PASS: lldb-api :: functionalities/optimized_code/TestNoASanExceptionAfterEvalOP_piece.py (1314 of 1935) UNSUPPORTED: lldb-api :: iohandler/completion/TestIOHandlerCompletion.py (1315 of 1935) PASS: lldb-unit :: Language/Highlighting/./HighlighterTests/HighlighterTest.ClangStringLiterals (1316 of 1935) PASS: lldb-unit :: ObjectFile/Breakpad/./ObjectFileBreakpadTests/StackWinRecord.parse (1317 of 1935) PASS: lldb-api :: functionalities/data-formatter/data-formatter-objc/TestDataFormatterObjCNSURL.py (1318 of 1935) PASS: lldb-unit :: ObjectFile/ELF/./ObjectFileELFTests/ObjectFileELFTest.SectionsResolveConsistently (1319 of 1935) PASS: lldb-unit :: Utility/./UtilityTests/UriParserTest.MinimalPortPath (1320 of 1935) PASS: lldb-api :: python_api/frame/get-variables/TestGetVariables.py (1321 of 1935) PASS: lldb-api :: api/command-return-object/TestSBCommandReturnObject.py (1322 of 1935) PASS: lldb-api :: commands/expression/vector_of_enums/TestVectorOfEnums.py (1323 of 1935) PASS: lldb-unit :: Utility/./UtilityTests/BinaryStreamTest.PutSLEB128OneByte (1324 of 1935) PASS: lldb-api :: types/TestDoubleTypes.py (1325 of 1935) PASS: lldb-api :: functionalities/data-formatter/data-formatter-objc/TestDataFormatterObjCNSContainer.py (1326 of 1935) PASS: lldb-api :: python_api/name_lookup/TestNameLookup.py (1327 of 1935) PASS: lldb-unit :: Target/./TargetTests/ExecutionContextTest.GetByteOrderProcess (1328 of 1935) PASS: lldb-api :: lang/objc/objc-stepping/TestObjCStepping.py (1329 of 1935) PASS: lldb-api :: tools/lldb-vscode/step/TestVSCode_step.py (1330 of 1935) PASS: lldb-unit :: Utility/./UtilityTests/StringExtractorTest.GetHexU8_Exact_NoEof (1331 of 1935) PASS: lldb-unit :: Utility/./UtilityTests/ScalarTest.SetValueFromCString (1332 of 1935) PASS: lldb-shell :: Quit/TestQuitExitCodeTooManyArgs.test (1333 of 1935) PASS: lldb-unit :: Symbol/./SymbolTests/TestClangASTImporter.MetadataPropagationAfterCopying (1334 of 1935) PASS: lldb-shell :: ObjectFile/ELF/PT_LOAD-overlap-PT_INTERP.yaml (1335 of 1935) PASS: lldb-unit :: Utility/./UtilityTests/UriParserTest.Minimal (1336 of 1935) PASS: lldb-api :: types/TestRecursiveTypes.py (1337 of 1935) PASS: lldb-api :: commands/expression/persistent_ptr_update/TestPersistentPtrUpdate.py (1338 of 1935) PASS: lldb-unit :: Utility/./UtilityTests/StreamTest.PutChar (1339 of 1935) PASS: lldb-unit :: Utility/./UtilityTests/ConstStringTest.NullAndEmptyStates (1340 of 1935) PASS: lldb-shell :: Settings/TestFrameFormatMangling.test (1341 of 1935) PASS: lldb-api :: functionalities/thread/concurrent_events/TestConcurrentCrashWithSignal.py (1342 of 1935) PASS: lldb-api :: functionalities/gdb_remote_client/TestGDBRemoteClient.py (1343 of 1935) PASS: lldb-shell :: ObjectFile/Breakpad/breakpad-identification.test (1344 of 1935) PASS: lldb-api :: functionalities/thread/exit_during_break/TestExitDuringBreak.py (1345 of 1935) PASS: lldb-shell :: Minidump/fb-dump.test (1346 of 1935) PASS: lldb-api :: commands/version/TestVersion.py (1347 of 1935) PASS: lldb-shell :: SymbolFile/DWARF/dwp.s (1348 of 1935) PASS: lldb-unit :: Utility/./UtilityTests/StreamTest.QuotedCString (1349 of 1935) PASS: lldb-api :: functionalities/inferior-crashing/recursive-inferior/TestRecursiveInferior.py (1350 of 1935) PASS: lldb-unit :: Host/./HostTests/FileSystemTest.MakeAbsolute (1351 of 1935) PASS: lldb-shell :: SymbolFile/DWARF/split-dwarf-multiple-cu.ll (1352 of 1935) XFAIL: lldb-shell :: SymbolFile/DWARF/find-type-in-function.cpp (1353 of 1935) PASS: lldb-api :: commands/expression/import-std-module/shared_ptr-dbg-info-content/TestSharedPtrDbgInfoContentFromStdModule.py (1354 of 1935) PASS: lldb-api :: commands/expression/issue_11588/Test11588.py (1355 of 1935) PASS: lldb-api :: lang/cpp/class_types/TestClassTypesDisassembly.py (1356 of 1935) PASS: lldb-unit :: Utility/./UtilityTests/StreamTest.ShiftOperatorChars (1357 of 1935) PASS: lldb-shell :: Breakpoint/single-file-split-dwarf.test (1358 of 1935) PASS: lldb-unit :: UnwindAssembly/x86/./UnwindAssemblyx86Tests/Testx86AssemblyInspectionEngine.TestPopEBX (1359 of 1935) PASS: lldb-shell :: SymbolFile/DWARF/deterministic-build.cpp (1360 of 1935) PASS: lldb-shell :: SymbolFile/DWARF/debug_loc_and_loclists.s (1361 of 1935) PASS: lldb-unit :: Symbol/./SymbolTests/PostfixExpression.ParseOneExpression (1362 of 1935) PASS: lldb-unit :: Utility/./UtilityTests/UUIDTest.RelationalOperators (1363 of 1935) PASS: lldb-api :: functionalities/data-formatter/data-formatter-objc/TestDataFormatterObjCNSData.py (1364 of 1935) UNSUPPORTED: lldb-shell :: BuildScript/toolchain-msvc.test (1365 of 1935) PASS: lldb-unit :: Process/minidump/./LLDBMinidumpTests/MinidumpParserTest.GetLinuxProcStatus_no_stream (1366 of 1935) PASS: lldb-unit :: Process/minidump/./LLDBMinidumpTests/RegisterContextMinidump.ConvertMinidumpContext_x86_32 (1367 of 1935) PASS: lldb-unit :: Host/./HostTests/Host.GetEnvironment (1368 of 1935) PASS: lldb-unit :: Host/./HostTests/SocketTest.DecodeHostAndPort (1369 of 1935) PASS: lldb-unit :: Utility/./UtilityTests/BinaryStreamTest.PutSLEB128One (1370 of 1935) PASS: lldb-api :: tools/lldb-vscode/breakpoint/TestVSCode_setExceptionBreakpoints.py (1371 of 1935) UNSUPPORTED: lldb-api :: functionalities/darwin_log/filter/regex/message/TestDarwinLogFilterRegexMessage.py (1372 of 1935) PASS: lldb-shell :: SymbolFile/DWARF/DW_OP_piece-struct.s (1373 of 1935) PASS: lldb-api :: python_api/findvalue_duplist/TestSBFrameFindValue.py (1374 of 1935) PASS: lldb-unit :: Utility/./UtilityTests/ArgsTest.TestSingleArgWithQuotedSpace (1375 of 1935) PASS: lldb-shell :: ScriptInterpreter/Python/scripted_breakpoint.test (1376 of 1935) PASS: lldb-unit :: Host/./HostTests/SocketAddressTest.Set (1377 of 1935) PASS: lldb-api :: lang/objc/ptr_refs/TestPtrRefsObjC.py (1378 of 1935) PASS: lldb-shell :: SymbolFile/DWARF/dir-separator-windows.s (1379 of 1935) PASS: lldb-shell :: Settings/TestModuleCacheSanity.test (1380 of 1935) PASS: lldb-api :: functionalities/thread/concurrent_events/TestConcurrentTwoBreakpointsOneDelaySignal.py (1381 of 1935) PASS: lldb-shell :: Reproducer/Functionalities/TestExpressionEvaluation.test (1382 of 1935) PASS: lldb-unit :: Signals/./SignalsTests/UnixSignalsTest.Iteration (1383 of 1935) PASS: lldb-unit :: Utility/./UtilityTests/RangeTest.Equal (1384 of 1935) PASS: lldb-api :: commands/quit/TestQuit.py (1385 of 1935) UNSUPPORTED: lldb-api :: linux/add-symbols/TestTargetSymbolsAddCommand.py (1386 of 1935) PASS: lldb-unit :: Utility/./UtilityTests/UriParserTest.TypicalPortPath (1387 of 1935) PASS: lldb-api :: linux/builtin_trap/TestBuiltinTrap.py (1388 of 1935) PASS: lldb-unit :: Expression/./ExpressionTests/ClangHostTest.MacOSX (1389 of 1935) UNSUPPORTED: lldb-api :: functionalities/thread/state/TestThreadStates.py (1390 of 1935) PASS: lldb-api :: functionalities/inferior-crashing/TestInferiorCrashingStep.py (1391 of 1935) PASS: lldb-api :: functionalities/thread/concurrent_events/TestConcurrentTwoWatchpointsOneSignal.py (1392 of 1935) PASS: lldb-api :: commands/target/create-deps/TestTargetCreateDeps.py (1393 of 1935) PASS: lldb-api :: tools/lldb-server/inferior-crash/TestGdbRemoteAbort.py (1394 of 1935) UNSUPPORTED: lldb-shell :: SymbolFile/target-symbols-add-unwind.test (1395 of 1935) PASS: lldb-api :: lang/objcxx/objcxx-ivar-vector/TestIvarVector.py (1396 of 1935) PASS: lldb-unit :: Utility/./UtilityTests/StringExtractorTest.GetHexU8_Underflow2_NoEof (1397 of 1935) PASS: lldb-api :: tools/lldb-vscode/launch/TestVSCode_launch.py (1398 of 1935) PASS: lldb-unit :: Utility/./UtilityTests/DataExtractorTest.GetCStr (1399 of 1935) PASS: lldb-api :: functionalities/thread/concurrent_events/TestConcurrentWatchpointWithDelayWatchpointThreads.py (1400 of 1935) PASS: lldb-api :: functionalities/breakpoint/dummy_target_breakpoints/TestBreakpointsWithNoTargets.py (1401 of 1935) PASS: lldb-unit :: Utility/./UtilityTests/ArgsTest.ReplaceArgumentAtIndexOutOfRange (1402 of 1935) PASS: lldb-shell :: Quit/TestQuitExitCodeImplicit0.test (1403 of 1935) PASS: lldb-api :: commands/expression/two-files/TestObjCTypeQueryFromOtherCompileUnit.py (1404 of 1935) PASS: lldb-unit :: Utility/./UtilityTests/ProcessInstanceInfoMatch.Name (1405 of 1935) PASS: lldb-unit :: Utility/./UtilityTests/RecordReplayTest.InstrumentedBarRef (1406 of 1935) PASS: lldb-unit :: Process/minidump/./LLDBMinidumpTests/MinidumpParserTest.GetThreadsAndGetThreadContext (1407 of 1935) PASS: lldb-api :: tools/lldb-server/TestGdbRemoteKill.py (1408 of 1935) PASS: lldb-unit :: ObjectFile/Breakpad/./ObjectFileBreakpadTests/PublicRecord.parse (1409 of 1935) PASS: lldb-api :: functionalities/type_completion/TestTypeCompletion.py (1410 of 1935) PASS: lldb-unit :: Utility/./UtilityTests/StringListTest.PopBack (1411 of 1935) PASS: lldb-unit :: Utility/./UtilityTests/StringExtractorTest.GetHexU8_Underflow_NoEof (1412 of 1935) PASS: lldb-shell :: SymbolFile/DWARF/dwarf5-debug_line.s (1413 of 1935) PASS: lldb-unit :: Utility/./UtilityTests/StringListTest.JoinMultiCharSeparator (1414 of 1935) PASS: lldb-api :: commands/expression/completion/TestExprCompletion.py (1415 of 1935) PASS: lldb-unit :: Utility/./UtilityTests/BinaryStreamTest.PutSLEB128ThreeBytes (1416 of 1935) PASS: lldb-unit :: Utility/./UtilityTests/UriParserTest.PortOverflow (1417 of 1935) PASS: lldb-api :: python_api/default-constructor/TestDefaultConstructorForAPIObjects.py (1418 of 1935) PASS: lldb-unit :: Symbol/./SymbolTests/TestTypeSystemClang.TestDisplayName (1419 of 1935) PASS: lldb-unit :: UnwindAssembly/x86/./UnwindAssemblyx86Tests/Testx86AssemblyInspectionEngine.TestSubESP (1420 of 1935) PASS: lldb-unit :: Utility/./UtilityTests/StringListTest.RemoveBlankLines (1421 of 1935) PASS: lldb-unit :: Utility/./UtilityTests/AnsiTerminal.WhiteSpace (1422 of 1935) PASS: lldb-shell :: SymbolFile/DWARF/debug-types-address-ranges.s (1423 of 1935) PASS: lldb-unit :: UnwindAssembly/x86/./UnwindAssemblyx86Tests/Testx86AssemblyInspectionEngine.TestPushRBX (1424 of 1935) PASS: lldb-unit :: ScriptInterpreter/Python/./ScriptInterpreterPythonTests/PythonDataObjectsTest.TestGlobalNameResolutionWithDot (1425 of 1935) UNSUPPORTED: lldb-api :: lang/cpp/function-template-parameter-pack/TestFunctionTemplateParameterPack.py (1426 of 1935) PASS: lldb-api :: functionalities/ptr_refs/TestPtrRefs.py (1427 of 1935) PASS: lldb-unit :: Symbol/./SymbolTests/PostfixExpression.ParseFPOProgram (1428 of 1935) PASS: lldb-api :: functionalities/data-formatter/data-formatter-caching/TestDataFormatterCaching.py (1429 of 1935) PASS: lldb-api :: lang/objc/objc-builtin-types/TestObjCBuiltinTypes.py (1430 of 1935) PASS: lldb-unit :: Utility/./UtilityTests/RegisterValueTest.GetSet8 (1431 of 1935) UNSUPPORTED: lldb-api :: commands/expression/multiline-completion/TestMultilineCompletion.py (1432 of 1935) PASS: lldb-shell :: SymbolFile/DWARF/inline-function-address-shared.test (1433 of 1935) PASS: lldb-shell :: ObjectFile/ELF/section-overlap.yaml (1434 of 1935) UNSUPPORTED: lldb-api :: functionalities/asan/TestReportData.py (1435 of 1935) PASS: lldb-api :: tools/lldb-server/TestLldbGdbServer.py (1436 of 1935) PASS: lldb-shell :: Commands/command-script-import.test (1437 of 1935) PASS: lldb-unit :: Utility/./UtilityTests/VMRange.ContainsAddr (1438 of 1935) PASS: lldb-api :: commands/expression/entry-bp/TestExprEntryBP.py (1439 of 1935) PASS: lldb-shell :: Breakpoint/case-sensitive.test (1440 of 1935) PASS: lldb-unit :: Host/./HostTests/FileSystemTest.FileAndDirectoryComponents (1441 of 1935) PASS: lldb-api :: functionalities/step-avoids-no-debug/TestStepNoDebug.py (1442 of 1935) PASS: lldb-unit :: Utility/./UtilityTests/StreamTest.PutNHex8 (1443 of 1935) PASS: lldb-unit :: Utility/./UtilityTests/ListenerTest.GetEventImmediate (1444 of 1935) PASS: lldb-unit :: ScriptInterpreter/Python/./ScriptInterpreterPythonTests/PythonDataObjectsTest.TestObjectAttributes (1445 of 1935) PASS: lldb-unit :: Expression/./ExpressionTests/DWARFExpression.DW_OP_convert (1446 of 1935) PASS: lldb-shell :: Commands/CommandScriptImmediateOutput/CommandScriptImmediateOutputFile.test (1447 of 1935) PASS: lldb-unit :: Utility/./UtilityTests/StringExtractorTest.GetHexBytes_FullString (1448 of 1935) PASS: lldb-unit :: Utility/./UtilityTests/RegularExpression.Valid (1449 of 1935) PASS: lldb-api :: functionalities/thread/concurrent_events/TestConcurrentTwoBreakpointsOneWatchpoint.py (1450 of 1935) PASS: lldb-api :: commands/source/info/TestSourceInfo.py (1451 of 1935) PASS: lldb-api :: python_api/formatters/TestFormattersSBAPI.py (1452 of 1935) PASS: lldb-api :: lang/objc/print-obj/TestPrintObj.py (1453 of 1935) PASS: lldb-shell :: Settings/TestFrameFormatNoColor.test (1454 of 1935) PASS: lldb-api :: api/multithreaded/TestMultithreaded.py (1455 of 1935) UNSUPPORTED: lldb-shell :: Register/x86-64-zmm-write.test (1456 of 1935) PASS: lldb-unit :: Utility/./UtilityTests/ArgsTest.TestOverwriteArgs (1457 of 1935) UNSUPPORTED: lldb-api :: functionalities/darwin_log/filter/exact_match/activity/TestDarwinLogFilterMatchActivity.py (1458 of 1935) UNSUPPORTED: lldb-api :: tools/lldb-server/TestGdbRemote_vContThreads.py (1459 of 1935) PASS: lldb-unit :: Utility/./UtilityTests/VASprintfTest.NoBufferResize (1460 of 1935) PASS: lldb-shell :: Reproducer/TestGDBRemoteRepro.test (1461 of 1935) PASS: lldb-api :: commands/command/script_alias/TestCommandScriptAlias.py (1462 of 1935) PASS: lldb-unit :: Utility/./UtilityTests/RangeTest.Constructor (1463 of 1935) UNSUPPORTED: lldb-api :: functionalities/data-formatter/data-formatter-stl/libstdcpp/string/TestDataFormatterStdString.py (1464 of 1935) PASS: lldb-api :: functionalities/data-formatter/data-formatter-stl/libcxx/forward_list/TestDataFormatterLibcxxForwardList.py (1465 of 1935) PASS: lldb-api :: tools/lldb-server/TestGdbRemoteExpeditedRegisters.py (1466 of 1935) PASS: lldb-unit :: Symbol/./SymbolTests/TestClangASTImporter.RecordLayout (1467 of 1935) PASS: lldb-unit :: UnwindAssembly/x86/./UnwindAssemblyx86Tests/Testx86AssemblyInspectionEngine.Test64bitFramelessSmallStackFrame (1468 of 1935) PASS: lldb-unit :: Host/./HostTests/HostInfoTest.GetHostname (1469 of 1935) PASS: lldb-api :: lang/cpp/thread_local/TestThreadLocal.py (1470 of 1935) PASS: lldb-unit :: Utility/./UtilityTests/ArgsTest.TestTrailingBackslash (1471 of 1935) UNSUPPORTED: lldb-api :: macosx/macabi/TestMacABImacOSFramework.py (1472 of 1935) PASS: lldb-api :: lang/c/set_values/TestSetValues.py (1473 of 1935) PASS: lldb-unit :: Utility/./UtilityTests/FileSpecTest.FormatFileSpec (1474 of 1935) PASS: lldb-api :: commands/expression/inline-namespace/TestInlineNamespace.py (1475 of 1935) PASS: lldb-unit :: Core/./LLDBCoreTests/UniqueCStringMap.NoDefaultConstructor (1476 of 1935) PASS: lldb-api :: functionalities/thread/concurrent_events/TestConcurrentDelaySignalBreak.py (1477 of 1935) PASS: lldb-unit :: UnwindAssembly/x86/./UnwindAssemblyx86Tests/Testx86AssemblyInspectionEngine.Testi386IgnoredRegisters (1478 of 1935) PASS: lldb-unit :: Expression/./ExpressionTests/DiagnosticManagerTest.GetStringMultiline (1479 of 1935) PASS: lldb-unit :: Utility/./UtilityTests/TimerTest.CategoryTimesNested (1480 of 1935) UNSUPPORTED: lldb-shell :: Register/aarch64-fp-read.test (1481 of 1935) UNSUPPORTED: lldb-shell :: Breakpoint/ppc64-localentry.test (1482 of 1935) PASS: lldb-shell :: SymbolFile/DWARF/find-function-regex.cpp (1483 of 1935) PASS: lldb-api :: python_api/exprpath_synthetic/TestExprPathSynthetic.py (1484 of 1935) UNSUPPORTED: lldb-api :: android/platform/TestDefaultCacheLineSize.py (1485 of 1935) PASS: lldb-unit :: Utility/./UtilityTests/RecordReplayTest.InstrumentedBar (1486 of 1935) PASS: lldb-unit :: Utility/./UtilityTests/StateTest.Formatv (1487 of 1935) PASS: lldb-unit :: Utility/./UtilityTests/StreamTest.AddressSize (1488 of 1935) PASS: lldb-unit :: Utility/./UtilityTests/StringListTest.LongestCommonPrefix (1489 of 1935) PASS: lldb-unit :: Utility/./UtilityTests/StatusTest.ErrorConversion (1490 of 1935) PASS: lldb-api :: commands/platform/basic/TestPlatformCommand.py (1491 of 1935) PASS: lldb-unit :: ScriptInterpreter/Python/./ScriptInterpreterPythonTests/PythonDataObjectsTest.TestPythonStringToStr (1492 of 1935) PASS: lldb-unit :: Utility/./UtilityTests/RegularExpression.Invalid (1493 of 1935) PASS: lldb-unit :: Process/minidump/./LLDBMinidumpTests/MinidumpParserTest.GetArchitecture (1494 of 1935) PASS: lldb-unit :: Process/minidump/./LLDBMinidumpTests/MinidumpParserTest.GetMemoryRegionInfoFromMemory64List (1495 of 1935) PASS: lldb-unit :: Process/gdb-remote/./ProcessGdbRemoteTests/GDBRemoteClientBaseTest.SendContinueAndAsyncPacket (1496 of 1935) PASS: lldb-shell :: Minidump/memory-region-from-module.yaml (1497 of 1935) PASS: lldb-api :: functionalities/thread/step_until/TestStepUntil.py (1498 of 1935) PASS: lldb-api :: tools/lldb-vscode/stackTrace/TestVSCode_stackTrace.py (1499 of 1935) PASS: lldb-api :: functionalities/load_unload/TestLoadUnload.py (1500 of 1935) PASS: lldb-unit :: Utility/./UtilityTests/UUIDTest.StringConverion (1501 of 1935) PASS: lldb-unit :: tools/lldb-server/tests/./LLDBServerTests/TestBase.DebugserverEnv (1502 of 1935) PASS: lldb-api :: functionalities/breakpoint/breakpoint_ignore_count/TestBreakpointIgnoreCount.py (1503 of 1935) UNSUPPORTED: lldb-shell :: Register/x86-gp-read.test (1504 of 1935) PASS: lldb-unit :: Utility/./UtilityTests/CompletionRequest.TryCompleteCurrentArgGood (1505 of 1935) PASS: lldb-api :: functionalities/float-display/TestFloatDisplay.py (1506 of 1935) PASS: lldb-api :: lang/objc/radar-9691614/TestObjCMethodReturningBOOL.py (1507 of 1935) PASS: lldb-shell :: Commands/CommandScriptImmediateOutput/CommandScriptImmediateOutputConsole.test (1508 of 1935) PASS: lldb-api :: functionalities/data-formatter/data-formatter-stl/libcxx/multimap/TestDataFormatterLibccMultiMap.py (1509 of 1935) PASS: lldb-api :: functionalities/thread/concurrent_events/TestConcurrentDelayedCrashWithBreakpointWatchpoint.py (1510 of 1935) PASS: lldb-api :: lang/objc/self/TestObjCSelf.py (1511 of 1935) PASS: lldb-api :: python_api/file_handle/TestFileHandle.py (1512 of 1935) PASS: lldb-api :: functionalities/data-formatter/data-formatter-skip-summary/TestDataFormatterSkipSummary.py (1513 of 1935) PASS: lldb-api :: commands/settings/TestSettings.py (1514 of 1935) PASS: lldb-shell :: ObjectFile/MachO/lc_build_version.yaml (1515 of 1935) PASS: lldb-unit :: Utility/./UtilityTests/AnsiTerminal.KnownPrefix (1516 of 1935) PASS: lldb-unit :: Language/CPlusPlus/./LanguageCPlusPlusTests/CPlusPlusLanguage.CPlusPlusNameParser (1517 of 1935) PASS: lldb-api :: commands/watchpoints/watchpoint_commands/TestWatchpointCommands.py (1518 of 1935) PASS: lldb-unit :: Utility/./UtilityTests/StreamTest.PutHex32ByteOrderBig (1519 of 1935) PASS: lldb-unit :: Utility/./UtilityTests/StringExtractorTest.DecodeHexU8_Extra (1520 of 1935) PASS: lldb-unit :: Utility/./UtilityTests/DataExtractorTest.GetCStrAtEnd (1521 of 1935) PASS: lldb-unit :: Utility/./UtilityTests/StreamTest.PutMaxHex64ByteOrderBig (1522 of 1935) PASS: lldb-unit :: Host/./HostTests/NativeProcessProtocolTest.SetBreakpointFailRead (1523 of 1935) PASS: lldb-api :: lang/cpp/unicode-literals/TestUnicodeLiterals.py (1524 of 1935) PASS: lldb-api :: python_api/watchpoint/TestSetWatchpoint.py (1525 of 1935) PASS: lldb-shell :: Minidump/memory-region.yaml (1526 of 1935) PASS: lldb-unit :: Utility/./UtilityTests/RangeTest.ContainsRangeStartingFromZero (1527 of 1935) PASS: lldb-unit :: Utility/./UtilityTests/UriParserTest.BadPort (1528 of 1935) PASS: lldb-unit :: Utility/./UtilityTests/RangeTest.DoesIntersect (1529 of 1935) PASS: lldb-shell :: Commands/command-regex-unalias.test (1530 of 1935) PASS: lldb-api :: api/log/TestAPILog.py (1531 of 1935) PASS: lldb-api :: lang/cpp/class-template-parameter-pack/TestClassTemplateParameterPack.py (1532 of 1935) PASS: lldb-unit :: Utility/./UtilityTests/StringListTest.InsertStringAtIndexStdString (1533 of 1935) PASS: lldb-api :: lang/c/function_types/TestFunctionTypes.py (1534 of 1935) PASS: lldb-api :: commands/frame/diagnose/array/TestArray.py (1535 of 1935) PASS: lldb-api :: functionalities/thread/crash_during_step/TestCrashDuringStep.py (1536 of 1935) PASS: lldb-shell :: SymbolFile/DWARF/debug_line-relative_path.s (1537 of 1935) PASS: lldb-unit :: UnwindAssembly/x86/./UnwindAssemblyx86Tests/Testx86AssemblyInspectionEngine.TestPush0 (1538 of 1935) UNSUPPORTED: lldb-shell :: Process/Windows/exception_access_violation.cpp (1539 of 1935) PASS: lldb-api :: lang/objc/objc-static-method-stripped/TestObjCStaticMethodStripped.py (1540 of 1935) PASS: lldb-unit :: Utility/./UtilityTests/StringListTest.LongestCommonPrefixNoPrefix (1541 of 1935) PASS: lldb-unit :: Utility/./UtilityTests/BinaryStreamTest.PutSLEB128TwoBytes (1542 of 1935) PASS: lldb-unit :: Utility/./UtilityTests/StreamTest.PutRawBytesToBigEndian (1543 of 1935) PASS: lldb-unit :: Language/Highlighting/./HighlighterTests/HighlighterTest.DefaultHighlighter (1544 of 1935) PASS: lldb-api :: functionalities/data-formatter/data-formatter-proper-plurals/TestFormattersOneIsSingular.py (1545 of 1935) PASS: lldb-unit :: Utility/./UtilityTests/StreamTeeTest.Flush (1546 of 1935) PASS: lldb-api :: lang/cpp/scope/TestCppScope.py (1547 of 1935) PASS: lldb-unit :: Language/Highlighting/./HighlighterTests/HighlighterTest.ClangIdentifiers (1548 of 1935) PASS: lldb-api :: functionalities/data-formatter/nsdictionarysynth/TestNSDictionarySynthetic.py (1549 of 1935) PASS: lldb-unit :: Utility/./UtilityTests/ArchSpecTest.MergeFrom (1550 of 1935) PASS: lldb-unit :: Utility/./UtilityTests/VMRange.CollectionContains (1551 of 1935) PASS: lldb-api :: functionalities/show_location/TestShowLocationDwarf5.py (1552 of 1935) UNSUPPORTED: lldb-shell :: ScriptInterpreter/Lua/breakpoint_callback.test (1553 of 1935) PASS: lldb-unit :: UnwindAssembly/x86/./UnwindAssemblyx86Tests/Testx86AssemblyInspectionEngine.TestPushESI (1554 of 1935) PASS: lldb-api :: commands/watchpoints/watchpoint_set_command/TestWatchLocationWithWatchSet.py (1555 of 1935) PASS: lldb-unit :: SymbolFile/NativePDB/./SymbolFileNativePDBTests/PDBFPOProgramToDWARFExpressionTests.InvalidAssignmentSingle (1556 of 1935) PASS: lldb-unit :: UnwindAssembly/x86/./UnwindAssemblyx86Tests/Testx86AssemblyInspectionEngine.TestPushR15 (1557 of 1935) UNSUPPORTED: lldb-api :: functionalities/tsan/global_location/TestTsanGlobalLocation.py (1558 of 1935) PASS: lldb-unit :: Utility/./UtilityTests/RecordReplayTest.InstrumentedFoo (1559 of 1935) PASS: lldb-api :: functionalities/fat_archives/TestFatArchives.py (1560 of 1935) PASS: lldb-api :: lang/cpp/stl/TestSTL.py (1561 of 1935) PASS: lldb-unit :: Utility/./UtilityTests/ArgsTest.GetQuotedCommandString (1562 of 1935) PASS: lldb-unit :: Utility/./UtilityTests/ScalarTest.Division (1563 of 1935) PASS: lldb-unit :: Process/gdb-remote/./ProcessGdbRemoteTests/GDBRemoteClientBaseTest.SendContinueDelegateInterface (1564 of 1935) PASS: lldb-shell :: Minidump/Windows/find-module.test (1565 of 1935) PASS: lldb-shell :: SymbolFile/DWARF/apple-index-is-used.cpp (1566 of 1935) PASS: lldb-shell :: ObjectFile/ELF/gnu-debuglink.yaml (1567 of 1935) PASS: lldb-api :: commands/frame/diagnose/dereference-function-return/TestDiagnoseDereferenceFunctionReturn.py (1568 of 1935) PASS: lldb-shell :: SymbolFile/Breakpad/line-table-mixed-path-styles.test (1569 of 1935) PASS: lldb-api :: python_api/process/read-mem-cstring/TestReadMemCString.py (1570 of 1935) PASS: lldb-unit :: Utility/./UtilityTests/StreamTest.PutPtr (1571 of 1935) PASS: lldb-unit :: Utility/./UtilityTests/TimerTest.CategoryTimes2 (1572 of 1935) PASS: lldb-unit :: Language/Highlighting/./HighlighterTests/HighlighterTest.ClangSquareBrackets (1573 of 1935) PASS: lldb-unit :: Utility/./UtilityTests/StringLexerTest.NextIf (1574 of 1935) PASS: lldb-shell :: ObjectFile/ELF/minidebuginfo-find-symbols.yaml (1575 of 1935) PASS: lldb-shell :: SymbolFile/DWARF/inline-function-address.ll (1576 of 1935) PASS: lldb-api :: commands/platform/process/TestProcessList.py (1577 of 1935) PASS: lldb-api :: functionalities/data-formatter/compactvectors/TestCompactVectors.py (1578 of 1935) PASS: lldb-api :: functionalities/thread/concurrent_events/TestConcurrentCrashWithWatchpointBreakpointSignal.py (1579 of 1935) PASS: lldb-unit :: Utility/./UtilityTests/StringListTest.CopyListEmpty (1580 of 1935) PASS: lldb-unit :: Utility/./UtilityTests/NameMatchesTest.EndsWith (1581 of 1935) PASS: lldb-api :: commands/expression/dont_allow_jit/TestAllowJIT.py (1582 of 1935) PASS: lldb-unit :: Utility/./UtilityTests/BinaryStreamTest.PutULEB128FourBytes (1583 of 1935) PASS: lldb-unit :: SymbolFile/DWARF/./SymbolFileDWARFTests/SymbolFileDWARFTests.TestAbbrevOutOfOrder (1584 of 1935) PASS: lldb-api :: commands/expression/cast_int_to_anonymous_enum/TestCastIntToAnonymousEnum.py (1585 of 1935) PASS: lldb-unit :: Utility/./UtilityTests/ConstStringTest.FromMidOfBufferStringRef (1586 of 1935) PASS: lldb-unit :: Language/Highlighting/./HighlighterTests/HighlighterTest.DefaultHighlighterWithCursor (1587 of 1935) PASS: lldb-unit :: Utility/./UtilityTests/ArgsTest.TestUnknownEscape (1588 of 1935) PASS: lldb-unit :: Process/minidump/./LLDBMinidumpTests/MinidumpParserTest.GetPidWindows (1589 of 1935) PASS: lldb-unit :: Process/minidump/./LLDBMinidumpTests/MinidumpParserTest.GetPidWow64 (1590 of 1935) UNSUPPORTED: lldb-api :: commands/expression/multiline-navigation/TestMultilineNavigation.py (1591 of 1935) UNSUPPORTED: lldb-api :: commands/gui/basic/TestGuiBasic.py (1592 of 1935) PASS: lldb-api :: python_api/symbol-context/two-files/TestSymbolContextTwoFiles.py (1593 of 1935) PASS: lldb-unit :: Utility/./UtilityTests/BinaryStreamTest.PutSLEB128MaxValue (1594 of 1935) PASS: lldb-unit :: ScriptInterpreter/Python/./ScriptInterpreterPythonTests/PythonDataObjectsTest.TestScript (1595 of 1935) PASS: lldb-unit :: Symbol/./SymbolTests/TestClangASTImporter.CopyTypeTagDecl (1596 of 1935) UNSUPPORTED: lldb-shell :: Register/x86-gp-write.test (1597 of 1935) PASS: lldb-api :: functionalities/memory/cache/TestMemoryCache.py (1598 of 1935) PASS: lldb-unit :: Host/./HostTests/SocketTest.TCPListen0ConnectAccept (1599 of 1935) PASS: lldb-api :: python_api/sbdata/TestSBData.py (1600 of 1935) UNSUPPORTED: lldb-api :: functionalities/data-formatter/data-formatter-stl/libstdcpp/smart_ptr/TestDataFormatterStdSmartPtr.py (1601 of 1935) PASS: lldb-unit :: Utility/./UtilityTests/StringListTest.AppendListCStringArray (1602 of 1935) PASS: lldb-api :: lang/cpp/class_static/TestStaticVariables.py (1603 of 1935) PASS: lldb-shell :: Unwind/trap_frame_sym_ctx.test (1604 of 1935) PASS: lldb-shell :: ObjectFile/PECOFF/uuid.yaml (1605 of 1935) PASS: lldb-api :: functionalities/thread/concurrent_events/TestConcurrentBreakpointDelayBreakpointOneSignal.py (1606 of 1935) PASS: lldb-unit :: Utility/./UtilityTests/ProcessInstanceInfo.Dump (1607 of 1935) PASS: lldb-unit :: Utility/./UtilityTests/StringListTest.AppendListCStringArrayEmpty (1608 of 1935) PASS: lldb-api :: lang/cpp/global_variables/TestCPPGlobalVariables.py (1609 of 1935) PASS: lldb-unit :: Utility/./UtilityTests/TimerTest.CategoryTimesStats (1610 of 1935) PASS: lldb-api :: lang/c/find_struct_type/TestFindStructTypes.py (1611 of 1935) PASS: lldb-unit :: Utility/./UtilityTests/OptionsWithRawTest.LeadingSpaceArgs (1612 of 1935) UNSUPPORTED: lldb-api :: functionalities/darwin_log/format/TestDarwinLogMessageFormat.py (1613 of 1935) PASS: lldb-unit :: Utility/./UtilityTests/LogChannelEnabledTest.LogThread (1614 of 1935) PASS: lldb-api :: functionalities/data-formatter/data-formatter-stl/libcxx/atomic/TestLibCxxAtomic.py (1615 of 1935) PASS: lldb-api :: functionalities/breakpoint/cpp/TestCPPBreakpointLocations.py (1616 of 1935) PASS: lldb-unit :: Process/minidump/./LLDBMinidumpTests/MinidumpParserTest.GetPid (1617 of 1935) PASS: lldb-api :: commands/target/create-no-such-arch/TestNoSuchArch.py (1618 of 1935) PASS: lldb-unit :: Utility/./UtilityTests/OptionsWithRawTest.MultiWordSuffix (1619 of 1935) PASS: lldb-unit :: UnwindAssembly/x86/./UnwindAssemblyx86Tests/Testx86AssemblyInspectionEngine.TestSimplei386ugmented (1620 of 1935) PASS: lldb-unit :: UnwindAssembly/x86/./UnwindAssemblyx86Tests/Testx86AssemblyInspectionEngine.TestPushRBP (1621 of 1935) PASS: lldb-unit :: Utility/./UtilityTests/NameMatchesTest.RegularExpression (1622 of 1935) PASS: lldb-shell :: Minidump/Windows/broken-unwind.test (1623 of 1935) PASS: lldb-api :: commands/expression/import-std-module/vector-dbg-info-content/TestDbgInfoContentVectorFromStdModule.py (1624 of 1935) PASS: lldb-api :: commands/expression/import-std-module/list-dbg-info-content/TestDbgInfoContentListFromStdModule.py (1625 of 1935) PASS: lldb-shell :: SymbolFile/DWARF/dir-separator-no-comp-dir-relative-name.s (1626 of 1935) PASS: lldb-unit :: Utility/./UtilityTests/OptionsWithRawTest.WhitespaceInput (1627 of 1935) PASS: lldb-unit :: Language/Highlighting/./HighlighterTests/HighlighterTest.ClangPPDirectives (1628 of 1935) UNSUPPORTED: lldb-api :: benchmarks/frame_variable/TestFrameVariableResponse.py (1629 of 1935) PASS: lldb-unit :: Utility/./UtilityTests/LogTest.Register (1630 of 1935) PASS: lldb-unit :: Utility/./UtilityTests/RangeTest.EqualInvalid (1631 of 1935) PASS: lldb-unit :: Process/gdb-remote/./ProcessGdbRemoteTests/GDBRemoteClientBaseTest.SendContinueDelegateStructuredDataReceipt (1632 of 1935) PASS: lldb-unit :: Process/gdb-remote/./ProcessGdbRemoteTests/GDBRemoteCommunicationServerTest.SendErrorResponse_ErrorNumber (1633 of 1935) PASS: lldb-api :: python_api/watchpoint/watchlocation/TestTargetWatchAddress.py (1634 of 1935) PASS: lldb-unit :: UnwindAssembly/x86/./UnwindAssemblyx86Tests/Testx86AssemblyInspectionEngine.Test32bitFramelessSmallStackFrame (1635 of 1935) UNSUPPORTED: lldb-shell :: ExecControl/StopHook/stop-hook-threads.test (1636 of 1935) PASS: lldb-unit :: Utility/./UtilityTests/StringListTest.ForRangeEmpty (1637 of 1935) PASS: lldb-api :: python_api/section/TestSectionAPI.py (1638 of 1935) UNSUPPORTED: lldb-shell :: Expr/TestIRMemoryMapWindows.test (1639 of 1935) PASS: lldb-unit :: Language/Highlighting/./HighlighterTests/HighlighterTest.ClangCursorPosAfterOtherToken (1640 of 1935) PASS: lldb-shell :: Settings/TestSettingsWrite.test (1641 of 1935) PASS: lldb-shell :: Driver/TestConvenienceVariables.test (1642 of 1935) PASS: lldb-api :: functionalities/tail_call_frames/ambiguous_tail_call_seq1/TestAmbiguousTailCallSeq1.py (1643 of 1935) PASS: lldb-api :: commands/expression/pr35310/TestExprsBug35310.py (1644 of 1935) PASS: lldb-api :: commands/expression/save_jit_objects/TestSaveJITObjects.py (1645 of 1935) PASS: lldb-api :: commands/command/source/TestCommandSource.py (1646 of 1935) PASS: lldb-unit :: Utility/./UtilityTests/FileSpecTest.FileAndDirectoryComponents (1647 of 1935) PASS: lldb-unit :: Utility/./UtilityTests/FileSpecTest.Match (1648 of 1935) PASS: lldb-shell :: SymbolFile/DWARF/dwarf5-index-is-used.cpp (1649 of 1935) PASS: lldb-api :: functionalities/tail_call_frames/cross_dso/TestCrossDSOTailCalls.py (1650 of 1935) PASS: lldb-api :: commands/expression/radar_9673664/TestExprHelpExamples.py (1651 of 1935) PASS: lldb-unit :: Utility/./UtilityTests/FileSpecTest.IsRelative (1652 of 1935) PASS: lldb-api :: tools/lldb-server/register-reading/TestGdbRemoteGPacket.py (1653 of 1935) PASS: lldb-unit :: UnwindAssembly/x86/./UnwindAssemblyx86Tests/Testx86AssemblyInspectionEngine.TestSubRSP (1654 of 1935) PASS: lldb-api :: functionalities/gdb_remote_client/TestStopPCs.py (1655 of 1935) UNSUPPORTED: lldb-shell :: SymbolFile/PDB/ast-restore.test (1656 of 1935) PASS: lldb-unit :: Utility/./UtilityTests/ScalarTest.GetValue (1657 of 1935) PASS: lldb-shell :: Breakpoint/implicit_const_form_support.test (1658 of 1935) PASS: lldb-shell :: Breakpoint/split-dwarf-5-addrbase.test (1659 of 1935) PASS: lldb-unit :: Utility/./UtilityTests/RangeTest.NotEqualInvalid (1660 of 1935) PASS: lldb-unit :: Utility/./UtilityTests/UriParserTest.BracketedHostnameWithColon (1661 of 1935) PASS: lldb-unit :: SymbolFile/NativePDB/./SymbolFileNativePDBTests/PDBFPOProgramToDWARFExpressionTests.UnsupportedRASearch (1662 of 1935) PASS: lldb-api :: python_api/disassemble-raw-data/TestDisassembleRawData.py (1663 of 1935) PASS: lldb-unit :: Host/./HostTests/TaskPoolTest.AddTask (1664 of 1935) PASS: lldb-unit :: Utility/./UtilityTests/StringLexerTest.AdvanceIf (1665 of 1935) PASS: lldb-api :: lang/cpp/call-function/TestCallCPPFunction.py (1666 of 1935) UNSUPPORTED: lldb-api :: tools/lldb-server/signal-filtering/TestGdbRemote_QPassSignals.py (1667 of 1935) PASS: lldb-unit :: Utility/./UtilityTests/StreamTest.PutRawBytesToMixedEndian (1668 of 1935) PASS: lldb-unit :: Utility/./UtilityTests/RegularExpression.CopyAssignment (1669 of 1935) PASS: lldb-unit :: Utility/./UtilityTests/StringExtractorTest.GetHexBytes_OddPair2 (1670 of 1935) PASS: lldb-api :: commands/expression/import-std-module/unique_ptr/TestUniquePtrFromStdModule.py (1671 of 1935) PASS: lldb-unit :: Language/Highlighting/./HighlighterTests/HighlighterTest.ClangCursorOutOfBounds (1672 of 1935) UNSUPPORTED: lldb-api :: functionalities/thread/break_after_join/TestBreakAfterJoin.py (1673 of 1935) PASS: lldb-unit :: Symbol/./SymbolTests/TestTypeSystemClang.TestBuiltinTypeForEncodingAndBitSize (1674 of 1935) PASS: lldb-unit :: ScriptInterpreter/Python/./ScriptInterpreterPythonTests/PythonDataObjectsTest.TestPythonDictionaryValueEquality (1675 of 1935) PASS: lldb-api :: functionalities/unwind/noreturn/TestNoreturnUnwind.py (1676 of 1935) UNSUPPORTED: lldb-shell :: ScriptInterpreter/Lua/convenience_variables.test (1677 of 1935) PASS: lldb-unit :: Expression/./ExpressionTests/CppModuleConfigurationTest.LibCppV2 (1678 of 1935) PASS: lldb-api :: commands/expression/fixits/TestFixIts.py (1679 of 1935) PASS: lldb-api :: commands/expression/ir-interpreter/TestIRInterpreter.py (1680 of 1935) PASS: lldb-unit :: Utility/./UtilityTests/StringExtractorTest.GetHexBytesAvail_Partial (1681 of 1935) PASS: lldb-api :: functionalities/data-formatter/data-formatter-enum-format/TestDataFormatterEnumFormat.py (1682 of 1935) PASS: lldb-api :: functionalities/breakpoint/cpp_exception/TestCPPExceptionBreakpoint.py (1683 of 1935) PASS: lldb-api :: commands/expression/call-function/TestCallUserDefinedFunction.py (1684 of 1935) PASS: lldb-unit :: ObjectFile/PECOFF/./ObjectFilePECOFFTests/PECallFrameInfoTest.Basic_eh (1685 of 1935) PASS: lldb-shell :: ObjectFile/PECOFF/basic-info-arm.yaml (1686 of 1935) PASS: lldb-api :: macosx/order/TestOrderFile.py (1687 of 1935) PASS: lldb-api :: functionalities/thread/concurrent_events/TestConcurrentSignalWatchBreak.py (1688 of 1935) PASS: lldb-api :: python_api/function_symbol/TestSymbolAPI.py (1689 of 1935) PASS: lldb-shell :: Commands/command-breakpoint-col.test (1690 of 1935) PASS: lldb-shell :: SymbolFile/DWARF/clang-ast-from-dwarf-objc-property.m (1691 of 1935) UNSUPPORTED: lldb-api :: python_api/disassemble-raw-data/TestDisassemble_VST1_64.py (1692 of 1935) PASS: lldb-shell :: ObjectFile/MachO/subsections.yaml (1693 of 1935) PASS: lldb-unit :: Host/./HostTests/SocketTest.TCPListen0GetPort (1694 of 1935) PASS: lldb-unit :: Symbol/./SymbolTests/TestTypeSystemClang.TestGetEnumIntegerTypeInvalid (1695 of 1935) PASS: lldb-api :: python_api/lldbutil/iter/TestLLDBIterator.py (1696 of 1935) PASS: lldb-api :: commands/breakpoint/command/list/TestBreakpointCommandList.py (1697 of 1935) PASS: lldb-api :: functionalities/data-formatter/data-formatter-globals/TestDataFormatterGlobals.py (1698 of 1935) PASS: lldb-unit :: Utility/./UtilityTests/RangeTest.ContainsRange (1699 of 1935) PASS: lldb-unit :: Process/gdb-remote/./ProcessGdbRemoteTests/GDBRemoteClientBaseTest.SendContinueAndLateInterrupt (1700 of 1935) PASS: lldb-unit :: Utility/./UtilityTests/StringListTest.InsertStringAtIndexStart (1701 of 1935) UNSUPPORTED: lldb-shell :: ScriptInterpreter/Lua/bindings.test (1702 of 1935) PASS: lldb-unit :: Symbol/./SymbolTests/DWARFCallFrameInfoTest.Basic_dwarf3 (1703 of 1935) PASS: lldb-shell :: Breakpoint/debug_rnglistx_rlex.test (1704 of 1935) PASS: lldb-api :: functionalities/data-formatter/parray/TestPrintArray.py (1705 of 1935) PASS: lldb-unit :: Utility/./UtilityTests/ScalarTest.ExtractBitfield (1706 of 1935) PASS: lldb-api :: lang/c/struct_types/TestStructTypes.py (1707 of 1935) PASS: lldb-unit :: SymbolFile/NativePDB/./SymbolFileNativePDBTests/PDBFPOProgramToDWARFExpressionTests.DependencyChain (1708 of 1935) PASS: lldb-unit :: Expression/./ExpressionTests/DiagnosticManagerTest.AppendMessageSubsequentDiags (1709 of 1935) PASS: lldb-api :: lang/cpp/const_this/TestConstThis.py (1710 of 1935) PASS: lldb-shell :: SymbolFile/DWARF/debug_aranges-empty-section.s (1711 of 1935) PASS: lldb-api :: functionalities/plugins/command_plugin/TestPluginCommands.py (1712 of 1935) PASS: lldb-api :: functionalities/process_group/TestChangeProcessGroup.py (1713 of 1935) PASS: lldb-shell :: SymbolFile/NativePDB/ast-methods.cpp (1714 of 1935) PASS: lldb-unit :: Utility/./UtilityTests/DataExtractorTest.GetCStrEmpty (1715 of 1935) PASS: lldb-shell :: ObjectFile/Breakpad/sections-trailing-func.test (1716 of 1935) PASS: lldb-unit :: Utility/./UtilityTests/LogChannelTest.Disable (1717 of 1935) PASS: lldb-unit :: Utility/./UtilityTests/StreamTeeTest.SetStreamAtIndexOverwrite (1718 of 1935) PASS: lldb-unit :: Symbol/./SymbolTests/TestTypeSystemClang.TestGetEnumIntegerTypeUnexpectedType (1719 of 1935) PASS: lldb-api :: functionalities/postmortem/elf-core/gcore/TestGCore.py (1720 of 1935) UNSUPPORTED: lldb-shell :: ScriptInterpreter/Lua/persistent_state.test (1721 of 1935) PASS: lldb-shell :: SymbolFile/DWARF/debug_loc-aslr.s (1722 of 1935) PASS: lldb-api :: functionalities/data-formatter/data-formatter-objc/TestDataFormatterObjCNSDate.py (1723 of 1935) PASS: lldb-unit :: UnwindAssembly/x86/./UnwindAssemblyx86Tests/Testx86AssemblyInspectionEngine.TestSimple64bitFrameFunction (1724 of 1935) PASS: lldb-unit :: Utility/./UtilityTests/StreamTeeTest.DefaultConstructor (1725 of 1935) PASS: lldb-unit :: Utility/./UtilityTests/SerializationRountripTest.SerializeDeserializeObjectPointer (1726 of 1935) UNSUPPORTED: lldb-api :: functionalities/data-formatter/data-formatter-stl/libstdcpp/map/TestDataFormatterStdMap.py (1727 of 1935) PASS: lldb-api :: functionalities/breakpoint/breakpoint_hit_count/TestBreakpointHitCount.py (1728 of 1935) PASS: lldb-unit :: UnwindAssembly/x86/./UnwindAssemblyx86Tests/Testx86AssemblyInspectionEngine.TestPushR14 (1729 of 1935) PASS: lldb-api :: lang/objc/exceptions/TestObjCExceptions.py (1730 of 1935) PASS: lldb-api :: api/multiple-targets/TestMultipleTargets.py (1731 of 1935) UNSUPPORTED: lldb-shell :: SymbolFile/NativePDB/local-variables.cpp (1732 of 1935) UNSUPPORTED: lldb-api :: commands/register/register/intel_xtended_registers/mpx_offset_intersection/TestMPXOffsetIntersection.py (1733 of 1935) PASS: lldb-unit :: Utility/./UtilityTests/LogChannelEnabledTest.LLDB_LOG_ERROR (1734 of 1935) PASS: lldb-api :: commands/process/launch/TestProcessLaunch.py (1735 of 1935) PASS: lldb-api :: functionalities/recursion/TestValueObjectRecursion.py (1736 of 1935) PASS: lldb-api :: functionalities/inferior-changed/TestInferiorChanged.py (1737 of 1935) PASS: lldb-unit :: Utility/./UtilityTests/StringListTest.GetMaxStringLengthEqualSize (1738 of 1935) PASS: lldb-shell :: ObjectFile/PECOFF/section-types.yaml (1739 of 1935) PASS: lldb-shell :: SymbolFile/Breakpad/line-table-missing-file.test (1740 of 1935) PASS: lldb-api :: types/TestIntegerTypeExpr.py (1741 of 1935) PASS: lldb-unit :: Utility/./UtilityTests/BinaryStreamTest.PutULEB128EightBytes (1742 of 1935) PASS: lldb-unit :: ObjectFile/Breakpad/./ObjectFileBreakpadTests/InfoRecord.parse (1743 of 1935) PASS: lldb-unit :: Utility/./UtilityTests/StringListTest.SplitIntoLinesSingleTrailingCR (1744 of 1935) PASS: lldb-api :: lang/c/forward/TestForwardDeclaration.py (1745 of 1935) PASS: lldb-unit :: Utility/./UtilityTests/SerializationRountripTest.SerializeDeserializePodReferences (1746 of 1935) PASS: lldb-api :: lang/cpp/virtual-functions/TestCppVirtualFunctions.py (1747 of 1935) PASS: lldb-shell :: BuildScript/modes.test (1748 of 1935) PASS: lldb-api :: tools/lldb-server/TestGdbRemoteAttach.py (1749 of 1935) PASS: lldb-api :: lang/cpp/template/TestTemplateArgs.py (1750 of 1935) PASS: lldb-unit :: Expression/./ExpressionTests/DiagnosticManagerTest.GetStringBasic (1751 of 1935) PASS: lldb-api :: commands/expression/po_verbosity/TestPoVerbosity.py (1752 of 1935) PASS: lldb-unit :: Utility/./UtilityTests/StreamTest.ChangingByteOrder (1753 of 1935) PASS: lldb-api :: commands/expression/weak_symbols/TestWeakSymbols.py (1754 of 1935) PASS: lldb-api :: functionalities/non-overlapping-index-variable-i/TestIndexVariable.py (1755 of 1935) PASS: lldb-api :: lang/cpp/static_methods/TestCPPStaticMethods.py (1756 of 1935) PASS: lldb-unit :: UnwindAssembly/x86/./UnwindAssemblyx86Tests/Testx86AssemblyInspectionEngine.TestPopR14 (1757 of 1935) PASS: lldb-shell :: ObjectFile/ELF/section-types-edgecases.yaml (1758 of 1935) UNSUPPORTED: lldb-api :: commands/watchpoints/multi_watchpoint_slots/TestWatchpointMultipleSlots.py (1759 of 1935) PASS: lldb-unit :: ScriptInterpreter/Python/./ScriptInterpreterPythonTests/PythonDataObjectsTest.TestDictionaryResolutionWithDot (1760 of 1935) PASS: lldb-api :: lang/objc/modules-auto-import/TestModulesAutoImport.py (1761 of 1935) UNSUPPORTED: lldb-api :: functionalities/thread/thread_specific_break_plus_condition/TestThreadSpecificBpPlusCondition.py (1762 of 1935) PASS: lldb-unit :: Signals/./SignalsTests/UnixSignalsTest.GetFilteredSignals (1763 of 1935) PASS: lldb-shell :: Breakpoint/jitbp_elf.test (1764 of 1935) UNSUPPORTED: lldb-shell :: SymbolFile/PDB/type-quals.test (1765 of 1935) PASS: lldb-unit :: debugserver/./debugserverTests/RNBSocket.LoopBackListenIPv6 (1766 of 1935) PASS: lldb-unit :: Process/minidump/./LLDBMinidumpTests/MinidumpParserTest.GetLinuxProcStatus (1767 of 1935) PASS: lldb-unit :: Expression/./ExpressionTests/CppModuleConfigurationTest.MissingUsrInclude (1768 of 1935) PASS: lldb-unit :: Process/minidump/./LLDBMinidumpTests/MinidumpParserTest.GetThreadContext_x86_32 (1769 of 1935) PASS: lldb-shell :: SymbolFile/DWARF/debug-types-basic.test (1770 of 1935) PASS: lldb-unit :: Utility/./UtilityTests/ArgsTest.GetArgumentArrayRef (1771 of 1935) PASS: lldb-unit :: Utility/./UtilityTests/StringLexerTest.NextIfList (1772 of 1935) PASS: lldb-unit :: Symbol/./SymbolTests/TestTypeSystemClang.TemplateArguments (1773 of 1935) PASS: lldb-api :: python_api/sbstructureddata/TestStructuredDataAPI.py (1774 of 1935) PASS: lldb-api :: commands/expression/unwind_expression/TestUnwindExpression.py (1775 of 1935) PASS: lldb-unit :: ObjectFile/Breakpad/./ObjectFileBreakpadTests/Record.classify (1776 of 1935) PASS: lldb-unit :: ScriptInterpreter/Python/./ScriptInterpreterPythonTests/PythonDataObjectsTest.TestPythonListValueEquality (1777 of 1935) PASS: lldb-unit :: Utility/./UtilityTests/FileSpecTest.EqualDotsPosixRoot (1778 of 1935) PASS: lldb-api :: functionalities/data-formatter/varscript_formatting/TestDataFormatterVarScriptFormatting.py (1779 of 1935) PASS: lldb-unit :: ScriptInterpreter/Python/./ScriptInterpreterPythonTests/PythonDataObjectsTest.TestPythonTupleInitializerList (1780 of 1935) PASS: lldb-api :: lang/cpp/extern_c/TestExternCSymbols.py (1781 of 1935) PASS: lldb-api :: functionalities/postmortem/netbsd-core/TestNetBSDCore.py (1782 of 1935) PASS: lldb-api :: functionalities/data-formatter/ptr_ref_typedef/TestPtrRef2Typedef.py (1783 of 1935) PASS: lldb-unit :: Utility/./UtilityTests/IndexToObjectTest.ObjectForIndex (1784 of 1935) PASS: lldb-api :: lang/objc/rdar-10967107/TestRdar10967107.py (1785 of 1935) PASS: lldb-api :: commands/expression/import-std-module/empty-module/TestEmptyStdModule.py (1786 of 1935) PASS: lldb-api :: functionalities/data-formatter/data-formatter-objc/TestDataFormatterObjCNSBundle.py (1787 of 1935) UNSUPPORTED: lldb-api :: commands/expression/macros/TestMacros.py (1788 of 1935) PASS: lldb-unit :: Core/./LLDBCoreTests/RichManglingContextTest.Basic (1789 of 1935) PASS: lldb-unit :: Utility/./UtilityTests/OptionsWithRawTest.SingleWordSuffix (1790 of 1935) UNSUPPORTED: lldb-api :: functionalities/data-formatter/data-formatter-stl/libstdcpp/iterator/TestDataFormatterStdIterator.py (1791 of 1935) PASS: lldb-unit :: Utility/./UtilityTests/ScalarTest.Scalar_512 (1792 of 1935) PASS: lldb-api :: commands/frame/diagnose/dereference-this/TestDiagnoseDereferenceThis.py (1793 of 1935) PASS: lldb-api :: lang/objc/objc-new-syntax/TestObjCNewSyntaxDictionary.py (1794 of 1935) PASS: lldb-api :: functionalities/memory/find/TestMemoryFind.py (1795 of 1935) PASS: lldb-unit :: SymbolFile/DWARF/./SymbolFileDWARFTests/SymbolFileDWARFTests.TestAbbrevMissingTerminator (1796 of 1935) PASS: lldb-api :: lang/cpp/offsetof/TestOffsetofCpp.py (1797 of 1935) PASS: lldb-api :: functionalities/data-formatter/vector-types/TestVectorTypesFormatting.py (1798 of 1935) PASS: lldb-unit :: Utility/./UtilityTests/StreamTest.AddressPrefixAndSuffix (1799 of 1935) PASS: lldb-unit :: Utility/./UtilityTests/CompletionRequest.TryCompleteCurrentArgMode (1800 of 1935) PASS: lldb-api :: functionalities/plugins/python_os_plugin/TestPythonOSPlugin.py (1801 of 1935) PASS: lldb-unit :: Utility/./UtilityTests/GeneratorTest.GetOrCreate (1802 of 1935) PASS: lldb-shell :: Reproducer/Functionalities/TestDataFormatter.test (1803 of 1935) PASS: lldb-api :: macosx/queues/TestQueues.py (1804 of 1935) PASS: lldb-unit :: Utility/./UtilityTests/BinaryStreamTest.PutULEB128NineBytes (1805 of 1935) PASS: lldb-shell :: BuildScript/toolchain-clang.test (1806 of 1935) PASS: lldb-unit :: Host/./HostTests/SocketTest.DomainGetConnectURI (1807 of 1935) PASS: lldb-unit :: Language/Highlighting/./HighlighterTests/HighlighterTest.Colons (1808 of 1935) PASS: lldb-api :: lang/cpp/char8_t/TestCxxChar8_t.py (1809 of 1935) UNSUPPORTED: lldb-shell :: ScriptInterpreter/Lua/nested_sessions.test (1810 of 1935) PASS: lldb-unit :: Utility/./UtilityTests/DataExtractorTest.GetCStrUnterminated (1811 of 1935) PASS: lldb-shell :: SymbolFile/Breakpad/symtab-macho.test (1812 of 1935) PASS: lldb-shell :: ObjectFile/ELF/PT_LOAD-empty.yaml (1813 of 1935) PASS: lldb-api :: functionalities/breakpoint/consecutive_breakpoints/TestConsecutiveBreakpoints.py (1814 of 1935) UNSUPPORTED: lldb-shell :: Register/x86-zmm-write.test (1815 of 1935) UNSUPPORTED: lldb-shell :: Unwind/unwind-plan-dwarf-dump.test (1816 of 1935) PASS: lldb-api :: functionalities/breakpoint/scripted_bkpt/TestScriptedResolver.py (1817 of 1935) PASS: lldb-unit :: Host/./HostTests/SocketTest.TCPGetAddress (1818 of 1935) UNSUPPORTED: lldb-shell :: Register/x86-64-gp-write.test (1819 of 1935) PASS: lldb-unit :: Utility/./UtilityTests/StringListTest.ShiftCString (1820 of 1935) PASS: lldb-unit :: Utility/./UtilityTests/ArchSpecTest.TestParseMachCPUDashSubtypeTripleExtra (1821 of 1935) PASS: lldb-api :: functionalities/data-formatter/nssetsynth/TestNSSetSynthetic.py (1822 of 1935) PASS: lldb-unit :: UnwindAssembly/x86/./UnwindAssemblyx86Tests/Testx86AssemblyInspectionEngine.TestSpillRegToStackViaMOVx86_64 (1823 of 1935) PASS: lldb-api :: lang/c/const_variables/TestConstVariables.py (1824 of 1935) PASS: lldb-unit :: Host/./HostTests/TaskPoolTest.TaskMap (1825 of 1935) PASS: lldb-unit :: UnwindAssembly/x86/./UnwindAssemblyx86Tests/Testx86AssemblyInspectionEngine.TestAddRSP (1826 of 1935) PASS: lldb-unit :: ObjectFile/PECOFF/./ObjectFilePECOFFTests/PECallFrameInfoTest.Chained_eh (1827 of 1935) PASS: lldb-api :: lang/cpp/template-function/TestTemplateFunctions.py (1828 of 1935) PASS: lldb-api :: commands/command/invalid-args/TestInvalidArgsCommand.py (1829 of 1935) PASS: lldb-shell :: ObjectFile/ELF/minidebuginfo-corrupt-xz.yaml (1830 of 1935) PASS: lldb-shell :: Expr/TestTypeOfDeclTypeExpr.test (1831 of 1935) UNSUPPORTED: lldb-api :: commands/register/register/intel_xtended_registers/TestMPXRegisters.py (1832 of 1935) PASS: lldb-api :: lang/objc/foundation/TestObjCMethods.py (1833 of 1935) PASS: lldb-api :: types/TestLongTypes.py (1834 of 1935) PASS: lldb-shell :: Driver/TestProcessAttach.test (1835 of 1935) UNSUPPORTED: lldb-api :: tools/lldb-server/TestGdbRemoteAuxvSupport.py (1836 of 1935) PASS: lldb-unit :: Symbol/./SymbolTests/TestTypeSystemClang.TestIsClangType (1837 of 1935) PASS: lldb-api :: functionalities/data-formatter/hexcaps/TestDataFormatterHexCaps.py (1838 of 1935) PASS: lldb-api :: functionalities/value_md5_crash/TestValueMD5Crash.py (1839 of 1935) PASS: lldb-unit :: Utility/./UtilityTests/StreamTest.AddressPrefix (1840 of 1935) UNSUPPORTED: lldb-api :: iohandler/unicode/TestUnicode.py (1841 of 1935) PASS: lldb-api :: functionalities/data-formatter/data-formatter-stl/libcxx/vector/TestDataFormatterLibcxxVector.py (1842 of 1935) PASS: lldb-api :: commands/expression/import-std-module/conflicts/TestStdModuleWithConflicts.py (1843 of 1935) PASS: lldb-api :: commands/command/delete/TestCommandDelete.py (1844 of 1935) PASS: lldb-api :: functionalities/breakpoint/hardware_breakpoints/hardware_breakpoint_on_multiple_threads/TestHWBreakMultiThread.py (1845 of 1935) PASS: lldb-shell :: SymbolFile/Breakpad/line-table-edgecases.test (1846 of 1935) PASS: lldb-api :: commands/process/attach/TestProcessAttach.py (1847 of 1935) PASS: lldb-shell :: Breakpoint/debug_rnglist_offset_pair.test (1848 of 1935) PASS: lldb-shell :: ObjectFile/PECOFF/sections-names.yaml (1849 of 1935) PASS: lldb-api :: functionalities/breakpoint/breakpoint_command/TestBreakpointCommandsFromPython.py (1850 of 1935) PASS: lldb-shell :: SymbolFile/DWARF/debug-names-compressed.cpp (1851 of 1935) PASS: lldb-unit :: Utility/./UtilityTests/StreamTest.PutStringAsRawHex8 (1852 of 1935) PASS: lldb-api :: python_api/debugger/TestDebuggerAPI.py (1853 of 1935) PASS: lldb-api :: lang/objc/unicode-string/TestUnicodeString.py (1854 of 1935) PASS: lldb-unit :: Symbol/./SymbolTests/TestTypeSystemClang.TestGetTypeClassTypeOf (1855 of 1935) PASS: lldb-api :: lang/cpp/std-function-step-into-callable/TestStdFunctionStepIntoCallable.py (1856 of 1935) PASS: lldb-api :: lang/cpp/limit-debug-info/TestWithLimitDebugInfo.py (1857 of 1935) PASS: lldb-unit :: Utility/./UtilityTests/DataExtractorTest.GetMaxU64 (1858 of 1935) PASS: lldb-unit :: Utility/./UtilityTests/UserIDResolver.GetUserName (1859 of 1935) PASS: lldb-shell :: SymbolFile/DWARF/debug-line-basic.s (1860 of 1935) PASS: lldb-shell :: ObjectFile/ELF/PT_LOAD-overlap-PT_TLS.yaml (1861 of 1935) PASS: lldb-api :: lang/objc/objc-checker/TestObjCCheckers.py (1862 of 1935) PASS: lldb-unit :: ScriptInterpreter/Python/./ScriptInterpreterPythonTests/PythonDataObjectsTest.TestPythonTupleValues (1863 of 1935) PASS: lldb-api :: commands/expression/deleting-implicit-copy-constructor/TestDeletingImplicitCopyConstructor.py (1864 of 1935) PASS: lldb-api :: functionalities/data-formatter/data-formatter-stl/libcxx/string/TestDataFormatterLibcxxString.py (1865 of 1935) PASS: lldb-unit :: Process/gdb-remote/./ProcessGdbRemoteTests/GDBRemoteClientBaseTest.SendPacketAndReceiveResponseWithOutputSupport (1866 of 1935) PASS: lldb-shell :: ObjectFile/Breakpad/discontiguous-sections.test (1867 of 1935) UNSUPPORTED: lldb-shell :: Unwind/eh-frame-small-fde.test (1868 of 1935) PASS: lldb-shell :: ObjectFile/ELF/section-addresses.yaml (1869 of 1935) PASS: lldb-shell :: SymbolFile/DWARF/array-sizes.s (1870 of 1935) PASS: lldb-unit :: Signals/./SignalsTests/UnixSignalsTest.GetInfo (1871 of 1935) PASS: lldb-unit :: Host/./HostTests/HostInfoTest.GetAugmentedArchSpec (1872 of 1935) PASS: lldb-api :: commands/watchpoints/watchpoint_commands/command/TestWatchpointCommandPython.py (1873 of 1935) PASS: lldb-shell :: SymbolFile/DWARF/DW_AT_low_pc-addrx.s (1874 of 1935) PASS: lldb-unit :: Core/./LLDBCoreTests/MangledTest.EmptyForInvalidName (1875 of 1935) UNSUPPORTED: lldb-api :: functionalities/param_entry_vals/basic_entry_values_x86_64/TestBasicEntryValuesX86_64.py (1876 of 1935) PASS: lldb-api :: tools/lldb-vscode/breakpoint/TestVSCode_setBreakpoints.py (1877 of 1935) PASS: lldb-shell :: Driver/TestRepl.test (1878 of 1935) PASS: lldb-unit :: Process/gdb-remote/./ProcessGdbRemoteTests/GDBRemoteCommunicationClientTest.GetModulesInfo (1879 of 1935) PASS: lldb-api :: lang/c/shared_lib_stripped_symbols/TestSharedLibStrippedSymbols.py (1880 of 1935) PASS: lldb-unit :: Symbol/./SymbolTests/TestTypeSystemClang.TestRemoveFastQualifiers (1881 of 1935) PASS: lldb-api :: lang/c/stepping/TestThreadStepping.py (1882 of 1935) PASS: lldb-unit :: Language/Highlighting/./HighlighterTests/HighlighterTest.ClangTrailingBackslashWithWhitespace (1883 of 1935) PASS: lldb-api :: commands/target/basic/TestTargetCommand.py (1884 of 1935) UNSUPPORTED: lldb-shell :: ObjectFile/ELF/minidebuginfo-set-and-hit-breakpoint.test (1885 of 1935) PASS: lldb-shell :: ScriptInterpreter/None/import_module.test (1886 of 1935) PASS: lldb-api :: lang/c/blocks/TestBlocks.py (1887 of 1935) PASS: lldb-api :: lang/cpp/unique-types/TestUniqueTypes.py (1888 of 1935) PASS: lldb-unit :: Utility/./UtilityTests/StringListTest.GetMaxStringLengthEmpty (1889 of 1935) PASS: lldb-api :: commands/expression/invalid-args/TestInvalidArgsExpression.py (1890 of 1935) PASS: lldb-unit :: Utility/./UtilityTests/BinaryStreamTest.PutULEB128MaxValue (1891 of 1935) PASS: lldb-api :: functionalities/postmortem/minidump/TestMiniDump.py (1892 of 1935) PASS: lldb-shell :: SymbolFile/NativePDB/break-by-line.cpp (1893 of 1935) PASS: lldb-api :: functionalities/data-formatter/type_summary_list_arg/TestTypeSummaryListArg.py (1894 of 1935) PASS: lldb-api :: lang/cpp/multiple-inheritance/TestCppMultipleInheritance.py (1895 of 1935) PASS: lldb-shell :: SymbolFile/DWARF/gnu-style-compression.cpp (1896 of 1935) PASS: lldb-api :: commands/process/launch-with-shellexpand/TestLaunchWithShellExpand.py (1897 of 1935) PASS: lldb-unit :: ObjectFile/Breakpad/./ObjectFileBreakpadTests/ModuleRecord.parse (1898 of 1935) PASS: lldb-unit :: Platform/./LLDBPlatformTests/PlatformDarwinTest.TestParseVersionBuildDir (1899 of 1935) PASS: lldb-unit :: Utility/./UtilityTests/StringListTest.JoinEmpty (1900 of 1935) PASS: lldb-api :: lang/objc/direct-dispatch-step/TestObjCDirectDispatchStepping.py (1901 of 1935) PASS: lldb-api :: functionalities/postmortem/elf-core/thread_crash/TestLinuxCoreThreads.py (1902 of 1935) PASS: lldb-api :: functionalities/thread/concurrent_events/TestConcurrentManyWatchpoints.py (1903 of 1935) PASS: lldb-unit :: Utility/./UtilityTests/StreamTest.PutCString (1904 of 1935) PASS: lldb-unit :: SymbolFile/NativePDB/./SymbolFileNativePDBTests/PDBFPOProgramToDWARFExpressionTests.MultipleDependentAssignments (1905 of 1935) PASS: lldb-api :: types/TestFloatTypes.py (1906 of 1935) PASS: lldb-unit :: Process/minidump/./LLDBMinidumpTests/MinidumpParserTest.GetMemory (1907 of 1935) PASS: lldb-unit :: Utility/./UtilityTests/UUIDTest.Validity (1908 of 1935) UNSUPPORTED: lldb-shell :: Register/x86-64-zmm-read.test (1909 of 1935) PASS: lldb-api :: commands/expression/char/TestExprsChar.py (1910 of 1935) PASS: lldb-shell :: ObjectFile/ELF/duplicate-section.yaml (1911 of 1935) PASS: lldb-shell :: ObjectFile/PECOFF/dep-modules.yaml (1912 of 1935) PASS: lldb-unit :: Expression/./ExpressionTests/DiagnosticManagerTest.AddDiagnostic (1913 of 1935) PASS: lldb-unit :: Editline/./EditlineTests/EditlineTestFixture.EditlineReceivesMultiLineText (1914 of 1935) PASS: lldb-api :: functionalities/backticks/TestBackticksWithoutATarget.py (1915 of 1935) PASS: lldb-unit :: Host/./HostTests/NativeProcessProtocolTest.SetBreakpointFailVerify (1916 of 1935) PASS: lldb-unit :: Process/minidump/./LLDBMinidumpTests/MinidumpParserTest.MinidumpModuleOrder (1917 of 1935) PASS: lldb-api :: functionalities/data-formatter/frameformat_smallstruct/TestFrameFormatSmallStruct.py (1918 of 1935) PASS: lldb-api :: functionalities/data-formatter/data-formatter-objc/nsindexpath/TestDataFormatterNSIndexPath.py (1919 of 1935) PASS: lldb-unit :: Utility/./UtilityTests/TildeExpressionResolver.ResolveFullPath (1920 of 1935) PASS: lldb-api :: commands/apropos/basic/TestApropos.py (1921 of 1935) PASS: lldb-api :: functionalities/thread/num_threads/TestNumThreads.py (1922 of 1935) PASS: lldb-unit :: Symbol/./SymbolTests/TestTypeSystemClang.TestGetTypeClassTypeOfExpr (1923 of 1935) PASS: lldb-unit :: Utility/./UtilityTests/VASprintfTest.BufferResize (1924 of 1935) PASS: lldb-api :: functionalities/data-formatter/type_summary_list_script/TestTypeSummaryListScript.py (1925 of 1935) UNSUPPORTED: lldb-api :: functionalities/darwin_log/filter/regex/subsystem/TestDarwinLogFilterRegexSubsystem.py (1926 of 1935) PASS: lldb-unit :: Utility/./UtilityTests/StringListTest.AppendList (1927 of 1935) PASS: lldb-unit :: Utility/./UtilityTests/FileSpecTest.EqualDotsPosix (1928 of 1935) PASS: lldb-unit :: Symbol/./SymbolTests/DWARFCallFrameInfoTest.Basic_eh (1929 of 1935) PASS: lldb-unit :: Utility/./UtilityTests/Predicate.WaitForValueEqualTo (1930 of 1935) PASS: lldb-api :: commands/expression/import-std-module/weak_ptr-dbg-info-content/TestDbgInfoContentWeakPtrFromStdModule.py (1931 of 1935) PASS: lldb-api :: functionalities/data-formatter/setvaluefromcstring/TestSetValueFromCString.py (1932 of 1935) PASS: lldb-api :: types/TestDoubleTypesExpr.py (1933 of 1935) PASS: lldb-api :: lang/objc/objc-class-method/TestObjCClassMethod.py (1934 of 1935) PASS: lldb-api :: lang/objc/blocks/TestObjCIvarsInBlocks.py (1935 of 1935)

Hide Details

Testing Time: 4214.48s ******************** Unresolved Tests (1): lldb-api :: functionalities/gdb_remote_client/TestWasm.py

Hide Details

Hide Details

Slowest Tests: -------------------------------------------------------------------------- 79.51s: lldb-api :: functionalities/data-formatter/compactvectors/TestCompactVectors.py 79.86s: lldb-api :: types/TestIntegerTypeExpr.py 82.43s: lldb-api :: python_api/lldbutil/iter/TestLLDBIterator.py 93.60s: lldb-api :: types/TestLongTypes.py 105.47s: lldb-api :: lang/objc/objc-new-syntax/TestObjCNewSyntaxArray.py 113.72s: lldb-api :: lang/objc/objc-new-syntax/TestObjCNewSyntaxDictionary.py 113.91s: lldb-api :: lang/objc/foundation/TestObjCMethodsString.py 119.45s: lldb-api :: tools/lldb-server/TestGdbRemote_qThreadStopInfo.py 131.99s: lldb-api :: types/TestLongTypesExpr.py 136.28s: lldb-api :: lang/objc/exceptions/TestObjCExceptions.py 140.40s: lldb-api :: lang/objc/real-definition/TestRealDefinition.py 151.33s: lldb-api :: lang/objc/objc-new-syntax/TestObjCNewSyntaxLiteral.py 154.62s: lldb-api :: lang/objc/foundation/TestObjCMethodsNSError.py 165.31s: lldb-api :: lang/cpp/namespace/TestNamespaceLookup.py 213.63s: lldb-api :: lang/objc/foundation/TestObjCMethods.py 242.00s: lldb-api :: lang/objc/hidden-ivars/TestHiddenIvars.py 248.30s: lldb-api :: api/multithreaded/TestMultithreaded.py 248.75s: lldb-api :: tools/lldb-server/TestGdbRemoteThreadsInStopReply.py 272.01s: lldb-api :: lang/cpp/enum_types/TestCPP11EnumTypes.py 360.43s: lldb-api :: tools/lldb-server/TestLldbGdbServer.py

Hide Details

Tests Times: -------------------------------------------------------------------------- [ Range ] :: [ Percentage ] :: [ Count ] -------------------------------------------------------------------------- [ 0s, 20s) :: [********************************** ] :: [1687/1935] [ 20s, 40s) :: [** ] :: [ 118/1935] [ 40s, 60s) :: [* ] :: [ 79/1935] [ 60s, 80s) :: [ ] :: [ 26/1935] [ 80s,100s) :: [ ] :: [ 9/1935] [100s,120s) :: [ ] :: [ 2/1935] [120s,140s) :: [ ] :: [ 3/1935] [140s,160s) :: [ ] :: [ 3/1935] [160s,180s) :: [ ] :: [ 2/1935] [180s,200s) :: [ ] :: [ 0/1935] [200s,220s) :: [ ] :: [ 0/1935] [220s,240s) :: [ ] :: [ 1/1935] [240s,260s) :: [ ] :: [ 1/1935] [260s,280s) :: [ ] :: [ 2/1935] [280s,300s) :: [ ] :: [ 1/1935] [300s,320s) :: [ ] :: [ 0/1935] [320s,340s) :: [ ] :: [ 0/1935] [340s,360s) :: [ ] :: [ 0/1935] [360s,380s) :: [ ] :: [ 1/1935] Expected Passes : 1764 Expected Failures : 6 Unsupported Tests : 164 Unresolved Tests : 1 FAILED: tools/lldb/test/CMakeFiles/check-lldb-lit cd /Users/buildslave/jenkins/workspace/lldb-cmake-sanitized/lldb-build/tools/lldb/test && /usr/local/bin/python /Users/buildslave/jenkins/workspace/lldb-cmake-sanitized/lldb-build/./bin/llvm-lit -v --time-tests --shuffle --xunit-xml-output=/Users/buildslave/jenkins/workspace/lldb-cmake-sanitized/test/results.xml -v -j 4 --timeout 1200 /Users/buildslave/jenkins/workspace/lldb-cmake-sanitized/lldb-build/tools/lldb/test ninja: build stopped: subcommand failed. Command failed: Command '['/usr/bin/env', 'TERM=vt100', '/usr/local/bin/ninja', '-v', 'check-lldb']' returned non-zero exit status 1. Command: ['/usr/bin/env', 'TERM=vt100', '/usr/local/bin/ninja', '-v', 'check-lldb'] [Pipeline] } [Pipeline] // timeout [Pipeline] } [Pipeline] // stage [Pipeline] stage [Pipeline] { (Declarative: Post Actions) [Pipeline] scanForIssues No credentials specified [Clang (LLVM based)] Sleeping for 5 seconds due to JENKINS-32191... [Clang (LLVM based)] Parsing console log (workspace: '/Users/buildslave/jenkins/workspace/lldb-cmake-sanitized') [Clang (LLVM based)] [-ERROR-] Git blame errors: [Clang (LLVM based)] [-ERROR-] - no blame results for request <llvm-project/lldb/source/Plugins/Language/ObjC/NSDictionary.cpp - [726]>.

Hide Details

[Clang (LLVM based)] [-ERROR-] Git blame errors: [Clang (LLVM based)] [-ERROR-] - no blame results for request <llvm-project/lldb/tools/debugserver/source/RNBRemote.cpp - [16]>.

Hide Details

[Clang (LLVM based)] [-ERROR-] Git blame errors: [Clang (LLVM based)] [-ERROR-] - no blame results for request <llvm-project/lldb/source/Plugins/Language/ObjC/NSSet.cpp - [516]>.

Hide Details

[Clang (LLVM based)] [-ERROR-] Git blame errors: [Clang (LLVM based)] [-ERROR-] - no blame results for request <llvm-project/lldb/source/Plugins/Language/ObjC/NSArray.cpp - [530, 597]>.

Hide Details

[Clang (LLVM based)] Post processing issues on 'green-dragon-23' with source code encoding 'UTF-8' [Clang (LLVM based)] Resolving absolute file names for all issues in workspace '/Users/buildslave/jenkins/workspace/lldb-cmake-sanitized' [Clang (LLVM based)] -> 0 resolved, 0 unresolved, 4 already resolved [Clang (LLVM based)] Copying affected files to Jenkins' build folder '/Users/Shared/Jenkins/Home/jobs/lldb-cmake-sanitized/builds/969/files-with-issues' [Clang (LLVM based)] -> 4 copied, 0 not in workspace, 0 not-found, 0 with I/O error [Clang (LLVM based)] Resolving module names from module definitions (build.xml, pom.xml, or Manifest.mf files) [Clang (LLVM based)] -> resolved module names for 5 issues [Clang (LLVM based)] Resolving package names (or namespaces) by parsing the affected files [Clang (LLVM based)] -> resolved package names of 4 affected files [Clang (LLVM based)] No filter has been set, publishing all 5 issues [Clang (LLVM based)] Creating fingerprints for all affected code blocks to track issues over different builds [Clang (LLVM based)] -> created fingerprints for 5 issues [Clang (LLVM based)] Invoking Git blamer to create author and commit information for all affected files [Clang (LLVM based)] GIT_COMMIT env = 'HEAD' [Clang (LLVM based)] Git working tree = '/Users/buildslave/jenkins/workspace/lldb-cmake-sanitized' [Clang (LLVM based)] Git commit ID = '3a4296e9c1cdb53e0bf939b244790d257a6d5f26' [Clang (LLVM based)] Job workspace = '/Users/buildslave/jenkins/workspace/lldb-cmake-sanitized' [Clang (LLVM based)] Created blame requests for 4 files - invoking Git blame on agent for each of the requests [Clang (LLVM based)] -> blamed authors of issues in 4 files
[Pipeline] junit Recording test results [Pipeline] } [Pipeline] // stage [Pipeline] } [Pipeline] // withEnv [Pipeline] } [Pipeline] // node [Pipeline] End of Pipeline ERROR: script returned exit code 1 Finished: FAILURE