Console Output

Skipping 1,120 KB.. Full Log
PASS: lldb-unit :: Utility/./UtilityTests/ArgsTest.ReplaceArgumentAtIndexOutOfRange (526 of 1935)
PASS: lldb-api :: tools/lldb-vscode/launch/TestVSCode_launch.py (527 of 1935)
PASS: lldb-unit :: ScriptInterpreter/Python/./ScriptInterpreterPythonTests/PythonDataObjectsTest.TestCallable (528 of 1935)
PASS: lldb-unit :: Host/./HostTests/NativeProcessProtocolTest.SetBreakpoint (529 of 1935)
PASS: lldb-unit :: ScriptInterpreter/Python/./ScriptInterpreterPythonTests/PythonDataObjectsTest.TestScript (530 of 1935)
PASS: lldb-unit :: Utility/./UtilityTests/BinaryStreamTest.PutSLEB128One (531 of 1935)
PASS: lldb-shell :: Driver/TestTarget.test (532 of 1935)
PASS: lldb-unit :: Process/gdb-remote/./ProcessGdbRemoteTests/GDBRemoteCommunicationClientTest.SendStartTracePacket (533 of 1935)
PASS: lldb-unit :: UnwindAssembly/x86/./UnwindAssemblyx86Tests/Testx86AssemblyInspectionEngine.TestPopRBX (534 of 1935)
PASS: lldb-api :: commands/quit/TestQuit.py (535 of 1935)
PASS: lldb-unit :: Utility/./UtilityTests/LogChannelEnabledTest.LogVerboseThread (536 of 1935)
PASS: lldb-api :: lang/cpp/class-template-parameter-pack/TestClassTemplateParameterPack.py (537 of 1935)
PASS: lldb-api :: lang/c/stepping/TestStepAndBreakpoints.py (538 of 1935)
PASS: lldb-api :: functionalities/object-file/TestImageListMultiArchitecture.py (539 of 1935)
PASS: lldb-unit :: Utility/./UtilityTests/RangeDataVector.CustomSort (540 of 1935)
PASS: lldb-unit :: Utility/./UtilityTests/UriParserTest.BracketedHostnameWithColon (541 of 1935)
PASS: lldb-unit :: Process/minidump/./LLDBMinidumpTests/MinidumpParserTest.InvalidMinidump (542 of 1935)
UNSUPPORTED: lldb-api :: android/platform/TestDefaultCacheLineSize.py (543 of 1935)
PASS: lldb-api :: functionalities/thread/concurrent_events/TestConcurrentBreakpointDelayBreakpointOneSignal.py (544 of 1935)
PASS: lldb-api :: lang/objc/objc-super/TestObjCSuper.py (545 of 1935)
PASS: lldb-api :: lang/cpp/nsimport/TestCppNsImport.py (546 of 1935)
PASS: lldb-shell :: ObjectFile/wasm/stripped-debug-sections.yaml (547 of 1935)
UNSUPPORTED: lldb-shell :: SymbolFile/PDB/ast-restore.test (548 of 1935)
PASS: lldb-api :: types/TestShortType.py (549 of 1935)
PASS: lldb-unit :: Symbol/./SymbolTests/DWARFCallFrameInfoTest.Basic_dwarf4 (550 of 1935)
PASS: lldb-shell :: Settings/TestSettingsSet.test (551 of 1935)
PASS: lldb-api :: lang/objc/foundation/TestObjCMethods.py (552 of 1935)
PASS: lldb-unit :: Process/minidump/./LLDBMinidumpTests/MinidumpParserTest.GetLinuxProcStatus (553 of 1935)
PASS: lldb-shell :: SymbolFile/NativePDB/function-types-classes.cpp (554 of 1935)
UNSUPPORTED: lldb-shell :: SymbolFile/DWARF/debug-types-expressions.test (555 of 1935)
PASS: lldb-unit :: Utility/./UtilityTests/StringExtractorTest.GetNameColonValueNoColon (556 of 1935)
PASS: lldb-unit :: Language/Highlighting/./HighlighterTests/HighlighterTest.ClangCursorPosAfterOtherToken (557 of 1935)
UNSUPPORTED: lldb-shell :: SymbolFile/PDB/expressions.test (558 of 1935)
PASS: lldb-api :: python_api/name_lookup/TestNameLookup.py (559 of 1935)
PASS: lldb-unit :: ObjectFile/Breakpad/./ObjectFileBreakpadTests/StackWinRecord.parse (560 of 1935)
PASS: lldb-unit :: UnwindAssembly/x86/./UnwindAssemblyx86Tests/Testx86AssemblyInspectionEngine.TestPushR13 (561 of 1935)
UNSUPPORTED: lldb-api :: functionalities/tsan/thread_leak/TestTsanThreadLeak.py (562 of 1935)
UNSUPPORTED: lldb-shell :: Breakpoint/case-insensitive.test (563 of 1935)
PASS: lldb-unit :: ScriptInterpreter/Python/./ScriptInterpreterPythonTests/PythonDataObjectsTest.TestRun (564 of 1935)
PASS: lldb-unit :: Utility/./UtilityTests/StringExtractorTest.GetHexU8_Exact (565 of 1935)
PASS: lldb-unit :: Utility/./UtilityTests/StringListTest.ForRange (566 of 1935)
PASS: lldb-unit :: Language/Highlighting/./HighlighterTests/HighlighterTest.ClangTrailingBackslashWithWhitespace (567 of 1935)
UNSUPPORTED: lldb-api :: macosx/macabi/TestMacABImacOSFramework.py (568 of 1935)
PASS: lldb-api :: functionalities/thread/concurrent_events/TestConcurrentTwoWatchpointsOneDelayBreakpoint.py (569 of 1935)
PASS: lldb-api :: lang/objc/modules-cache/TestClangModulesCache.py (570 of 1935)
PASS: lldb-unit :: UnwindAssembly/x86/./UnwindAssemblyx86Tests/Testx86AssemblyInspectionEngine.TestPopRBP (571 of 1935)
PASS: lldb-unit :: Target/./TargetTests/ModuleCacheTest.GetAndPutStrangeHostname (572 of 1935)
PASS: lldb-shell :: SymbolFile/Breakpad/line-table-missing-file.test (573 of 1935)
PASS: lldb-unit :: ObjectFile/ELF/./ObjectFileELFTests/ObjectFileELFTest.SectionsResolveConsistently (574 of 1935)
PASS: lldb-api :: functionalities/deleted-executable/TestDeletedExecutable.py (575 of 1935)
PASS: lldb-unit :: Utility/./UtilityTests/StringExtractorTest.GetHexU8_Underflow_NoEof (576 of 1935)
PASS: lldb-api :: commands/expression/fixits/TestFixIts.py (577 of 1935)
PASS: lldb-unit :: Host/./HostTests/SocketAddressTest.GetAddressInfo (578 of 1935)
UNSUPPORTED: lldb-shell :: Unwind/eh-frame-small-fde.test (579 of 1935)
PASS: lldb-unit :: Utility/./UtilityTests/StreamTest.PutHex16ByteOrderLittle (580 of 1935)
PASS: lldb-shell :: SymbolFile/Breakpad/symtab-macho.test (581 of 1935)
PASS: lldb-api :: lang/cpp/lambdas/TestLambdas.py (582 of 1935)
UNSUPPORTED: lldb-api :: benchmarks/startup/TestStartupDelays.py (583 of 1935)
PASS: lldb-api :: commands/expression/persistent_types/TestPersistentTypes.py (584 of 1935)
PASS: lldb-api :: lang/c/shared_lib/TestSharedLib.py (585 of 1935)
PASS: lldb-unit :: Utility/./UtilityTests/UriParserTest.BracketedHostnamePort (586 of 1935)
PASS: lldb-api :: commands/command/script/TestCommandScript.py (587 of 1935)
PASS: lldb-api :: functionalities/target-new-solib-notifications/TestModuleLoadedNotifys.py (588 of 1935)
PASS: lldb-unit :: UnwindAssembly/x86/./UnwindAssemblyx86Tests/Testx86AssemblyInspectionEngine.TestStackRealignMSVC_i386 (589 of 1935)
PASS: lldb-unit :: ScriptInterpreter/Python/./ScriptInterpreterPythonTests/PythonDataObjectsTest.TestPythonDictionaryManipulation (590 of 1935)
PASS: lldb-unit :: Utility/./UtilityTests/StreamTest.PutNHex8 (591 of 1935)
PASS: lldb-unit :: Utility/./UtilityTests/BinaryStreamTest.PutULEB128EightBytes (592 of 1935)
UNSUPPORTED: lldb-shell :: Register/x86-zmm-write.test (593 of 1935)
PASS: lldb-api :: commands/expression/entry-bp/TestExprEntryBP.py (594 of 1935)
PASS: lldb-api :: commands/command/nested_alias/TestNestedAlias.py (595 of 1935)
PASS: lldb-unit :: Utility/./UtilityTests/StringExtractorTest.GetU32LittleEndian (596 of 1935)
PASS: lldb-api :: commands/breakpoint/command/list/TestBreakpointCommandList.py (597 of 1935)
PASS: lldb-unit :: Utility/./UtilityTests/Flags.AllClear (598 of 1935)
UNSUPPORTED: lldb-api :: functionalities/thread/multi_break/TestMultipleBreakpoints.py (599 of 1935)
PASS: lldb-shell :: Unwind/eh-frame-dwarf-unwind.test (600 of 1935)
PASS: lldb-api :: commands/expression/test/TestExprs2.py (601 of 1935)
PASS: lldb-api :: commands/expression/import-std-module/weak_ptr/TestWeakPtrFromStdModule.py (602 of 1935)
PASS: lldb-api :: functionalities/data-formatter/data-formatter-cpp/TestDataFormatterCpp.py (603 of 1935)
PASS: lldb-unit :: Signals/./SignalsTests/UnixSignalsTest.Iteration (604 of 1935)
PASS: lldb-api :: functionalities/signal/handle-abrt/TestHandleAbort.py (605 of 1935)
PASS: lldb-shell :: Minidump/breakpad-symbols.test (606 of 1935)
UNSUPPORTED: lldb-shell :: ScriptInterpreter/Lua/bindings.test (607 of 1935)
PASS: lldb-unit :: Symbol/./SymbolTests/LineEntryTest.GetSameLineContiguousAddressRangeNoInlines (608 of 1935)
XFAIL: lldb-shell :: Register/x86-64-ymm-write.test (609 of 1935)
PASS: lldb-unit :: Process/minidump/./LLDBMinidumpTests/MinidumpParserTest.GetMemoryRegionInfoFromMemory64List (610 of 1935)
PASS: lldb-unit :: Utility/./UtilityTests/UriParserTest.SchemeHostSeparator3 (611 of 1935)
PASS: lldb-api :: python_api/value/linked_list/TestValueAPILinkedList.py (612 of 1935)
PASS: lldb-unit :: Core/./LLDBCoreTests/UniqueCStringMap.NoDefaultConstructor (613 of 1935)
PASS: lldb-api :: lang/c/step_over_no_deadlock/TestStepOverDoesntBlock.py (614 of 1935)
PASS: lldb-api :: python_api/frame/get-variables/TestGetVariables.py (615 of 1935)
PASS: lldb-api :: functionalities/data-formatter/data-formatter-stl/libcxx/vector/TestDataFormatterLibcxxVector.py (616 of 1935)
PASS: lldb-api :: python_api/interpreter/TestRunCommandInterpreterAPI.py (617 of 1935)
PASS: lldb-api :: functionalities/value_md5_crash/TestValueMD5Crash.py (618 of 1935)
PASS: lldb-api :: functionalities/breakpoint/debugbreak/TestDebugBreak.py (619 of 1935)
PASS: lldb-unit :: Utility/./UtilityTests/StructuredDataTest.ParseJSONFromFile (620 of 1935)
PASS: lldb-api :: lang/objc/foundation/TestObjCMethodsNSArray.py (621 of 1935)
PASS: lldb-api :: tools/lldb-server/TestGdbRemote_vCont.py (622 of 1935)
PASS: lldb-unit :: Utility/./UtilityTests/FileSpecTest.PrependPathComponent (623 of 1935)
PASS: lldb-api :: functionalities/data-formatter/data-formatter-stl/libcxx/optional/TestDataFormatterLibcxxOptional.py (624 of 1935)
PASS: lldb-api :: lang/cpp/bool/TestCPPBool.py (625 of 1935)
UNSUPPORTED: lldb-shell :: ObjectFile/ELF/minidebuginfo-no-lzma.yaml (626 of 1935)
UNSUPPORTED: lldb-shell :: Register/x86-ymm-write.test (627 of 1935)
UNSUPPORTED: lldb-api :: functionalities/data-formatter/data-formatter-stl/libstdcpp/smart_ptr/TestDataFormatterStdSmartPtr.py (628 of 1935)
PASS: lldb-shell :: Commands/command-source.test (629 of 1935)
PASS: lldb-api :: commands/frame/diagnose/dereference-function-return/TestDiagnoseDereferenceFunctionReturn.py (630 of 1935)
PASS: lldb-unit :: Utility/./UtilityTests/StreamTest.AddressSize (631 of 1935)
UNSUPPORTED: lldb-api :: lang/c/typedef/Testtypedef.py (632 of 1935)
PASS: lldb-api :: functionalities/data-formatter/language_category_updates/TestDataFormatterLanguageCategoryUpdates.py (633 of 1935)
PASS: lldb-unit :: Utility/./UtilityTests/ArgsTest.TestUnknownEscape (634 of 1935)
PASS: lldb-api :: functionalities/data-formatter/data-formatter-objc/nsstring/TestDataFormatterNSString.py (635 of 1935)
PASS: lldb-unit :: Language/Highlighting/./HighlighterTests/HighlighterTest.ClangEmptyInput (636 of 1935)
PASS: lldb-shell :: SymbolFile/Breakpad/line-table.test (637 of 1935)
PASS: lldb-api :: commands/watchpoints/step_over_watchpoint/TestStepOverWatchpoint.py (638 of 1935)
PASS: lldb-api :: lang/cpp/breakpoint_in_member_func_w_non_primitive_params/TestBreakpointInMemberFuncWNonPrimitiveParams.py (639 of 1935)
PASS: lldb-api :: tools/lldb-server/commandline/TestStubReverseConnect.py (640 of 1935)
UNSUPPORTED: lldb-api :: linux/sepdebugsymlink/TestTargetSymbolsSepDebugSymlink.py (641 of 1935)
PASS: lldb-api :: commands/expression/ir-interpreter/TestIRInterpreter.py (642 of 1935)
PASS: lldb-shell :: ObjectFile/MachO/lc_build_version.yaml (643 of 1935)
PASS: lldb-unit :: SymbolFile/NativePDB/./SymbolFileNativePDBTests/PDBFPOProgramToDWARFExpressionTests.InvalidOpBinary (644 of 1935)
PASS: lldb-unit :: Host/./HostTests/Host.WaitStatusFormat (645 of 1935)
PASS: lldb-api :: commands/process/attach-resume/TestAttachResume.py (646 of 1935)
PASS: lldb-unit :: Symbol/./SymbolTests/PostfixExpression.ParseOneExpression (647 of 1935)
PASS: lldb-api :: macosx/DBGSourcePathRemapping/TestDSYMSourcePathRemapping.py (648 of 1935)
PASS: lldb-unit :: SymbolFile/NativePDB/./SymbolFileNativePDBTests/PDBFPOProgramToDWARFExpressionTests.MultipleIndependentAssignments (649 of 1935)
PASS: lldb-shell :: ObjectFile/ELF/short-build-id.yaml (650 of 1935)
PASS: lldb-unit :: Process/minidump/./LLDBMinidumpTests/MinidumpParserTest.GetMemoryRegionInfo (651 of 1935)
UNSUPPORTED: lldb-shell :: ScriptInterpreter/Lua/command_script_import.test (652 of 1935)
PASS: lldb-api :: functionalities/data-formatter/dump_dynamic/TestDumpDynamic.py (653 of 1935)
PASS: lldb-unit :: Utility/./UtilityTests/AnsiTerminal.AtEnd (654 of 1935)
PASS: lldb-unit :: Utility/./UtilityTests/SubsystemRAIITest.SubsystemWithErrorSuccess (655 of 1935)
PASS: lldb-api :: commands/expression/context-object-objc/TestContextObjectObjc.py (656 of 1935)
PASS: lldb-unit :: Host/./HostTests/FileSystemTest.GetByteSize (657 of 1935)
PASS: lldb-api :: functionalities/thread/step_out/TestThreadStepOut.py (658 of 1935)
PASS: lldb-api :: lang/cpp/extern_c/TestExternCSymbols.py (659 of 1935)
PASS: lldb-unit :: Utility/./UtilityTests/BinaryStreamTest.PutULEB128One (660 of 1935)
PASS: lldb-shell :: SymbolFile/Breakpad/stack-cfi-parsing.test (661 of 1935)
PASS: lldb-unit :: Utility/./UtilityTests/NameMatchesTest.StartsWith (662 of 1935)
PASS: lldb-shell :: ObjectFile/ELF/avr-basic-info.yaml (663 of 1935)
PASS: lldb-api :: python_api/sbvalue_persist/TestSBValuePersist.py (664 of 1935)
PASS: lldb-shell :: Breakpoint/debug_rnglist_basic.test (665 of 1935)
PASS: lldb-api :: macosx/thread-names/TestInterruptThreadNames.py (666 of 1935)
UNSUPPORTED: lldb-api :: tools/lldb-server/libraries-svr4/TestGdbRemoteLibrariesSvr4Support.py (667 of 1935)
PASS: lldb-unit :: Interpreter/./InterpreterTests/CompletionTest.FileCompletionAbsolute (668 of 1935)
PASS: lldb-api :: lang/cpp/operator-overload/TestOperatorOverload.py (669 of 1935)
PASS: lldb-api :: lang/cpp/nested-class-other-compilation-unit/TestNestedClassWithParentInAnotherCU.py (670 of 1935)
UNSUPPORTED: lldb-api :: functionalities/data-formatter/data-formatter-stl/libstdcpp/iterator/TestDataFormatterStdIterator.py (671 of 1935)
PASS: lldb-unit :: Utility/./UtilityTests/StreamTest.PutCharWhitespace (672 of 1935)
PASS: lldb-shell :: Breakpoint/debug_rnglist_offset_pair.test (673 of 1935)
PASS: lldb-api :: functionalities/unwind/sigtramp/TestSigtrampUnwind.py (674 of 1935)
UNSUPPORTED: lldb-api :: functionalities/data-formatter/data-formatter-stl/libstdcpp/unique_ptr/TestDataFormatterStdUniquePtr.py (675 of 1935)
PASS: lldb-api :: functionalities/breakpoint/auto_continue/TestBreakpointAutoContinue.py (676 of 1935)
PASS: lldb-unit :: Utility/./UtilityTests/UUIDTest.StringConverion (677 of 1935)
PASS: lldb-api :: functionalities/thread/concurrent_events/TestConcurrentSignalDelayBreak.py (678 of 1935)
PASS: lldb-api :: types/TestDoubleTypes.py (679 of 1935)
PASS: lldb-unit :: Target/./TargetTests/PathMappingListTest.RelativeTests (680 of 1935)
PASS: lldb-unit :: Utility/./UtilityTests/BinaryStreamTest.PutSLEB128FiveBytes (681 of 1935)
PASS: lldb-unit :: Utility/./UtilityTests/CompletionRequest.FakeLastArg (682 of 1935)
PASS: lldb-unit :: Language/Highlighting/./HighlighterTests/HighlighterTest.ClangComments (683 of 1935)
PASS: lldb-api :: functionalities/thread/concurrent_events/TestConcurrentTwoBreakpointsOneDelaySignal.py (684 of 1935)
PASS: lldb-unit :: Utility/./UtilityTests/StringListTest.DefaultConstructor (685 of 1935)
PASS: lldb-unit :: Utility/./UtilityTests/ConstStringTest.CompareConstString (686 of 1935)
PASS: lldb-unit :: Utility/./UtilityTests/ProcessInstanceInfo.Dump (687 of 1935)
PASS: lldb-unit :: UnwindAssembly/x86/./UnwindAssemblyx86Tests/Testx86AssemblyInspectionEngine.TestPushRBPWithREX (688 of 1935)
PASS: lldb-unit :: Utility/./UtilityTests/StringListTest.InsertStringAtIndexOutOfBounds (689 of 1935)
PASS: lldb-api :: functionalities/data-formatter/data-formatter-python-synth/TestDataFormatterPythonSynth.py (690 of 1935)
PASS: lldb-unit :: Symbol/./SymbolTests/SymbolsTest.TerminateLocateExecutableSymbolFileForUnknownExecutableAndUnknownSymbolFile (691 of 1935)
PASS: lldb-api :: functionalities/thread/exit_during_step/TestExitDuringStep.py (692 of 1935)
PASS: lldb-unit :: Utility/./UtilityTests/StringLexerTest.HasAtLeast (693 of 1935)
PASS: lldb-unit :: Utility/./UtilityTests/RangeTest.ContainsAddr (694 of 1935)
PASS: lldb-unit :: UnwindAssembly/x86/./UnwindAssemblyx86Tests/Testx86AssemblyInspectionEngine.TestAddRSP (695 of 1935)
PASS: lldb-unit :: ScriptInterpreter/Python/./ScriptInterpreterPythonTests/PythonDataObjectsTest.TestPythonTupleToStructuredList (696 of 1935)
UNSUPPORTED: lldb-shell :: SymbolFile/PDB/variables-locations.test (697 of 1935)
PASS: lldb-unit :: ScriptInterpreter/Python/./ScriptInterpreterPythonTests/PythonDataObjectsTest.TestResetting (698 of 1935)
PASS: lldb-api :: functionalities/thread/concurrent_events/TestConcurrentWatchpointWithDelayWatchpointThreads.py (699 of 1935)
PASS: lldb-api :: commands/expression/save_jit_objects/TestSaveJITObjects.py (700 of 1935)
PASS: lldb-api :: commands/expression/char/TestExprsChar.py (701 of 1935)
PASS: lldb-api :: python_api/value/empty_class/TestValueAPIEmptyClass.py (702 of 1935)
PASS: lldb-api :: functionalities/data-formatter/data-formatter-stl/libcxx/variant/TestDataFormatterLibcxxVariant.py (703 of 1935)
PASS: lldb-unit :: ScriptInterpreter/Python/./ScriptInterpreterPythonTests/PythonDataObjectsTest.TestPythonFile (704 of 1935)
UNSUPPORTED: lldb-shell :: BuildScript/toolchain-msvc.test (705 of 1935)
PASS: lldb-unit :: Utility/./UtilityTests/StreamTest.PutHex8 (706 of 1935)
UNSUPPORTED: lldb-api :: functionalities/tsan/cpp_global_location/TestTsanCPPGlobalLocation.py (707 of 1935)
PASS: lldb-unit :: Utility/./UtilityTests/RangeTest.Slide (708 of 1935)
PASS: lldb-unit :: Utility/./UtilityTests/StringListTest.Assignment (709 of 1935)
PASS: lldb-unit :: UnwindAssembly/x86/./UnwindAssemblyx86Tests/Testx86AssemblyInspectionEngine.Test64bitFramelessBigStackFrame (710 of 1935)
PASS: lldb-api :: functionalities/data-formatter/compactvectors/TestCompactVectors.py (711 of 1935)
PASS: lldb-api :: macosx/find-app-in-bundle/TestFindAppInBundle.py (712 of 1935)
PASS: lldb-shell :: Breakpoint/debug_addrx.test (713 of 1935)
PASS: lldb-shell :: SymbolFile/DWARF/split-dwarf-multiple-cu.ll (714 of 1935)
PASS: lldb-unit :: UnwindAssembly/x86/./UnwindAssemblyx86Tests/Testx86AssemblyInspectionEngine.TestPushEAX (715 of 1935)
PASS: lldb-api :: commands/expression/import-std-module/list/TestListFromStdModule.py (716 of 1935)
PASS: lldb-shell :: ObjectFile/PECOFF/section-types.yaml (717 of 1935)
UNSUPPORTED: lldb-shell :: Unwind/unwind-plan-dwarf-dump.test (718 of 1935)
PASS: lldb-api :: commands/statistics/basic/TestStats.py (719 of 1935)
PASS: lldb-shell :: ObjectFile/ELF/PT_LOAD-overlap-section.yaml (720 of 1935)
PASS: lldb-api :: lang/objc/exceptions/TestObjCExceptions.py (721 of 1935)
PASS: lldb-unit :: Process/minidump/./LLDBMinidumpTests/MinidumpParserTest.GetExceptionStream (722 of 1935)
PASS: lldb-api :: tools/lldb-server/register-reading/TestGdbRemoteGPacket.py (723 of 1935)
PASS: lldb-shell :: ObjectFile/ELF/aarch64-relocations.yaml (724 of 1935)
PASS: lldb-unit :: tools/lldb-server/tests/./LLDBServerTests/TestBase.DebugserverEnv (725 of 1935)
PASS: lldb-api :: functionalities/thread/concurrent_events/TestConcurrentBreakpointOneDelayBreakpointThreads.py (726 of 1935)
PASS: lldb-unit :: Utility/./UtilityTests/ArgsTest.TestSingleArgWithQuotedSpace (727 of 1935)
PASS: lldb-api :: macosx/duplicate-archive-members/TestDuplicateMembers.py (728 of 1935)
PASS: lldb-api :: lang/objc/objc-foundation-dictionary-empty/TestNSDictionary0.py (729 of 1935)
PASS: lldb-api :: lang/objc/objc-static-method-stripped/TestObjCStaticMethodStripped.py (730 of 1935)
PASS: lldb-api :: functionalities/fat_archives/TestFatArchives.py (731 of 1935)
PASS: lldb-api :: tools/lldb-vscode/attach/TestVSCode_attach.py (732 of 1935)
PASS: lldb-api :: functionalities/plugins/command_plugin/TestPluginCommands.py (733 of 1935)
PASS: lldb-shell :: SymbolFile/DWARF/debug_line-relative_path.s (734 of 1935)
PASS: lldb-unit :: Utility/./UtilityTests/BinaryStreamTest.PutULEB128NineBytes (735 of 1935)
PASS: lldb-api :: functionalities/breakpoint/breakpoint_names/TestBreakpointNames.py (736 of 1935)
PASS: lldb-shell :: SymbolFile/DWARF/debug_loclists-dwo.s (737 of 1935)
PASS: lldb-unit :: Utility/./UtilityTests/ListenerTest.GetEventWait (738 of 1935)
PASS: lldb-shell :: ObjectFile/PECOFF/export-dllfunc.yaml (739 of 1935)
UNSUPPORTED: lldb-shell :: SymbolFile/PDB/enums-layout.test (740 of 1935)
PASS: lldb-api :: functionalities/breakpoint/step_over_breakpoint/TestStepOverBreakpoint.py (741 of 1935)
PASS: lldb-unit :: Utility/./UtilityTests/RegularExpression.CopyAssignment (742 of 1935)
PASS: lldb-api :: functionalities/data-formatter/data-formatter-disabling/TestDataFormatterDisabling.py (743 of 1935)
PASS: lldb-unit :: Utility/./UtilityTests/RangeTest.NotEqualInvalid (744 of 1935)
UNSUPPORTED: lldb-api :: commands/expression/macros/TestMacros.py (745 of 1935)
PASS: lldb-api :: commands/frame/diagnose/inheritance/TestDiagnoseInheritance.py (746 of 1935)
PASS: lldb-api :: lang/objc/foundation/TestObjectDescriptionAPI.py (747 of 1935)
PASS: lldb-unit :: Utility/./UtilityTests/StringLexerTest.Next (748 of 1935)
PASS: lldb-unit :: Utility/./UtilityTests/StringLexerTest.PutBack (749 of 1935)
PASS: lldb-api :: lang/cpp/char8_t/TestCxxChar8_t.py (750 of 1935)
PASS: lldb-unit :: Target/./TargetTests/ExecutionContextTest.GetByteOrderProcess (751 of 1935)
PASS: lldb-api :: python_api/sbstructureddata/TestStructuredDataAPI.py (752 of 1935)
PASS: lldb-unit :: Host/./HostTests/FileSystemTest.Resolve (753 of 1935)
PASS: lldb-unit :: Language/Highlighting/./HighlighterTests/HighlighterTest.HighlighterSelectionPath (754 of 1935)
PASS: lldb-api :: commands/expression/call-function/TestCallStopAndContinue.py (755 of 1935)
PASS: lldb-unit :: Utility/./UtilityTests/FileSpecTest.FormatFileSpec (756 of 1935)
PASS: lldb-unit :: Utility/./UtilityTests/UriParserTest.BadPort2 (757 of 1935)
PASS: lldb-api :: functionalities/data-formatter/data-formatter-script/TestDataFormatterScript.py (758 of 1935)
PASS: lldb-api :: python_api/watchpoint/TestSetWatchpoint.py (759 of 1935)
PASS: lldb-shell :: Expr/TestTypeOfDeclTypeExpr.test (760 of 1935)
PASS: lldb-unit :: Utility/./UtilityTests/ArgsTest.TestInsertArg (761 of 1935)
PASS: lldb-unit :: Process/gdb-remote/./ProcessGdbRemoteTests/GDBRemoteCommunicationClientTest.GetMemoryRegionInfoInvalidResponse (762 of 1935)
PASS: lldb-unit :: Utility/./UtilityTests/ArgsTest.AppendArguments (763 of 1935)
PASS: lldb-unit :: Utility/./UtilityTests/FileSpecTest.AppendPathComponent (764 of 1935)
PASS: lldb-api :: types/TestFloatTypesExpr.py (765 of 1935)
PASS: lldb-unit :: ScriptInterpreter/Python/./ScriptInterpreterPythonTests/PythonDataObjectsTest.TestPythonListManipulation (766 of 1935)
PASS: lldb-api :: commands/expression/no-deadlock/TestExprDoesntBlock.py (767 of 1935)
PASS: lldb-unit :: Signals/./SignalsTests/UnixSignalsTest.GetInfo (768 of 1935)
PASS: lldb-api :: functionalities/tail_call_frames/disambiguate_tail_call_seq/TestDisambiguateTailCallSeq.py (769 of 1935)
PASS: lldb-shell :: SymbolFile/DWARF/find-basic-type.cpp (770 of 1935)
PASS: lldb-api :: lang/objcxx/cxx-bridged-po/TestObjCXXBridgedPO.py (771 of 1935)
PASS: lldb-shell :: SymbolFile/DWARF/gnu-style-compression.cpp (772 of 1935)
PASS: lldb-unit :: UnwindAssembly/x86/./UnwindAssemblyx86Tests/Testx86AssemblyInspectionEngine.TestAddESP (773 of 1935)
PASS: lldb-shell :: ObjectFile/ELF/PT_LOAD-overlap-PT_INTERP.yaml (774 of 1935)
PASS: lldb-unit :: Utility/./UtilityTests/BinaryStreamTest.PutSLEB128OneByte (775 of 1935)
PASS: lldb-unit :: Utility/./UtilityTests/BinaryStreamTest.PutULEB128TwoBytes (776 of 1935)
PASS: lldb-api :: functionalities/data-formatter/array_typedef/TestArrayTypedef.py (777 of 1935)
PASS: lldb-api :: lang/cpp/inlines/TestInlines.py (778 of 1935)
PASS: lldb-unit :: Utility/./UtilityTests/ArgsTest.ReplaceArgumentAtIndexLonger (779 of 1935)
PASS: lldb-api :: commands/expression/deleting-implicit-copy-constructor/TestDeletingImplicitCopyConstructor.py (780 of 1935)
PASS: lldb-unit :: SymbolFile/NativePDB/./SymbolFileNativePDBTests/PDBFPOProgramToDWARFExpressionTests.InvalidOpUnary (781 of 1935)
PASS: lldb-api :: commands/target/stop-hooks/TestStopHooks.py (782 of 1935)
PASS: lldb-unit :: Utility/./UtilityTests/OptionsWithRawTest.EmptyArgsOnlySuffix (783 of 1935)
UNSUPPORTED: lldb-shell :: Register/x86-64-xmm16-read.test (784 of 1935)
PASS: lldb-unit :: Utility/./UtilityTests/DataExtractorTest.GetCStrEmpty (785 of 1935)
PASS: lldb-unit :: Core/./LLDBCoreTests/MangledTest.ResultForValidName (786 of 1935)
UNSUPPORTED: lldb-shell :: ExecControl/StopHook/stop-hook-threads.test (787 of 1935)
PASS: lldb-unit :: Core/./LLDBCoreTests/MangledTest.ResultForBlockInvocation (788 of 1935)
PASS: lldb-unit :: Utility/./UtilityTests/ArchSpecTest.MergeFromMachOUnknown (789 of 1935)
PASS: lldb-api :: functionalities/breakpoint/cpp_exception/TestCPPExceptionBreakpoint.py (790 of 1935)
PASS: lldb-unit :: Utility/./UtilityTests/StreamTest.AddressPrefix (791 of 1935)
PASS: lldb-unit :: Utility/./UtilityTests/ArgsTest.TestTrailingBackslash (792 of 1935)
PASS: lldb-unit :: Utility/./UtilityTests/StringExtractorTest.GetHexU8_Extra_NoEof (793 of 1935)
PASS: lldb-unit :: Utility/./UtilityTests/StreamTest.PutMaxHex64ByteOrderBig (794 of 1935)
PASS: lldb-api :: lang/objc/real-definition/TestRealDefinition.py (795 of 1935)
PASS: lldb-unit :: Utility/./UtilityTests/FileSpecTest.Equal (796 of 1935)
UNSUPPORTED: lldb-api :: iohandler/unicode/TestUnicode.py (797 of 1935)
PASS: lldb-unit :: Utility/./UtilityTests/StringExtractorTest.DecodeHexU8_InvalidHex (798 of 1935)
PASS: lldb-unit :: Utility/./UtilityTests/DataExtractorTest.GetCStr (799 of 1935)
UNSUPPORTED: lldb-shell :: SymbolFile/dissassemble-entry-point.s (800 of 1935)
PASS: lldb-api :: functionalities/step-avoids-no-debug/TestStepNoDebug.py (801 of 1935)
PASS: lldb-unit :: Utility/./UtilityTests/StringExtractorTest.GetHexU8_InvalidHex (802 of 1935)
PASS: lldb-api :: python_api/watchpoint/TestWatchpointIter.py (803 of 1935)
PASS: lldb-unit :: Utility/./UtilityTests/StringExtractorTest.GetHexU8_Exact_NoEof (804 of 1935)
PASS: lldb-shell :: Commands/command-regex-unalias.test (805 of 1935)
PASS: lldb-shell :: Driver/TestRepl.test (806 of 1935)
PASS: lldb-unit :: Utility/./UtilityTests/VASprintfTest.EncodingError (807 of 1935)
PASS: lldb-unit :: Process/minidump/./LLDBMinidumpTests/MinidumpParserTest.FindMemoryRange (808 of 1935)
PASS: lldb-unit :: Utility/./UtilityTests/StringLexerTest.Peek (809 of 1935)
UNSUPPORTED: lldb-shell :: Register/aarch64-gp-read.test (810 of 1935)
PASS: lldb-unit :: Utility/./UtilityTests/StringExtractorTest.GetHexBytesAvail (811 of 1935)
PASS: lldb-api :: tools/lldb-vscode/step/TestVSCode_step.py (812 of 1935)
PASS: lldb-unit :: Expression/./ExpressionTests/DiagnosticManagerTest.FixedExpression (813 of 1935)
PASS: lldb-unit :: Utility/./UtilityTests/StringExtractorTest.GetHexBytesAvail_OddPair2 (814 of 1935)
PASS: lldb-shell :: SymbolFile/DWARF/anon_class_w_and_wo_export_symbols.ll (815 of 1935)
PASS: lldb-unit :: Utility/./UtilityTests/TimerTest.CategoryTimes (816 of 1935)
PASS: lldb-unit :: ScriptInterpreter/Python/./ScriptInterpreterPythonTests/PythonDataObjectsTest.TestExtractingUInt64ThroughStructuredData (817 of 1935)
PASS: lldb-api :: functionalities/data-formatter/data-formatter-caching/TestDataFormatterCaching.py (818 of 1935)
PASS: lldb-api :: lang/objc/modules-update/TestClangModulesUpdate.py (819 of 1935)
PASS: lldb-unit :: Target/./TargetTests/StackFrameRecognizerTest.NullModuleRegex (820 of 1935)
PASS: lldb-api :: python_api/process/TestProcessAPI.py (821 of 1935)
PASS: lldb-unit :: Utility/./UtilityTests/StringExtractorTest.GetHexBytes_Underflow (822 of 1935)
PASS: lldb-api :: functionalities/process_group/TestChangeProcessGroup.py (823 of 1935)
PASS: lldb-api :: functionalities/data-formatter/boolreference/TestFormattersBoolRefPtr.py (824 of 1935)
PASS: lldb-unit :: Utility/./UtilityTests/CompletionRequest.TryCompleteCurrentArgGood (825 of 1935)
PASS: lldb-shell :: ObjectFile/ELF/PT_LOAD.yaml (826 of 1935)
PASS: lldb-api :: commands/expression/two-files/TestObjCTypeQueryFromOtherCompileUnit.py (827 of 1935)
PASS: lldb-unit :: ScriptInterpreter/Python/./ScriptInterpreterPythonTests/PythonDataObjectsTest.TestGlobalNameResolutionWithDot (828 of 1935)
PASS: lldb-api :: api/multiple-targets/TestMultipleTargets.py (829 of 1935)
PASS: lldb-unit :: Utility/./UtilityTests/StreamTest.PutChar (830 of 1935)
PASS: lldb-shell :: ObjectFile/ELF/PT_LOAD-empty.yaml (831 of 1935)
PASS: lldb-api :: functionalities/thread/jump/TestThreadJump.py (832 of 1935)
PASS: lldb-unit :: ObjectFile/Breakpad/./ObjectFileBreakpadTests/FuncRecord.parse (833 of 1935)
PASS: lldb-shell :: ObjectFile/Breakpad/breakpad-identification.test (834 of 1935)
PASS: lldb-unit :: Utility/./UtilityTests/SerializationRountripTest.SerializeDeserializeCString (835 of 1935)
PASS: lldb-unit :: Process/gdb-remote/./ProcessGdbRemoteTests/GDBRemoteClientBaseTest.SendContinueDelegateInterface (836 of 1935)
PASS: lldb-shell :: Settings/TestModuleCacheSanity.test (837 of 1935)
PASS: lldb-api :: functionalities/thread/concurrent_events/TestConcurrentTwoWatchpointThreads.py (838 of 1935)
PASS: lldb-unit :: Utility/./UtilityTests/StringExtractorTest.GetU64BigEndian (839 of 1935)
PASS: lldb-unit :: Utility/./UtilityTests/StringExtractorTest.InitMisc (840 of 1935)
PASS: lldb-api :: commands/expression/rdar42038760/TestScalarURem.py (841 of 1935)
PASS: lldb-unit :: ScriptInterpreter/Python/./ScriptInterpreterPythonTests/PythonDataObjectsTest.TestGlobalNameResolutionNoDot (842 of 1935)
PASS: lldb-shell :: SymbolFile/DWARF/forward-declarations.s (843 of 1935)
PASS: lldb-shell :: Settings/TestEchoCommands.test (844 of 1935)
PASS: lldb-shell :: ObjectFile/Breakpad/sections-trailing-func.test (845 of 1935)
PASS: lldb-api :: python_api/sbtype_typeclass/TestSBTypeTypeClass.py (846 of 1935)
PASS: lldb-api :: lang/cpp/class_types/TestClassTypesDisassembly.py (847 of 1935)
PASS: lldb-unit :: Utility/./UtilityTests/StreamTeeTest.Flush (848 of 1935)
PASS: lldb-api :: functionalities/thread/concurrent_events/TestConcurrentManyWatchpoints.py (849 of 1935)
PASS: lldb-unit :: Language/Highlighting/./HighlighterTests/HighlighterTest.ClangCursorPos (850 of 1935)
PASS: lldb-unit :: Utility/./UtilityTests/BinaryStreamTest.PutSLEB128FourBytes (851 of 1935)
PASS: lldb-api :: functionalities/thread/backtrace_limit/TestBacktraceLimit.py (852 of 1935)
PASS: lldb-unit :: Core/./LLDBCoreTests/RichManglingContextTest.Basic (853 of 1935)
PASS: lldb-api :: functionalities/thread/concurrent_events/TestConcurrentTwoBreakpointThreads.py (854 of 1935)
PASS: lldb-api :: functionalities/breakpoint/breakpoint_set_restart/TestBreakpointSetRestart.py (855 of 1935)
PASS: lldb-unit :: Utility/./UtilityTests/CompletionRequest.TryCompleteCurrentArgBad (856 of 1935)
PASS: lldb-unit :: Utility/./UtilityTests/BinaryStreamTest.PutSLEB128NineBytes (857 of 1935)
UNSUPPORTED: lldb-shell :: Register/arm-gp-read.test (858 of 1935)
PASS: lldb-api :: tools/lldb-vscode/variables/TestVSCode_variables.py (859 of 1935)
PASS: lldb-shell :: Reproducer/TestGDBRemoteRepro.test (860 of 1935)
PASS: lldb-api :: functionalities/breakpoint/global_constructor/TestBreakpointInGlobalConstructor.py (861 of 1935)
PASS: lldb-api :: lang/c/const_variables/TestConstVariables.py (862 of 1935)
PASS: lldb-unit :: Utility/./UtilityTests/LogChannelTest.Enable (863 of 1935)
UNSUPPORTED: lldb-api :: functionalities/thread/break_after_join/TestBreakAfterJoin.py (864 of 1935)
PASS: lldb-unit :: Utility/./UtilityTests/NameMatchesTest.Equals (865 of 1935)
PASS: lldb-api :: python_api/type/TestTypeList.py (866 of 1935)
PASS: lldb-unit :: Utility/./UtilityTests/TildeExpressionResolver.ResolveFullPath (867 of 1935)
PASS: lldb-api :: lang/cpp/constructors/TestCppConstructors.py (868 of 1935)
PASS: lldb-api :: functionalities/data-formatter/format-propagation/TestFormatPropagation.py (869 of 1935)
PASS: lldb-api :: functionalities/breakpoint/breakpoint_language/TestBreakpointLanguage.py (870 of 1935)
PASS: lldb-api :: lang/cpp/wchar_t/TestCxxWCharT.py (871 of 1935)
UNSUPPORTED: lldb-api :: benchmarks/libcxxmap/TestBenchmarkLibcxxMap.py (872 of 1935)
PASS: lldb-unit :: Process/gdb-remote/./ProcessGdbRemoteTests/GDBRemoteCommunicationClientTest.GetModulesInfoInvalidResponse (873 of 1935)
PASS: lldb-unit :: Process/gdb-remote/./ProcessGdbRemoteTests/GDBRemoteClientBaseTest.SendContinueAndAsyncPacket (874 of 1935)
PASS: lldb-unit :: Symbol/./SymbolTests/TestTypeSystemClang.TestConvertAccessTypeToAccessSpecifier (875 of 1935)
PASS: lldb-shell :: BuildScript/toolchain-clang.test (876 of 1935)
PASS: lldb-unit :: Host/./HostTests/HostInfoTest.GetHostname (877 of 1935)
PASS: lldb-shell :: Reproducer/Functionalities/TestDataFormatter.test (878 of 1935)
PASS: lldb-api :: lang/cpp/enum_types/TestCPP11EnumTypes.py (879 of 1935)
PASS: lldb-unit :: Utility/./UtilityTests/StreamTest.PutRawBytesToMixedEndian (880 of 1935)
PASS: lldb-api :: tools/lldb-vscode/breakpoint/TestVSCode_setFunctionBreakpoints.py (881 of 1935)
UNSUPPORTED: lldb-shell :: SymbolFile/NativePDB/stack_unwinding01.cpp (882 of 1935)
PASS: lldb-unit :: Process/gdb-remote/./ProcessGdbRemoteTests/GDBRemoteCommunicationClientTest.WriteRegister (883 of 1935)
PASS: lldb-api :: lang/objc/objc-ivar-protocols/TestIvarProtocols.py (884 of 1935)
PASS: lldb-unit :: Utility/./UtilityTests/Flags.AllSet (885 of 1935)
PASS: lldb-unit :: Utility/./UtilityTests/StringExtractorTest.GetHexU8_Underflow2 (886 of 1935)
PASS: lldb-unit :: Utility/./UtilityTests/OptionsWithRawTest.ArgsButNoLeadingDash (887 of 1935)
PASS: lldb-shell :: Reproducer/TestDriverOptions.test (888 of 1935)
UNSUPPORTED: lldb-shell :: Process/Windows/exception_access_violation.cpp (889 of 1935)
PASS: lldb-unit :: Utility/./UtilityTests/UUIDTest.SetFromStringRef (890 of 1935)
PASS: lldb-api :: functionalities/pre_run_dylibs/TestPreRunDylibs.py (891 of 1935)
PASS: lldb-unit :: Utility/./UtilityTests/CompletionRequest.TryCompleteCurrentArgMode (892 of 1935)
PASS: lldb-api :: functionalities/data-formatter/varscript_formatting/TestDataFormatterVarScriptFormatting.py (893 of 1935)
PASS: lldb-api :: lang/cpp/class_types/TestClassTypes.py (894 of 1935)
UNSUPPORTED: lldb-api :: commands/register/register/intel_xtended_registers/mpx_bound_violation/TestBoundViolation.py (895 of 1935)
PASS: lldb-api :: lang/c/modules/TestCModules.py (896 of 1935)
PASS: lldb-unit :: Utility/./UtilityTests/ReproducerTest.SetReplay (897 of 1935)
PASS: lldb-api :: lang/cpp/incomplete-types/TestCppIncompleteTypes.py (898 of 1935)
UNSUPPORTED: lldb-api :: commands/watchpoints/variable_out_of_scope/TestWatchedVarHitWhenInScope.py (899 of 1935)
UNSUPPORTED: lldb-api :: functionalities/darwin_log/filter/regex/category/TestDarwinLogFilterRegexCategory.py (900 of 1935)
PASS: lldb-unit :: Utility/./UtilityTests/StructuredDataTest.StringDump (901 of 1935)
PASS: lldb-api :: macosx/thread_suspend/TestInternalThreadSuspension.py (902 of 1935)
PASS: lldb-api :: lang/objc/modules-auto-import/TestModulesAutoImport.py (903 of 1935)
PASS: lldb-unit :: Utility/./UtilityTests/ArgsTest.BareSingleQuote (904 of 1935)
PASS: lldb-api :: functionalities/data-formatter/poarray/TestPrintObjectArray.py (905 of 1935)
PASS: lldb-api :: commands/expression/call-throws/TestCallThatThrows.py (906 of 1935)
PASS: lldb-unit :: Utility/./UtilityTests/StreamTeeTest.GetStreamAtIndexOutOfBounds (907 of 1935)
PASS: lldb-unit :: Language/Highlighting/./HighlighterTests/HighlighterTest.ClangCursorPosBeforeOtherToken (908 of 1935)
UNSUPPORTED: lldb-shell :: Register/x86-gp-write.test (909 of 1935)
PASS: lldb-unit :: Utility/./UtilityTests/ArgsTest.DoubleQuotedItem (910 of 1935)
PASS: lldb-api :: commands/command/delete/TestCommandDelete.py (911 of 1935)
PASS: lldb-shell :: Register/x86-64-gp-read.test (912 of 1935)
PASS: lldb-shell :: Reproducer/TestFileRepro.test (913 of 1935)
UNSUPPORTED: lldb-api :: functionalities/param_entry_vals/basic_entry_values_x86_64/TestBasicEntryValuesX86_64.py (914 of 1935)
PASS: lldb-unit :: Utility/./UtilityTests/RangeTest.LessThan (915 of 1935)
PASS: lldb-unit :: Utility/./UtilityTests/ArchSpecTest.OperatorBool (916 of 1935)
PASS: lldb-api :: functionalities/data-formatter/data-formatter-stl/libcxx/list/TestDataFormatterLibcxxList.py (917 of 1935)
PASS: lldb-unit :: Editline/./EditlineTests/EditlineTestFixture.EditlineReceivesSingleLineText (918 of 1935)
PASS: lldb-unit :: Expression/./ExpressionTests/CppModuleConfigurationTest.AmbiguousLibCpp (919 of 1935)
PASS: lldb-shell :: SymbolFile/DWARF/debug_loc_and_loclists.s (920 of 1935)
PASS: lldb-shell :: SymbolFile/DWARF/dwarf5-partial-index.cpp (921 of 1935)
PASS: lldb-shell :: Breakpoint/debug_rnglist_rlestartend.test (922 of 1935)
PASS: lldb-api :: functionalities/thread/backtrace_all/TestBacktraceAll.py (923 of 1935)
PASS: lldb-unit :: Host/./HostTests/SocketTest.UDPGetConnectURI (924 of 1935)
PASS: lldb-unit :: Utility/./UtilityTests/StreamTest.PutBytesAsRawHex8ToBigEndian (925 of 1935)
UNSUPPORTED: lldb-shell :: Register/x86-64-zmm-write.test (926 of 1935)
PASS: lldb-api :: commands/log/invalid-args/TestInvalidArgsLog.py (927 of 1935)
PASS: lldb-api :: commands/reproducer/invalid-args/TestInvalidArgsReproducer.py (928 of 1935)
PASS: lldb-unit :: Process/gdb-remote/./ProcessGdbRemoteTests/GDBRemoteClientBaseTest.SendContinueAndWait (929 of 1935)
PASS: lldb-unit :: Language/Highlighting/./HighlighterTests/HighlighterTest.ClangStringLiterals (930 of 1935)
PASS: lldb-api :: functionalities/tail_call_frames/thread_step_out_or_return/TestSteppingOutWithArtificialFrames.py (931 of 1935)
PASS: lldb-api :: commands/frame/language/TestGuessLanguage.py (932 of 1935)
PASS: lldb-api :: commands/expression/import-std-module/weak_ptr-dbg-info-content/TestDbgInfoContentWeakPtrFromStdModule.py (933 of 1935)
PASS: lldb-api :: macosx/find-dsym/bundle-with-dot-in-filename/TestBundleWithDotInFilename.py (934 of 1935)
PASS: lldb-api :: commands/help/TestHelp.py (935 of 1935)
UNSUPPORTED: lldb-api :: benchmarks/turnaround/TestCompileRunToBreakpointTurnaround.py (936 of 1935)
PASS: lldb-unit :: Host/./HostTests/TaskPoolTest.RunTasks (937 of 1935)
PASS: lldb-shell :: ObjectFile/ELF/section-types-edgecases.yaml (938 of 1935)
PASS: lldb-unit :: Utility/./UtilityTests/RangeTest.Union (939 of 1935)
PASS: lldb-unit :: Utility/./UtilityTests/OptionsWithRawTest.LeadingSpaceArgs (940 of 1935)
PASS: lldb-unit :: Utility/./UtilityTests/BinaryStreamTest.PutULEB128MaxValue (941 of 1935)
PASS: lldb-shell :: Driver/TestSingleQuote.test (942 of 1935)
PASS: lldb-unit :: Host/./HostTests/MainLoopTest.Signal (943 of 1935)
PASS: lldb-api :: python_api/findvalue_duplist/TestSBFrameFindValue.py (944 of 1935)
PASS: lldb-shell :: Breakpoint/single-file-split-dwarf.test (945 of 1935)
PASS: lldb-shell :: SymbolFile/DWARF/dir-separator-no-comp-dir-relative-name.s (946 of 1935)
PASS: lldb-unit :: Utility/./UtilityTests/DataExtractorTest.GetCStrUnterminated (947 of 1935)
PASS: lldb-unit :: Utility/./UtilityTests/IndexToObjectTest.ObjectForIndex (948 of 1935)
PASS: lldb-unit :: Utility/./UtilityTests/StatusTest.ErrorConversion (949 of 1935)
PASS: lldb-unit :: Symbol/./SymbolTests/LineEntryTest.GetSameLineContiguousAddressRangeNestedInline (950 of 1935)
PASS: lldb-shell :: ObjectFile/wasm/embedded-debug-sections.yaml (951 of 1935)
PASS: lldb-api :: functionalities/data-formatter/setvaluefromcstring/TestSetValueFromCString.py (952 of 1935)
PASS: lldb-api :: lang/objc/variadic_methods/TestVariadicMethods.py (953 of 1935)
PASS: lldb-api :: functionalities/breakpoint/serialize/TestBreakpointSerialization.py (954 of 1935)
PASS: lldb-api :: functionalities/breakpoint/source_regexp/TestSourceRegexBreakpoints.py (955 of 1935)
PASS: lldb-api :: lang/objc/objc-struct-argument/TestObjCStructArgument.py (956 of 1935)
UNSUPPORTED: lldb-api :: functionalities/thread/concurrent_events/TestConcurrentManySignals.py (957 of 1935)
PASS: lldb-unit :: Utility/./UtilityTests/SerializationRountripTest.SerializeDeserializeObjectReference (958 of 1935)
PASS: lldb-api :: commands/frame/var-scope/TestFrameVariableScope.py (959 of 1935)
PASS: lldb-unit :: Core/./LLDBCoreTests/StreamCallbackTest.Callback (960 of 1935)
UNSUPPORTED: lldb-api :: functionalities/data-formatter/data-formatter-stl/libstdcpp/vector/TestDataFormatterStdVector.py (961 of 1935)
PASS: lldb-api :: functionalities/multidebugger_commands/TestMultipleDebuggersCommands.py (962 of 1935)
PASS: lldb-unit :: Utility/./UtilityTests/StreamTeeTest.AppendStream (963 of 1935)
PASS: lldb-api :: functionalities/data-formatter/data-formatter-categories/TestDataFormatterCategories.py (964 of 1935)
PASS: lldb-unit :: Utility/./UtilityTests/GeneratorTest.GetOrCreate (965 of 1935)
PASS: lldb-unit :: Utility/./UtilityTests/StringExtractorTest.GetHexBytes_Partial (966 of 1935)
PASS: lldb-api :: functionalities/gdb_remote_client/TestGDBRemoteClient.py (967 of 1935)
PASS: lldb-unit :: Utility/./UtilityTests/StringListTest.AppendStringStdString (968 of 1935)
PASS: lldb-shell :: SymbolFile/DWARF/array-sizes.s (969 of 1935)
PASS: lldb-unit :: Utility/./UtilityTests/StreamTest.SetIndentLevel (970 of 1935)
PASS: lldb-api :: types/TestCharTypeExpr.py (971 of 1935)
PASS: lldb-unit :: Utility/./UtilityTests/RangeTest.DoesAdjoinOrIntersect (972 of 1935)
UNSUPPORTED: lldb-api :: benchmarks/continue/TestBenchmarkContinue.py (973 of 1935)
PASS: lldb-unit :: Utility/./UtilityTests/BinaryStreamTest.PutULEB128ThreeBytes (974 of 1935)
PASS: lldb-shell :: ObjectFile/MachO/lc_build_version_notools.yaml (975 of 1935)
PASS: lldb-unit :: Utility/./UtilityTests/AnsiTerminal.Twice (976 of 1935)
PASS: lldb-shell :: SymbolFile/DWARF/find-variable-dwo.cpp (977 of 1935)
PASS: lldb-unit :: Utility/./UtilityTests/StreamTest.PutRawBytesToLittleEndian (978 of 1935)
PASS: lldb-api :: lang/cpp/virtual-functions/TestCppVirtualFunctions.py (979 of 1935)
PASS: lldb-api :: commands/expression/import-std-module/conflicts/TestStdModuleWithConflicts.py (980 of 1935)
PASS: lldb-api :: lang/objc/modules-incomplete/TestIncompleteModules.py (981 of 1935)
PASS: lldb-unit :: Utility/./UtilityTests/StringListTest.InsertStringAtIndexEnd (982 of 1935)
PASS: lldb-unit :: Utility/./UtilityTests/ScalarTest.Division (983 of 1935)
PASS: lldb-unit :: Language/Highlighting/./HighlighterTests/HighlighterTest.ClangCursorPosInOtherToken (984 of 1935)
PASS: lldb-unit :: UnwindAssembly/x86/./UnwindAssemblyx86Tests/Testx86AssemblyInspectionEngine.TestStackRealign32BitDisp_x86_64 (985 of 1935)
PASS: lldb-unit :: UnwindAssembly/x86/./UnwindAssemblyx86Tests/Testx86AssemblyInspectionEngine.TestSpArithx86_64Augmented (986 of 1935)
PASS: lldb-unit :: Utility/./UtilityTests/StreamTest.PutBytesAsRawHex8ToLittleEndian (987 of 1935)
PASS: lldb-api :: lang/cpp/this/TestCPPThis.py (988 of 1935)
PASS: lldb-shell :: SymbolFile/DWARF/debug_ranges-missing-section.s (989 of 1935)
PASS: lldb-unit :: ScriptInterpreter/Python/./ScriptInterpreterPythonTests/PythonDataObjectsTest.TestPythonStringToStructuredString (990 of 1935)
UNSUPPORTED: lldb-api :: tools/lldb-server/TestGdbRemote_vContThreads.py (991 of 1935)
PASS: lldb-unit :: Utility/./UtilityTests/StreamTest.PutULEB128 (992 of 1935)
PASS: lldb-api :: lang/objc/ptr_refs/TestPtrRefsObjC.py (993 of 1935)
PASS: lldb-unit :: Symbol/./SymbolTests/TestTypeSystemClang.TestUnifyAccessSpecifiers (994 of 1935)
PASS: lldb-api :: functionalities/signal/TestSendSignal.py (995 of 1935)
PASS: lldb-api :: types/TestRecursiveTypes.py (996 of 1935)
PASS: lldb-unit :: Language/Highlighting/./HighlighterTests/HighlighterTest.ClangCommas (997 of 1935)
PASS: lldb-unit :: Expression/./ExpressionTests/DWARFExpression.DW_OP_piece (998 of 1935)
PASS: lldb-unit :: Signals/./SignalsTests/UnixSignalsTest.VersionChange (999 of 1935)
PASS: lldb-unit :: ScriptInterpreter/Python/./ScriptInterpreterPythonTests/PythonDataObjectsTest.TestPythonBytes (1000 of 1935)
PASS: lldb-unit :: ScriptInterpreter/Python/./ScriptInterpreterPythonTests/PythonDataObjectsTest.TestPythonIntegerToStructuredInteger (1001 of 1935)
PASS: lldb-unit :: Core/./LLDBCoreTests/RichManglingContextTest.SwitchProvider (1002 of 1935)
PASS: lldb-unit :: Utility/./UtilityTests/AnsiTerminal.KnownPrefix (1003 of 1935)
PASS: lldb-unit :: Utility/./UtilityTests/StreamTest.AddressRangeInvalidRange (1004 of 1935)
PASS: lldb-api :: python_api/process/read-mem-cstring/TestReadMemCString.py (1005 of 1935)
PASS: lldb-api :: source-manager/TestSourceManager.py (1006 of 1935)
PASS: lldb-shell :: SymbolFile/DWARF/debug-types-line-tables.s (1007 of 1935)
PASS: lldb-unit :: debugserver/./debugserverTests/RNBSocket.AnyListen (1008 of 1935)
PASS: lldb-api :: macosx/function-starts/TestFunctionStarts.py (1009 of 1935)
PASS: lldb-api :: lang/c/array_types/TestArrayTypes.py (1010 of 1935)
PASS: lldb-api :: functionalities/data-formatter/data-formatter-objc/TestDataFormatterObjCNSURL.py (1011 of 1935)
PASS: lldb-unit :: Expression/./ExpressionTests/DiagnosticManagerTest.GetStringSeverityLabels (1012 of 1935)
UNSUPPORTED: lldb-api :: lang/objc/rdar-12408181/TestRdar12408181.py (1013 of 1935)
PASS: lldb-api :: python_api/frame/inlines/TestInlinedFrame.py (1014 of 1935)
PASS: lldb-shell :: Breakpoint/split-dwarf-5-addrbase.test (1015 of 1935)
PASS: lldb-api :: python_api/lldbutil/TestSwigVersion.py (1016 of 1935)
PASS: lldb-api :: functionalities/data-formatter/data-formatter-stl/libcxx/list/loop/TestDataFormatterLibcxxListLoop.py (1017 of 1935)
PASS: lldb-api :: functionalities/data-formatter/var-in-aggregate-misuse/TestVarInAggregateMisuse.py (1018 of 1935)
PASS: lldb-shell :: Commands/command-backtrace.test (1019 of 1935)
UNSUPPORTED: lldb-api :: commands/target/auto-install-main-executable/TestAutoInstallMainExecutable.py (1020 of 1935)
UNSUPPORTED: lldb-api :: commands/gui/basic/TestGuiBasic.py (1021 of 1935)
PASS: lldb-unit :: Host/./HostTests/HostInfoTest.GetAugmentedArchSpec (1022 of 1935)
PASS: lldb-api :: python_api/sbvalue_const_addrof/TestSBValueConstAddrOf.py (1023 of 1935)
PASS: lldb-api :: commands/expression/persistent_types/TestNestedPersistentTypes.py (1024 of 1935)
PASS: lldb-shell :: SymbolFile/Breakpad/unwind-via-raSearch.test (1025 of 1935)
PASS: lldb-unit :: Utility/./UtilityTests/UriParserTest.TypicalPortPath (1026 of 1935)
PASS: lldb-unit :: Utility/./UtilityTests/ArgsTest.ReplaceArgumentAtIndexShort (1027 of 1935)
UNSUPPORTED: lldb-shell :: SymbolFile/PDB/compilands.test (1028 of 1935)
PASS: lldb-api :: arm/emulation/TestEmulations.py (1029 of 1935)
PASS: lldb-unit :: Utility/./UtilityTests/SubsystemRAIITest.NormalSubsystem (1030 of 1935)
UNSUPPORTED: lldb-shell :: Minidump/Windows/arm-fp-unwind.test (1031 of 1935)
PASS: lldb-unit :: Utility/./UtilityTests/FileSpecTest.GuessPathStyle (1032 of 1935)
UNSUPPORTED: lldb-api :: tools/lldb-server/TestGdbRemoteAuxvSupport.py (1033 of 1935)
PASS: lldb-shell :: SymbolFile/NativePDB/globals-bss.cpp (1034 of 1935)
PASS: lldb-api :: functionalities/data-formatter/data-formatter-stl/libcxx/multimap/TestDataFormatterLibccMultiMap.py (1035 of 1935)
PASS: lldb-unit :: SymbolFile/DWARF/./SymbolFileDWARFTests/SymbolFileDWARFTests.TestAbbrevValidAttrNullForm (1036 of 1935)
PASS: lldb-api :: functionalities/completion/TestCompletion.py (1037 of 1935)
PASS: lldb-api :: functionalities/data-formatter/data-formatter-objc/nsindexpath/TestDataFormatterNSIndexPath.py (1038 of 1935)
PASS: lldb-unit :: Utility/./UtilityTests/StringListTest.SplitIntoLinesEmpty (1039 of 1935)
PASS: lldb-api :: commands/command/script/import/TestImport.py (1040 of 1935)
PASS: lldb-api :: functionalities/memory/find/TestMemoryFind.py (1041 of 1935)
PASS: lldb-unit :: Utility/./UtilityTests/RangeTest.DoesIntersect (1042 of 1935)
PASS: lldb-unit :: Utility/./UtilityTests/RegisterValueTest.GetSet8 (1043 of 1935)
PASS: lldb-api :: functionalities/thread/concurrent_events/TestConcurrentWatchpointDelayWatchpointOneBreakpoint.py (1044 of 1935)
PASS: lldb-api :: lang/cpp/namespace_conflicts/TestNamespaceConflicts.py (1045 of 1935)
PASS: lldb-api :: lang/c/local_variables/TestLocalVariables.py (1046 of 1935)
PASS: lldb-api :: python_api/watchpoint/watchlocation/TestTargetWatchAddress.py (1047 of 1935)
PASS: lldb-api :: lang/objc/modules-inline-functions/TestModulesInlineFunctions.py (1048 of 1935)
PASS: lldb-unit :: Utility/./UtilityTests/StreamTeeTest.Assignment (1049 of 1935)
PASS: lldb-api :: functionalities/thread/crash_during_step/TestCrashDuringStep.py (1050 of 1935)
PASS: lldb-unit :: Utility/./UtilityTests/RangeTest.ContainsEndInclusiveInvalid (1051 of 1935)
PASS: lldb-unit :: Utility/./UtilityTests/ArgsTest.TestQuotedUnknownEscape (1052 of 1935)
PASS: lldb-unit :: Platform/./LLDBPlatformTests/PlatformDarwinTest.TestParseVersionBuildDir (1053 of 1935)
UNSUPPORTED: lldb-api :: tools/lldb-server/TestGdbRemoteModuleInfo.py (1054 of 1935)
PASS: lldb-api :: lang/cpp/auto/TestCPPAuto.py (1055 of 1935)
PASS: lldb-api :: lang/cpp/call-function/TestCallCPPFunction.py (1056 of 1935)
PASS: lldb-api :: lang/objc/objc-dyn-sbtype/TestObjCDynamicSBType.py (1057 of 1935)
PASS: lldb-shell :: ObjectFile/ELF/netbsd-core-amd64.test (1058 of 1935)
PASS: lldb-api :: functionalities/thread/concurrent_events/TestConcurrentTwoBreakpointsOneSignal.py (1059 of 1935)
PASS: lldb-api :: functionalities/data-formatter/synthcapping/TestSyntheticCapping.py (1060 of 1935)
PASS: lldb-unit :: Utility/./UtilityTests/SerializationRountripTest.SerializeDeserializeCStringArrayNullptrElem (1061 of 1935)
PASS: lldb-shell :: Minidump/Windows/broken-unwind.test (1062 of 1935)
PASS: lldb-shell :: ObjectFile/ELF/section-permissions.yaml (1063 of 1935)
PASS: lldb-api :: functionalities/set-data/TestSetData.py (1064 of 1935)
PASS: lldb-shell :: SymbolFile/DWARF/dwp.s (1065 of 1935)
PASS: lldb-api :: lang/cpp/modules-import/TestCXXModulesImport.py (1066 of 1935)
PASS: lldb-api :: functionalities/data-formatter/data-formatter-objc/TestDataFormatterObjCNSBundle.py (1067 of 1935)
PASS: lldb-unit :: Host/./HostTests/File.GetWaitableHandleFileno (1068 of 1935)
PASS: lldb-api :: functionalities/thread/concurrent_events/TestConcurrentManyBreakpoints.py (1069 of 1935)
PASS: lldb-api :: lang/cpp/unicode-literals/TestUnicodeLiterals.py (1070 of 1935)
PASS: lldb-unit :: Breakpoint/./LLDBBreakpointTests/BreakpointIDTest.StringIsBreakpointName (1071 of 1935)
PASS: lldb-api :: commands/expression/import-std-module/vector-of-vectors/TestVectorOfVectorsFromStdModule.py (1072 of 1935)
PASS: lldb-api :: lang/objc/ivar-IMP/TestObjCiVarIMP.py (1073 of 1935)
PASS: lldb-api :: lang/cpp/namespace_definitions/TestNamespaceDefinitions.py (1074 of 1935)
PASS: lldb-api :: lang/objc/objc-ivar-stripped/TestObjCIvarStripped.py (1075 of 1935)
PASS: lldb-unit :: Language/Highlighting/./HighlighterTests/HighlighterTest.Keywords (1076 of 1935)
PASS: lldb-api :: commands/watchpoints/watchpoint_commands/condition/TestWatchpointConditionCmd.py (1077 of 1935)
PASS: lldb-api :: functionalities/postmortem/minidump-new/TestMiniDumpNew.py (1078 of 1935)
PASS: lldb-api :: functionalities/avoids-fd-leak/TestFdLeak.py (1079 of 1935)
PASS: lldb-unit :: Host/./HostTests/FileSystemTest.GetPermissions (1080 of 1935)
PASS: lldb-api :: functionalities/dynamic_value_child_count/TestDynamicValueChildCount.py (1081 of 1935)
PASS: lldb-unit :: Utility/./UtilityTests/StringListTest.ForRangeEmpty (1082 of 1935)
PASS: lldb-shell :: Driver/TestConvenienceVariables.test (1083 of 1935)
PASS: lldb-shell :: ObjectFile/ELF/minidebuginfo-find-symbols.yaml (1084 of 1935)
PASS: lldb-unit :: ScriptInterpreter/Python/./ScriptInterpreterPythonTests/PythonDataObjectsTest.TestOwnedReferences (1085 of 1935)
PASS: lldb-unit :: Language/Highlighting/./HighlighterTests/HighlighterTest.ClangUnterminatedString (1086 of 1935)
PASS: lldb-unit :: Utility/./UtilityTests/StringListTest.AppendListCStringArrayEmpty (1087 of 1935)
PASS: lldb-shell :: SymbolFile/DWARF/debug_loc-aslr.s (1088 of 1935)
PASS: lldb-api :: python_api/sbdata/TestSBData.py (1089 of 1935)
PASS: lldb-shell :: Minidump/Windows/find-module.test (1090 of 1935)
PASS: lldb-unit :: Target/./TargetTests/ExecutionContextTest.GetByteOrderTarget (1091 of 1935)
PASS: lldb-api :: lang/objc/foundation/TestConstStrings.py (1092 of 1935)
PASS: lldb-unit :: ScriptInterpreter/Python/./ScriptInterpreterPythonTests/PythonDataObjectsTest.TestDictionaryResolutionWithDot (1093 of 1935)
PASS: lldb-shell :: Expr/TestMultilineExpr.test (1094 of 1935)
PASS: lldb-api :: commands/expression/import_builtin_fileid/TestImportBuiltinFileID.py (1095 of 1935)
PASS: lldb-api :: types/TestIntegerType.py (1096 of 1935)
PASS: lldb-unit :: Host/./HostTests/SocketTest.TCPListen0ConnectAccept (1097 of 1935)
PASS: lldb-api :: commands/source/info/TestSourceInfo.py (1098 of 1935)
PASS: lldb-api :: macosx/add-dsym/TestAddDsymMidExecutionCommand.py (1099 of 1935)
PASS: lldb-unit :: Utility/./UtilityTests/ConstStringTest.format_provider (1100 of 1935)
PASS: lldb-api :: commands/expression/anonymous-struct/TestCallUserAnonTypedef.py (1101 of 1935)
PASS: lldb-shell :: SymbolFile/DWARF/DW_AT_loclists_base.s (1102 of 1935)
PASS: lldb-api :: functionalities/gdb_remote_client/TestStopPCs.py (1103 of 1935)
PASS: lldb-unit :: Utility/./UtilityTests/StringListTest.PopBack (1104 of 1935)
PASS: lldb-unit :: Utility/./UtilityTests/StringExtractorTest.GetHexU8_InvalidHex_NoEof (1105 of 1935)
PASS: lldb-api :: commands/target/basic/TestTargetCommand.py (1106 of 1935)
PASS: lldb-unit :: Utility/./UtilityTests/ProcessInfoTest.Constructor (1107 of 1935)
PASS: lldb-unit :: Utility/./UtilityTests/OptionsWithRawTest.QuotedSuffix (1108 of 1935)
PASS: lldb-unit :: Expression/./ExpressionTests/DiagnosticManagerTest.AppendMessageSubsequentDiags (1109 of 1935)
PASS: lldb-unit :: Utility/./UtilityTests/Flags.AnySet (1110 of 1935)
PASS: lldb-api :: functionalities/data-formatter/data-formatter-skip-summary/TestDataFormatterSkipSummary.py (1111 of 1935)
PASS: lldb-unit :: Utility/./UtilityTests/ProcessInstanceInfo.DumpTable_invalidUID (1112 of 1935)
PASS: lldb-api :: commands/frame/var/TestFrameVar.py (1113 of 1935)
PASS: lldb-api :: lang/objc/objc-static-method/TestObjCStaticMethod.py (1114 of 1935)
PASS: lldb-api :: functionalities/breakpoint/move_nearest/TestMoveNearest.py (1115 of 1935)
PASS: lldb-unit :: Language/Highlighting/./HighlighterTests/HighlighterTest.ClangCursorPosEndOfLine (1116 of 1935)
PASS: lldb-unit :: Utility/./UtilityTests/StringExtractorTest.GetHexBytesAvail_Partial (1117 of 1935)
PASS: lldb-unit :: Utility/./UtilityTests/StringExtractorTest.GetHexBytes (1118 of 1935)
PASS: lldb-shell :: Minidump/memory-region-from-module.yaml (1119 of 1935)
PASS: lldb-unit :: Utility/./UtilityTests/StringListTest.SplitIntoLines (1120 of 1935)
PASS: lldb-unit :: Interpreter/./InterpreterTests/OptionArgParserTest.toBoolean (1121 of 1935)
PASS: lldb-unit :: Utility/./UtilityTests/StringExtractorTest.DecodeHexU8_InvalidHex2 (1122 of 1935)
PASS: lldb-api :: python_api/class_members/TestSBTypeClassMembers.py (1123 of 1935)
PASS: lldb-shell :: Driver/TestFile.test (1124 of 1935)
PASS: lldb-shell :: SymbolFile/DWARF/dir-separator-windows.s (1125 of 1935)
PASS: lldb-unit :: Utility/./UtilityTests/RecordReplayTest.InstrumentedBarPtr (1126 of 1935)
PASS: lldb-api :: lang/objcxx/hide-runtime-values/TestObjCXXHideRuntimeValues.py (1127 of 1935)
PASS: lldb-unit :: Utility/./UtilityTests/UriParserTest.SchemeHostSeparator2 (1128 of 1935)
PASS: lldb-unit :: Utility/./UtilityTests/Flags.IsClear (1129 of 1935)
PASS: lldb-shell :: SymbolFile/DWARF/DW_AT_low_pc-addrx.s (1130 of 1935)
PASS: lldb-api :: functionalities/thread/concurrent_events/TestConcurrentSignalWatchBreak.py (1131 of 1935)
PASS: lldb-unit :: Utility/./UtilityTests/StringListTest.LongestCommonPrefixNoPrefix (1132 of 1935)
PASS: lldb-api :: functionalities/tail_call_frames/thread_step_out_message/TestArtificialFrameStepOutMessage.py (1133 of 1935)
PASS: lldb-unit :: Utility/./UtilityTests/RegularExpression.Empty (1134 of 1935)
UNSUPPORTED: lldb-shell :: Register/aarch64-fp-read.test (1135 of 1935)
PASS: lldb-api :: commands/expression/import-std-module/vector-bool/TestVectorBoolFromStdModule.py (1136 of 1935)
UNSUPPORTED: lldb-api :: functionalities/darwin_log/basic/TestDarwinLogBasic.py (1137 of 1935)
PASS: lldb-unit :: Utility/./UtilityTests/RecordReplayTest.InstrumentedFooSameThis (1138 of 1935)
PASS: lldb-api :: lang/objc/objc_direct-methods/TestObjCDirectMethods.py (1139 of 1935)
UNSUPPORTED: lldb-shell :: SymbolFile/PDB/pointers.test (1140 of 1935)
PASS: lldb-api :: lang/cpp/const_this/TestConstThis.py (1141 of 1935)
PASS: lldb-shell :: Commands/CommandScriptImmediateOutput/CommandScriptImmediateOutputConsole.test (1142 of 1935)
PASS: lldb-unit :: Utility/./UtilityTests/ArgsTest.GetArgumentArrayRef (1143 of 1935)
PASS: lldb-unit :: Process/gdb-remote/./ProcessGdbRemoteTests/GDBRemoteCommunicationServerTest.SendErrorResponse_StringError (1144 of 1935)
PASS: lldb-api :: functionalities/inferior-crashing/TestInferiorCrashingStep.py (1145 of 1935)
PASS: lldb-unit :: Host/./HostTests/ProcessLaunchInfoTest.Constructor (1146 of 1935)
PASS: lldb-api :: api/listeners/TestListener.py (1147 of 1935)
XFAIL: lldb-shell :: Register/x86-64-write.test (1148 of 1935)
PASS: lldb-unit :: Expression/./ExpressionTests/DiagnosticManagerTest.GetStringPreserveOrder (1149 of 1935)
PASS: lldb-unit :: Utility/./UtilityTests/StringListTest.CopyListEmpty (1150 of 1935)
PASS: lldb-unit :: Utility/./UtilityTests/FileSpecTest.EqualDotsWindows (1151 of 1935)
PASS: lldb-api :: functionalities/thread/thread_exit/TestThreadExit.py (1152 of 1935)
PASS: lldb-unit :: Host/./HostTests/FileSystemTest.OpenErrno (1153 of 1935)
PASS: lldb-api :: functionalities/unwind/noreturn/module-end/TestNoReturnModuleEnd.py (1154 of 1935)
PASS: lldb-unit :: Expression/./ExpressionTests/CppModuleConfigurationTest.LibCppV2 (1155 of 1935)
PASS: lldb-unit :: Utility/./UtilityTests/StringListTest.GetMaxStringLengthEmpty (1156 of 1935)
PASS: lldb-api :: functionalities/data-formatter/ostypeformatting/TestFormattersOsType.py (1157 of 1935)
PASS: lldb-unit :: Utility/./UtilityTests/StreamTest.AddressRangeSize (1158 of 1935)
PASS: lldb-api :: commands/expression/import-std-module/unique_ptr/TestUniquePtrFromStdModule.py (1159 of 1935)
PASS: lldb-unit :: Utility/./UtilityTests/TimeoutTest.Construction (1160 of 1935)
PASS: lldb-api :: python_api/section/TestSectionAPI.py (1161 of 1935)
PASS: lldb-api :: lang/c/global_variables/TestGlobalVariables.py (1162 of 1935)
PASS: lldb-unit :: Symbol/./SymbolTests/Type.CompilerContextPattern (1163 of 1935)
PASS: lldb-api :: commands/expression/import-std-module/empty-module/TestEmptyStdModule.py (1164 of 1935)
PASS: lldb-unit :: Utility/./UtilityTests/StringLexerTest.GetUnlexed (1165 of 1935)
PASS: lldb-unit :: ObjectFile/PECOFF/./ObjectFilePECOFFTests/PECallFrameInfoTest.Frame_reg_eh (1166 of 1935)
PASS: lldb-unit :: Utility/./UtilityTests/StreamTeeTest.CopyConstructor (1167 of 1935)
PASS: lldb-api :: functionalities/inferior-crashing/recursive-inferior/TestRecursiveInferiorStep.py (1168 of 1935)
UNSUPPORTED: lldb-shell :: Register/x86-64-zmm-read.test (1169 of 1935)
PASS: lldb-api :: lang/cpp/member-and-local-vars-with-same-name/TestMembersAndLocalsWithSameName.py (1170 of 1935)
PASS: lldb-api :: commands/watchpoints/watchpoint_commands/command/TestWatchpointCommandLLDB.py (1171 of 1935)
PASS: lldb-api :: functionalities/history/TestHistoryRecall.py (1172 of 1935)
UNSUPPORTED: lldb-api :: functionalities/darwin_log/format/TestDarwinLogMessageFormat.py (1173 of 1935)
PASS: lldb-unit :: Process/minidump/./LLDBMinidumpTests/RegisterContextMinidump.CheckRegisterContextMinidump_ARM (1174 of 1935)
PASS: lldb-api :: functionalities/data-formatter/data-formatter-enum-format/TestDataFormatterEnumFormat.py (1175 of 1935)
PASS: lldb-api :: functionalities/thread/concurrent_events/TestConcurrentSignalBreak.py (1176 of 1935)
PASS: lldb-api :: python_api/lldbutil/iter/TestRegistersIterator.py (1177 of 1935)
PASS: lldb-unit :: Utility/./UtilityTests/UUIDTest.RelationalOperators (1178 of 1935)
PASS: lldb-unit :: Host/./HostTests/FileSystemTest.EnumerateDirectory (1179 of 1935)
PASS: lldb-api :: commands/expression/static-initializers/TestStaticInitializers.py (1180 of 1935)
PASS: lldb-unit :: Utility/./UtilityTests/UriParserTest.MinimalPath (1181 of 1935)
PASS: lldb-unit :: Utility/./UtilityTests/RangeTest.Constructor (1182 of 1935)
PASS: lldb-shell :: Breakpoint/debug_rnglistx_rlex.test (1183 of 1935)
PASS: lldb-unit :: Process/gdb-remote/./ProcessGdbRemoteTests/GDBRemoteCommunicationClientTest.SendGetMetaDataPacket (1184 of 1935)
PASS: lldb-unit :: Utility/./UtilityTests/StreamTest.QuotedCString (1185 of 1935)
PASS: lldb-api :: functionalities/data-formatter/refpointer-recursion/TestDataFormatterRefPtrRecursion.py (1186 of 1935)
PASS: lldb-unit :: Utility/./UtilityTests/AnsiTerminal.Empty (1187 of 1935)
PASS: lldb-api :: commands/disassemble/basic/TestFrameDisassemble.py (1188 of 1935)
PASS: lldb-unit :: Utility/./UtilityTests/StringListTest.LongestCommonPrefixSingleElement (1189 of 1935)
PASS: lldb-unit :: Utility/./UtilityTests/FileSpecTest.RemoveLastPathComponent (1190 of 1935)
PASS: lldb-api :: tools/lldb-vscode/stackTrace/TestVSCode_stackTrace.py (1191 of 1935)
PASS: lldb-api :: functionalities/data-formatter/data-formatter-stl/libcxx/queue/TestDataFormatterLibcxxQueue.py (1192 of 1935)
PASS: lldb-shell :: ScriptInterpreter/Python/scripted_breakpoint.test (1193 of 1935)
PASS: lldb-unit :: ScriptInterpreter/Python/./ScriptInterpreterPythonTests/PythonDataObjectsTest.TestPythonBoolean (1194 of 1935)
PASS: lldb-unit :: Utility/./UtilityTests/StringListTest.GetMaxStringLengthMixed (1195 of 1935)
PASS: lldb-api :: commands/platform/basic/TestPlatformPython.py (1196 of 1935)
PASS: lldb-unit :: Utility/./UtilityTests/CompletionRequest.TestCompletionOwnership (1197 of 1935)
PASS: lldb-unit :: Expression/./ExpressionTests/ClangHostTest.ComputeClangResourceDirectory (1198 of 1935)
PASS: lldb-api :: lang/c/local_types/TestUseClosestType.py (1199 of 1935)
PASS: lldb-unit :: Utility/./UtilityTests/StringListTest.ShiftMove (1200 of 1935)
PASS: lldb-unit :: Host/./HostTests/SocketTest.UDPConnect (1201 of 1935)
PASS: lldb-api :: commands/gui/invalid-args/TestInvalidArgsGui.py (1202 of 1935)
PASS: lldb-unit :: Utility/./UtilityTests/StreamTest.ShiftOperatorChars (1203 of 1935)
PASS: lldb-shell :: Driver/TestProcessAttach.test (1204 of 1935)
PASS: lldb-unit :: Utility/./UtilityTests/GeneratorTest.Get (1205 of 1935)
PASS: lldb-api :: lang/cpp/virtual-overload/TestVirtualOverload.py (1206 of 1935)
PASS: lldb-api :: lang/c/stepping/TestThreadStepping.py (1207 of 1935)
PASS: lldb-api :: lang/objc/modules-app-update/TestClangModulesAppUpdate.py (1208 of 1935)
PASS: lldb-unit :: Symbol/./SymbolTests/TestTypeSystemClang.TestFunctionTemplateConstruction (1209 of 1935)
PASS: lldb-shell :: SymbolFile/DWARF/debug-types-dwarf5.s (1210 of 1935)
PASS: lldb-unit :: Utility/./UtilityTests/ProcessInstanceInfo.DumpTable (1211 of 1935)
PASS: lldb-shell :: ObjectFile/PECOFF/sections-names.yaml (1212 of 1935)
PASS: lldb-api :: commands/expression/import-std-module/vector/TestVectorFromStdModule.py (1213 of 1935)
PASS: lldb-unit :: Utility/./UtilityTests/StreamTest.PutBytesAsRawHex8ToMixedEndian (1214 of 1935)
PASS: lldb-unit :: UnwindAssembly/x86/./UnwindAssemblyx86Tests/Testx86AssemblyInspectionEngine.TestDisassemblyJunkBytes (1215 of 1935)
PASS: lldb-api :: lang/cpp/namespace/TestNamespace.py (1216 of 1935)
PASS: lldb-api :: functionalities/signal/raise/TestRaise.py (1217 of 1935)
PASS: lldb-unit :: Utility/./UtilityTests/ScalarTest.Comparison (1218 of 1935)
PASS: lldb-shell :: ObjectFile/PECOFF/invalid-export-table.yaml (1219 of 1935)
PASS: lldb-unit :: Utility/./UtilityTests/StateTest.Formatv (1220 of 1935)
PASS: lldb-unit :: Symbol/./SymbolTests/TestClangASTImporter.MetadataPropagationAfterCopying (1221 of 1935)
PASS: lldb-unit :: Utility/./UtilityTests/AnsiTerminal.Basic (1222 of 1935)
PASS: lldb-unit :: Core/./LLDBCoreTests/RichManglingContextTest.IPDRealloc (1223 of 1935)
PASS: lldb-api :: python_api/sblaunchinfo/TestSBLaunchInfo.py (1224 of 1935)
PASS: lldb-unit :: Utility/./UtilityTests/StreamTest.Indent (1225 of 1935)
PASS: lldb-api :: python_api/lldbutil/iter/TestLLDBIterator.py (1226 of 1935)
PASS: lldb-api :: python_api/objc_type/TestObjCType.py (1227 of 1935)
PASS: lldb-shell :: Driver/LocalLLDBInit.test (1228 of 1935)
PASS: lldb-api :: functionalities/var_path/TestVarPath.py (1229 of 1935)
PASS: lldb-unit :: Utility/./UtilityTests/StringLexerTest.NextIfList (1230 of 1935)
PASS: lldb-unit :: Utility/./UtilityTests/StringListTest.AppendList (1231 of 1935)
PASS: lldb-api :: commands/expression/inline-namespace/TestInlineNamespace.py (1232 of 1935)
PASS: lldb-unit :: Language/Highlighting/./HighlighterTests/HighlighterTest.ClangCursorOutOfBounds (1233 of 1935)
PASS: lldb-unit :: Process/minidump/./LLDBMinidumpTests/MinidumpParserTest.GetLinuxProcStatus_no_stream (1234 of 1935)
PASS: lldb-api :: types/TestDoubleTypesExpr.py (1235 of 1935)
PASS: lldb-unit :: UnwindAssembly/x86/./UnwindAssemblyx86Tests/Testx86AssemblyInspectionEngine.TestPopR13 (1236 of 1935)
PASS: lldb-api :: functionalities/inferior-assert/TestInferiorAssert.py (1237 of 1935)
PASS: lldb-unit :: Utility/./UtilityTests/StreamTeeTest.DefaultConstructor (1238 of 1935)
PASS: lldb-unit :: Expression/./ExpressionTests/ClangHostTest.MacOSX (1239 of 1935)
PASS: lldb-api :: functionalities/data-formatter/hexcaps/TestDataFormatterHexCaps.py (1240 of 1935)
PASS: lldb-unit :: Host/./HostTests/NativeProcessProtocolTest.SetBreakpointFailVerify (1241 of 1935)
PASS: lldb-unit :: SymbolFile/NativePDB/./SymbolFileNativePDBTests/PDBFPOProgramToDWARFExpressionTests.UnresolvedCyclicRegisterAssignmentReference (1242 of 1935)
PASS: lldb-api :: lang/c/register_variables/TestRegisterVariables.py (1243 of 1935)
PASS: lldb-unit :: UnwindAssembly/x86/./UnwindAssemblyx86Tests/Testx86AssemblyInspectionEngine.TestDisassemblyMidFunctionEpilogues (1244 of 1935)
PASS: lldb-unit :: Utility/./UtilityTests/VASprintfTest.NoBufferResize (1245 of 1935)
PASS: lldb-unit :: Utility/./UtilityTests/ArgsTest.TestSingleQuotedArgWithSpace (1246 of 1935)
PASS: lldb-api :: commands/settings/TestSettings.py (1247 of 1935)
PASS: lldb-api :: functionalities/breakpoint/cpp/TestCPPBreakpointLocations.py (1248 of 1935)
PASS: lldb-unit :: Process/gdb-remote/./ProcessGdbRemoteTests/GDBRemoteClientBaseTest.InterruptNoResponse (1249 of 1935)
PASS: lldb-shell :: BuildScript/compiler-full-path.test (1250 of 1935)
UNSUPPORTED: lldb-api :: functionalities/unwind/ehframe/TestEhFrameUnwind.py (1251 of 1935)
PASS: lldb-shell :: SymbolFile/DWARF/dwarf5-debug_line.s (1252 of 1935)
PASS: lldb-unit :: UnwindAssembly/x86/./UnwindAssemblyx86Tests/Testx86AssemblyInspectionEngine.TestPushEBP (1253 of 1935)
PASS: lldb-api :: python_api/formatters/TestFormattersSBAPI.py (1254 of 1935)
PASS: lldb-unit :: Host/./HostTests/SocketTest.TCPListen0GetPort (1255 of 1935)
PASS: lldb-api :: lang/cpp/scope/TestCppScope.py (1256 of 1935)
PASS: lldb-api :: functionalities/tail_call_frames/inlining_and_tail_calls/TestInliningAndTailCalls.py (1257 of 1935)
PASS: lldb-api :: functionalities/data-formatter/data-formatter-globals/TestDataFormatterGlobals.py (1258 of 1935)
PASS: lldb-unit :: SymbolFile/DWARF/./SymbolFileDWARFTests/DWARFASTParserClangTests.EnsureAllDIEsInDeclContextHaveBeenParsedParsesOnlyMatchingEntries (1259 of 1935)
PASS: lldb-shell :: Unwind/trap_frame_sym_ctx.test (1260 of 1935)
PASS: lldb-unit :: Utility/./UtilityTests/NameMatchesTest.Ignore (1261 of 1935)
UNSUPPORTED: lldb-api :: lang/objc/foundation/TestFoundationDisassembly.py (1262 of 1935)
PASS: lldb-unit :: Utility/./UtilityTests/StreamTest.PutHex32ByteOrderBig (1263 of 1935)
PASS: lldb-unit :: Utility/./UtilityTests/StringExtractorTest.GetHexBytes_FullString (1264 of 1935)
PASS: lldb-api :: commands/expression/top-level/TestTopLevelExprs.py (1265 of 1935)
PASS: lldb-api :: commands/expression/po_verbosity/TestPoVerbosity.py (1266 of 1935)
PASS: lldb-unit :: SymbolFile/NativePDB/./SymbolFileNativePDBTests/PDBFPOProgramToDWARFExpressionTests.MissingTargetRegister (1267 of 1935)
PASS: lldb-api :: lang/cpp/accelerator-table/TestCPPAccelerator.py (1268 of 1935)
PASS: lldb-api :: commands/expression/persist_objc_pointeetype/TestPersistObjCPointeeType.py (1269 of 1935)
PASS: lldb-api :: lang/cpp/dynamic-value/TestCppValueCast.py (1270 of 1935)
PASS: lldb-api :: lang/objc/radar-9691614/TestObjCMethodReturningBOOL.py (1271 of 1935)
PASS: lldb-unit :: Symbol/./SymbolTests/Type.GetTypeScopeAndBasename (1272 of 1935)
PASS: lldb-unit :: UnwindAssembly/x86/./UnwindAssemblyx86Tests/Testx86AssemblyInspectionEngine.TestPushEBX (1273 of 1935)
PASS: lldb-unit :: Utility/./UtilityTests/CompletionRequest.DuplicateFilteringWithComments (1274 of 1935)
PASS: lldb-unit :: Utility/./UtilityTests/LogTest.Register (1275 of 1935)
PASS: lldb-unit :: UnwindAssembly/x86/./UnwindAssemblyx86Tests/Testx86AssemblyInspectionEngine.TestStackRealign8BitDisp_i386 (1276 of 1935)
PASS: lldb-unit :: Utility/./UtilityTests/VMRange.ContainsRange (1277 of 1935)
PASS: lldb-shell :: ObjectFile/PECOFF/dep-modules.yaml (1278 of 1935)
PASS: lldb-shell :: SymbolFile/NativePDB/s_constant.cpp (1279 of 1935)
PASS: lldb-api :: functionalities/abbreviation/TestCommonShortSpellings.py (1280 of 1935)
PASS: lldb-shell :: Process/TestEnvironment.test (1281 of 1935)
PASS: lldb-api :: functionalities/breakpoint/breakpoint_command/TestBreakpointCommand.py (1282 of 1935)
PASS: lldb-unit :: Utility/./UtilityTests/StreamTest.PutHex16ByteOrderBig (1283 of 1935)
PASS: lldb-unit :: Process/minidump/./LLDBMinidumpTests/MinidumpParserTest.GetThreadContext_x86_64 (1284 of 1935)
PASS: lldb-unit :: ScriptInterpreter/Python/./ScriptInterpreterPythonTests/PythonDataObjectsTest.TestPythonCallableInvoke (1285 of 1935)
PASS: lldb-unit :: UnwindAssembly/x86/./UnwindAssemblyx86Tests/Testx86AssemblyInspectionEngine.TestPushExtended (1286 of 1935)
PASS: lldb-unit :: Utility/./UtilityTests/StringExtractorTest.DecodeHexU8_Extra (1287 of 1935)
PASS: lldb-api :: tools/lldb-server/TestGdbRemoteExpeditedRegisters.py (1288 of 1935)
PASS: lldb-shell :: Breakpoint/jitbp_elf.test (1289 of 1935)
UNSUPPORTED: lldb-shell :: Breakpoint/ppc64-localentry.test (1290 of 1935)
PASS: lldb-unit :: Host/./HostTests/FileSystemTest.FileAndDirectoryComponents (1291 of 1935)
PASS: lldb-api :: commands/expression/invalid-args/TestInvalidArgsExpression.py (1292 of 1935)
PASS: lldb-api :: functionalities/load_unload/TestLoadUnload.py (1293 of 1935)
PASS: lldb-shell :: ObjectFile/ELF/many-sections.s (1294 of 1935)
PASS: lldb-api :: commands/command/script_alias/TestCommandScriptAlias.py (1295 of 1935)
PASS: lldb-unit :: Utility/./UtilityTests/Flags.Test (1296 of 1935)
PASS: lldb-unit :: Utility/./UtilityTests/RegularExpression.Valid (1297 of 1935)
UNSUPPORTED: lldb-shell :: SymbolFile/PDB/variables.test (1298 of 1935)
PASS: lldb-api :: lang/objc/modules/TestObjCModules.py (1299 of 1935)
PASS: lldb-unit :: Utility/./UtilityTests/RegularExpression.Match (1300 of 1935)
PASS: lldb-unit :: Utility/./UtilityTests/UriParserTest.PortOverflow (1301 of 1935)
PASS: lldb-unit :: Utility/./UtilityTests/ReproducerTest.SetCapture (1302 of 1935)
PASS: lldb-unit :: Utility/./UtilityTests/StreamTest.ShiftOperatorPtr (1303 of 1935)
PASS: lldb-unit :: SymbolFile/NativePDB/./SymbolFileNativePDBTests/PDBFPOProgramToDWARFExpressionTests.DependencyChain (1304 of 1935)
PASS: lldb-unit :: UnwindAssembly/x86/./UnwindAssemblyx86Tests/Testx86AssemblyInspectionEngine.TestPushEDI (1305 of 1935)
PASS: lldb-api :: functionalities/memory-region/TestMemoryRegion.py (1306 of 1935)
PASS: lldb-unit :: Utility/./UtilityTests/LogChannelEnabledTest.log_options (1307 of 1935)
PASS: lldb-unit :: ScriptInterpreter/Python/./ScriptInterpreterPythonTests/PythonDataObjectsTest.TestPythonTupleValues (1308 of 1935)
PASS: lldb-api :: python_api/file_handle/TestFileHandle.py (1309 of 1935)
PASS: lldb-api :: commands/target/create-no-such-arch/TestNoSuchArch.py (1310 of 1935)
UNSUPPORTED: lldb-shell :: SymbolFile/PDB/function-level-linking.test (1311 of 1935)
PASS: lldb-unit :: SymbolFile/NativePDB/./SymbolFileNativePDBTests/PDBFPOProgramToDWARFExpressionTests.UnsupportedRASearch (1312 of 1935)
PASS: lldb-unit :: ScriptInterpreter/Python/./ScriptInterpreterPythonTests/PythonDataObjectsTest.TestInstanceNameResolutionNoDot (1313 of 1935)
PASS: lldb-api :: commands/watchpoints/multiple_hits/TestMultipleHits.py (1314 of 1935)
PASS: lldb-unit :: Utility/./UtilityTests/FileSpecTest.FileAndDirectoryComponents (1315 of 1935)
PASS: lldb-api :: commands/log/basic/TestLogging.py (1316 of 1935)
PASS: lldb-unit :: UnwindAssembly/x86/./UnwindAssemblyx86Tests/Testx86AssemblyInspectionEngine.Test32BitOnlyInstruction (1317 of 1935)
PASS: lldb-unit :: Utility/./UtilityTests/LogChannelEnabledTest.LogGetLogThread (1318 of 1935)
PASS: lldb-unit :: Utility/./UtilityTests/LogChannelEnabledTest.LLDB_LOG_ERROR (1319 of 1935)
UNSUPPORTED: lldb-api :: functionalities/ubsan/user-expression/TestUbsanUserExpression.py (1320 of 1935)
PASS: lldb-api :: commands/expression/import-std-module/sysroot/TestStdModuleSysroot.py (1321 of 1935)
PASS: lldb-shell :: SymbolFile/DWARF/find-function-regex.cpp (1322 of 1935)
PASS: lldb-unit :: Symbol/./SymbolTests/TestClangASTImporter.CompleteFwdDeclWithOtherOrigin (1323 of 1935)
PASS: lldb-api :: macosx/indirect_symbol/TestIndirectSymbols.py (1324 of 1935)
PASS: lldb-unit :: Host/./HostTests/SocketTest.DomainGetConnectURI (1325 of 1935)
PASS: lldb-api :: lang/objcxx/objcxx-ivar-vector/TestIvarVector.py (1326 of 1935)
PASS: lldb-api :: commands/expression/radar_8638051/Test8638051.py (1327 of 1935)
PASS: lldb-api :: commands/frame/select/TestFrameSelect.py (1328 of 1935)
PASS: lldb-unit :: Utility/./UtilityTests/SerializationRountripTest.SerializeDeserializePodPointers (1329 of 1935)
PASS: lldb-shell :: Reproducer/TestRelativePath.test (1330 of 1935)
PASS: lldb-api :: functionalities/postmortem/minidump-new/TestMiniDumpUUID.py (1331 of 1935)
PASS: lldb-api :: lang/c/enum_types/TestEnumTypes.py (1332 of 1935)
PASS: lldb-unit :: Process/gdb-remote/./ProcessGdbRemoteTests/GDBRemoteClientBaseTest.SendContinueDelegateStructuredDataReceipt (1333 of 1935)
UNSUPPORTED: lldb-api :: benchmarks/libcxxlist/TestBenchmarkLibcxxList.py (1334 of 1935)
PASS: lldb-unit :: Utility/./UtilityTests/BinaryStreamTest.PutULEB128SixBytes (1335 of 1935)
PASS: lldb-unit :: Utility/./UtilityTests/StreamTest.PutCString (1336 of 1935)
PASS: lldb-unit :: Utility/./UtilityTests/UriParserTest.BadPort (1337 of 1935)
PASS: lldb-unit :: Utility/./UtilityTests/RangeTest.Clear (1338 of 1935)
PASS: lldb-api :: commands/expression/namespace_local_var_same_name_obj_c/TestNamespaceLocalVarSameNameObjC.py (1339 of 1935)
PASS: lldb-unit :: Symbol/./SymbolTests/TestTypeSystemClang.TestGetEnumIntegerTypeUnexpectedType (1340 of 1935)
PASS: lldb-api :: functionalities/data-formatter/data-formatter-synthtype/TestDataFormatterSynthType.py (1341 of 1935)
PASS: lldb-unit :: Symbol/./SymbolTests/TestClangASTImporter.CopyDeclTagDecl (1342 of 1935)
PASS: lldb-api :: functionalities/data-formatter/data-formatter-stl/libcxx/function/TestLibCxxFunction.py (1343 of 1935)
PASS: lldb-unit :: Utility/./UtilityTests/StreamTest.AddressPrefixAndSuffix (1344 of 1935)
UNSUPPORTED: lldb-shell :: ObjectFile/ELF/minidebuginfo-set-and-hit-breakpoint.test (1345 of 1935)
PASS: lldb-unit :: Process/minidump/./LLDBMinidumpTests/MinidumpParserTest.GetMemoryRegionInfoFromMemoryList (1346 of 1935)
PASS: lldb-api :: commands/watchpoints/watchpoint_on_vectors/TestValueOfVectorVariable.py (1347 of 1935)
PASS: lldb-api :: functionalities/data-formatter/typedef_array/TestTypedefArray.py (1348 of 1935)
PASS: lldb-api :: commands/expression/function_template_specialization_temp_args/TestFunctionTemplateSpecializationTempArgs.py (1349 of 1935)
PASS: lldb-unit :: Symbol/./SymbolTests/SymbolsTest.LocateExecutableSymbolFileForUnknownExecutableAndMissingSymbolFile (1350 of 1935)
PASS: lldb-unit :: Utility/./UtilityTests/StreamTeeTest.SetStreamAtIndexOutOfBounds (1351 of 1935)
PASS: lldb-api :: functionalities/breakpoint/address_breakpoints/TestBadAddressBreakpoints.py (1352 of 1935)
PASS: lldb-unit :: ObjectFile/Breakpad/./ObjectFileBreakpadTests/InfoRecord.parse (1353 of 1935)
PASS: lldb-api :: functionalities/thread/concurrent_events/TestConcurrentDelayWatchBreak.py (1354 of 1935)
PASS: lldb-unit :: Utility/./UtilityTests/EventTest.DumpEventDataBytes (1355 of 1935)
PASS: lldb-shell :: SymbolFile/symbol-binding.test (1356 of 1935)
PASS: lldb-unit :: ObjectFile/ELF/./ObjectFileELFTests/ObjectFileELFTest.GetSymtab_NoSymEntryPointArmAddressClass (1357 of 1935)
PASS: lldb-api :: functionalities/breakpoint/breakpoint_by_line_and_column/TestBreakpointByLineAndColumn.py (1358 of 1935)
PASS: lldb-api :: lang/cpp/diamond/TestDiamond.py (1359 of 1935)
PASS: lldb-api :: functionalities/abbreviation/TestAbbreviations.py (1360 of 1935)
PASS: lldb-unit :: ScriptInterpreter/Python/./ScriptInterpreterPythonTests/PythonDataObjectsTest.TestPythonTupleInitializerList (1361 of 1935)
PASS: lldb-unit :: Language/Highlighting/./HighlighterTests/HighlighterTest.HighlighterSelectionType (1362 of 1935)
PASS: lldb-unit :: Utility/./UtilityTests/OptionsWithRawTest.WhitespaceSuffix (1363 of 1935)
PASS: lldb-api :: lang/cpp/bitfields/TestCppBitfields.py (1364 of 1935)
PASS: lldb-unit :: ObjectFile/ELF/./ObjectFileELFTests/ObjectFileELFTest.GetSymtab_NoSymEntryPointArmThumbAddressClass (1365 of 1935)
PASS: lldb-shell :: Minidump/memory-region.yaml (1366 of 1935)
PASS: lldb-unit :: Process/gdb-remote/./ProcessGdbRemoteTests/GDBRemoteCommunicationClientTest.SendGetTraceConfigPacket (1367 of 1935)
PASS: lldb-api :: lang/c/tls_globals/TestTlsGlobals.py (1368 of 1935)
PASS: lldb-unit :: Host/./HostTests/SocketTest.TCPGetAddress (1369 of 1935)
PASS: lldb-api :: functionalities/postmortem/elf-core/gcore/TestGCore.py (1370 of 1935)
PASS: lldb-api :: functionalities/memory/cache/TestMemoryCache.py (1371 of 1935)
UNSUPPORTED: lldb-api :: functionalities/darwin_log/source/info/TestDarwinLogSourceInfo.py (1372 of 1935)
PASS: lldb-api :: commands/frame/recognizer/TestFrameRecognizer.py (1373 of 1935)
PASS: lldb-api :: functionalities/data-formatter/nsdictionarysynth/TestNSDictionarySynthetic.py (1374 of 1935)
PASS: lldb-unit :: Utility/./UtilityTests/StringExtractorTest.GetHexBytesAvail_Underflow (1375 of 1935)
UNSUPPORTED: lldb-api :: functionalities/asan/TestMemoryHistory.py (1376 of 1935)
PASS: lldb-api :: lang/c/set_values/TestSetValues.py (1377 of 1935)
PASS: lldb-api :: tools/lldb-server/TestGdbRemoteThreadsInStopReply.py (1378 of 1935)
PASS: lldb-api :: functionalities/thread/concurrent_events/TestConcurrentWatchBreakDelay.py (1379 of 1935)
UNRESOLVED: lldb-api :: functionalities/gdb_remote_client/TestWasm.py (1380 of 1935)
******************** TEST 'lldb-api :: functionalities/gdb_remote_client/TestWasm.py' FAILED ********************
Script:
--
/usr/local/bin/python /Users/buildslave/jenkins/workspace/lldb-cmake-sanitized/llvm-project/lldb/test/API/dotest.py --arch x86_64 -s /Users/buildslave/jenkins/workspace/lldb-cmake-sanitized/lldb-build/lldb-test-traces -S nm -u CXXFLAGS -u CFLAGS --codesign-identity lldb_codesign --server /Users/buildslave/jenkins/workspace/lldb-cmake-sanitized/lldb-build/./bin/debugserver --arch x86_64 --build-dir /Users/buildslave/jenkins/workspace/lldb-cmake-sanitized/lldb-build/lldb-test-build.noindex -s=/Users/buildslave/jenkins/workspace/lldb-cmake-sanitized/test/logs -t --env TERM=vt100 --env LLVM_LIBS_DIR=/Users/buildslave/jenkins/workspace/lldb-cmake-sanitized/lldb-build/./lib --inferior-env ASAN_OPTIONS=detect_stack_use_after_return=1 --inferior-env DYLD_INSERT_LIBRARIES=/Users/buildslave/jenkins/workspace/lldb-cmake-sanitized/host-compiler/lib/clang/11.0.0/lib/darwin/libclang_rt.asan_osx_dynamic.dylib --build-dir /Users/buildslave/jenkins/workspace/lldb-cmake-sanitized/lldb-build/lldb-test-build.noindex --lldb-module-cache-dir /Users/buildslave/jenkins/workspace/lldb-cmake-sanitized/lldb-build/lldb-test-build.noindex/module-cache-lldb/lldb-api --clang-module-cache-dir /Users/buildslave/jenkins/workspace/lldb-cmake-sanitized/lldb-build/lldb-test-build.noindex/module-cache-clang/lldb-api --executable /Users/buildslave/jenkins/workspace/lldb-cmake-sanitized/lldb-build/./bin/lldb --compiler /Users/buildslave/jenkins/workspace/lldb-cmake-sanitized/lldb-build/./bin/clang --dsymutil /Users/buildslave/jenkins/workspace/lldb-cmake-sanitized/lldb-build/./bin/dsymutil --filecheck /Users/buildslave/jenkins/workspace/lldb-cmake-sanitized/lldb-build/./bin/FileCheck --lldb-libs-dir /Users/buildslave/jenkins/workspace/lldb-cmake-sanitized/lldb-build/./lib /Users/buildslave/jenkins/workspace/lldb-cmake-sanitized/llvm-project/lldb/test/API/functionalities/gdb_remote_client -p TestWasm.py
--
Exit Code: -6

Hide Details

Command Output (stdout): -- lldb version 11.0.99 clang revision 78be61871704a451a5d9462d7e96ed6c982746d4 llvm revision 78be61871704a451a5d9462d7e96ed6c982746d4

Hide Details

-- Command Output (stderr): -- ================================================================= ==4495==ERROR: AddressSanitizer: container-overflow on address 0x615000016184 at pc 0x00010d5c88e3 bp 0x7ffee267d130 sp 0x7ffee267c8f8 READ of size 512 at 0x615000016184 thread T0 #0 0x10d5c88e2 in __asan_memcpy+0x1b2 (libclang_rt.asan_osx_dynamic.dylib:x86_64+0x418e2) #1 0x1180952e5 in lldb_private::MemoryCache::Read(unsigned long long, void*, unsigned long, lldb_private::Status&) Memory.cpp:189 #2 0x117be9cf9 in lldb_private::Module::GetMemoryObjectFile(std::__1::shared_ptr<lldb_private::Process> const&, unsigned long long, lldb_private::Status&, unsigned long) Module.cpp:298 #3 0x1180ebaff in lldb_private::Process::ReadModuleFromMemory(lldb_private::FileSpec const&, unsigned long long, unsigned long) Process.cpp:2402 #4 0x117b7ff8b in lldb_private::DynamicLoader::LoadModuleAtAddress(lldb_private::FileSpec const&, unsigned long long, unsigned long long, bool) DynamicLoader.cpp:212 #5 0x11891ba6a in lldb_private::process_gdb_remote::ProcessGDBRemote::LoadModuleAtAddress(lldb_private::FileSpec const&, unsigned long long, unsigned long long, bool) ProcessGDBRemote.cpp:4767 #6 0x11891c048 in lldb_private::process_gdb_remote::ProcessGDBRemote::LoadModules() ProcessGDBRemote.cpp:4801 #7 0x1184125ca in lldb_private::wasm::DynamicLoaderWasmDYLD::DidAttach() DynamicLoaderWasmDYLD.cpp:63 #8 0x1180f06a7 in lldb_private::Process::CompleteAttach() Process.cpp:2930 #9 0x1180f37ef in lldb_private::Process::ConnectRemote(lldb_private::Stream*, llvm::StringRef) Process.cpp:3015 #10 0x11748407e in lldb::SBTarget::ConnectRemote(lldb::SBListener&, char const*, char const*, lldb::SBError&) SBTarget.cpp:559 #11 0x117970f41 in _wrap_SBTarget_ConnectRemote(_object*, _object*) LLDBWrapPython.cpp:52799 #12 0x10e323226 in _PyMethodDef_RawFastCallKeywords+0xeb (Python:x86_64+0x1a226) #13 0x10e3228c6 in _PyCFunction_FastCallKeywords+0x2b (Python:x86_64+0x198c6) #14 0x10e3b8905 in call_function+0x1de (Python:x86_64+0xaf905) #15 0x10e3b15ee in _PyEval_EvalFrameDefault+0x1b51 (Python:x86_64+0xa85ee) #16 0x10e322ca1 in function_code_fastcall+0x6f (Python:x86_64+0x19ca1) #17 0x10e3b897d in call_function+0x256 (Python:x86_64+0xaf97d) #18 0x10e3b15d5 in _PyEval_EvalFrameDefault+0x1b38 (Python:x86_64+0xa85d5) #19 0x10e322ca1 in function_code_fastcall+0x6f (Python:x86_64+0x19ca1) #20 0x10e3b897d in call_function+0x256 (Python:x86_64+0xaf97d) #21 0x10e3b15d5 in _PyEval_EvalFrameDefault+0x1b38 (Python:x86_64+0xa85d5) #22 0x10e322ca1 in function_code_fastcall+0x6f (Python:x86_64+0x19ca1) #23 0x10e3b897d in call_function+0x256 (Python:x86_64+0xaf97d) #24 0x10e3b168c in _PyEval_EvalFrameDefault+0x1bef (Python:x86_64+0xa868c) #25 0x10e322ca1 in function_code_fastcall+0x6f (Python:x86_64+0x19ca1) #26 0x10e3b897d in call_function+0x256 (Python:x86_64+0xaf97d) #27 0x10e3b15d5 in _PyEval_EvalFrameDefault+0x1b38 (Python:x86_64+0xa85d5) #28 0x10e3b92da in _PyEval_EvalCodeWithName+0x72a (Python:x86_64+0xb02da) #29 0x10e3224f4 in _PyFunction_FastCallDict+0x1b8 (Python:x86_64+0x194f4) #30 0x10e323624 in _PyObject_Call_Prepend+0x95 (Python:x86_64+0x1a624) #31 0x10e3229d4 in PyObject_Call+0x87 (Python:x86_64+0x199d4) #32 0x10e3b1905 in _PyEval_EvalFrameDefault+0x1e68 (Python:x86_64+0xa8905) #33 0x10e3b92da in _PyEval_EvalCodeWithName+0x72a (Python:x86_64+0xb02da) #34 0x10e3224f4 in _PyFunction_FastCallDict+0x1b8 (Python:x86_64+0x194f4) #35 0x10e323624 in _PyObject_Call_Prepend+0x95 (Python:x86_64+0x1a624) #36 0x10e3604af in slot_tp_call+0x46 (Python:x86_64+0x574af) #37 0x10e32272c in _PyObject_FastCallKeywords+0x166 (Python:x86_64+0x1972c) #38 0x10e3b8976 in call_function+0x24f (Python:x86_64+0xaf976) #39 0x10e3b168c in _PyEval_EvalFrameDefault+0x1bef (Python:x86_64+0xa868c) #40 0x10e3b92da in _PyEval_EvalCodeWithName+0x72a (Python:x86_64+0xb02da) #41 0x10e32288b in _PyFunction_FastCallKeywords+0xe0 (Python:x86_64+0x1988b) #42 0x10e3b897d in call_function+0x256 (Python:x86_64+0xaf97d) #43 0x10e3b15d5 in _PyEval_EvalFrameDefault+0x1b38 (Python:x86_64+0xa85d5) #44 0x10e3b92da in _PyEval_EvalCodeWithName+0x72a (Python:x86_64+0xb02da) #45 0x10e32288b in _PyFunction_FastCallKeywords+0xe0 (Python:x86_64+0x1988b) #46 0x10e3b897d in call_function+0x256 (Python:x86_64+0xaf97d) #47 0x10e3b15d5 in _PyEval_EvalFrameDefault+0x1b38 (Python:x86_64+0xa85d5) #48 0x10e322ca1 in function_code_fastcall+0x6f (Python:x86_64+0x19ca1) #49 0x10e323624 in _PyObject_Call_Prepend+0x95 (Python:x86_64+0x1a624) #50 0x10e3229d4 in PyObject_Call+0x87 (Python:x86_64+0x199d4) #51 0x10e3b1905 in _PyEval_EvalFrameDefault+0x1e68 (Python:x86_64+0xa8905) #52 0x10e3b92da in _PyEval_EvalCodeWithName+0x72a (Python:x86_64+0xb02da) #53 0x10e3224f4 in _PyFunction_FastCallDict+0x1b8 (Python:x86_64+0x194f4) #54 0x10e323624 in _PyObject_Call_Prepend+0x95 (Python:x86_64+0x1a624) #55 0x10e3604af in slot_tp_call+0x46 (Python:x86_64+0x574af) #56 0x10e32272c in _PyObject_FastCallKeywords+0x166 (Python:x86_64+0x1972c) #57 0x10e3b8976 in call_function+0x24f (Python:x86_64+0xaf976) #58 0x10e3b168c in _PyEval_EvalFrameDefault+0x1bef (Python:x86_64+0xa868c) #59 0x10e322ca1 in function_code_fastcall+0x6f (Python:x86_64+0x19ca1) #60 0x10e3b897d in call_function+0x256 (Python:x86_64+0xaf97d) #61 0x10e3b15d5 in _PyEval_EvalFrameDefault+0x1b38 (Python:x86_64+0xa85d5) #62 0x10e322ca1 in function_code_fastcall+0x6f (Python:x86_64+0x19ca1) #63 0x10e3b897d in call_function+0x256 (Python:x86_64+0xaf97d) #64 0x10e3b15ee in _PyEval_EvalFrameDefault+0x1b51 (Python:x86_64+0xa85ee) #65 0x10e3b92da in _PyEval_EvalCodeWithName+0x72a (Python:x86_64+0xb02da) #66 0x10e3afa14 in PyEval_EvalCode+0x29 (Python:x86_64+0xa6a14) #67 0x10e3de2aa in run_mod+0x35 (Python:x86_64+0xd52aa) #68 0x10e3dd2c5 in PyRun_FileExFlags+0xa3 (Python:x86_64+0xd42c5) #69 0x10e3dc9a4 in PyRun_SimpleFileExFlags+0x114 (Python:x86_64+0xd39a4) #70 0x10e3f4010 in pymain_main+0x13de (Python:x86_64+0xeb010) #71 0x10e3f47b7 in _Py_UnixMain+0x67 (Python:x86_64+0xeb7b7) #72 0x7fff76163084 in start+0x0 (libdyld.dylib:x86_64+0x17084)

Hide Details

0x615000016300 is located 0 bytes to the right of 512-byte region [0x615000016100,0x615000016300) allocated by thread T0 here: #0 0x10d5d760d in wrap__Znwm+0x7d (libclang_rt.asan_osx_dynamic.dylib:x86_64+0x5060d) #1 0x1182c5750 in std::__1::vector<unsigned char, std::__1::allocator<unsigned char> >::__vallocate(unsigned long) new:253 #2 0x1182c12ff in std::__1::vector<unsigned char, std::__1::allocator<unsigned char> >::assign(unsigned long, unsigned char const&) vector:1481 #3 0x1182c114a in lldb_private::DataBufferHeap::DataBufferHeap(unsigned long long, unsigned char) DataBufferHeap.cpp:20 #4 0x11809568d in lldb_private::MemoryCache::Read(unsigned long long, void*, unsigned long, lldb_private::Status&) Memory.cpp:228 #5 0x117be9cf9 in lldb_private::Module::GetMemoryObjectFile(std::__1::shared_ptr<lldb_private::Process> const&, unsigned long long, lldb_private::Status&, unsigned long) Module.cpp:298 #6 0x1180ebaff in lldb_private::Process::ReadModuleFromMemory(lldb_private::FileSpec const&, unsigned long long, unsigned long) Process.cpp:2402 #7 0x117b7ff8b in lldb_private::DynamicLoader::LoadModuleAtAddress(lldb_private::FileSpec const&, unsigned long long, unsigned long long, bool) DynamicLoader.cpp:212 #8 0x11891ba6a in lldb_private::process_gdb_remote::ProcessGDBRemote::LoadModuleAtAddress(lldb_private::FileSpec const&, unsigned long long, unsigned long long, bool) ProcessGDBRemote.cpp:4767 #9 0x11891c048 in lldb_private::process_gdb_remote::ProcessGDBRemote::LoadModules() ProcessGDBRemote.cpp:4801 #10 0x1184125ca in lldb_private::wasm::DynamicLoaderWasmDYLD::DidAttach() DynamicLoaderWasmDYLD.cpp:63 #11 0x1180f06a7 in lldb_private::Process::CompleteAttach() Process.cpp:2930 #12 0x1180f37ef in lldb_private::Process::ConnectRemote(lldb_private::Stream*, llvm::StringRef) Process.cpp:3015 #13 0x11748407e in lldb::SBTarget::ConnectRemote(lldb::SBListener&, char const*, char const*, lldb::SBError&) SBTarget.cpp:559 #14 0x117970f41 in _wrap_SBTarget_ConnectRemote(_object*, _object*) LLDBWrapPython.cpp:52799 #15 0x10e323226 in _PyMethodDef_RawFastCallKeywords+0xeb (Python:x86_64+0x1a226) #16 0x10e3228c6 in _PyCFunction_FastCallKeywords+0x2b (Python:x86_64+0x198c6) #17 0x10e3b8905 in call_function+0x1de (Python:x86_64+0xaf905) #18 0x10e3b15ee in _PyEval_EvalFrameDefault+0x1b51 (Python:x86_64+0xa85ee) #19 0x10e322ca1 in function_code_fastcall+0x6f (Python:x86_64+0x19ca1) #20 0x10e3b897d in call_function+0x256 (Python:x86_64+0xaf97d) #21 0x10e3b15d5 in _PyEval_EvalFrameDefault+0x1b38 (Python:x86_64+0xa85d5) #22 0x10e322ca1 in function_code_fastcall+0x6f (Python:x86_64+0x19ca1) #23 0x10e3b897d in call_function+0x256 (Python:x86_64+0xaf97d) #24 0x10e3b15d5 in _PyEval_EvalFrameDefault+0x1b38 (Python:x86_64+0xa85d5) #25 0x10e322ca1 in function_code_fastcall+0x6f (Python:x86_64+0x19ca1) #26 0x10e3b897d in call_function+0x256 (Python:x86_64+0xaf97d) #27 0x10e3b168c in _PyEval_EvalFrameDefault+0x1bef (Python:x86_64+0xa868c) #28 0x10e322ca1 in function_code_fastcall+0x6f (Python:x86_64+0x19ca1) #29 0x10e3b897d in call_function+0x256 (Python:x86_64+0xaf97d)

Hide Details

HINT: if you don't care about these errors you may set ASAN_OPTIONS=detect_container_overflow=0. If you suspect a false positive see also: https://github.com/google/sanitizers/wiki/AddressSanitizerContainerOverflow. SUMMARY: AddressSanitizer: container-overflow (libclang_rt.asan_osx_dynamic.dylib:x86_64+0x418e2) in __asan_memcpy+0x1b2 Shadow bytes around the buggy address: 0x1c2a00002be0: 00 00 00 00 00 00 00 00 00 00 00 00 00 00 00 00 0x1c2a00002bf0: 00 00 00 00 00 00 00 00 00 00 00 00 00 00 00 00 0x1c2a00002c00: 00 00 00 00 00 00 00 00 00 00 00 00 00 00 00 00 0x1c2a00002c10: fa fa fa fa fa fa fa fa fa fa fa fa fa fa fa fa 0x1c2a00002c20: 00 00 00 00 00 00 00 00 00 00 00 00 00 00 00 00 =>0x1c2a00002c30:[04]fc fc fc fc fc fc fc fc fc fc fc fc fc fc fc 0x1c2a00002c40: fc fc fc fc fc fc fc fc fc fc fc fc fc fc fc fc 0x1c2a00002c50: fc fc fc fc fc fc fc fc fc fc fc fc fc fc fc fc 0x1c2a00002c60: fa fa fa fa fa fa fa fa fa fa fa fa fa fa fa fa 0x1c2a00002c70: fd fd fd fd fd fd fd fd fd fd fd fd fd fd fd fd 0x1c2a00002c80: fd fd fd fd fd fd fd fd fd fd fd fd fd fd fd fd Shadow byte legend (one shadow byte represents 8 application bytes): Addressable: 00 Partially addressable: 01 02 03 04 05 06 07 Heap left redzone: fa Freed heap region: fd Stack left redzone: f1 Stack mid redzone: f2 Stack right redzone: f3 Stack after return: f5 Stack use after scope: f8 Global redzone: f9 Global init order: f6 Poisoned by user: f7 Container overflow: fc Array cookie: ac Intra object redzone: bb ASan internal: fe Left alloca redzone: ca Right alloca redzone: cb Shadow gap: cc ==4495==ABORTING

Hide Details

--

Hide Details

******************** PASS: lldb-unit :: Process/minidump/./LLDBMinidumpTests/MinidumpParserTest.GetArchitecture (1381 of 1935) PASS: lldb-unit :: Process/gdb-remote/./ProcessGdbRemoteTests/GDBRemoteCommunicationClientTest.GetModulesInfo (1382 of 1935) PASS: lldb-api :: python_api/symbol-context/two-files/TestSymbolContextTwoFiles.py (1383 of 1935) UNSUPPORTED: lldb-api :: commands/expression/multiline-completion/TestMultilineCompletion.py (1384 of 1935) PASS: lldb-unit :: Symbol/./SymbolTests/TestTypeSystemClang.TestGetTypeClassDeclType (1385 of 1935) UNSUPPORTED: lldb-shell :: SymbolFile/PDB/udt-layout.test (1386 of 1935) PASS: lldb-shell :: Quit/TestQuitExitCodeHexA.test (1387 of 1935) PASS: lldb-shell :: SymbolFile/NativePDB/ast-types.cpp (1388 of 1935) PASS: lldb-unit :: Process/minidump/./LLDBMinidumpTests/MinidumpParserTest.GetMemory (1389 of 1935) PASS: lldb-unit :: Utility/./UtilityTests/DataExtractorTest.GetMaxU64 (1390 of 1935) PASS: lldb-unit :: ObjectFile/Breakpad/./ObjectFileBreakpadTests/LineRecord.parse (1391 of 1935) PASS: lldb-unit :: Utility/./UtilityTests/StringListTest.AppendStringCString (1392 of 1935) PASS: lldb-shell :: Register/x86-64-read.test (1393 of 1935) PASS: lldb-api :: lang/cpp/global_operators/TestCppGlobalOperators.py (1394 of 1935) PASS: lldb-api :: functionalities/breakpoint/address_breakpoints/TestAddressBreakpoints.py (1395 of 1935) PASS: lldb-api :: functionalities/thread/concurrent_events/TestConcurrentTwoBreakpointsOneWatchpoint.py (1396 of 1935) PASS: lldb-api :: functionalities/inferior-changed/TestInferiorChanged.py (1397 of 1935) PASS: lldb-unit :: Utility/./UtilityTests/StringListTest.GetSize (1398 of 1935) PASS: lldb-unit :: Symbol/./SymbolTests/TestTypeSystemClang.TestBuiltinTypeForEncodingAndBitSize (1399 of 1935) UNSUPPORTED: lldb-api :: functionalities/tsan/thread_numbers/TestTsanThreadNumbers.py (1400 of 1935) PASS: lldb-api :: functionalities/testid/TestTestId.py (1401 of 1935) PASS: lldb-unit :: Process/gdb-remote/./ProcessGdbRemoteTests/GDBRemoteCommunicationServerTest.SendErrorResponse_Status (1402 of 1935) PASS: lldb-unit :: Host/./HostTests/SocketTest.TCPGetConnectURI (1403 of 1935) PASS: lldb-unit :: Utility/./UtilityTests/ArgsTest.ReplaceArgumentAtIndexEqual (1404 of 1935) PASS: lldb-unit :: Process/gdb-remote/./ProcessGdbRemoteTests/GDBRemoteCommunicationTest.ReadPacket_checksum (1405 of 1935) PASS: lldb-api :: commands/expression/unicode-in-variable/TestUnicodeInVariable.py (1406 of 1935) PASS: lldb-unit :: UnwindAssembly/x86/./UnwindAssemblyx86Tests/Testx86AssemblyInspectionEngine.TestPush0 (1407 of 1935) UNSUPPORTED: lldb-api :: commands/watchpoints/hello_watchlocation/TestWatchLocation.py (1408 of 1935) PASS: lldb-unit :: Language/Highlighting/./HighlighterTests/HighlighterTest.ClangSquareBrackets (1409 of 1935) PASS: lldb-api :: commands/expression/diagnostics/TestExprDiagnostics.py (1410 of 1935) PASS: lldb-unit :: Target/./TargetTests/MCBasedABI.MapRegisterName (1411 of 1935) PASS: lldb-api :: commands/expression/import-std-module/no-std-module/TestMissingStdModule.py (1412 of 1935) PASS: lldb-shell :: Driver/TestNoUseColor.test (1413 of 1935) PASS: lldb-api :: functionalities/breakpoint/breakpoint_command/TestBreakpointCommandsFromPython.py (1414 of 1935) PASS: lldb-api :: commands/watchpoints/watchpoint_events/TestWatchpointEvents.py (1415 of 1935) PASS: lldb-api :: macosx/order/TestOrderFile.py (1416 of 1935) PASS: lldb-api :: functionalities/thread/concurrent_events/TestConcurrentCrashWithSignal.py (1417 of 1935) PASS: lldb-unit :: Symbol/./SymbolTests/TestTypeSystemClang.TestRecordHasFields (1418 of 1935) UNSUPPORTED: lldb-api :: tools/lldb-server/platform-process-connect/TestPlatformProcessConnect.py (1419 of 1935) PASS: lldb-shell :: BuildScript/script-args.test (1420 of 1935) PASS: lldb-shell :: ObjectFile/ELF/section-types.yaml (1421 of 1935) PASS: lldb-unit :: Utility/./UtilityTests/BroadcasterTest.BroadcastEvent (1422 of 1935) PASS: lldb-api :: commands/frame/diagnose/dereference-this/TestDiagnoseDereferenceThis.py (1423 of 1935) PASS: lldb-api :: functionalities/thread/concurrent_events/TestConcurrentDelayedCrashWithBreakpointSignal.py (1424 of 1935) PASS: lldb-api :: lang/cpp/template-function/TestTemplateFunctions.py (1425 of 1935) PASS: lldb-unit :: Host/./HostTests/NativeProcessProtocolTest.SetBreakpointFailRead (1426 of 1935) PASS: lldb-shell :: Settings/TestSettingsWrite.test (1427 of 1935) PASS: lldb-shell :: SymbolFile/DWARF/win-i386-line-table.s (1428 of 1935) PASS: lldb-api :: lang/cpp/class_static/TestStaticVariables.py (1429 of 1935) PASS: lldb-api :: functionalities/data-formatter/data-formatter-stl/libcxx/map/TestDataFormatterLibccMap.py (1430 of 1935) PASS: lldb-api :: lang/cpp/dynamic-value-same-basename/TestDynamicValueSameBase.py (1431 of 1935) PASS: lldb-api :: lang/c/step-target/TestStepTarget.py (1432 of 1935) PASS: lldb-unit :: UnwindAssembly/x86/./UnwindAssemblyx86Tests/Testx86AssemblyInspectionEngine.TestSimplei386ugmented (1433 of 1935) UNSUPPORTED: lldb-shell :: SymbolFile/target-symbols-add-unwind.test (1434 of 1935) PASS: lldb-shell :: ObjectFile/ELF/PT_TLS-overlap-PT_LOAD.yaml (1435 of 1935) PASS: lldb-api :: functionalities/data-formatter/pyobjsynthprovider/TestPyObjSynthProvider.py (1436 of 1935) PASS: lldb-api :: functionalities/postmortem/minidump/TestMiniDump.py (1437 of 1935) PASS: lldb-api :: python_api/watchpoint/watchlocation/TestSetWatchlocation.py (1438 of 1935) UNSUPPORTED: lldb-shell :: SymbolFile/PDB/class-layout.test (1439 of 1935) PASS: lldb-unit :: Core/./LLDBCoreTests/MangledTest.NameIndexes_FindFunctionSymbols (1440 of 1935) UNSUPPORTED: lldb-shell :: SymbolFile/PDB/function-nested-block.test (1441 of 1935) PASS: lldb-unit :: UnwindAssembly/x86/./UnwindAssemblyx86Tests/Testx86AssemblyInspectionEngine.TestPopRBPWithREX (1442 of 1935) PASS: lldb-unit :: Symbol/./SymbolTests/TestTypeSystemClang.TestGetEnumIntegerTypeBasicTypes (1443 of 1935) PASS: lldb-unit :: Utility/./UtilityTests/AnsiTerminal.WhiteSpace (1444 of 1935) PASS: lldb-shell :: Reproducer/TestDump.test (1445 of 1935) PASS: lldb-unit :: Process/minidump/./LLDBMinidumpTests/MinidumpParserTest.GetPidWow64 (1446 of 1935) PASS: lldb-api :: functionalities/data-formatter/data-formatter-objc/cmtime/TestDataFormatterCMTime.py (1447 of 1935) PASS: lldb-api :: functionalities/data-formatter/user-format-vs-summary/TestUserFormatVsSummary.py (1448 of 1935) PASS: lldb-api :: commands/expression/import-std-module/forward_list/TestForwardListFromStdModule.py (1449 of 1935) PASS: lldb-shell :: ObjectFile/ELF/section-addresses.yaml (1450 of 1935) PASS: lldb-api :: commands/expression/import-std-module/deque-dbg-info-content/TestDbgInfoContentDequeFromStdModule.py (1451 of 1935) PASS: lldb-unit :: Expression/./ExpressionTests/DWARFExpression.DW_OP_convert (1452 of 1935) PASS: lldb-api :: lang/cpp/gmodules/TestWithModuleDebugging.py (1453 of 1935) PASS: lldb-unit :: Language/CPlusPlus/./LanguageCPlusPlusTests/CPlusPlusLanguage.FindAlternateFunctionManglings (1454 of 1935) PASS: lldb-unit :: Utility/./UtilityTests/LogTest.LLDB_LOG_nullptr (1455 of 1935) PASS: lldb-unit :: Utility/./UtilityTests/StreamTest.PutHex32ByteOrderLittle (1456 of 1935) PASS: lldb-api :: lang/c/strings/TestCStrings.py (1457 of 1935) PASS: lldb-api :: commands/watchpoints/watchpoint_commands/TestWatchpointCommands.py (1458 of 1935) PASS: lldb-unit :: Utility/./UtilityTests/RangeTest.SizeTypes (1459 of 1935) PASS: lldb-unit :: Utility/./UtilityTests/DeserializerTest.HasData (1460 of 1935) PASS: lldb-shell :: SymbolFile/DWARF/parallel-indexing-stress.s (1461 of 1935) PASS: lldb-unit :: UnwindAssembly/x86/./UnwindAssemblyx86Tests/Testx86AssemblyInspectionEngine.TestCALLNextInsn (1462 of 1935) PASS: lldb-api :: commands/register/register/register_command/TestRegisters.py (1463 of 1935) PASS: lldb-unit :: Utility/./UtilityTests/StreamTeeTest.SetStreamAtIndexOverwrite (1464 of 1935) PASS: lldb-api :: functionalities/thread/concurrent_events/TestConcurrentCrashWithWatchpointBreakpointSignal.py (1465 of 1935) PASS: lldb-unit :: Utility/./UtilityTests/RangeDataVector.FindEntryThatContains_Overlap (1466 of 1935) PASS: lldb-unit :: Utility/./UtilityTests/TimerTest.CategoryTimes2 (1467 of 1935) PASS: lldb-shell :: BuildScript/modes.test (1468 of 1935) PASS: lldb-unit :: SymbolFile/NativePDB/./SymbolFileNativePDBTests/PDBFPOProgramToDWARFExpressionTests.UnknownOp (1469 of 1935) PASS: lldb-api :: lang/objc/hidden-ivars/TestHiddenIvars.py (1470 of 1935) PASS: lldb-api :: functionalities/tail_call_frames/cross_dso/TestCrossDSOTailCalls.py (1471 of 1935) PASS: lldb-shell :: Quit/TestQuitExitCodeImplicit0.test (1472 of 1935) PASS: lldb-unit :: Target/./TargetTests/ModuleCacheTest.GetAndPut (1473 of 1935) PASS: lldb-api :: functionalities/gdb_remote_client/TestRestartBug.py (1474 of 1935) UNSUPPORTED: lldb-api :: functionalities/darwin_log/filter/regex/activity-chain/TestDarwinLogFilterRegexActivityChain.py (1475 of 1935) UNSUPPORTED: lldb-shell :: SymbolFile/PDB/type-quals.test (1476 of 1935) PASS: lldb-unit :: Process/minidump/./LLDBMinidumpTests/MinidumpParserTest.GetMiscInfoWindows (1477 of 1935) PASS: lldb-api :: functionalities/data-formatter/type_summary_list_script/TestTypeSummaryListScript.py (1478 of 1935) PASS: lldb-unit :: Utility/./UtilityTests/RangeTest.EqualInvalid (1479 of 1935) PASS: lldb-api :: functionalities/breakpoint/breakpoint_ids/TestBreakpointIDs.py (1480 of 1935) PASS: lldb-api :: terminal/TestSTTYBeforeAndAfter.py (1481 of 1935) PASS: lldb-unit :: Utility/./UtilityTests/RangeTest.ContainsAddrInvalid (1482 of 1935) PASS: lldb-unit :: Expression/./ExpressionTests/DiagnosticManagerTest.GetStringNoDiags (1483 of 1935) PASS: lldb-shell :: Quit/TestQuitExitCode0.test (1484 of 1935) PASS: lldb-api :: functionalities/gdb_remote_client/TestWriteMemory.py (1485 of 1935) PASS: lldb-shell :: SymbolFile/DWARF/DW_OP_piece-struct.s (1486 of 1935) PASS: lldb-unit :: Utility/./UtilityTests/VMRange.Comparison (1487 of 1935) PASS: lldb-api :: lang/objc/orderedset/TestOrderedSet.py (1488 of 1935) PASS: lldb-api :: lang/cpp/exceptions/TestCPPExceptionBreakpoints.py (1489 of 1935) PASS: lldb-unit :: Utility/./UtilityTests/FileSpecTest.EqualDotsPosixRoot (1490 of 1935) PASS: lldb-api :: functionalities/breakpoint/breakpoint_hit_count/TestBreakpointHitCount.py (1491 of 1935) PASS: lldb-api :: commands/target/create-deps/TestTargetCreateDeps.py (1492 of 1935) PASS: lldb-api :: functionalities/data-formatter/data-formatter-synth/TestDataFormatterSynth.py (1493 of 1935) PASS: lldb-api :: functionalities/data-formatter/data-formatter-proper-plurals/TestFormattersOneIsSingular.py (1494 of 1935) PASS: lldb-unit :: ScriptInterpreter/Python/./ScriptInterpreterPythonTests/PythonDataObjectsTest.TestBorrowedReferences (1495 of 1935) UNSUPPORTED: lldb-api :: functionalities/darwin_log/filter/regex/subsystem/TestDarwinLogFilterRegexSubsystem.py (1496 of 1935) PASS: lldb-unit :: debugserver/./debugserverTests/RNBSocket.LoopBackConnectIPv4 (1497 of 1935) UNSUPPORTED: lldb-api :: benchmarks/expression/TestRepeatedExprs.py (1498 of 1935) PASS: lldb-unit :: Utility/./UtilityTests/GeneratorTest.Create (1499 of 1935) PASS: lldb-shell :: SymbolFile/DWARF/debug_aranges-empty-section.s (1500 of 1935) PASS: lldb-api :: functionalities/thread/concurrent_events/TestConcurrentDelaySignalWatch.py (1501 of 1935) PASS: lldb-unit :: Utility/./UtilityTests/ScalarTest.GetValue (1502 of 1935) PASS: lldb-unit :: UnwindAssembly/x86/./UnwindAssemblyx86Tests/Testx86AssemblyInspectionEngine.Test32bitFramelessSmallStackFrame (1503 of 1935) UNSUPPORTED: lldb-api :: functionalities/longjmp/TestLongjmp.py (1504 of 1935) PASS: lldb-unit :: UnwindAssembly/x86/./UnwindAssemblyx86Tests/Testx86AssemblyInspectionEngine.TestSimple32bitFrameFunction (1505 of 1935) PASS: lldb-unit :: UnwindAssembly/x86/./UnwindAssemblyx86Tests/Testx86AssemblyInspectionEngine.TestSubESP (1506 of 1935) PASS: lldb-shell :: Commands/command-breakpoint-col.test (1507 of 1935) PASS: lldb-unit :: Utility/./UtilityTests/LogChannelTest.Disable (1508 of 1935) PASS: lldb-api :: macosx/find-dsym/deep-bundle/TestDeepBundle.py (1509 of 1935) PASS: lldb-api :: commands/expression/weak_symbols/TestWeakSymbols.py (1510 of 1935) PASS: lldb-api :: lang/c/bitfields/TestBitfields.py (1511 of 1935) UNSUPPORTED: lldb-api :: functionalities/tsan/global_location/TestTsanGlobalLocation.py (1512 of 1935) UNSUPPORTED: lldb-api :: functionalities/data-formatter/data-formatter-stl/libstdcpp/list/TestDataFormatterStdList.py (1513 of 1935) PASS: lldb-api :: functionalities/tail_call_frames/disambiguate_call_site/TestDisambiguateCallSite.py (1514 of 1935) PASS: lldb-shell :: SymbolFile/NativePDB/source-list.cpp (1515 of 1935) PASS: lldb-shell :: Reproducer/TestReuseDirectory.test (1516 of 1935) PASS: lldb-unit :: Process/gdb-remote/./ProcessGdbRemoteTests/GDBRemoteCommunicationServerTest.SendErrorResponse_ErrorNumber (1517 of 1935) PASS: lldb-unit :: Utility/./UtilityTests/StringListTest.CopyListSingle (1518 of 1935) PASS: lldb-api :: commands/expression/test/TestExprs.py (1519 of 1935) PASS: lldb-unit :: UnwindAssembly/x86/./UnwindAssemblyx86Tests/Testx86AssemblyInspectionEngine.TestPopEDI (1520 of 1935) PASS: lldb-unit :: Utility/./UtilityTests/StringExtractorTest.GetHexU8_Underflow (1521 of 1935) PASS: lldb-api :: commands/watchpoints/watchpoint_set_command/TestWatchLocationWithWatchSet.py (1522 of 1935) PASS: lldb-unit :: Utility/./UtilityTests/BinaryStreamTest.PutULEB128SevenBytes (1523 of 1935) PASS: lldb-api :: commands/process/launch/TestProcessLaunch.py (1524 of 1935) PASS: lldb-api :: functionalities/data-formatter/data-formatter-stl/libcxx/string/TestDataFormatterLibcxxString.py (1525 of 1935) PASS: lldb-api :: commands/watchpoints/watchpoint_commands/command/TestWatchpointCommandPython.py (1526 of 1935) UNSUPPORTED: lldb-api :: iohandler/completion/TestIOHandlerCompletion.py (1527 of 1935) PASS: lldb-unit :: Language/Highlighting/./HighlighterTests/HighlighterTest.ClangBraces (1528 of 1935) PASS: lldb-unit :: Process/minidump/./LLDBMinidumpTests/MinidumpParserTest.GetThreadContext_x86_32_wow64 (1529 of 1935) PASS: lldb-unit :: Utility/./UtilityTests/StringListTest.JoinNonSpace (1530 of 1935) PASS: lldb-unit :: Utility/./UtilityTests/StreamTest.AddressSuffix (1531 of 1935) UNSUPPORTED: lldb-api :: functionalities/data-formatter/data-formatter-stl/libstdcpp/tuple/TestDataFormatterStdTuple.py (1532 of 1935) PASS: lldb-unit :: Process/gdb-remote/./ProcessGdbRemoteTests/GDBRemoteClientBaseTest.SendPacketAndReceiveResponseWithOutputSupport (1533 of 1935) PASS: lldb-shell :: SymbolFile/NativePDB/ast-methods.cpp (1534 of 1935) PASS: lldb-shell :: Breakpoint/implicit_const_form_support.test (1535 of 1935) PASS: lldb-unit :: Language/Highlighting/./HighlighterTests/HighlighterTest.ClangIdentifiers (1536 of 1935) PASS: lldb-api :: functionalities/gdb_remote_client/TestTargetXMLArch.py (1537 of 1935) PASS: lldb-api :: functionalities/jitloader_gdb/TestJITLoaderGDB.py (1538 of 1935) PASS: lldb-unit :: DataFormatter/./LLDBFormatterTests/FormatManagerTests.CompatibleLangs (1539 of 1935) PASS: lldb-api :: functionalities/data-formatter/data-formatter-objc/TestDataFormatterObjCKVO.py (1540 of 1935) PASS: lldb-api :: commands/expression/vector_of_enums/TestVectorOfEnums.py (1541 of 1935) PASS: lldb-unit :: SymbolFile/DWARF/./SymbolFileDWARFTests/SymbolFileDWARFTests.TestAbbrevNullAttrValidForm (1542 of 1935) PASS: lldb-api :: commands/expression/expr-in-syscall/TestExpressionInSyscall.py (1543 of 1935) PASS: lldb-unit :: Language/Highlighting/./HighlighterTests/HighlighterTest.Colons (1544 of 1935) PASS: lldb-api :: commands/expression/import-std-module/shared_ptr/TestSharedPtrFromStdModule.py (1545 of 1935) PASS: lldb-api :: tools/lldb-vscode/breakpoint/TestVSCode_setBreakpoints.py (1546 of 1935) PASS: lldb-unit :: Language/CPlusPlus/./LanguageCPlusPlusTests/CPlusPlusLanguage.ExtractContextAndIdentifier (1547 of 1935) PASS: lldb-api :: functionalities/plugins/python_os_plugin/TestPythonOSPlugin.py (1548 of 1935) PASS: lldb-unit :: Target/./TargetTests/PathMappingListTest.AbsoluteTests (1549 of 1935) PASS: lldb-shell :: SymbolFile/DWARF/find-basic-namespace.cpp (1550 of 1935) PASS: lldb-api :: macosx/load-kext/TestLoadKext.py (1551 of 1935) PASS: lldb-unit :: Utility/./UtilityTests/TimerTest.CategoryTimesStats (1552 of 1935) PASS: lldb-unit :: Expression/./ExpressionTests/DiagnosticManagerTest.PutStringSeverities (1553 of 1935) PASS: lldb-api :: functionalities/float-display/TestFloatDisplay.py (1554 of 1935) XFAIL: lldb-shell :: Register/x86-mm-xmm-read.test (1555 of 1935) PASS: lldb-shell :: SymbolFile/DWARF/deterministic-build.cpp (1556 of 1935) PASS: lldb-unit :: Utility/./UtilityTests/OptionsWithRawTest.SingleWordSuffix (1557 of 1935) PASS: lldb-unit :: debugserver/./debugserverTests/RNBSocket.LoopBackConnectIPv6 (1558 of 1935) PASS: lldb-unit :: UnwindAssembly/x86/./UnwindAssemblyx86Tests/Testx86AssemblyInspectionEngine.Test64bitFramelessSmallStackFrame (1559 of 1935) UNSUPPORTED: lldb-api :: terminal/TestEditline.py (1560 of 1935) PASS: lldb-unit :: Process/minidump/./LLDBMinidumpTests/MinidumpParserTest.GetFilteredModuleList (1561 of 1935) PASS: lldb-api :: functionalities/optimized_code/TestNoASanExceptionAfterEvalOP_piece.py (1562 of 1935) PASS: lldb-unit :: Language/CPlusPlus/./LanguageCPlusPlusTests/CPlusPlusLanguage.CPlusPlusNameParser (1563 of 1935) PASS: lldb-unit :: Host/./HostTests/ConnectionFileDescriptorTest.TCPGetURIv4 (1564 of 1935) PASS: lldb-unit :: Utility/./UtilityTests/StringListTest.AppendListCStringArray (1565 of 1935) PASS: lldb-api :: python_api/lldbutil/frame/TestFrameUtils.py (1566 of 1935) PASS: lldb-unit :: Utility/./UtilityTests/ConstStringTest.NullAndEmptyStates (1567 of 1935) PASS: lldb-unit :: Utility/./UtilityTests/StreamTest.PutCharNull (1568 of 1935) PASS: lldb-api :: functionalities/return-value/TestReturnValue.py (1569 of 1935) PASS: lldb-unit :: Utility/./UtilityTests/ConstStringTest.FromMidOfBufferStringRef (1570 of 1935) PASS: lldb-unit :: Host/./HostTests/FileSystemTest.Readable (1571 of 1935) PASS: lldb-unit :: Utility/./UtilityTests/OptionsWithRawTest.EmptySuffix (1572 of 1935) PASS: lldb-api :: lang/cpp/llvm-style/TestLLVMStyle.py (1573 of 1935) PASS: lldb-unit :: Core/./LLDBCoreTests/RichManglingContextTest.FromCxxMethodName (1574 of 1935) PASS: lldb-api :: functionalities/thread/num_threads/TestNumThreads.py (1575 of 1935) PASS: lldb-api :: functionalities/gdb_remote_client/TestJLink6Armv7RegisterDefinition.py (1576 of 1935) PASS: lldb-api :: functionalities/tail_call_frames/cross_object/TestCrossObjectTailCalls.py (1577 of 1935) PASS: lldb-unit :: ScriptInterpreter/Python/./ScriptInterpreterPythonTests/PythonDataObjectsTest.TestPythonDictionaryValueEquality (1578 of 1935) PASS: lldb-api :: functionalities/breakpoint/breakpoint_ignore_count/TestBreakpointIgnoreCount.py (1579 of 1935) UNSUPPORTED: lldb-api :: commands/expression/call-restarts/TestCallThatRestarts.py (1580 of 1935) PASS: lldb-api :: lang/cpp/unique-types/TestUniqueTypes.py (1581 of 1935) PASS: lldb-unit :: debugserver/./debugserverTests/RNBSocket.LoopBackListenIPv6 (1582 of 1935) PASS: lldb-unit :: Utility/./UtilityTests/StringLexerTest.AdvanceIf (1583 of 1935) PASS: lldb-shell :: SymbolFile/DWARF/dwarf5-index-is-used.cpp (1584 of 1935) PASS: lldb-api :: commands/disassemble/basic/TestDisassembleBreakpoint.py (1585 of 1935) PASS: lldb-unit :: Process/gdb-remote/./ProcessGdbRemoteTests/GDBRemoteCommunicationClientTest.GetMemoryRegionInfo (1586 of 1935) PASS: lldb-unit :: Utility/./UtilityTests/SerializationRountripTest.SerializeDeserializePod (1587 of 1935) PASS: lldb-shell :: ObjectFile/PECOFF/symbol.yaml (1588 of 1935) PASS: lldb-unit :: Utility/./UtilityTests/OptionsWithRawTest.SingleWhitespaceInput (1589 of 1935) PASS: lldb-api :: functionalities/data-formatter/data-formatter-objc/TestDataFormatterObjCExpr.py (1590 of 1935) UNSUPPORTED: lldb-api :: functionalities/darwin_log/filter/exact_match/category/TestDarwinLogFilterMatchCategory.py (1591 of 1935) PASS: lldb-unit :: Symbol/./SymbolTests/TestTypeSystemClang.TestIsClangType (1592 of 1935) PASS: lldb-api :: api/log/TestAPILog.py (1593 of 1935) PASS: lldb-unit :: Utility/./UtilityTests/StringListTest.GetMaxStringLengthEqualSize (1594 of 1935) PASS: lldb-shell :: SymbolFile/DWARF/dir-separator-posix.s (1595 of 1935) UNSUPPORTED: lldb-shell :: Register/x86-gp-read.test (1596 of 1935) UNSUPPORTED: lldb-api :: commands/register/register/intel_xtended_registers/TestMPXRegisters.py (1597 of 1935) PASS: lldb-shell :: ObjectFile/Breakpad/sections.test (1598 of 1935) PASS: lldb-unit :: UnwindAssembly/x86/./UnwindAssemblyx86Tests/Testx86AssemblyInspectionEngine.TestPopR12 (1599 of 1935) PASS: lldb-api :: lang/c/blocks/TestBlocks.py (1600 of 1935) PASS: lldb-api :: functionalities/breakpoint/breakpoint_locations/TestBreakpointLocations.py (1601 of 1935) PASS: lldb-unit :: Process/gdb-remote/./ProcessGdbRemoteTests/GDBRemoteClientBaseTest.SendContinueAndAsyncSignal (1602 of 1935) PASS: lldb-api :: lang/objc/rdar-11355592/TestRdar11355592.py (1603 of 1935) PASS: lldb-shell :: SymbolFile/NativePDB/nested-types.cpp (1604 of 1935) PASS: lldb-unit :: Utility/./UtilityTests/ArgsTest.StringListConstructor (1605 of 1935) PASS: lldb-unit :: Utility/./UtilityTests/ConstStringTest.UpdateMangledCounterpart (1606 of 1935) PASS: lldb-api :: lang/cpp/char1632_t/TestChar1632T.py (1607 of 1935) PASS: lldb-api :: python_api/interpreter/TestCommandInterpreterAPI.py (1608 of 1935) PASS: lldb-unit :: Process/gdb-remote/./ProcessGdbRemoteTests/GDBRemoteCommunicationClientTest.SaveRestoreRegistersNoSuffix (1609 of 1935) PASS: lldb-api :: functionalities/data-formatter/data-formatter-stl/libcxx/set/TestDataFormatterLibcxxSet.py (1610 of 1935) PASS: lldb-unit :: Expression/./ExpressionTests/DiagnosticManagerTest.GetStringMultipleDiags (1611 of 1935) PASS: lldb-unit :: UnwindAssembly/x86/./UnwindAssemblyx86Tests/Testx86AssemblyInspectionEngine.TestReturnDetect (1612 of 1935) PASS: lldb-api :: functionalities/data-formatter/data-formatter-smart-array/TestDataFormatterSmartArray.py (1613 of 1935) PASS: lldb-shell :: Breakpoint/split-dwarf5-debug-stroffsets.test (1614 of 1935) PASS: lldb-api :: commands/expression/xvalue/TestXValuePrinting.py (1615 of 1935) PASS: lldb-api :: lang/objc/objc-stepping/TestObjCStepping.py (1616 of 1935) UNSUPPORTED: lldb-shell :: Register/arm-fp-read.test (1617 of 1935) UNSUPPORTED: lldb-api :: functionalities/data-formatter/data-formatter-stl/libstdcpp/string/TestDataFormatterStdString.py (1618 of 1935) PASS: lldb-shell :: Minidump/disassemble-no-module.yaml (1619 of 1935) UNSUPPORTED: lldb-shell :: ScriptInterpreter/Lua/persistent_state.test (1620 of 1935) PASS: lldb-api :: functionalities/stats_api/TestStatisticsAPI.py (1621 of 1935) PASS: lldb-shell :: SymbolFile/DWARF/dir-separator-no-comp-dir.s (1622 of 1935) PASS: lldb-api :: functionalities/postmortem/netbsd-core/TestNetBSDCore.py (1623 of 1935) PASS: lldb-unit :: Utility/./UtilityTests/VMRange.IsValid (1624 of 1935) UNSUPPORTED: lldb-shell :: SymbolFile/NativePDB/typedefs.cpp (1625 of 1935) PASS: lldb-api :: python_api/target/TestTargetAPI.py (1626 of 1935) PASS: lldb-api :: functionalities/thread/concurrent_events/TestConcurrentCrashWithBreak.py (1627 of 1935) PASS: lldb-api :: commands/expression/regression-access-function-template-in-record/TestRegressionAccessFunctionTemplateInRecord.py (1628 of 1935) PASS: lldb-unit :: Host/./HostTests/NativeProcessProtocolTest.SetBreakpointFailWrite (1629 of 1935) PASS: lldb-shell :: SymbolFile/DWARF/find-inline-method.s (1630 of 1935) PASS: lldb-api :: functionalities/thread/thread_specific_break/TestThreadSpecificBreakpoint.py (1631 of 1935) UNSUPPORTED: lldb-api :: functionalities/exec/TestExec.py (1632 of 1935) PASS: lldb-shell :: Reproducer/TestMultipleTargets.test (1633 of 1935) PASS: lldb-shell :: Watchpoint/SetErrorCases.test (1634 of 1935) PASS: lldb-api :: functionalities/breakpoint/breakpoint_conditions/TestBreakpointConditions.py (1635 of 1935) PASS: lldb-api :: functionalities/data-formatter/data-formatter-stl/libcxx/initializerlist/TestInitializerList.py (1636 of 1935) PASS: lldb-unit :: Utility/./UtilityTests/ArchSpecTest.Compatibility (1637 of 1935) PASS: lldb-shell :: SymbolFile/DWARF/clang-ast-from-dwarf-objc-property.m (1638 of 1935) PASS: lldb-unit :: Editline/./EditlineTests/EditlineTestFixture.EditlineReceivesMultiLineText (1639 of 1935) PASS: lldb-api :: tools/lldb-server/TestGdbRemoteProcessInfo.py (1640 of 1935) PASS: lldb-api :: functionalities/thread/concurrent_events/TestConcurrentWatchBreak.py (1641 of 1935) PASS: lldb-api :: lang/objc/foundation/TestRuntimeTypes.py (1642 of 1935) PASS: lldb-api :: lang/cpp/chained-calls/TestCppChainedCalls.py (1643 of 1935) PASS: lldb-unit :: Process/gdb-remote/./ProcessGdbRemoteTests/GDBRemoteCommunicationClientTest.GetModulesInfo_UUID20 (1644 of 1935) PASS: lldb-unit :: Target/./TargetTests/ExecutionContextTest.GetByteOrder (1645 of 1935) PASS: lldb-unit :: Utility/./UtilityTests/BinaryStreamTest.PutULEB128FourBytes (1646 of 1935) PASS: lldb-unit :: Process/gdb-remote/./ProcessGdbRemoteTests/GDBRemoteClientBaseTest.SendContinueAndInterrupt2PacketBug (1647 of 1935) UNSUPPORTED: lldb-api :: functionalities/breakpoint/breakpoint_callback_command_source/TestBreakpointCallbackCommandSource.py (1648 of 1935) PASS: lldb-api :: functionalities/data-formatter/data-formatter-objc/TestDataFormatterObjCCF.py (1649 of 1935) UNSUPPORTED: lldb-shell :: Register/x86-64-xmm16-write.test (1650 of 1935) PASS: lldb-unit :: Utility/./UtilityTests/StringExtractorTest.GetHexBytes_OddPair2 (1651 of 1935) PASS: lldb-unit :: Language/Highlighting/./HighlighterTests/HighlighterTest.ClangPPDirectives (1652 of 1935) PASS: lldb-unit :: Symbol/./SymbolTests/TestTypeSystemClang.TestFunctionTemplateInRecordConstruction (1653 of 1935) PASS: lldb-api :: functionalities/thread/concurrent_events/TestConcurrentManyCrash.py (1654 of 1935) PASS: lldb-unit :: Signals/./SignalsTests/UnixSignalsTest.GetFilteredSignals (1655 of 1935) PASS: lldb-unit :: Utility/./UtilityTests/ScalarTest.Scalar_512 (1656 of 1935) PASS: lldb-unit :: SymbolFile/NativePDB/./SymbolFileNativePDBTests/PDBFPOProgramToDWARFExpressionTests.MultipleDependentAssignments (1657 of 1935) PASS: lldb-api :: functionalities/data-formatter/data-formatter-objc/TestDataFormatterObjCNSContainer.py (1658 of 1935) PASS: lldb-api :: commands/watchpoints/hello_watchpoint/TestMyFirstWatchpoint.py (1659 of 1935) PASS: lldb-unit :: ScriptInterpreter/Python/./ScriptInterpreterPythonTests/PythonDataObjectsTest.TestExceptions (1660 of 1935) PASS: lldb-api :: lang/c/shared_lib_stripped_symbols/TestSharedLibStrippedSymbols.py (1661 of 1935) PASS: lldb-shell :: Settings/TestStopCommandSourceOnError.test (1662 of 1935) PASS: lldb-unit :: Utility/./UtilityTests/CompletionRequest.DuplicateFiltering (1663 of 1935) PASS: lldb-api :: commands/expression/persistent_variables/TestPersistentVariables.py (1664 of 1935) PASS: lldb-unit :: Utility/./UtilityTests/StringExtractorTest.GetHexU8_Underflow2_NoEof (1665 of 1935) PASS: lldb-unit :: Expression/./ExpressionTests/CppModuleConfigurationTest.MissingUsrInclude (1666 of 1935) PASS: lldb-shell :: SymbolFile/NativePDB/function-types-builtins.cpp (1667 of 1935) PASS: lldb-unit :: ScriptInterpreter/Python/./ScriptInterpreterPythonTests/PythonDataObjectsTest.TestPythonStringToStr (1668 of 1935) PASS: lldb-api :: functionalities/thread/create_after_attach/TestCreateAfterAttach.py (1669 of 1935) PASS: lldb-unit :: Interpreter/./InterpreterTests/CompletionTest.DirCompletionUsername (1670 of 1935) PASS: lldb-unit :: SymbolFile/DWARF/./SymbolFileDWARFTests/SymbolFileDWARFTests.TestAbbrevOutOfOrder (1671 of 1935) PASS: lldb-unit :: Utility/./UtilityTests/RegularExpression.Invalid (1672 of 1935) PASS: lldb-api :: lang/cpp/namespace/TestNamespaceLookup.py (1673 of 1935) PASS: lldb-unit :: Symbol/./SymbolTests/TestTypeSystemClang.TestDisplayName (1674 of 1935) PASS: lldb-unit :: Utility/./UtilityTests/RangeTest.Copy (1675 of 1935) PASS: lldb-unit :: Host/./HostTests/TaskPoolTest.AddTask (1676 of 1935) PASS: lldb-unit :: Utility/./UtilityTests/ArchSpecTest.MergeFrom (1677 of 1935) PASS: lldb-unit :: Utility/./UtilityTests/StringListTest.JoinMultiCharSeparator (1678 of 1935) UNSUPPORTED: lldb-api :: benchmarks/expression/TestExpressionCmd.py (1679 of 1935) PASS: lldb-shell :: SymbolFile/DWARF/inline-function-address-shared.test (1680 of 1935) UNSUPPORTED: lldb-api :: lang/objc/bitfield_ivars/TestBitfieldIvars.py (1681 of 1935) PASS: lldb-unit :: Utility/./UtilityTests/ArgsTest.ReplaceArgumentAtIndexFarOutOfRange (1682 of 1935) PASS: lldb-api :: tools/lldb-server/inferior-crash/TestGdbRemoteAbort.py (1683 of 1935) PASS: lldb-unit :: Utility/./UtilityTests/UriParserTest.SchemeHostSeparator4 (1684 of 1935) PASS: lldb-unit :: UnwindAssembly/x86/./UnwindAssemblyx86Tests/Testx86AssemblyInspectionEngine.TestPopESI (1685 of 1935) PASS: lldb-shell :: Settings/TestFrameFormatMangling.test (1686 of 1935) UNSUPPORTED: lldb-api :: linux/mix-dwo-and-regular-objects/TestMixedDwarfBinary.py (1687 of 1935) PASS: lldb-shell :: ObjectFile/PECOFF/basic-info-arm.yaml (1688 of 1935) PASS: lldb-shell :: SymbolFile/DWARF/apple-index-is-used.cpp (1689 of 1935) PASS: lldb-api :: commands/target/dump-symtab-demangle/TestDumpSymtabDemangle.py (1690 of 1935) PASS: lldb-api :: python_api/debugger/TestDebuggerAPI.py (1691 of 1935) PASS: lldb-shell :: SymbolFile/DWARF/dwarf5-atomic.s (1692 of 1935) PASS: lldb-api :: macosx/safe-to-func-call/TestSafeFuncCalls.py (1693 of 1935) PASS: lldb-unit :: ScriptInterpreter/Python/./ScriptInterpreterPythonTests/PythonDataObjectsTest.TestPythonByteArray (1694 of 1935) PASS: lldb-api :: types/TestLongTypes.py (1695 of 1935) PASS: lldb-api :: functionalities/data-formatter/data-formatter-named-summaries/TestDataFormatterNamedSummaries.py (1696 of 1935) PASS: lldb-unit :: Symbol/./SymbolTests/TestTypeSystemClang.TestDisplayNameEmpty (1697 of 1935) PASS: lldb-unit :: Utility/./UtilityTests/BinaryStreamTest.PutSLEB128Zero (1698 of 1935) PASS: lldb-api :: lang/objc/print-obj/TestPrintObj.py (1699 of 1935) PASS: lldb-unit :: Utility/./UtilityTests/RangeTest.ContainsEndInclusive (1700 of 1935) PASS: lldb-unit :: Utility/./UtilityTests/StringListTest.GetMaxStringLengthIncreasingSize (1701 of 1935) PASS: lldb-unit :: Utility/./UtilityTests/BinaryStreamTest.PutSLEB128ThreeBytes (1702 of 1935) PASS: lldb-unit :: Utility/./UtilityTests/RecordReplayTest.InstrumentedBar (1703 of 1935) UNSUPPORTED: lldb-api :: functionalities/data-formatter/data-formatter-stl/libstdcpp/vbool/TestDataFormatterStdVBool.py (1704 of 1935) PASS: lldb-unit :: Utility/./UtilityTests/VMRange.Reset (1705 of 1935) PASS: lldb-api :: commands/platform/basic/TestPlatformCommand.py (1706 of 1935) PASS: lldb-api :: lang/c/unicode/TestUnicodeSymbols.py (1707 of 1935) PASS: lldb-unit :: Host/./HostTests/NativeProcessProtocolTest.ReadCStringFromMemory_CrossPageBoundary (1708 of 1935) PASS: lldb-unit :: Utility/./UtilityTests/StreamTest.ShiftOperatorStrings (1709 of 1935) PASS: lldb-unit :: Utility/./UtilityTests/VMRange.ContainsAddr (1710 of 1935) PASS: lldb-api :: commands/expression/ir-interpreter-phi-nodes/TestIRInterpreterPHINodes.py (1711 of 1935) PASS: lldb-shell :: Settings/TestFrameFormatNoColor.test (1712 of 1935) PASS: lldb-api :: commands/settings/quoting/TestQuoting.py (1713 of 1935) PASS: lldb-api :: types/TestShortTypeExpr.py (1714 of 1935) PASS: lldb-unit :: Utility/./UtilityTests/StreamTest.PutSLEB128 (1715 of 1935) PASS: lldb-unit :: Utility/./UtilityTests/StringListTest.GetMaxStringLengthDecreasingSize (1716 of 1935) PASS: lldb-api :: python_api/symbol-context/TestSymbolContext.py (1717 of 1935) PASS: lldb-unit :: Utility/./UtilityTests/BinaryStreamTest.PutULEB128FiveBytes (1718 of 1935) PASS: lldb-unit :: SymbolFile/NativePDB/./SymbolFileNativePDBTests/PDBFPOProgramToDWARFExpressionTests.InvalidAssignmentMultiple (1719 of 1935) UNSUPPORTED: lldb-api :: functionalities/ubsan/basic/TestUbsanBasic.py (1720 of 1935) PASS: lldb-unit :: ScriptInterpreter/Python/./ScriptInterpreterPythonTests/PythonDataObjectsTest.TestPythonTupleSize (1721 of 1935) PASS: lldb-shell :: Minidump/dump-all.test (1722 of 1935) UNSUPPORTED: lldb-shell :: ScriptInterpreter/Lua/lua.test (1723 of 1935) PASS: lldb-unit :: Utility/./UtilityTests/BinaryStreamTest.PutSLEB128MaxValue (1724 of 1935) PASS: lldb-api :: commands/expression/codegen-crash-typedefdecl-not-in_declcontext/TestCodegenCrashTypedefDeclNotInDeclContext.py (1725 of 1935) PASS: lldb-unit :: Symbol/./SymbolTests/TestClangASTImporter.RecordLayout (1726 of 1935) PASS: lldb-unit :: Utility/./UtilityTests/RecordReplayTest.InstrumentedFoo (1727 of 1935) PASS: lldb-unit :: Language/CPlusPlus/./LanguageCPlusPlusTests/CPlusPlusLanguage.MethodNameParsing (1728 of 1935) PASS: lldb-api :: functionalities/thread/concurrent_events/TestConcurrentSignalDelayWatch.py (1729 of 1935) PASS: lldb-unit :: Utility/./UtilityTests/StringListTest.InsertStringAtIndexStart (1730 of 1935) PASS: lldb-api :: lang/objc/objc-new-syntax/TestObjCNewSyntaxDictionary.py (1731 of 1935) PASS: lldb-api :: commands/expression/calculator_mode/TestCalculatorMode.py (1732 of 1935) PASS: lldb-api :: commands/watchpoints/multiple_threads/TestWatchpointMultipleThreads.py (1733 of 1935) PASS: lldb-api :: python_api/default-constructor/TestDefaultConstructorForAPIObjects.py (1734 of 1935) PASS: lldb-unit :: Expression/./ExpressionTests/DiagnosticManagerTest.GetStringMultiline (1735 of 1935) PASS: lldb-unit :: Utility/./UtilityTests/StringExtractorTest.GetNameColonValueNoSemicolon (1736 of 1935) PASS: lldb-unit :: Expression/./ExpressionTests/DiagnosticManagerTest.AddDiagnostic (1737 of 1935) PASS: lldb-unit :: Host/./HostTests/MainLoopTest.ReadObject (1738 of 1935) PASS: lldb-api :: commands/expression/pr35310/TestExprsBug35310.py (1739 of 1935) PASS: lldb-api :: lang/c/anonymous/TestAnonymous.py (1740 of 1935) PASS: lldb-api :: functionalities/postmortem/elf-core/TestLinuxCore.py (1741 of 1935) PASS: lldb-shell :: ObjectFile/PECOFF/sections.yaml (1742 of 1935) PASS: lldb-api :: tools/lldb-vscode/breakpoint/TestVSCode_setExceptionBreakpoints.py (1743 of 1935) PASS: lldb-api :: commands/expression/ignore-artificial-constructors/TestIgnoreArtificialConstructors.py (1744 of 1935) PASS: lldb-api :: functionalities/thread/concurrent_events/TestConcurrentBreakpointsDelayedBreakpointOneWatchpoint.py (1745 of 1935) PASS: lldb-unit :: Utility/./UtilityTests/StreamTest.AddressRangeEmptyRange (1746 of 1935) PASS: lldb-api :: lang/cpp/limit-debug-info/TestWithLimitDebugInfo.py (1747 of 1935) PASS: lldb-unit :: ScriptInterpreter/Python/./ScriptInterpreterPythonTests/PythonDataObjectsTest.TestPythonInteger (1748 of 1935) PASS: lldb-shell :: SymbolFile/Breakpad/line-table-mixed-path-styles.test (1749 of 1935) PASS: lldb-unit :: Utility/./UtilityTests/StringExtractorTest.GetNameColonValueContainsColon (1750 of 1935) PASS: lldb-unit :: Utility/./UtilityTests/FileSpecTest.GetPath (1751 of 1935) PASS: lldb-unit :: Utility/./UtilityTests/DataExtractorTest.GetCStrAtEnd (1752 of 1935) PASS: lldb-api :: commands/apropos/with-process/TestAproposWithProcess.py (1753 of 1935) PASS: lldb-api :: commands/expression/radar_9531204/TestPrintfAfterUp.py (1754 of 1935) UNSUPPORTED: lldb-api :: functionalities/darwin_log/filter/exact_match/activity-chain/TestDarwinLogFilterMatchActivityChain.py (1755 of 1935) PASS: lldb-shell :: SymbolFile/DWARF/debug-types-signature-loop.s (1756 of 1935) PASS: lldb-api :: macosx/queues/TestQueues.py (1757 of 1935) PASS: lldb-shell :: Expr/TestIRMemoryMap.test (1758 of 1935) PASS: lldb-shell :: SymbolFile/DWARF/inline-function-address.ll (1759 of 1935) PASS: lldb-api :: lang/cpp/multiple-inheritance/TestCppMultipleInheritance.py (1760 of 1935) PASS: lldb-api :: functionalities/unwind/noreturn/TestNoreturnUnwind.py (1761 of 1935) PASS: lldb-unit :: Target/./TargetTests/MemoryRegionInfoTest.Formatv (1762 of 1935) PASS: lldb-unit :: ScriptInterpreter/Python/./ScriptInterpreterPythonTests/PythonDataObjectsTest.TestModuleNameResolutionNoDot (1763 of 1935) PASS: lldb-unit :: Utility/./UtilityTests/BinaryStreamTest.PutULEB128OneByte (1764 of 1935) PASS: lldb-unit :: Expression/./ExpressionTests/DiagnosticManagerTest.PutStringMultiple (1765 of 1935) PASS: lldb-api :: lang/objc/single-entry-dictionary/TestObjCSingleEntryDictionary.py (1766 of 1935) PASS: lldb-api :: functionalities/tail_call_frames/disambiguate_paths_to_common_sink/TestDisambiguatePathsToCommonSink.py (1767 of 1935) PASS: lldb-api :: lang/cpp/stl/TestSTL.py (1768 of 1935) PASS: lldb-unit :: Utility/./UtilityTests/UriParserTest.MinimalPort (1769 of 1935) PASS: lldb-api :: functionalities/data-formatter/data-formatter-ptr-to-array/TestPtrToArrayFormatting.py (1770 of 1935) PASS: lldb-api :: lang/objc/objc-class-method/TestObjCClassMethod.py (1771 of 1935) PASS: lldb-shell :: ObjectFile/PECOFF/uuid.yaml (1772 of 1935) PASS: lldb-api :: lang/cpp/breakpoint-commands/TestCPPBreakpointCommands.py (1773 of 1935) PASS: lldb-api :: lang/objc/direct-dispatch-step/TestObjCDirectDispatchStepping.py (1774 of 1935) PASS: lldb-api :: lang/cpp/symbols/TestSymbols.py (1775 of 1935) PASS: lldb-shell :: SymbolFile/DWARF/find-method-local-struct.cpp (1776 of 1935) PASS: lldb-unit :: Process/gdb-remote/./ProcessGdbRemoteTests/GDBRemoteCommunicationClientTest.SendGetDataPacket (1777 of 1935) PASS: lldb-unit :: Utility/./UtilityTests/StreamTeeTest.GetStreamAtIndexOutOfBoundsEmpty (1778 of 1935) PASS: lldb-unit :: Language/Highlighting/./HighlighterTests/HighlighterTest.ClangTrailingBackslashBeforeNewline (1779 of 1935) PASS: lldb-api :: commands/frame/diagnose/bad-reference/TestBadReference.py (1780 of 1935) PASS: lldb-unit :: Utility/./UtilityTests/BinaryStreamTest.PutSLEB128TwoBytes (1781 of 1935) PASS: lldb-unit :: Utility/./UtilityTests/StringLexerTest.NextIf (1782 of 1935) PASS: lldb-unit :: Symbol/./SymbolTests/DWARFCallFrameInfoTest.Basic_eh (1783 of 1935) PASS: lldb-api :: functionalities/target_var/TestTargetVar.py (1784 of 1935) PASS: lldb-unit :: Utility/./UtilityTests/VASprintfTest.BufferResize (1785 of 1935) PASS: lldb-api :: functionalities/type_completion/TestTypeCompletion.py (1786 of 1935) PASS: lldb-api :: sample_test/TestSampleInlineTest.py (1787 of 1935) PASS: lldb-shell :: Settings/TestDisableColor.test (1788 of 1935) PASS: lldb-api :: lang/c/inlines/TestRedefinitionsInInlines.py (1789 of 1935) PASS: lldb-unit :: Target/./TargetTests/ModuleCacheTest.GetAndPutUuidExists (1790 of 1935) PASS: lldb-shell :: ObjectFile/wasm/unified-debug-sections.yaml (1791 of 1935) PASS: lldb-api :: functionalities/inline-stepping/TestInlineStepping.py (1792 of 1935) PASS: lldb-unit :: Utility/./UtilityTests/FileSpecTest.CopyByAppendingPathComponent (1793 of 1935) PASS: lldb-unit :: Utility/./UtilityTests/ArchSpecTest.TripleComponentsWereSpecified (1794 of 1935) PASS: lldb-unit :: Utility/./UtilityTests/AnsiTerminal.AtStart (1795 of 1935) PASS: lldb-unit :: Utility/./UtilityTests/StringExtractorTest.GetHexBytesAvail_FullString (1796 of 1935) UNSUPPORTED: lldb-shell :: SymbolFile/PDB/vbases.test (1797 of 1935) PASS: lldb-unit :: Utility/./UtilityTests/DataExtractorTest.GetCStrAtNullOffset (1798 of 1935) UNSUPPORTED: lldb-api :: functionalities/thread/state/TestThreadStates.py (1799 of 1935) PASS: lldb-shell :: Quit/TestQuitExitCodeHex0.test (1800 of 1935) PASS: lldb-unit :: Utility/./UtilityTests/StringExtractorTest.GetHexBytes_OddPair (1801 of 1935) PASS: lldb-unit :: Utility/./UtilityTests/LogChannelTest.List (1802 of 1935) PASS: lldb-unit :: Host/./HostTests/MainLoopTest.UnmonitoredSignal (1803 of 1935) PASS: lldb-api :: functionalities/breakpoint/objc/TestObjCBreakpoints.py (1804 of 1935) PASS: lldb-api :: lang/objc/objc-baseclass-sbtype/TestObjCBaseClassSBType.py (1805 of 1935) PASS: lldb-unit :: Utility/./UtilityTests/StringListTest.JoinSingle (1806 of 1935) PASS: lldb-unit :: Language/Highlighting/./HighlighterTests/HighlighterTest.ClangScalarLiterals (1807 of 1935) PASS: lldb-api :: lang/objc/objc-builtin-types/TestObjCBuiltinTypes.py (1808 of 1935) PASS: lldb-api :: functionalities/data-formatter/vector-types/TestVectorTypesFormatting.py (1809 of 1935) PASS: lldb-unit :: UnwindAssembly/x86/./UnwindAssemblyx86Tests/Testx86AssemblyInspectionEngine.TestPushRBP (1810 of 1935) PASS: lldb-unit :: Symbol/./SymbolTests/TestTypeSystemClang.TestRemoveFastQualifiers (1811 of 1935) PASS: lldb-unit :: Utility/./UtilityTests/StreamTest.PutCStringWithStringRef (1812 of 1935) PASS: lldb-api :: functionalities/data-formatter/type_summary_list_arg/TestTypeSummaryListArg.py (1813 of 1935) PASS: lldb-api :: functionalities/gdb_remote_client/TestRecognizeBreakpoint.py (1814 of 1935) PASS: lldb-api :: commands/frame/diagnose/complicated-expression/TestComplicatedExpression.py (1815 of 1935) PASS: lldb-unit :: Utility/./UtilityTests/StringExtractorTest.GetU64LittleEndian (1816 of 1935) PASS: lldb-unit :: Expression/./ExpressionTests/CppModuleConfigurationTest.UnrelatedLibrary (1817 of 1935) PASS: lldb-api :: lang/objc/objc-new-syntax/TestObjCNewSyntaxArray.py (1818 of 1935) PASS: lldb-unit :: Process/gdb-remote/./ProcessGdbRemoteTests/GDBRemoteCommunicationClientTest.SyncThreadState (1819 of 1935) PASS: lldb-unit :: Utility/./UtilityTests/StringListTest.Clear (1820 of 1935) PASS: lldb-unit :: Expression/./ExpressionTests/DWARFExpression.DW_OP_pick (1821 of 1935) PASS: lldb-unit :: Utility/./UtilityTests/ArgsTest.TestOverwriteArgs (1822 of 1935) UNSUPPORTED: lldb-api :: functionalities/tty/TestTerminal.py (1823 of 1935) PASS: lldb-api :: commands/expression/call-function/TestCallUserDefinedFunction.py (1824 of 1935) PASS: lldb-unit :: Utility/./UtilityTests/StatusTest.ErrorConstructor (1825 of 1935) PASS: lldb-unit :: Language/Highlighting/./HighlighterTests/HighlighterTest.ClangTrailingBackslashMissingNewLine (1826 of 1935) PASS: lldb-api :: python_api/disassemble-raw-data/TestDisassembleRawData.py (1827 of 1935) PASS: lldb-unit :: SymbolFile/NativePDB/./SymbolFileNativePDBTests/PDBFPOProgramToDWARFExpressionTests.UnresolvedRegisterReference (1828 of 1935) PASS: lldb-api :: functionalities/mtc/simple/TestMTCSimple.py (1829 of 1935) UNSUPPORTED: lldb-api :: functionalities/darwin_log/filter/regex/message/TestDarwinLogFilterRegexMessage.py (1830 of 1935) PASS: lldb-unit :: Process/gdb-remote/./ProcessGdbRemoteTests/GDBRemoteCommunicationClientTest.ReadRegister (1831 of 1935) PASS: lldb-api :: functionalities/recursion/TestValueObjectRecursion.py (1832 of 1935) PASS: lldb-unit :: Host/./HostTests/ConnectionFileDescriptorTest.TCPGetURIv6 (1833 of 1935) PASS: lldb-unit :: UnwindAssembly/x86/./UnwindAssemblyx86Tests/Testx86AssemblyInspectionEngine.TestPopR15 (1834 of 1935) PASS: lldb-api :: macosx/nslog/TestDarwinNSLogOutput.py (1835 of 1935) PASS: lldb-unit :: Utility/./UtilityTests/RangeTest.LessThanInvalid (1836 of 1935) PASS: lldb-api :: lang/c/offsetof/TestOffsetof.py (1837 of 1935) PASS: lldb-api :: functionalities/thread/concurrent_events/TestConcurrentSignalNWatchNBreak.py (1838 of 1935) PASS: lldb-api :: functionalities/data-formatter/nssetsynth/TestNSSetSynthetic.py (1839 of 1935) PASS: lldb-unit :: Host/./HostTests/FileActionTest.Open (1840 of 1935) PASS: lldb-unit :: Symbol/./SymbolTests/TestTypeSystemClang.TemplateArguments (1841 of 1935) PASS: lldb-api :: functionalities/data-formatter/data-formatter-stl/libcxx/vbool/TestDataFormatterLibcxxVBool.py (1842 of 1935) UNSUPPORTED: lldb-api :: benchmarks/stepping/TestSteppingSpeed.py (1843 of 1935) PASS: lldb-shell :: Reproducer/TestCrash.test (1844 of 1935) PASS: lldb-unit :: Utility/./UtilityTests/RecordReplayTest.InstrumentedBarRef (1845 of 1935) PASS: lldb-shell :: SymbolFile/DWARF/debug_rnglists-dwo.s (1846 of 1935) PASS: lldb-shell :: SymbolFile/DWARF/debug_ranges_and_rnglists.test (1847 of 1935) PASS: lldb-shell :: ExecControl/StopHook/stop-hook.test (1848 of 1935) PASS: lldb-api :: driver/batch_mode/TestBatchMode.py (1849 of 1935) PASS: lldb-api :: functionalities/data-formatter/parray/TestPrintArray.py (1850 of 1935) PASS: lldb-unit :: Utility/./UtilityTests/LogChannelTest.EnableOptions (1851 of 1935) UNSUPPORTED: lldb-api :: commands/expression/completion-crash-invalid-iterator/TestInvalidIteratorCompletionCrash.py (1852 of 1935) PASS: lldb-api :: functionalities/data-formatter/data-formatter-stl/libcxx/unordered/TestDataFormatterUnordered.py (1853 of 1935) PASS: lldb-api :: lang/cpp/thread_local/TestThreadLocal.py (1854 of 1935) PASS: lldb-api :: lang/cpp/trivial_abi/TestTrivialABI.py (1855 of 1935) PASS: lldb-api :: functionalities/type_lookup/TestTypeLookup.py (1856 of 1935) PASS: lldb-api :: commands/frame/diagnose/local-variable/TestLocalVariable.py (1857 of 1935) PASS: lldb-api :: commands/expression/namespace_local_var_same_name_cpp_and_c/TestNamespaceLocalVarSameNameCppAndC.py (1858 of 1935) PASS: lldb-unit :: Utility/./UtilityTests/StreamTest.PutHex64ByteOrderLittle (1859 of 1935) UNSUPPORTED: lldb-api :: functionalities/breakpoint/breakpoint_in_delayslot/TestAvoidBreakpointInDelaySlot.py (1860 of 1935) PASS: lldb-api :: commands/expression/context-object/TestContextObject.py (1861 of 1935) PASS: lldb-unit :: UnwindAssembly/x86/./UnwindAssemblyx86Tests/Testx86AssemblyInspectionEngine.TestMovRSPtoRBP (1862 of 1935) PASS: lldb-api :: functionalities/data-formatter/ptr_ref_typedef/TestPtrRef2Typedef.py (1863 of 1935) UNSUPPORTED: lldb-api :: tools/lldb-vscode/completions/TestVSCode_completions.py (1864 of 1935) PASS: lldb-unit :: Utility/./UtilityTests/BinaryStreamTest.PutULEB128Zero (1865 of 1935) UNSUPPORTED: lldb-api :: functionalities/signal/handle-segv/TestHandleSegv.py (1866 of 1935) PASS: lldb-api :: commands/expression/dollar-in-variable/TestDollarInVariable.py (1867 of 1935) PASS: lldb-unit :: Utility/./UtilityTests/ListenerTest.GetEventImmediate (1868 of 1935) PASS: lldb-shell :: Unwind/thread-step-out-ret-addr-check.test (1869 of 1935) PASS: lldb-api :: commands/watchpoints/watchpoint_size/TestWatchpointSizes.py (1870 of 1935) UNSUPPORTED: lldb-api :: commands/register/register/intel_xtended_registers/mpx_offset_intersection/TestMPXOffsetIntersection.py (1871 of 1935) PASS: lldb-unit :: UnwindAssembly/x86/./UnwindAssemblyx86Tests/Testx86AssemblyInspectionEngine.TestSpillRegToStackViaMOVi386 (1872 of 1935) PASS: lldb-unit :: Utility/./UtilityTests/SerializationRountripTest.SerializeDeserializeCStringArrayNullptr (1873 of 1935) PASS: lldb-unit :: Host/./HostTests/NativeProcessProtocolTest.ReadCStringFromMemory_MaxSize (1874 of 1935) PASS: lldb-shell :: SymbolFile/NativePDB/break-by-function.cpp (1875 of 1935) PASS: lldb-api :: python_api/thread/TestThreadAPI.py (1876 of 1935) PASS: lldb-unit :: Expression/./ExpressionTests/CppModuleConfigurationTest.AmbiguousCLib (1877 of 1935) UNSUPPORTED: lldb-api :: functionalities/process_save_core/TestProcessSaveCore.py (1878 of 1935) PASS: lldb-unit :: ObjectFile/Breakpad/./ObjectFileBreakpadTests/StackCFIRecord.parse (1879 of 1935) PASS: lldb-unit :: Utility/./UtilityTests/ArgsTest.TestAppendArg (1880 of 1935) PASS: lldb-unit :: UnwindAssembly/x86/./UnwindAssemblyx86Tests/Testx86AssemblyInspectionEngine.TestPushR15 (1881 of 1935) PASS: lldb-api :: functionalities/archives/TestBSDArchives.py (1882 of 1935) XFAIL: lldb-shell :: Register/x86-mm-xmm-write.test (1883 of 1935) PASS: lldb-shell :: ObjectFile/ELF/basic-info.yaml (1884 of 1935) PASS: lldb-api :: lang/cpp/offsetof/TestOffsetofCpp.py (1885 of 1935) PASS: lldb-api :: commands/expression/rdar44436068/Test128BitsInteger.py (1886 of 1935) PASS: lldb-shell :: Minidump/Windows/Sigsegv/sigsegv.test (1887 of 1935) PASS: lldb-api :: functionalities/postmortem/wow64_minidump/TestWow64MiniDump.py (1888 of 1935) PASS: lldb-api :: functionalities/data-formatter/data-formatter-stl/libstdcpp/unique_ptr/invalid/TestDataFormatterInvalidStdUniquePtr.py (1889 of 1935) PASS: lldb-unit :: SymbolFile/DWARF/./SymbolFileDWARFTests/SymbolFileDWARFTests.TestAbbrevOrder1Start1 (1890 of 1935) PASS: lldb-api :: functionalities/breakpoint/inlined_breakpoints/TestInlinedBreakpoints.py (1891 of 1935) PASS: lldb-unit :: Utility/./UtilityTests/StringExtractorTest.GetU32BigEndian (1892 of 1935) PASS: lldb-unit :: Utility/./UtilityTests/SharedCluster.ClusterManager (1893 of 1935) UNSUPPORTED: lldb-shell :: Register/x86-64-ymm16-read.test (1894 of 1935) PASS: lldb-api :: functionalities/step_scripted/TestStepScripted.py (1895 of 1935) PASS: lldb-shell :: Reproducer/TestCaptureEnvOverride.test (1896 of 1935) PASS: lldb-unit :: Utility/./UtilityTests/StringListTest.JoinEmpty (1897 of 1935) PASS: lldb-api :: sanity/TestModuleCacheSanity.py (1898 of 1935) PASS: lldb-shell :: Breakpoint/case-sensitive.test (1899 of 1935) PASS: lldb-unit :: UnwindAssembly/x86/./UnwindAssemblyx86Tests/Testx86AssemblyInspectionEngine.TestSimplex86_64Augmented (1900 of 1935) PASS: lldb-unit :: Utility/./UtilityTests/StringExtractorTest.DecodeHexU8_Underflow (1901 of 1935) PASS: lldb-unit :: UnwindAssembly/x86/./UnwindAssemblyx86Tests/Testx86AssemblyInspectionEngine.TestPushESI (1902 of 1935) UNSUPPORTED: lldb-shell :: Register/x86-64-ymm16-write.test (1903 of 1935) PASS: lldb-unit :: tools/lldb-server/tests/./LLDBServerTests/StandardStartupTest.TestStopReplyContainsThreadPcs (1904 of 1935) PASS: lldb-api :: lang/objc/objc-new-syntax/TestObjCNewSyntaxLiteral.py (1905 of 1935) PASS: lldb-unit :: Process/minidump/./LLDBMinidumpTests/MinidumpParserTest.GetPidWindows (1906 of 1935) PASS: lldb-api :: functionalities/thread/concurrent_events/TestConcurrentTwoWatchpointsOneSignal.py (1907 of 1935) UNSUPPORTED: lldb-shell :: SymbolFile/PDB/calling-conventions.test (1908 of 1935) PASS: lldb-api :: commands/process/attach/attach_denied/TestAttachDenied.py (1909 of 1935) UNSUPPORTED: lldb-api :: functionalities/tsan/basic/TestTsanBasic.py (1910 of 1935) PASS: lldb-api :: python_api/process/io/TestProcessIO.py (1911 of 1935) PASS: lldb-api :: functionalities/gdb_remote_client/TestGDBRemoteLoad.py (1912 of 1935) PASS: lldb-api :: python_api/function_symbol/TestSymbolAPI.py (1913 of 1935) PASS: lldb-unit :: Symbol/./SymbolTests/PostfixExpression.ParseFPOProgram (1914 of 1935) PASS: lldb-shell :: Settings/TestFrameFormatColor.test (1915 of 1935) PASS: lldb-unit :: Utility/./UtilityTests/UriParserTest.LongPath (1916 of 1935) PASS: lldb-unit :: Utility/./UtilityTests/OptionsWithRawTest.WhitespaceInput (1917 of 1935) PASS: lldb-unit :: Utility/./UtilityTests/StreamTeeTest.Write (1918 of 1935) PASS: lldb-api :: commands/expression/unwind_expression/TestUnwindExpression.py (1919 of 1935) PASS: lldb-unit :: Host/./HostTests/MainLoopTest.TerminatesImmediately (1920 of 1935) PASS: lldb-api :: commands/expression/class_template_specialization_empty_pack/TestClassTemplateSpecializationParametersHandling.py (1921 of 1935) PASS: lldb-unit :: Utility/./UtilityTests/StringListTest.AppendStringMove (1922 of 1935) UNSUPPORTED: lldb-api :: linux/thread/create_during_instruction_step/TestCreateDuringInstructionStep.py (1923 of 1935) PASS: lldb-api :: commands/expression/options/TestExprOptions.py (1924 of 1935) PASS: lldb-unit :: Utility/./UtilityTests/OptionsWithRawTest.EmptyInput (1925 of 1935) PASS: lldb-api :: functionalities/backticks/TestBackticksWithoutATarget.py (1926 of 1935) PASS: lldb-unit :: Process/minidump/./LLDBMinidumpTests/MinidumpParserTest.MinidumpDuplicateModuleMinAddress (1927 of 1935) PASS: lldb-unit :: Utility/./UtilityTests/StringListTest.LongestCommonPrefix (1928 of 1935) PASS: lldb-api :: functionalities/thread/exit_during_break/TestExitDuringBreak.py (1929 of 1935) PASS: lldb-unit :: Utility/./UtilityTests/ScalarTest.Promotion (1930 of 1935) PASS: lldb-unit :: Utility/./UtilityTests/RangeTest.ContainsRangeStartingFromZero (1931 of 1935) PASS: lldb-api :: commands/expression/persistent_ptr_update/TestPersistentPtrUpdate.py (1932 of 1935) PASS: lldb-api :: functionalities/rerun/TestRerun.py (1933 of 1935) PASS: lldb-api :: lang/objc/objc-ivar-offsets/TestObjCIvarOffsets.py (1934 of 1935) PASS: lldb-api :: api/multithreaded/TestMultithreaded.py (1935 of 1935)

Hide Details

Testing Time: 4270.02s ******************** Unresolved Tests (1): lldb-api :: functionalities/gdb_remote_client/TestWasm.py

Hide Details

Hide Details

Slowest Tests: -------------------------------------------------------------------------- 84.15s: lldb-api :: functionalities/data-formatter/synthupdate/TestSyntheticFilterRecompute.py 95.89s: lldb-api :: types/TestLongTypes.py 102.04s: lldb-api :: lang/objc/forward-decl/TestForwardDecl.py 107.39s: lldb-api :: lang/objcxx/class-name-clash/TestNameClash.py 112.55s: lldb-api :: lang/objc/foundation/TestObjCMethodsNSError.py 113.51s: lldb-api :: lang/objc/objc-new-syntax/TestObjCNewSyntaxArray.py 113.98s: lldb-api :: lang/objc/foundation/TestObjCMethodsString.py 114.75s: lldb-api :: lang/objc/objc-new-syntax/TestObjCNewSyntaxDictionary.py 119.84s: lldb-api :: tools/lldb-server/TestGdbRemote_qThreadStopInfo.py 129.08s: lldb-api :: types/TestLongTypesExpr.py 135.43s: lldb-api :: lang/objc/exceptions/TestObjCExceptions.py 139.95s: lldb-api :: lang/objc/real-definition/TestRealDefinition.py 150.89s: lldb-api :: lang/objc/objc-new-syntax/TestObjCNewSyntaxLiteral.py 164.97s: lldb-api :: lang/cpp/namespace/TestNamespaceLookup.py 213.88s: lldb-api :: lang/objc/foundation/TestObjCMethods.py 218.29s: lldb-api :: lang/objc/hidden-ivars/TestHiddenIvars.py 233.97s: lldb-api :: api/multithreaded/TestMultithreaded.py 248.38s: lldb-api :: tools/lldb-server/TestGdbRemoteThreadsInStopReply.py 276.64s: lldb-api :: lang/cpp/enum_types/TestCPP11EnumTypes.py 361.19s: lldb-api :: tools/lldb-server/TestLldbGdbServer.py

Hide Details

Tests Times: -------------------------------------------------------------------------- [ Range ] :: [ Percentage ] :: [ Count ] -------------------------------------------------------------------------- [ 0s, 20s) :: [********************************** ] :: [1690/1935] [ 20s, 40s) :: [** ] :: [ 118/1935] [ 40s, 60s) :: [* ] :: [ 78/1935] [ 60s, 80s) :: [ ] :: [ 23/1935] [ 80s,100s) :: [ ] :: [ 7/1935] [100s,120s) :: [ ] :: [ 6/1935] [120s,140s) :: [ ] :: [ 3/1935] [140s,160s) :: [ ] :: [ 3/1935] [160s,180s) :: [ ] :: [ 1/1935] [180s,200s) :: [ ] :: [ 0/1935] [200s,220s) :: [ ] :: [ 0/1935] [220s,240s) :: [ ] :: [ 2/1935] [240s,260s) :: [ ] :: [ 1/1935] [260s,280s) :: [ ] :: [ 1/1935] [280s,300s) :: [ ] :: [ 1/1935] [300s,320s) :: [ ] :: [ 0/1935] [320s,340s) :: [ ] :: [ 0/1935] [340s,360s) :: [ ] :: [ 0/1935] [360s,380s) :: [ ] :: [ 1/1935] Expected Passes : 1764 Expected Failures : 6 Unsupported Tests : 164 Unresolved Tests : 1 FAILED: tools/lldb/test/CMakeFiles/check-lldb-lit cd /Users/buildslave/jenkins/workspace/lldb-cmake-sanitized/lldb-build/tools/lldb/test && /usr/local/bin/python /Users/buildslave/jenkins/workspace/lldb-cmake-sanitized/lldb-build/./bin/llvm-lit -v --time-tests --shuffle --xunit-xml-output=/Users/buildslave/jenkins/workspace/lldb-cmake-sanitized/test/results.xml -v -j 4 --timeout 1200 /Users/buildslave/jenkins/workspace/lldb-cmake-sanitized/lldb-build/tools/lldb/test ninja: build stopped: subcommand failed. Command failed: Command '['/usr/bin/env', 'TERM=vt100', '/usr/local/bin/ninja', '-v', 'check-lldb']' returned non-zero exit status 1. Command: ['/usr/bin/env', 'TERM=vt100', '/usr/local/bin/ninja', '-v', 'check-lldb'] [Pipeline] } [Pipeline] // timeout [Pipeline] } [Pipeline] // stage [Pipeline] stage [Pipeline] { (Declarative: Post Actions) [Pipeline] scanForIssues No credentials specified [Clang (LLVM based)] Sleeping for 5 seconds due to JENKINS-32191... [Clang (LLVM based)] Parsing console log (workspace: '/Users/buildslave/jenkins/workspace/lldb-cmake-sanitized') [Pipeline] junit Recording test results [Pipeline] } [Pipeline] // stage [Pipeline] } [Pipeline] // withEnv [Pipeline] } [Pipeline] // node [Pipeline] End of Pipeline ERROR: script returned exit code 1 Finished: FAILURE